lucene-dev mailing list archives

Site index · List index
Message view « Date » · « Thread »
Top « Date » · « Thread »
From Apache Jenkins Server <jenk...@builds.apache.org>
Subject [JENKINS] Lucene-Solr-SmokeRelease-master - Build # 819 - Failure
Date Fri, 21 Jul 2017 00:06:45 GMT
Build: https://builds.apache.org/job/Lucene-Solr-SmokeRelease-master/819/

No tests ran.

Build Log:
[...truncated 25696 lines...]
prepare-release-no-sign:
    [mkdir] Created dir: /home/jenkins/jenkins-slave/workspace/Lucene-Solr-SmokeRelease-master/lucene/build/smokeTestRelease/dist
     [copy] Copying 476 files to /home/jenkins/jenkins-slave/workspace/Lucene-Solr-SmokeRelease-master/lucene/build/smokeTestRelease/dist/lucene
     [copy] Copying 215 files to /home/jenkins/jenkins-slave/workspace/Lucene-Solr-SmokeRelease-master/lucene/build/smokeTestRelease/dist/solr
   [smoker] Java 1.8 JAVA_HOME=/home/jenkins/tools/java/latest1.8
   [smoker] NOTE: output encoding is UTF-8
   [smoker] 
   [smoker] Load release URL "file:/home/jenkins/jenkins-slave/workspace/Lucene-Solr-SmokeRelease-master/lucene/build/smokeTestRelease/dist/"...
   [smoker] 
   [smoker] Test Lucene...
   [smoker]   test basics...
   [smoker]   get KEYS
   [smoker]     0.2 MB in 0.01 sec (41.3 MB/sec)
   [smoker]   check changes HTML...
   [smoker]   download lucene-8.0.0-src.tgz...
   [smoker]     28.9 MB in 0.02 sec (1239.3 MB/sec)
   [smoker]     verify md5/sha1 digests
   [smoker]   download lucene-8.0.0.tgz...
   [smoker]     68.9 MB in 0.06 sec (1234.6 MB/sec)
   [smoker]     verify md5/sha1 digests
   [smoker]   download lucene-8.0.0.zip...
   [smoker]     79.2 MB in 0.06 sec (1251.8 MB/sec)
   [smoker]     verify md5/sha1 digests
   [smoker]   unpack lucene-8.0.0.tgz...
   [smoker]     verify JAR metadata/identity/no javax.* or java.* classes...
   [smoker]     test demo with 1.8...
   [smoker]       got 6128 hits for query "lucene"
   [smoker]     checkindex with 1.8...
   [smoker]     check Lucene's javadoc JAR
   [smoker]   unpack lucene-8.0.0.zip...
   [smoker]     verify JAR metadata/identity/no javax.* or java.* classes...
   [smoker]     test demo with 1.8...
   [smoker]       got 6128 hits for query "lucene"
   [smoker]     checkindex with 1.8...
   [smoker]     check Lucene's javadoc JAR
   [smoker]   unpack lucene-8.0.0-src.tgz...
   [smoker]     make sure no JARs/WARs in src dist...
   [smoker]     run "ant validate"
   [smoker]     run tests w/ Java 8 and testArgs='-Dtests.slow=false'...
   [smoker] 
   [smoker] command "export JAVA_HOME="/home/jenkins/tools/java/latest1.8" PATH="/home/jenkins/tools/java/latest1.8/bin:$PATH" JAVACMD="/home/jenkins/tools/java/latest1.8/bin/java"; ant clean test -Dtests.slow=false" failed:
   [smoker] Buildfile: /home/jenkins/jenkins-slave/workspace/Lucene-Solr-SmokeRelease-master/lucene/build/smokeTestRelease/tmp/unpack/lucene-8.0.0/build.xml
   [smoker] 
   [smoker] clean:
   [smoker]    [delete] Deleting directory /home/jenkins/jenkins-slave/workspace/Lucene-Solr-SmokeRelease-master/lucene/build/smokeTestRelease/tmp/unpack/lucene-8.0.0/build
   [smoker] 
   [smoker] ivy-availability-check:
   [smoker] 
   [smoker] ivy-fail:
   [smoker] 
   [smoker] ivy-configure:
   [smoker] [ivy:configure] :: Apache Ivy 2.3.0 - 20130110142753 :: http://ant.apache.org/ivy/ ::
   [smoker] [ivy:configure] :: loading settings :: file = /home/jenkins/jenkins-slave/workspace/Lucene-Solr-SmokeRelease-master/lucene/build/smokeTestRelease/tmp/unpack/lucene-8.0.0/top-level-ivy-settings.xml
   [smoker] 
   [smoker] -clover.load:
   [smoker] 
   [smoker] resolve-groovy:
   [smoker] [ivy:cachepath] :: resolving dependencies :: org.codehaus.groovy#groovy-all-caller;working
   [smoker] [ivy:cachepath] 	confs: [default]
   [smoker] [ivy:cachepath] 	found org.codehaus.groovy#groovy-all;2.4.8 in public
   [smoker] [ivy:cachepath] :: resolution report :: resolve 148ms :: artifacts dl 9ms
   [smoker] 	---------------------------------------------------------------------
   [smoker] 	|                  |            modules            ||   artifacts   |
   [smoker] 	|       conf       | number| search|dwnlded|evicted|| number|dwnlded|
   [smoker] 	---------------------------------------------------------------------
   [smoker] 	|      default     |   1   |   0   |   0   |   0   ||   1   |   0   |
   [smoker] 	---------------------------------------------------------------------
   [smoker] 
   [smoker] -init-totals:
   [smoker] 
   [smoker] test-core:
   [smoker] 
   [smoker] -clover.disable:
   [smoker] 
   [smoker] ivy-availability-check:
   [smoker] 
   [smoker] ivy-fail:
   [smoker] 
   [smoker] ivy-configure:
   [smoker] [ivy:configure] :: loading settings :: file = /home/jenkins/jenkins-slave/workspace/Lucene-Solr-SmokeRelease-master/lucene/build/smokeTestRelease/tmp/unpack/lucene-8.0.0/top-level-ivy-settings.xml
   [smoker] 
   [smoker] -clover.load:
   [smoker] 
   [smoker] -clover.classpath:
   [smoker] 
   [smoker] -clover.setup:
   [smoker] 
   [smoker] clover:
   [smoker] 
   [smoker] -check-git-state:
   [smoker] 
   [smoker] -git-cleanroot:
   [smoker] 
   [smoker] -copy-git-state:
   [smoker] 
   [smoker] git-autoclean:
   [smoker] 
   [smoker] resolve:
   [smoker] 
   [smoker] init:
   [smoker] 
   [smoker] compile-core:
   [smoker]     [mkdir] Created dir: /home/jenkins/jenkins-slave/workspace/Lucene-Solr-SmokeRelease-master/lucene/build/smokeTestRelease/tmp/unpack/lucene-8.0.0/build/core/classes/java
   [smoker]     [javac] Compiling 823 source files to /home/jenkins/jenkins-slave/workspace/Lucene-Solr-SmokeRelease-master/lucene/build/smokeTestRelease/tmp/unpack/lucene-8.0.0/build/core/classes/java
   [smoker]     [javac] Note: Some input files use or override a deprecated API.
   [smoker]     [javac] Note: Recompile with -Xlint:deprecation for details.
   [smoker]     [javac] Creating empty /home/jenkins/jenkins-slave/workspace/Lucene-Solr-SmokeRelease-master/lucene/build/smokeTestRelease/tmp/unpack/lucene-8.0.0/build/core/classes/java/org/apache/lucene/util/graph/package-info.class
   [smoker]     [javac] Creating empty /home/jenkins/jenkins-slave/workspace/Lucene-Solr-SmokeRelease-master/lucene/build/smokeTestRelease/tmp/unpack/lucene-8.0.0/build/core/classes/java/org/apache/lucene/document/package-info.class
   [smoker]     [javac] Creating empty /home/jenkins/jenkins-slave/workspace/Lucene-Solr-SmokeRelease-master/lucene/build/smokeTestRelease/tmp/unpack/lucene-8.0.0/build/core/classes/java/org/apache/lucene/package-info.class
   [smoker]     [javac] Creating empty /home/jenkins/jenkins-slave/workspace/Lucene-Solr-SmokeRelease-master/lucene/build/smokeTestRelease/tmp/unpack/lucene-8.0.0/build/core/classes/java/org/apache/lucene/util/bkd/package-info.class
   [smoker]     [javac] Creating empty /home/jenkins/jenkins-slave/workspace/Lucene-Solr-SmokeRelease-master/lucene/build/smokeTestRelease/tmp/unpack/lucene-8.0.0/build/core/classes/java/org/apache/lucene/codecs/compressing/package-info.class
   [smoker]     [javac] Creating empty /home/jenkins/jenkins-slave/workspace/Lucene-Solr-SmokeRelease-master/lucene/build/smokeTestRelease/tmp/unpack/lucene-8.0.0/build/core/classes/java/org/apache/lucene/codecs/lucene60/package-info.class
   [smoker]     [javac] Creating empty /home/jenkins/jenkins-slave/workspace/Lucene-Solr-SmokeRelease-master/lucene/build/smokeTestRelease/tmp/unpack/lucene-8.0.0/build/core/classes/java/org/apache/lucene/codecs/package-info.class
   [smoker]     [javac] Creating empty /home/jenkins/jenkins-slave/workspace/Lucene-Solr-SmokeRelease-master/lucene/build/smokeTestRelease/tmp/unpack/lucene-8.0.0/build/core/classes/java/org/apache/lucene/util/package-info.class
   [smoker]     [javac] Creating empty /home/jenkins/jenkins-slave/workspace/Lucene-Solr-SmokeRelease-master/lucene/build/smokeTestRelease/tmp/unpack/lucene-8.0.0/build/core/classes/java/org/apache/lucene/index/package-info.class
   [smoker]     [javac] Creating empty /home/jenkins/jenkins-slave/workspace/Lucene-Solr-SmokeRelease-master/lucene/build/smokeTestRelease/tmp/unpack/lucene-8.0.0/build/core/classes/java/org/apache/lucene/util/fst/package-info.class
   [smoker]     [javac] Creating empty /home/jenkins/jenkins-slave/workspace/Lucene-Solr-SmokeRelease-master/lucene/build/smokeTestRelease/tmp/unpack/lucene-8.0.0/build/core/classes/java/org/apache/lucene/analysis/tokenattributes/package-info.class
   [smoker]     [javac] Creating empty /home/jenkins/jenkins-slave/workspace/Lucene-Solr-SmokeRelease-master/lucene/build/smokeTestRelease/tmp/unpack/lucene-8.0.0/build/core/classes/java/org/apache/lucene/search/package-info.class
   [smoker]     [javac] Creating empty /home/jenkins/jenkins-slave/workspace/Lucene-Solr-SmokeRelease-master/lucene/build/smokeTestRelease/tmp/unpack/lucene-8.0.0/build/core/classes/java/org/apache/lucene/codecs/lucene62/package-info.class
   [smoker]     [javac] Creating empty /home/jenkins/jenkins-slave/workspace/Lucene-Solr-SmokeRelease-master/lucene/build/smokeTestRelease/tmp/unpack/lucene-8.0.0/build/core/classes/java/org/apache/lucene/util/packed/package-info.class
   [smoker]     [javac] Creating empty /home/jenkins/jenkins-slave/workspace/Lucene-Solr-SmokeRelease-master/lucene/build/smokeTestRelease/tmp/unpack/lucene-8.0.0/build/core/classes/java/org/apache/lucene/util/mutable/package-info.class
   [smoker]     [javac] Creating empty /home/jenkins/jenkins-slave/workspace/Lucene-Solr-SmokeRelease-master/lucene/build/smokeTestRelease/tmp/unpack/lucene-8.0.0/build/core/classes/java/org/apache/lucene/codecs/lucene70/package-info.class
   [smoker]     [javac] Creating empty /home/jenkins/jenkins-slave/workspace/Lucene-Solr-SmokeRelease-master/lucene/build/smokeTestRelease/tmp/unpack/lucene-8.0.0/build/core/classes/java/org/apache/lucene/codecs/perfield/package-info.class
   [smoker]     [javac] Creating empty /home/jenkins/jenkins-slave/workspace/Lucene-Solr-SmokeRelease-master/lucene/build/smokeTestRelease/tmp/unpack/lucene-8.0.0/build/core/classes/java/org/apache/lucene/analysis/package-info.class
   [smoker]     [javac] Creating empty /home/jenkins/jenkins-slave/workspace/Lucene-Solr-SmokeRelease-master/lucene/build/smokeTestRelease/tmp/unpack/lucene-8.0.0/build/core/classes/java/org/apache/lucene/analysis/standard/package-info.class
   [smoker]     [javac] Creating empty /home/jenkins/jenkins-slave/workspace/Lucene-Solr-SmokeRelease-master/lucene/build/smokeTestRelease/tmp/unpack/lucene-8.0.0/build/core/classes/java/org/apache/lucene/store/package-info.class
   [smoker]     [javac] Creating empty /home/jenkins/jenkins-slave/workspace/Lucene-Solr-SmokeRelease-master/lucene/build/smokeTestRelease/tmp/unpack/lucene-8.0.0/build/core/classes/java/org/apache/lucene/codecs/blocktree/package-info.class
   [smoker]     [javac] Creating empty /home/jenkins/jenkins-slave/workspace/Lucene-Solr-SmokeRelease-master/lucene/build/smokeTestRelease/tmp/unpack/lucene-8.0.0/build/core/classes/java/org/apache/lucene/search/spans/package-info.class
   [smoker]     [javac] Creating empty /home/jenkins/jenkins-slave/workspace/Lucene-Solr-SmokeRelease-master/lucene/build/smokeTestRelease/tmp/unpack/lucene-8.0.0/build/core/classes/java/org/apache/lucene/search/similarities/package-info.class
   [smoker]     [javac] Creating empty /home/jenkins/jenkins-slave/workspace/Lucene-Solr-SmokeRelease-master/lucene/build/smokeTestRelease/tmp/unpack/lucene-8.0.0/build/core/classes/java/org/apache/lucene/util/automaton/package-info.class
   [smoker]     [javac] Creating empty /home/jenkins/jenkins-slave/workspace/Lucene-Solr-SmokeRelease-master/lucene/build/smokeTestRelease/tmp/unpack/lucene-8.0.0/build/core/classes/java/org/apache/lucene/codecs/lucene50/package-info.class
   [smoker]     [javac] Creating empty /home/jenkins/jenkins-slave/workspace/Lucene-Solr-SmokeRelease-master/lucene/build/smokeTestRelease/tmp/unpack/lucene-8.0.0/build/core/classes/java/org/apache/lucene/geo/package-info.class
   [smoker]      [copy] Copying 3 files to /home/jenkins/jenkins-slave/workspace/Lucene-Solr-SmokeRelease-master/lucene/build/smokeTestRelease/tmp/unpack/lucene-8.0.0/build/core/classes/java
   [smoker] 
   [smoker] compile-test-framework:
   [smoker] 
   [smoker] -check-git-state:
   [smoker] 
   [smoker] -git-cleanroot:
   [smoker] 
   [smoker] -copy-git-state:
   [smoker] 
   [smoker] git-autoclean:
   [smoker] 
   [smoker] ivy-availability-check:
   [smoker] 
   [smoker] ivy-fail:
   [smoker] 
   [smoker] ivy-configure:
   [smoker] [ivy:configure] :: loading settings :: file = /home/jenkins/jenkins-slave/workspace/Lucene-Solr-SmokeRelease-master/lucene/build/smokeTestRelease/tmp/unpack/lucene-8.0.0/top-level-ivy-settings.xml
   [smoker] 
   [smoker] resolve:
   [smoker] 
   [smoker] init:
   [smoker] 
   [smoker] compile-lucene-core:
   [smoker] 
   [smoker] -check-git-state:
   [smoker] 
   [smoker] -git-cleanroot:
   [smoker] 
   [smoker] -copy-git-state:
   [smoker] 
   [smoker] git-autoclean:
   [smoker] 
   [smoker] ivy-availability-check:
   [smoker] 
   [smoker] ivy-fail:
   [smoker] 
   [smoker] ivy-configure:
   [smoker] [ivy:configure] :: loading settings :: file = /home/jenkins/jenkins-slave/workspace/Lucene-Solr-SmokeRelease-master/lucene/build/smokeTestRelease/tmp/unpack/lucene-8.0.0/top-level-ivy-settings.xml
   [smoker] 
   [smoker] resolve:
   [smoker] 
   [smoker] init:
   [smoker] 
   [smoker] -clover.disable:
   [smoker] 
   [smoker] -clover.load:
   [smoker] 
   [smoker] -clover.classpath:
   [smoker] 
   [smoker] -clover.setup:
   [smoker] 
   [smoker] clover:
   [smoker] 
   [smoker] compile-core:
   [smoker] 
   [smoker] compile-codecs:
   [smoker] 
   [smoker] -check-git-state:
   [smoker] 
   [smoker] -git-cleanroot:
   [smoker] 
   [smoker] -copy-git-state:
   [smoker] 
   [smoker] git-autoclean:
   [smoker] 
   [smoker] ivy-availability-check:
   [smoker] 
   [smoker] ivy-fail:
   [smoker] 
   [smoker] ivy-configure:
   [smoker] [ivy:configure] :: loading settings :: file = /home/jenkins/jenkins-slave/workspace/Lucene-Solr-SmokeRelease-master/lucene/build/smokeTestRelease/tmp/unpack/lucene-8.0.0/top-level-ivy-settings.xml
   [smoker] 
   [smoker] resolve:
   [smoker] 
   [smoker] common.init:
   [smoker] 
   [smoker] compile-lucene-core:
   [smoker] 
   [smoker] init:
   [smoker] 
   [smoker] -clover.disable:
   [smoker] 
   [smoker] -clover.load:
   [smoker] 
   [smoker] -clover.classpath:
   [smoker] 
   [smoker] -clover.setup:
   [smoker] 
   [smoker] clover:
   [smoker] 
   [smoker] compile-core:
   [smoker]     [mkdir] Created dir: /home/jenkins/jenkins-slave/workspace/Lucene-Solr-SmokeRelease-master/lucene/build/smokeTestRelease/tmp/unpack/lucene-8.0.0/build/codecs/classes/java
   [smoker]     [javac] Compiling 67 source files to /home/jenkins/jenkins-slave/workspace/Lucene-Solr-SmokeRelease-master/lucene/build/smokeTestRelease/tmp/unpack/lucene-8.0.0/build/codecs/classes/java
   [smoker]     [javac] Note: Some input files use or override a deprecated API.
   [smoker]     [javac] Note: Recompile with -Xlint:deprecation for details.
   [smoker]     [javac] Creating empty /home/jenkins/jenkins-slave/workspace/Lucene-Solr-SmokeRelease-master/lucene/build/smokeTestRelease/tmp/unpack/lucene-8.0.0/build/codecs/classes/java/org/apache/lucene/codecs/bloom/package-info.class
   [smoker]     [javac] Creating empty /home/jenkins/jenkins-slave/workspace/Lucene-Solr-SmokeRelease-master/lucene/build/smokeTestRelease/tmp/unpack/lucene-8.0.0/build/codecs/classes/java/org/apache/lucene/codecs/memory/package-info.class
   [smoker]     [javac] Creating empty /home/jenkins/jenkins-slave/workspace/Lucene-Solr-SmokeRelease-master/lucene/build/smokeTestRelease/tmp/unpack/lucene-8.0.0/build/codecs/classes/java/org/apache/lucene/codecs/simpletext/package-info.class
   [smoker]     [javac] Creating empty /home/jenkins/jenkins-slave/workspace/Lucene-Solr-SmokeRelease-master/lucene/build/smokeTestRelease/tmp/unpack/lucene-8.0.0/build/codecs/classes/java/org/apache/lucene/codecs/blockterms/package-info.class
   [smoker]     [javac] Creating empty /home/jenkins/jenkins-slave/workspace/Lucene-Solr-SmokeRelease-master/lucene/build/smokeTestRelease/tmp/unpack/lucene-8.0.0/build/codecs/classes/java/org/apache/lucene/codecs/blocktreeords/package-info.class
   [smoker]      [copy] Copying 3 files to /home/jenkins/jenkins-slave/workspace/Lucene-Solr-SmokeRelease-master/lucene/build/smokeTestRelease/tmp/unpack/lucene-8.0.0/build/codecs/classes/java
   [smoker] 
   [smoker] -clover.disable:
   [smoker] 
   [smoker] -clover.load:
   [smoker] 
   [smoker] -clover.classpath:
   [smoker] 
   [smoker] -clover.setup:
   [smoker] 
   [smoker] clover:
   [smoker] 
   [smoker] common.compile-core:
   [smoker]     [mkdir] Created dir: /home/jenkins/jenkins-slave/workspace/Lucene-Solr-SmokeRelease-master/lucene/build/smokeTestRelease/tmp/unpack/lucene-8.0.0/build/test-framework/classes/java
   [smoker]     [javac] Compiling 188 source files to /home/jenkins/jenkins-slave/workspace/Lucene-Solr-SmokeRelease-master/lucene/build/smokeTestRelease/tmp/unpack/lucene-8.0.0/build/test-framework/classes/java
   [smoker]     [javac] Note: /home/jenkins/jenkins-slave/workspace/Lucene-Solr-SmokeRelease-master/lucene/build/smokeTestRelease/tmp/unpack/lucene-8.0.0/test-framework/src/java/org/apache/lucene/store/BaseDirectoryTestCase.java uses or overrides a deprecated API.
   [smoker]     [javac] Note: Recompile with -Xlint:deprecation for details.
   [smoker]     [javac] Creating empty /home/jenkins/jenkins-slave/workspace/Lucene-Solr-SmokeRelease-master/lucene/build/smokeTestRelease/tmp/unpack/lucene-8.0.0/build/test-framework/classes/java/org/apache/lucene/codecs/asserting/package-info.class
   [smoker]     [javac] Creating empty /home/jenkins/jenkins-slave/workspace/Lucene-Solr-SmokeRelease-master/lucene/build/smokeTestRelease/tmp/unpack/lucene-8.0.0/build/test-framework/classes/java/org/apache/lucene/codecs/ramonly/package-info.class
   [smoker]     [javac] Creating empty /home/jenkins/jenkins-slave/workspace/Lucene-Solr-SmokeRelease-master/lucene/build/smokeTestRelease/tmp/unpack/lucene-8.0.0/build/test-framework/classes/java/org/apache/lucene/mockfile/package-info.class
   [smoker]     [javac] Creating empty /home/jenkins/jenkins-slave/workspace/Lucene-Solr-SmokeRelease-master/lucene/build/smokeTestRelease/tmp/unpack/lucene-8.0.0/build/test-framework/classes/java/org/apache/lucene/codecs/cheapbastard/package-info.class
   [smoker]     [javac] Creating empty /home/jenkins/jenkins-slave/workspace/Lucene-Solr-SmokeRelease-master/lucene/build/smokeTestRelease/tmp/unpack/lucene-8.0.0/build/test-framework/classes/java/org/apache/lucene/codecs/mockrandom/package-info.class
   [smoker]     [javac] Creating empty /home/jenkins/jenkins-slave/workspace/Lucene-Solr-SmokeRelease-master/lucene/build/smokeTestRelease/tmp/unpack/lucene-8.0.0/build/test-framework/classes/java/org/apache/lucene/codecs/cranky/package-info.class
   [smoker]     [javac] Creating empty /home/jenkins/jenkins-slave/workspace/Lucene-Solr-SmokeRelease-master/lucene/build/smokeTestRelease/tmp/unpack/lucene-8.0.0/build/test-framework/classes/java/org/apache/lucene/codecs/compressing/dummy/package-info.class
   [smoker]      [copy] Copying 4 files to /home/jenkins/jenkins-slave/workspace/Lucene-Solr-SmokeRelease-master/lucene/build/smokeTestRelease/tmp/unpack/lucene-8.0.0/build/test-framework/classes/java
   [smoker] 
   [smoker] compile-core:
   [smoker] 
   [smoker] compile-test:
   [smoker]     [mkdir] Created dir: /home/jenkins/jenkins-slave/workspace/Lucene-Solr-SmokeRelease-master/lucene/build/smokeTestRelease/tmp/unpack/lucene-8.0.0/build/core/classes/test
   [smoker]     [javac] Compiling 461 source files to /home/jenkins/jenkins-slave/workspace/Lucene-Solr-SmokeRelease-master/lucene/build/smokeTestRelease/tmp/unpack/lucene-8.0.0/build/core/classes/test
   [smoker]     [javac] Note: Some input files use or override a deprecated API.
   [smoker]     [javac] Note: Recompile with -Xlint:deprecation for details.
   [smoker]      [copy] Copying 3 files to /home/jenkins/jenkins-slave/workspace/Lucene-Solr-SmokeRelease-master/lucene/build/smokeTestRelease/tmp/unpack/lucene-8.0.0/build/core/classes/test
   [smoker] 
   [smoker] install-junit4-taskdef:
   [smoker] 
   [smoker] validate:
   [smoker] 
   [smoker] resolve-groovy:
   [smoker] 
   [smoker] -init-totals:
   [smoker] 
   [smoker] -test:
   [smoker]     [mkdir] Created dir: /home/jenkins/jenkins-slave/workspace/Lucene-Solr-SmokeRelease-master/lucene/build/smokeTestRelease/tmp/unpack/lucene-8.0.0/build/core/test
   [smoker]     [mkdir] Created dir: /home/jenkins/jenkins-slave/workspace/Lucene-Solr-SmokeRelease-master/lucene/build/smokeTestRelease/tmp/unpack/lucene-8.0.0/build/core/test/temp
   [smoker]     [mkdir] Created dir: /home/jenkins/jenkins-slave/workspace/Lucene-Solr-SmokeRelease-master/lucene/build/smokeTestRelease/tmp/unpack/.caches/test-stats/core
   [smoker]    [junit4] <JUnit4> says salut! Master seed: D2E196D489A307A1
   [smoker]    [junit4] Executing 454 suites with 3 JVMs.
   [smoker]    [junit4] 
   [smoker]    [junit4] Started J2 PID(27489@lucene2-us-west.apache.org).
   [smoker]    [junit4] Started J1 PID(27487@lucene2-us-west.apache.org).
   [smoker]    [junit4] Started J0 PID(27488@lucene2-us-west.apache.org).
   [smoker]    [junit4] Suite: org.apache.lucene.util.automaton.TestRegExp
   [smoker]    [junit4] Completed [1/454] on J1 in 1.78s, 5 tests
   [smoker]    [junit4] 
   [smoker]    [junit4] Suite: org.apache.lucene.index.TestDocsAndPositions
   [smoker]    [junit4] Completed [2/454] on J0 in 5.60s, 6 tests
   [smoker]    [junit4] 
   [smoker]    [junit4] Suite: org.apache.lucene.store.TestSimpleFSDirectory
   [smoker]    [junit4] Completed [3/454] on J2 in 5.65s, 42 tests
   [smoker]    [junit4] 
   [smoker]    [junit4] Suite: org.apache.lucene.util.automaton.TestDeterminism
   [smoker]    [junit4] Completed [4/454] on J1 in 4.26s, 2 tests
   [smoker]    [junit4] 
   [smoker]    [junit4] Suite: org.apache.lucene.util.TestMathUtil
   [smoker]    [junit4] Completed [5/454] on J2 in 0.49s, 5 tests
   [smoker]    [junit4] 
   [smoker]    [junit4] Suite: org.apache.lucene.index.TestOneMergeWrappingMergePolicy
   [smoker]    [junit4] Completed [6/454] on J2 in 0.11s, 1 test
   [smoker]    [junit4] 
   [smoker]    [junit4] Suite: org.apache.lucene.index.TestTerms
   [smoker]    [junit4] Completed [7/454] on J0 in 1.09s, 2 tests
   [smoker]    [junit4] 
   [smoker]    [junit4] Suite: org.apache.lucene.index.TestFieldsReader
   [smoker]    [junit4] Completed [8/454] on J2 in 3.74s, 2 tests
   [smoker]    [junit4] 
   [smoker]    [junit4] Suite: org.apache.lucene.index.TestIndexWriterLockRelease
   [smoker]    [junit4] Completed [9/454] on J2 in 0.21s, 1 test
   [smoker]    [junit4] 
   [smoker]    [junit4] Suite: org.apache.lucene.search.TestPrefixInBooleanQuery
   [smoker]    [junit4] Completed [10/454] on J1 in 5.16s, 4 tests
   [smoker]    [junit4] 
   [smoker]    [junit4] Suite: org.apache.lucene.index.TestAllFilesDetectTruncation
   [smoker]    [junit4] Completed [11/454] on J1 in 3.61s, 1 test
   [smoker]    [junit4] 
   [smoker]    [junit4] Suite: org.apache.lucene.util.automaton.TestDeterminizeLexicon
   [smoker]    [junit4] Completed [12/454] on J0 in 8.80s, 1 test
   [smoker]    [junit4] 
   [smoker]    [junit4] Suite: org.apache.lucene.search.similarities.TestClassicSimilarity
   [smoker]    [junit4] Completed [13/454] on J0 in 0.96s, 11 tests
   [smoker]    [junit4] 
   [smoker]    [junit4] Suite: org.apache.lucene.analysis.TestWordlistLoader
   [smoker]    [junit4] Completed [14/454] on J0 in 0.08s, 3 tests
   [smoker]    [junit4] 
   [smoker]    [junit4] Suite: org.apache.lucene.codecs.lucene60.TestLucene60PointsFormat
   [smoker]    [junit4] IGNOR/A 0.03s J2 | TestLucene60PointsFormat.testRamBytesUsed
   [smoker]    [junit4]    > Assumption #1: 'slow' test group is disabled (@Slow())
   [smoker]    [junit4] IGNOR/A 0.01s J2 | TestLucene60PointsFormat.testMergeStability
   [smoker]    [junit4]    > Assumption #1: merge is not stable
   [smoker]    [junit4] IGNOR/A 0.00s J2 | TestLucene60PointsFormat.testRandomBinaryBig
   [smoker]    [junit4]    > Assumption #1: 'nightly' test group is disabled (@Nightly())
   [smoker]    [junit4] Completed [15/454] on J2 in 16.28s, 20 tests, 3 skipped
   [smoker]    [junit4] 
   [smoker]    [junit4] Suite: org.apache.lucene.index.TestDocValues
   [smoker]    [junit4] Completed [16/454] on J2 in 0.33s, 7 tests
   [smoker]    [junit4] 
   [smoker]    [junit4] Suite: org.apache.lucene.util.bkd.TestDocIdsWriter
   [smoker]    [junit4] Completed [17/454] on J1 in 12.60s, 2 tests
   [smoker]    [junit4] 
   [smoker]    [junit4] Suite: org.apache.lucene.search.TestIntRangeFieldQueries
   [smoker]    [junit4] IGNOR/A 0.05s J0 | TestIntRangeFieldQueries.testRandomBig
   [smoker]    [junit4]    > Assumption #1: 'nightly' test group is disabled (@Nightly())
   [smoker]    [junit4] Completed [18/454] on J0 in 11.97s, 5 tests, 1 skipped
   [smoker]    [junit4] 
   [smoker]    [junit4] Suite: org.apache.lucene.search.TestSimilarityProvider
   [smoker]    [junit4] Completed [19/454] on J0 in 0.10s, 1 test
   [smoker]    [junit4] 
   [smoker]    [junit4] Suite: org.apache.lucene.TestExternalCodecs
   [smoker]    [junit4] Completed [20/454] on J1 in 2.21s, 1 test
   [smoker]    [junit4] 
   [smoker]    [junit4] Suite: org.apache.lucene.search.spans.TestSpans
   [smoker]    [junit4] Completed [21/454] on J2 in 3.06s, 26 tests
   [smoker]    [junit4] 
   [smoker]    [junit4] Suite: org.apache.lucene.search.TestBooleanRewrites
   [smoker]    [junit4] Completed [22/454] on J0 in 1.60s, 10 tests
   [smoker]    [junit4] 
   [smoker]    [junit4] Suite: org.apache.lucene.index.TestSizeBoundedForceMerge
   [smoker]    [junit4] Completed [23/454] on J1 in 0.89s, 11 tests
   [smoker]    [junit4] 
   [smoker]    [junit4] Suite: org.apache.lucene.index.TestReadOnlyIndex
   [smoker]    [junit4] Completed [24/454] on J2 in 0.47s, 1 test
   [smoker]    [junit4] 
   [smoker]    [junit4] Suite: org.apache.lucene.util.TestRecyclingByteBlockAllocator
   [smoker]    [junit4] Completed [25/454] on J1 in 0.27s, 3 tests
   [smoker]    [junit4] 
   [smoker]    [junit4] Suite: org.apache.lucene.analysis.tokenattributes.TestPackedTokenAttributeImpl
   [smoker]    [junit4] Completed [26/454] on J2 in 0.08s, 4 tests
   [smoker]    [junit4] 
   [smoker]    [junit4] Suite: org.apache.lucene.index.TestPayloadsOnVectors
   [smoker]    [junit4] Completed [27/454] on J2 in 0.22s, 3 tests
   [smoker]    [junit4] 
   [smoker]    [junit4] Suite: org.apache.lucene.index.TestPersistentSnapshotDeletionPolicy
   [smoker]    [junit4] Completed [28/454] on J0 in 2.37s, 13 tests
   [smoker]    [junit4] 
   [smoker]    [junit4] Suite: org.apache.lucene.search.TestNGramPhraseQuery
   [smoker]    [junit4] Completed [29/454] on J0 in 0.44s, 1 test
   [smoker]    [junit4] 
   [smoker]    [junit4] Suite: org.apache.lucene.index.TestIndexWriterThreadsToSegments
   [smoker]    [junit4] Completed [30/454] on J2 in 7.84s, 4 tests
   [smoker]    [junit4] 
   [smoker]    [junit4] Suite: org.apache.lucene.search.TestSearcherManager
   [smoker]    [junit4] Completed [31/454] on J1 in 13.05s, 11 tests
   [smoker]    [junit4] 
   [smoker]    [junit4] Suite: org.apache.lucene.index.TestBagOfPositions
   [smoker]    [junit4] Completed [32/454] on J0 in 13.82s, 1 test
   [smoker]    [junit4] 
   [smoker]    [junit4] Suite: org.apache.lucene.index.TestMixedDocValuesUpdates
   [smoker]    [junit4] IGNOR/A 0.03s J1 | TestMixedDocValuesUpdates.testTonsOfUpdates
   [smoker]    [junit4]    > Assumption #1: 'nightly' test group is disabled (@Nightly())
   [smoker]    [junit4] Completed [33/454] on J1 in 4.95s, 4 tests, 1 skipped
   [smoker]    [junit4] 
   [smoker]    [junit4] Suite: org.apache.lucene.index.TestTermdocPerf
   [smoker]    [junit4] Completed [34/454] on J1 in 0.07s, 1 test
   [smoker]    [junit4] 
   [smoker]    [junit4] Suite: org.apache.lucene.index.TestFieldInvertState
   [smoker]    [junit4] Completed [35/454] on J1 in 0.54s, 2 tests
   [smoker]    [junit4] 
   [smoker]    [junit4] Suite: org.apache.lucene.search.spans.TestSpanOrQuery
   [smoker]    [junit4] Completed [36/454] on J1 in 0.15s, 3 tests
   [smoker]    [junit4] 
   [smoker]    [junit4] Suite: org.apache.lucene.index.TestFilterLeafReader
   [smoker]    [junit4] Completed [37/454] on J1 in 0.36s, 3 tests
   [smoker]    [junit4] 
   [smoker]    [junit4] Suite: org.apache.lucene.index.TestFilterDirectoryReader
   [smoker]    [junit4] Completed [38/454] on J1 in 0.14s, 1 test
   [smoker]    [junit4] 
   [smoker]    [junit4] Suite: org.apache.lucene.index.TestStressIndexing
   [smoker]    [junit4] Completed [39/454] on J0 in 3.52s, 1 test
   [smoker]    [junit4] 
   [smoker]    [junit4] Suite: org.apache.lucene.index.TestTermVectorsWriter
   [smoker]    [junit4] Completed [40/454] on J0 in 0.79s, 15 tests
   [smoker]    [junit4] 
   [smoker]    [junit4] Suite: org.apache.lucene.index.TestMergeRateLimiter
   [smoker]    [junit4] Completed [41/454] on J0 in 0.06s, 1 test
   [smoker]    [junit4] 
   [smoker]    [junit4] Suite: org.apache.lucene.util.automaton.TestAutomaton
   [smoker]    [junit4] Completed [42/454] on J2 in 13.68s, 56 tests
   [smoker]    [junit4] 
   [smoker]    [junit4] Suite: org.apache.lucene.index.TestIndexWriterMergePolicy
   [smoker]    [junit4] Completed [43/454] on J2 in 6.02s, 7 tests
   [smoker]    [junit4] 
   [smoker]    [junit4] Suite: org.apache.lucene.index.TestByteSlices
   [smoker]    [junit4] Completed [44/454] on J1 in 9.99s, 1 test
   [smoker]    [junit4] 
   [smoker]    [junit4] Suite: org.apache.lucene.index.TestPrefixCodedTerms
   [smoker]    [junit4] Completed [45/454] on J1 in 0.61s, 3 tests
   [smoker]    [junit4] 
   [smoker]    [junit4] Suite: org.apache.lucene.store.TestByteArrayDataInput
   [smoker]    [junit4] Completed [46/454] on J1 in 0.09s, 1 test
   [smoker]    [junit4] 
   [smoker]    [junit4] Suite: org.apache.lucene.search.TestPhrasePrefixQuery
   [smoker]    [junit4] Completed [47/454] on J1 in 0.27s, 1 test
   [smoker]    [junit4] 
   [smoker]    [junit4] Suite: org.apache.lucene.util.mutable.TestMutableValues
   [smoker]    [junit4] Completed [48/454] on J1 in 0.22s, 6 tests
   [smoker]    [junit4] 
   [smoker]    [junit4] Suite: org.apache.lucene.index.TestReaderClosed
   [smoker]    [junit4] Completed [49/454] on J1 in 0.25s, 2 tests
   [smoker]    [junit4] 
   [smoker]    [junit4] Suite: org.apache.lucene.search.spans.TestSpanContainQuery
   [smoker]    [junit4] Completed [50/454] on J1 in 0.28s, 4 tests
   [smoker]    [junit4] 
   [smoker]    [junit4] Suite: org.apache.lucene.search.TestScoreCachingWrappingScorer
   [smoker]    [junit4] Completed [51/454] on J1 in 0.11s, 1 test
   [smoker]    [junit4] 
   [smoker]    [junit4] Suite: org.apache.lucene.util.TestFixedBitDocIdSet
   [smoker]    [junit4] Completed [52/454] on J1 in 4.54s, 5 tests
   [smoker]    [junit4] 
   [smoker]    [junit4] Suite: org.apache.lucene.index.TestBagOfPostings
   [smoker]    [junit4] Completed [53/454] on J2 in 12.26s, 1 test
   [smoker]    [junit4] 
   [smoker]    [junit4] Suite: org.apache.lucene.index.TestPayloads
   [smoker]    [junit4] Completed [54/454] on J2 in 0.91s, 7 tests
   [smoker]    [junit4] 
   [smoker]    [junit4] Suite: org.apache.lucene.util.TestWeakIdentityMap
   [smoker]    [junit4] Completed [55/454] on J1 in 10.26s, 2 tests
   [smoker]    [junit4] 
   [smoker]    [junit4] Suite: org.apache.lucene.search.TestPhraseQuery
   [smoker]    [junit4] Completed [56/454] on J1 in 4.20s, 21 tests
   [smoker]    [junit4] 
   [smoker]    [junit4] Suite: org.apache.lucene.geo.TestPolygon
   [smoker]    [junit4] Completed [57/454] on J1 in 0.17s, 15 tests
   [smoker]    [junit4] 
   [smoker]    [junit4] Suite: org.apache.lucene.analysis.TestToken
   [smoker]    [junit4] Completed [58/454] on J1 in 0.15s, 5 tests
   [smoker]    [junit4] 
   [smoker]    [junit4] Suite: org.apache.lucene.search.similarities.TestBM25Similarity
   [smoker]    [junit4] Completed [59/454] on J1 in 0.16s, 2 tests
   [smoker]    [junit4] 
   [smoker]    [junit4] Suite: org.apache.lucene.index.TestIndexWriterReader
   [smoker]    [junit4] IGNOR/A 0.00s J2 | TestIndexWriterReader.testDuringAddIndexes
   [smoker]    [junit4]    > Assumption #1: 'nightly' test group is disabled (@Nightly())
   [smoker]    [junit4] IGNOR/A 0.00s J2 | TestIndexWriterReader.testAddIndexesAndDoDeletesThreads
   [smoker]    [junit4]    > Assumption #1: 'slow' test group is disabled (@Slow())
   [smoker]    [junit4] Completed [60/454] on J2 in 11.95s, 23 tests, 2 skipped
   [smoker]    [junit4] 
   [smoker]    [junit4] Suite: org.apache.lucene.search.spans.TestSpanTermQuery
   [smoker]    [junit4] Completed [61/454] on J2 in 0.14s, 2 tests
   [smoker]    [junit4] 
   [smoker]    [junit4] Suite: org.apache.lucene.search.TestSortRescorer
   [smoker]    [junit4] Completed [62/454] on J2 in 2.20s, 2 tests
   [smoker]    [junit4] 
   [smoker]    [junit4] Suite: org.apache.lucene.util.TestSentinelIntSet
   [smoker]    [junit4] Completed [63/454] on J2 in 0.49s, 2 tests
   [smoker]    [junit4] 
   [smoker]    [junit4] Suite: org.apache.lucene.search.TestDocValuesScoring
   [smoker]    [junit4] Completed [64/454] on J2 in 0.42s, 1 test
   [smoker]    [junit4] 
   [smoker]    [junit4] Suite: org.apache.lucene.geo.TestGeoUtils
   [smoker]    [junit4] Completed [65/454] on J0 in 38.46s, 7 tests
   [smoker]    [junit4] 
   [smoker]    [junit4] Suite: org.apache.lucene.index.TestFilterCodecReader
   [smoker]    [junit4] Completed [66/454] on J0 in 0.12s, 1 test
   [smoker]    [junit4] 
   [smoker]    [junit4] Suite: org.apache.lucene.search.TestScorerPerf
   [smoker]    [junit4] Completed [67/454] on J2 in 12.95s, 1 test
   [smoker]    [junit4] 
   [smoker]    [junit4] Suite: org.apache.lucene.search.TestDocValuesQueries
   [smoker]    [junit4] Completed [68/454] on J1 in 23.94s, 10 tests
   [smoker]    [junit4] 
   [smoker]    [junit4] Suite: org.apache.lucene.search.TestSearchWithThreads
   [smoker]    [junit4] Completed [69/454] on J2 in 7.97s, 1 test
   [smoker]    [junit4] 
   [smoker]    [junit4] Suite: org.apache.lucene.search.TestUsageTrackingFilterCachingPolicy
   [smoker]    [junit4] Completed [70/454] on J2 in 0.21s, 4 tests
   [smoker]    [junit4] 
   [smoker]    [junit4] Suite: org.apache.lucene.search.TestSloppyPhraseQuery2
   [smoker]    [junit4] Completed [71/454] on J2 in 5.16s, 9 tests
   [smoker]    [junit4] 
   [smoker]    [junit4] Suite: org.apache.lucene.search.MultiCollectorTest
   [smoker]    [junit4] Completed [72/454] on J2 in 0.27s, 4 tests
   [smoker]    [junit4] 
   [smoker]    [junit4] Suite: org.apache.lucene.index.TestTieredMergePolicy
   [smoker]    [junit4] Completed [73/454] on J1 in 10.80s, 6 tests
   [smoker]    [junit4] 
   [smoker]    [junit4] Suite: org.apache.lucene.search.TestSameScoresWithThreads
   [smoker]    [junit4] Completed [74/454] on J1 in 1.83s, 1 test
   [smoker]    [junit4] 
   [smoker]    [junit4] Suite: org.apache.lucene.search.TermInSetQueryTest
   [smoker]    [junit4] Completed [75/454] on J2 in 4.67s, 10 tests
   [smoker]    [junit4] 
   [smoker]    [junit4] Suite: org.apache.lucene.util.TestFilterIterator
   [smoker]    [junit4] Completed [76/454] on J1 in 0.64s, 8 tests
   [smoker]    [junit4] 
   [smoker]    [junit4] Suite: org.apache.lucene.search.TestPositionIncrement
   [smoker]    [junit4] Completed [77/454] on J1 in 0.31s, 2 tests
   [smoker]    [junit4] 
   [smoker]    [junit4] Suite: org.apache.lucene.store.TestGrowableByteArrayDataOutput
   [smoker]    [junit4] Completed [78/454] on J0 in 30.71s, 2 tests
   [smoker]    [junit4] 
   [smoker]    [junit4] Suite: org.apache.lucene.index.TestIsCurrent
   [smoker]    [junit4] Completed [79/454] on J0 in 0.26s, 2 tests
   [smoker]    [junit4] 
   [smoker]    [junit4] Suite: org.apache.lucene.index.TestFlex
   [smoker]    [junit4] Completed [80/454] on J0 in 1.30s, 2 tests
   [smoker]    [junit4] 
   [smoker]    [junit4] Suite: org.apache.lucene.index.TestNRTReaderWithThreads
   [smoker]    [junit4] Completed [81/454] on J2 in 6.09s, 1 test
   [smoker]    [junit4] 
   [smoker]    [junit4] Suite: org.apache.lucene.util.TestIntArrayDocIdSet
   [smoker]    [junit4] Completed [82/454] on J2 in 11.34s, 5 tests
   [smoker]    [junit4] 
   [smoker]    [junit4] Suite: org.apache.lucene.util.TestAttributeSource
   [smoker]    [junit4] Completed [83/454] on J2 in 0.30s, 7 tests
   [smoker]    [junit4] 
   [smoker]    [junit4] Suite: org.apache.lucene.search.TestSubScorerFreqs
   [smoker]    [junit4] Completed [84/454] on J2 in 0.37s, 3 tests
   [smoker]    [junit4] 
   [smoker]    [junit4] Suite: org.apache.lucene.search.similarities.TestSimilarity2
   [smoker]    [junit4] Completed [85/454] on J2 in 1.41s, 8 tests
   [smoker]    [junit4] 
   [smoker]    [junit4] Suite: org.apache.lucene.search.TestMultiset
   [smoker]    [junit4] Completed [86/454] on J2 in 0.13s, 2 tests
   [smoker]    [junit4] 
   [smoker]    [junit4] Suite: org.apache.lucene.codecs.compressing.TestFastCompressionMode
   [smoker]    [junit4] Completed [87/454] on J2 in 4.16s, 11 tests
   [smoker]    [junit4] 
   [smoker]    [junit4] Suite: org.apache.lucene.index.TestLogMergePolicy
   [smoker]    [junit4] Completed [88/454] on J2 in 0.40s, 2 tests
   [smoker]    [junit4] 
   [smoker]    [junit4] Suite: org.apache.lucene.index.TestAllFilesHaveChecksumFooter
   [smoker]    [junit4] Completed [89/454] on J2 in 0.94s, 1 test
   [smoker]    [junit4] 
   [smoker]    [junit4] Suite: org.apache.lucene.codecs.perfield.TestPerFieldPostingsFormat
   [smoker]    [junit4] IGNOR/A 0.00s J0 | TestPerFieldPostingsFormat.testPostingsEnumReuse
   [smoker]    [junit4]    > Assumption #1: The MockRandom PF randomizes content on the fly, so we can't check it
   [smoker]    [junit4] IGNOR/A 0.04s J0 | TestPerFieldPostingsFormat.testMergeStability
   [smoker]    [junit4]    > Assumption #1: The MockRandom PF randomizes content on the fly, so we can't check it
   [smoker]    [junit4] IGNOR/A 0.04s J0 | TestPerFieldPostingsFormat.testRamBytesUsed
   [smoker]    [junit4]    > Assumption #1: 'slow' test group is disabled (@Slow())
   [smoker]    [junit4] Completed [90/454] on J0 in 22.56s, 25 tests, 3 skipped
   [smoker]    [junit4] 
   [smoker]    [junit4] Suite: org.apache.lucene.search.similarities.TestSimilarityBase
   [smoker]    [junit4] Completed [91/454] on J2 in 1.47s, 30 tests
   [smoker]    [junit4] 
   [smoker]    [junit4] Suite: org.apache.lucene.index.TestIndexWriterConfig
   [smoker]    [junit4] Completed [92/454] on J0 in 0.36s, 8 tests
   [smoker]    [junit4] 
   [smoker]    [junit4] Suite: org.apache.lucene.geo.TestGeoEncodingUtils
   [smoker]    [junit4] Completed [93/454] on J2 in 5.75s, 3 tests
   [smoker]    [junit4] 
   [smoker]    [junit4] Suite: org.apache.lucene.search.TestLRUQueryCache
   [smoker]    [junit4] Completed [94/454] on J1 in 33.92s, 20 tests
   [smoker]    [junit4] 
   [smoker]    [junit4] Suite: org.apache.lucene.util.automaton.LimitedFiniteStringsIteratorTest
   [smoker]    [junit4] Completed [95/454] on J1 in 1.35s, 6 tests
   [smoker]    [junit4] 
   [smoker]    [junit4] Suite: org.apache.lucene.codecs.compressing.TestHighCompressionMode
   [smoker]    [junit4] Completed [96/454] on J2 in 4.79s, 7 tests
   [smoker]    [junit4] 
   [smoker]    [junit4] Suite: org.apache.lucene.analysis.tokenattributes.TestCharTermAttributeImpl
   [smoker]    [junit4] Completed [97/454] on J2 in 2.70s, 12 tests
   [smoker]    [junit4] 
   [smoker]    [junit4] Suite: org.apache.lucene.store.TestSimpleFSLockFactory
   [smoker]    [junit4] Completed [98/454] on J0 in 18.15s, 7 tests
   [smoker]    [junit4] 
   [smoker]    [junit4] Suite: org.apache.lucene.search.TestTotalHitCountCollector
   [smoker]    [junit4] Completed [99/454] on J0 in 0.07s, 1 test
   [smoker]    [junit4] 
   [smoker]    [junit4] Suite: org.apache.lucene.search.TestShardSearching
   [smoker]    [junit4] Completed [100/454] on J2 in 7.44s, 1 test
   [smoker]    [junit4] 
   [smoker]    [junit4] Suite: org.apache.lucene.store.TestBufferedIndexInput
   [smoker]    [junit4] Completed [101/454] on J2 in 2.42s, 4 tests
   [smoker]    [junit4] 
   [smoker]    [junit4] Suite: org.apache.lucene.search.TestComplexExplanationsOfNonMatches
   [smoker]    [junit4] Completed [102/454] on J2 in 0.77s, 21 tests
   [smoker]    [junit4] 
   [smoker]    [junit4] Suite: org.apache.lucene.document.TestField
   [smoker]    [junit4] Completed [103/454] on J2 in 0.40s, 23 tests
   [smoker]    [junit4] 
   [smoker]    [junit4] Suite: org.apache.lucene.search.TestSimpleExplanations
   [smoker]    [junit4] Completed [104/454] on J0 in 8.71s, 70 tests
   [smoker]    [junit4] 
   [smoker]    [junit4] Suite: org.apache.lucene.index.TestSegmentReader
   [smoker]    [junit4] Completed [105/454] on J2 in 4.00s, 7 tests
   [smoker]    [junit4] 
   [smoker]    [junit4] Suite: org.apache.lucene.codecs.perfield.TestPerFieldPostingsFormat2
   [smoker]    [junit4] Completed [106/454] on J2 in 2.58s, 6 tests
   [smoker]    [junit4] 
   [smoker]    [junit4] Suite: org.apache.lucene.search.TestControlledRealTimeReopenThread
   [smoker]    [junit4] IGNOR/A 0.00s J0 | TestControlledRealTimeReopenThread.testCRTReopen
   [smoker]    [junit4]    > Assumption #1: 'awaitsfix' test group is disabled (@AwaitsFix(bugUrl=https://issues.apache.org/jira/browse/LUCENE-5737))
   [smoker]    [junit4] Completed [107/454] on J0 in 4.54s, 6 tests, 1 skipped
   [smoker]    [junit4] 
   [smoker]    [junit4] Suite: org.apache.lucene.search.TestMultiCollector
   [smoker]    [junit4] Completed [108/454] on J0 in 0.98s, 2 tests
   [smoker]    [junit4] 
   [smoker]    [junit4] Suite: org.apache.lucene.index.TestAllFilesCheckIndexHeader
   [smoker]    [junit4] Completed [109/454] on J0 in 1.94s, 1 test
   [smoker]    [junit4] 
   [smoker]    [junit4] Suite: org.apache.lucene.search.TestConstantScoreQuery
   [smoker]    [junit4] Completed [110/454] on J0 in 0.56s, 5 tests
   [smoker]    [junit4] 
   [smoker]    [junit4] Suite: org.apache.lucene.index.TestStressDeletes
   [smoker]    [junit4] Completed [111/454] on J0 in 3.21s, 1 test
   [smoker]    [junit4] 
   [smoker]    [junit4] Suite: org.apache.lucene.search.TestAutomatonQuery
   [smoker]    [junit4] Completed [112/454] on J0 in 7.34s, 8 tests
   [smoker]    [junit4] 
   [smoker]    [junit4] Suite: org.apache.lucene.util.TestBytesRef
   [smoker]    [junit4] Completed [113/454] on J0 in 0.31s, 3 tests
   [smoker]    [junit4] 
   [smoker]    [junit4] Suite: org.apache.lucene.search.TestBooleanMinShouldMatch
   [smoker]    [junit4] Completed [114/454] on J0 in 5.37s, 17 tests
   [smoker]    [junit4] 
   [smoker]    [junit4] Suite: org.apache.lucene.index.TestReaderWrapperDVTypeCheck
   [smoker]    [junit4] Completed [115/454] on J0 in 0.22s, 1 test
   [smoker]    [junit4] 
   [smoker]    [junit4] Suite: org.apache.lucene.util.automaton.TestUTF32ToUTF8
   [smoker]    [junit4] Completed [116/454] on J0 in 7.08s, 6 tests
   [smoker]    [junit4] 
   [smoker]    [junit4] Suite: org.apache.lucene.index.TestManyFields
   [smoker]    [junit4] Completed [117/454] on J0 in 5.42s, 3 tests
   [smoker]    [junit4] 
   [smoker]    [junit4] Suite: org.apache.lucene.geo.TestPolygon2D
   [smoker]    [junit4] Completed [118/454] on J2 in 34.08s, 10 tests
   [smoker]    [junit4] 
   [smoker]    [junit4] Suite: org.apache.lucene.util.TestStringHelper
   [smoker]    [junit4] Completed [119/454] on J2 in 0.07s, 7 tests
   [smoker]    [junit4] 
   [smoker]    [junit4] Suite: org.apache.lucene.index.Test2BBinaryDocValues
   [smoker]    [junit4] IGNOR/A 0.00s J2 | Test2BBinaryDocValues.testVariableBinary
   [smoker]    [junit4]    > Assumption #1: 'monster' test group is disabled (@Monster(value=takes ~ 6 hours if the heap is 5gb))
   [smoker]    [junit4] IGNOR/A 0.00s J2 | Test2BBinaryDocValues.testFixedBinary
   [smoker]    [junit4]    > Assumption #1: 'monster' test group is disabled (@Monster(value=takes ~ 6 hours if the heap is 5gb))
   [smoker]    [junit4] Completed [120/454] on J2 in 0.04s, 2 tests, 2 skipped
   [smoker]    [junit4] 
   [smoker]    [junit4] Suite: org.apache.lucene.search.TestSimpleExplanationsOfNonMatches
   [smoker]    [junit4] Completed [121/454] on J2 in 0.51s, 70 tests
   [smoker]    [junit4] 
   [smoker]    [junit4] Suite: org.apache.lucene.index.TestMultiTermsEnum
   [smoker]    [junit4] Completed [122/454] on J2 in 0.17s, 1 test
   [smoker]    [junit4] 
   [smoker]    [junit4] Suite: org.apache.lucene.codecs.lucene50.TestBlockPostingsFormat2
   [smoker]    [junit4] Completed [123/454] on J0 in 10.20s, 4 tests
   [smoker]    [junit4] 
   [smoker]    [junit4] Suite: org.apache.lucene.search.spans.TestSpansEnum
   [smoker]    [junit4] Completed [124/454] on J0 in 0.82s, 7 tests
   [smoker]    [junit4] 
   [smoker]    [junit4] Suite: org.apache.lucene.index.TestNRTReaderCleanup
   [smoker]    [junit4] Completed [125/454] on J0 in 0.12s, 1 test
   [smoker]    [junit4] 
   [smoker]    [junit4] Suite: org.apache.lucene.search.TestFieldCacheRewriteMethod
   [smoker]    [junit4] Completed [126/454] on J2 in 18.36s, 2 tests
   [smoker]    [junit4] 
   [smoker]    [junit4] Suite: org.apache.lucene.index.TestParallelCompositeReader
   [smoker]    [junit4] Completed [127/454] on J2 in 1.54s, 11 tests
   [smoker]    [junit4] 
   [smoker]    [junit4] Suite: org.apache.lucene.index.TestTwoPhaseCommitTool
   [smoker]    [junit4] Completed [128/454] on J2 in 0.30s, 3 tests
   [smoker]    [junit4] 
   [smoker]    [junit4] Suite: org.apache.lucene.util.Test2BPagedBytes
   [smoker]    [junit4] IGNOR/A 0.00s J2 | Test2BPagedBytes.test
   [smoker]    [junit4]    > Assumption #1: 'monster' test group is disabled (@Monster(value=You must increase heap to > 2 G to run this))
   [smoker]    [junit4] Completed [129/454] on J2 in 0.08s, 1 test, 1 skipped
   [smoker]    [junit4] 
   [smoker]    [junit4] Suite: org.apache.lucene.util.TestByteBlockPool
   [smoker]    [junit4] Completed [130/454] on J2 in 0.50s, 2 tests
   [smoker]    [junit4] 
   [smoker]    [junit4] Suite: org.apache.lucene.analysis.TestCachingTokenFilter
   [smoker]    [junit4] Completed [131/454] on J2 in 0.18s, 2 tests
   [smoker]    [junit4] 
   [smoker]    [junit4] Suite: org.apache.lucene.TestAssertions
   [smoker]    [junit4] Completed [132/454] on J2 in 0.22s, 1 test
   [smoker]    [junit4] 
   [smoker]    [junit4] Suite: org.apache.lucene.index.TestNoMergePolicy
   [smoker]    [junit4] Completed [133/454] on J2 in 0.29s, 4 tests
   [smoker]    [junit4] 
   [smoker]    [junit4] Suite: org.apache.lucene.index.Test2BNumericDocValues
   [smoker]    [junit4] IGNOR/A 0.00s J2 | Test2BNumericDocValues.testNumerics
   [smoker]    [junit4]    > Assumption #1: 'monster' test group is disabled (@Monster(value=takes ~ 2 hours if the heap is 5gb))
   [smoker]    [junit4] Completed [134/454] on J2 in 0.01s, 1 test, 1 skipped
   [smoker]    [junit4] 
   [smoker]    [junit4] Suite: org.apache.lucene.codecs.lucene70.TestIndexedDISI
   [smoker]    [junit4] Completed [135/454] on J0 in 17.40s, 10 tests
   [smoker]    [junit4] 
   [smoker]    [junit4] Suite: org.apache.lucene.index.TestUpgradeIndexMergePolicy
   [smoker]    [junit4] Completed [136/454] on J0 in 0.26s, 1 test
   [smoker]    [junit4] 
   [smoker]    [junit4] Suite: org.apache.lucene.util.packed.TestDirectMonotonic
   [smoker]    [junit4] Completed [137/454] on J2 in 6.18s, 4 tests
   [smoker]    [junit4] 
   [smoker]    [junit4] Suite: org.apache.lucene.index.TestLazyProxSkipping
   [smoker]    [junit4] Completed [138/454] on J2 in 1.47s, 2 tests
   [smoker]    [junit4] 
   [smoker]    [junit4] Suite: org.apache.lucene.util.TestIntroSelector
   [smoker]    [junit4] Completed [139/454] on J0 in 3.94s, 2 tests
   [smoker]    [junit4] 
   [smoker]    [junit4] Suite: org.apache.lucene.index.TestIndexWriter
   [smoker]    [junit4] Completed [140/454] on J0 in 17.46s, 72 tests, 1 skipped
   [smoker]    [junit4] 
   [smoker]    [junit4] Suite: org.apache.lucene.index.TestOmitNorms
   [smoker]    [junit4] Completed [141/454] on J0 in 3.64s, 5 tests
   [smoker]    [junit4] 
   [smoker]    [junit4] Suite: org.apache.lucene.codecs.perfield.TestPerFieldDocValuesFormat
   [smoker]    [junit4] IGNOR/A 0.00s J1 | TestPerFieldDocValuesFormat.testRamBytesUsed
   [smoker]    [junit4]    > Assumption #1: 'slow' test group is disabled (@Slow())
   [smoker]    [junit4] IGNOR/A 0.00s J1 | TestPerFieldDocValuesFormat.testThreads3
   [smoker]    [junit4]    > Assumption #1: 'slow' test group is disabled (@Slow())
   [smoker]    [junit4] IGNOR/A 0.02s J1 | TestPerFieldDocValuesFormat.testThreads2
   [smoker]    [junit4]    > Assumption #1: 'slow' test group is disabled (@Slow())
   [smoker]    [junit4] Completed [142/454] on J1 in 126.67s, 110 tests, 3 skipped
   [smoker]    [junit4] 
   [smoker]    [junit4] Suite: org.apache.lucene.search.TestDoubleRangeFieldQueries
   [smoker]    [junit4] IGNOR/A 0.00s J0 | TestDoubleRangeFieldQueries.testRandomBig
   [smoker]    [junit4]    > Assumption #1: 'nightly' test group is disabled (@Nightly())
   [smoker]    [junit4] Completed [143/454] on J0 in 19.00s, 5 tests, 1 skipped
   [smoker]    [junit4] 
   [smoker]    [junit4] Suite: org.apache.lucene.search.spans.TestSpanExplanations
   [smoker]    [junit4] Completed [144/454] on J1 in 2.98s, 30 tests
   [smoker]    [junit4] 
   [smoker]    [junit4] Suite: org.apache.lucene.index.TestForceMergeForever
   [smoker]    [junit4] Completed [145/454] on J0 in 2.21s, 1 test
   [smoker]    [junit4] 
   [smoker]    [junit4] Suite: org.apache.lucene.document.TestDateTools
   [smoker]    [junit4] Completed [146/454] on J0 in 0.13s, 5 tests
   [smoker]    [junit4] 
   [smoker]    [junit4] Suite: org.apache.lucene.search.TestEarlyTerminatingSortingCollector
   [smoker]    [junit4] Completed [147/454] on J2 in 44.77s, 4 tests
   [smoker]    [junit4] 
   [smoker]    [junit4] Suite: org.apache.lucene.search.TestPrefixRandom
   [smoker]    [junit4] Completed [148/454] on J1 in 1.77s, 1 test
   [smoker]    [junit4] 
   [smoker]    [junit4] Suite: org.apache.lucene.index.TestSegmentInfos
   [smoker]    [junit4] Completed [149/454] on J1 in 0.07s, 4 tests
   [smoker]    [junit4] 
   [smoker]    [junit4] Suite: org.apache.lucene.util.TestBytesRefArray
   [smoker]    [junit4] Completed [150/454] on J1 in 0.63s, 2 tests
   [smoker]    [junit4] 
   [smoker]    [junit4] Suite: org.apache.lucene.store.TestSingleInstanceLockFactory
   [smoker]    [junit4] Completed [151/454] on J1 in 3.56s, 7 tests
   [smoker]    [junit4] 
   [smoker]    [junit4] Suite: org.apache.lucene.index.TestCustomNorms
   [smoker]    [junit4] Completed [152/454] on J1 in 2.71s, 1 test
   [smoker]    [junit4] 
   [smoker]    [junit4] Suite: org.apache.lucene.util.TestRecyclingIntBlockAllocator
   [smoker]    [junit4] Completed [153/454] on J1 in 0.33s, 3 tests
   [smoker]    [junit4] 
   [smoker]    [junit4] Suite: org.apache.lucene.index.TestIndexWriterOutOfFileDescriptors
   [smoker]    [junit4] Completed [154/454] on J1 in 9.34s, 1 test
   [smoker]    [junit4] 
   [smoker]    [junit4] Suite: org.apache.lucene.search.TestIndexOrDocValuesQuery
   [smoker]    [junit4] Completed [155/454] on J1 in 0.30s, 1 test
   [smoker]    [junit4] 
   [smoker]    [junit4] Suite: org.apache.lucene.search.TestSimpleExplanationsWithFillerDocs
   [smoker]    [junit4] IGNOR/A 0.00s J1 | TestSimpleExplanationsWithFillerDocs.testDMQ2
   [smoker]    [junit4]    > Assumption #1: 'slow' test group is disabled (@Slow())
   [smoker]    [junit4] IGNOR/A 0.00s J1 | TestSimpleExplanationsWithFillerDocs.testMultiFieldBQ1
   [smoker]    [junit4]    > Assumption #1: 'slow' test group is disabled (@Slow())
   [smoker]    [junit4] IGNOR/A 0.00s J1 | TestSimpleExplanationsWithFillerDocs.testMultiFieldBQ3
   [smoker]    [junit4]    > Assumption #1: 'slow' test group is disabled (@Slow())
   [smoker]    [junit4] IGNOR/A 0.00s J1 | TestSimpleExplanationsWithFillerDocs.testDMQ3
   [smoker]    [junit4]    > Assumption #1: 'slow' test group is disabled (@Slow())
   [smoker]    [junit4] IGNOR/A 0.00s J1 | TestSimpleExplanationsWithFillerDocs.testDMQ1
   [smoker]    [junit4]    > Assumption #1: 'slow' test group is disabled (@Slow())
   [smoker]    [junit4] IGNOR/A 0.00s J1 | TestSimpleExplanationsWithFillerDocs.testBQ24
   [smoker]    [junit4]    > Assumption #1: 'slow' test group is disabled (@Slow())
   [smoker]    [junit4] IGNOR/A 0.00s J1 | TestSimpleExplanationsWithFillerDocs.testMPQ1
   [smoker]    [junit4]    > Assumption #1: 'slow' test group is disabled (@Slow())
   [smoker]    [junit4] IGNOR/A 0.00s J1 | TestSimpleExplanationsWithFillerDocs.testBQ5
   [smoker]    [junit4]    > Assumption #1: 'slow' test group is disabled (@Slow())
   [smoker]    [junit4] IGNOR/A 0.00s J1 | TestSimpleExplanationsWithFillerDocs.testEquality
   [smoker]    [junit4]    > Assumption #1: 'slow' test group is disabled (@Slow())
   [smoker]    [junit4] IGNOR/A 0.00s J1 | TestSimpleExplanationsWithFillerDocs.testMultiFieldBQofPQ3
   [smoker]    [junit4]    > Assumption #1: 'slow' test group is disabled (@Slow())
   [smoker]    [junit4] IGNOR/A 0.00s J1 | TestSimpleExplanationsWithFillerDocs.testDMQ5
   [smoker]    [junit4]    > Assumption #1: 'slow' test group is disabled (@Slow())
   [smoker]    [junit4] IGNOR/A 0.00s J1 | TestSimpleExplanationsWithFillerDocs.testDMQ8
   [smoker]    [junit4]    > Assumption #1: 'slow' test group is disabled (@Slow())
   [smoker]    [junit4] IGNOR/A 0.00s J1 | TestSimpleExplanationsWithFillerDocs.testP5
   [smoker]    [junit4]    > Assumption #1: 'slow' test group is disabled (@Slow())
   [smoker]    [junit4] IGNOR/A 0.00s J1 | TestSimpleExplanationsWithFillerDocs.testT2
   [smoker]    [junit4]    > Assumption #1: 'slow' test group is disabled (@Slow())
   [smoker]    [junit4] IGNOR/A 0.00s J1 | TestSimpleExplanationsWithFillerDocs.testBQ9
   [smoker]    [junit4]    > Assumption #1: 'slow' test group is disabled (@Slow())
   [smoker]    [junit4] IGNOR/A 0.00s J1 | TestSimpleExplanationsWithFillerDocs.testMPQ3
   [smoker]    [junit4]    > Assumption #1: 'slow' test group is disabled (@Slow())
   [smoker]    [junit4] IGNOR/A 0.00s J1 | TestSimpleExplanationsWithFillerDocs.testMultiFieldBQofPQ6
   [smoker]    [junit4]    > Assumption #1: 'slow' test group is disabled (@Slow())
   [smoker]    [junit4] IGNOR/A 0.00s J1 | TestSimpleExplanationsWithFillerDocs.testMPQ5
   [smoker]    [junit4]    > Assumption #1: 'slow' test group is disabled (@Slow())
   [smoker]    [junit4] IGNOR/A 0.00s J1 | TestSimpleExplanationsWithFillerDocs.testMultiFieldBQofPQ7
   [smoker]    [junit4]    > Assumption #1: 'slow' test group is disabled (@Slow())
   [smoker]    [junit4] IGNOR/A 0.00s J1 | TestSimpleExplanationsWithFillerDocs.testMultiFieldBQ10
   [smoker]    [junit4]    > Assumption #1: 'slow' test group is disabled (@Slow())
   [smoker]    [junit4] IGNOR/A 0.00s J1 | TestSimpleExplanationsWithFillerDocs.testP6
   [smoker]    [junit4]    > Assumption #1: 'slow' test group is disabled (@Slow())
   [smoker]    [junit4] IGNOR/A 0.00s J1 | TestSimpleExplanationsWithFillerDocs.testBQ17
   [smoker]    [junit4]    > Assumption #1: 'slow' test group is disabled (@Slow())
   [smoker]    [junit4] IGNOR/A 0.01s J1 | TestSimpleExplanationsWithFillerDocs.testDMQ4
   [smoker]    [junit4]    > Assumption #1: 'slow' test group is disabled (@Slow())
   [smoker]    [junit4] IGNOR/A 0.00s J1 | TestSimpleExplanationsWithFillerDocs.testDMQ9
   [smoker]    [junit4]    > Assumption #1: 'slow' test group is disabled (@Slow())
   [smoker]    [junit4] IGNOR/A 0.00s J1 | TestSimpleExplanationsWithFillerDocs.testMPQ4
   [smoker]    [junit4]    > Assumption #1: 'slow' test group is disabled (@Slow())
   [smoker]    [junit4] IGNOR/A 0.00s J1 | TestSimpleExplanationsWithFillerDocs.testCSQ2
   [smoker]    [junit4]    > Assumption #1: 'slow' test group is disabled (@Slow())
   [smoker]    [junit4] IGNOR/A 0.00s J1 | TestSimpleExplanationsWithFillerDocs.testMA2
   [smoker]    [junit4]    > Assumption #1: 'slow' test group is disabled (@Slow())
   [smoker]    [junit4] IGNOR/A 0.00s J1 | TestSimpleExplanationsWithFillerDocs.testCSQ3
   [smoker]    [junit4]    > Assumption #1: 'slow' test group is disabled (@Slow())
   [smoker]    [junit4] IGNOR/A 0.00s J1 | TestSimpleExplanationsWithFillerDocs.testBQ10
   [smoker]    [junit4]    > Assumption #1: 'slow' test group is disabled (@Slow())
   [smoker]    [junit4] IGNOR/A 0.00s J1 | TestSimpleExplanationsWithFillerDocs.testBQ11
   [smoker]    [junit4]    > Assumption #1: 'slow' test group is disabled (@Slow())
   [smoker]    [junit4] IGNOR/A 0.00s J1 | TestSimpleExplanationsWithFillerDocs.testBQ26
   [smoker]    [junit4]    > Assumption #1: 'slow' test group is disabled (@Slow())
   [smoker]    [junit4] IGNOR/A 0.00s J1 | TestSimpleExplanationsWithFillerDocs.testP4
   [smoker]    [junit4]    > Assumption #1: 'slow' test group is disabled (@Slow())
   [smoker]    [junit4] IGNOR/A 0.00s J1 | TestSimpleExplanationsWithFillerDocs.testMultiFieldBQ6
   [smoker]    [junit4]    > Assumption #1: 'slow' test group is disabled (@Slow())
   [smoker]    [junit4] IGNOR/A 0.00s J1 | TestSimpleExplanationsWithFillerDocs.testP1
   [smoker]    [junit4]    > Assumption #1: 'slow' test group is disabled (@Slow())
   [smoker]    [junit4] IGNOR/A 0.00s J1 | TestSimpleExplanationsWithFillerDocs.testBQ20
   [smoker]    [junit4]    > Assumption #1: 'slow' test group is disabled (@Slow())
   [smoker]    [junit4] IGNOR/A 0.02s J1 | TestSimpleExplanationsWithFillerDocs.testP2
   [smoker]    [junit4]    > Assumption #1: 'slow' test group is disabled (@Slow())
   [smoker]    [junit4] IGNOR/A 0.00s J1 | TestSimpleExplanationsWithFillerDocs.testBQ16
   [smoker]    [junit4]    > Assumption #1: 'slow' test group is disabled (@Slow())
   [smoker]    [junit4] IGNOR/A 0.00s J1 | TestSimpleExplanationsWithFillerDocs.testBQ2
   [smoker]    [junit4]    > Assumption #1: 'slow' test group is disabled (@Slow())
   [smoker]    [junit4] IGNOR/A 0.00s J1 | TestSimpleExplanationsWithFillerDocs.testMultiFieldBQ7
   [smoker]    [junit4]    > Assumption #1: 'slow' test group is disabled (@Slow())
   [smoker]    [junit4] IGNOR/A 0.00s J1 | TestSimpleExplanationsWithFillerDocs.testP7
   [smoker]    [junit4]    > Assumption #1: 'slow' test group is disabled (@Slow())
   [smoker]    [junit4] IGNOR/A 0.00s J1 | TestSimpleExplanationsWithFillerDocs.testBQ15
   [smoker]    [junit4]    > Assumption #1: 'slow' test group is disabled (@Slow())
   [smoker]    [junit4] IGNOR/A 0.00s J1 | TestSimpleExplanationsWithFillerDocs.testBQ21
   [smoker]    [junit4]    > Assumption #1: 'slow' test group is disabled (@Slow())
   [smoker]    [junit4] IGNOR/A 0.00s J1 | TestSimpleExplanationsWithFillerDocs.testBQ4
   [smoker]    [junit4]    > Assumption #1: 'slow' test group is disabled (@Slow())
   [smoker]    [junit4] IGNOR/A 0.00s J1 | TestSimpleExplanationsWithFillerDocs.testP3
   [smoker]    [junit4]    > Assumption #1: 'slow' test group is disabled (@Slow())
   [smoker]    [junit4] IGNOR/A 0.00s J1 | TestSimpleExplanationsWithFillerDocs.testBQ25
   [smoker]    [junit4]    > Assumption #1: 'slow' test group is disabled (@Slow())
   [smoker]    [junit4] IGNOR/A 0.00s J1 | TestSimpleExplanationsWithFillerDocs.testMultiFieldBQofPQ1
   [smoker]    [junit4]    > Assumption #1: 'slow' test group is disabled (@Slow())
   [smoker]    [junit4] IGNOR/A 0.00s J1 | TestSimpleExplanationsWithFillerDocs.testBQ23
   [smoker]    [junit4]    > Assumption #1: 'slow' test group is disabled (@Slow())
   [smoker]    [junit4] IGNOR/A 0.00s J1 | TestSimpleExplanationsWithFillerDocs.testBQ19
   [smoker]    [junit4]    > Assumption #1: 'slow' test group is disabled (@Slow())
   [smoker]    [junit4] IGNOR/A 0.00s J1 | TestSimpleExplanationsWithFillerDocs.testDMQ7
   [smoker]    [junit4]    > Assumption #1: 'slow' test group is disabled (@Slow())
   [smoker]    [junit4] IGNOR/A 0.00s J1 | TestSimpleExplanationsWithFillerDocs.testMultiFieldBQofPQ4
   [smoker]    [junit4]    > Assumption #1: 'slow' test group is disabled (@Slow())
   [smoker]    [junit4] IGNOR/A 0.00s J1 | TestSimpleExplanationsWithFillerDocs.testBQ1
   [smoker]    [junit4]    > Assumption #1: 'slow' test group is disabled (@Slow())
   [smoker]    [junit4] IGNOR/A 0.00s J1 | TestSimpleExplanationsWithFillerDocs.testBQ14
   [smoker]    [junit4]    > Assumption #1: 'slow' test group is disabled (@Slow())
   [smoker]    [junit4] IGNOR/A 0.00s J1 | TestSimpleExplanationsWithFillerDocs.testMPQ6
   [smoker]    [junit4]    > Assumption #1: 'slow' test group is disabled (@Slow())
   [smoker]    [junit4] IGNOR/A 0.00s J1 | TestSimpleExplanationsWithFillerDocs.testBQ8
   [smoker]    [junit4]    > Assumption #1: 'slow' test group is disabled (@Slow())
   [smoker]    [junit4] IGNOR/A 0.00s J1 | TestSimpleExplanationsWithFillerDocs.testMultiFieldBQ9
   [smoker]    [junit4]    > Assumption #1: 'slow' test group is disabled (@Slow())
   [smoker]    [junit4] IGNOR/A 0.00s J1 | TestSimpleExplanationsWithFillerDocs.testBQ7
   [smoker]    [junit4]    > Assumption #1: 'slow' test group is disabled (@Slow())
   [smoker]    [junit4] IGNOR/A 0.00s J1 | TestSimpleExplanationsWithFillerDocs.testDMQ6
   [smoker]    [junit4]    > Assumption #1: 'slow' test group is disabled (@Slow())
   [smoker]    [junit4] IGNOR/A 0.00s J1 | TestSimpleExplanationsWithFillerDocs.testMultiFieldBQ2
   [smoker]    [junit4]    > Assumption #1: 'slow' test group is disabled (@Slow())
   [smoker]    [junit4] IGNOR/A 0.00s J1 | TestSimpleExplanationsWithFillerDocs.testBQ3
   [smoker]    [junit4]    > Assumption #1: 'slow' test group is disabled (@Slow())
   [smoker]    [junit4] IGNOR/A 0.01s J1 | TestSimpleExplanationsWithFillerDocs.testMultiFieldBQ5
   [smoker]    [junit4]    > Assumption #1: 'slow' test group is disabled (@Slow())
   [smoker]    [junit4] IGNOR/A 0.00s J1 | TestSimpleExplanationsWithFillerDocs.testSynonymQuery
   [smoker]    [junit4]    > Assumption #1: 'slow' test group is disabled (@Slow())
   [smoker]    [junit4] IGNOR/A 0.00s J1 | TestSimpleExplanationsWithFillerDocs.testT1
   [smoker]    [junit4]    > Assumption #1: 'slow' test group is disabled (@Slow())
   [smoker]    [junit4] IGNOR/A 0.00s J1 | TestSimpleExplanationsWithFillerDocs.testBQ6
   [smoker]    [junit4]    > Assumption #1: 'slow' test group is disabled (@Slow())
   [smoker]    [junit4] IGNOR/A 0.00s J1 | TestSimpleExplanationsWithFillerDocs.testMultiFieldBQofPQ5
   [smoker]    [junit4]    > Assumption #1: 'slow' test group is disabled (@Slow())
   [smoker]    [junit4] IGNOR/A 0.00s J1 | TestSimpleExplanationsWithFillerDocs.testMultiFieldBQ4
   [smoker]    [junit4]    > Assumption #1: 'slow' test group is disabled (@Slow())
   [smoker]    [junit4] IGNOR/A 0.00s J1 | TestSimpleExplanationsWithFillerDocs.testMultiFieldBQ8
   [smoker]    [junit4]    > Assumption #1: 'slow' test group is disabled (@Slow())
   [smoker]    [junit4] IGNOR/A 0.00s J1 | TestSimpleExplanationsWithFillerDocs.testCSQ1
   [smoker]    [junit4]    > Assumption #1: 'slow' test group is disabled (@Slow())
   [smoker]    [junit4] IGNOR/A 0.00s J1 | TestSimpleExplanationsWithFillerDocs.testMA1
   [smoker]    [junit4]    > Assumption #1: 'slow' test group is disabled (@Slow())
   [smoker]    [junit4] IGNOR/A 0.00s J1 | TestSimpleExplanationsWithFillerDocs.testMPQ2
   [smoker]    [junit4]    > Assumption #1: 'slow' test group is disabled (@Slow())
   [smoker]    [junit4] IGNOR/A 0.00s J1 | TestSimpleExplanationsWithFillerDocs.testMultiFieldBQofPQ2
   [smoker]    [junit4]    > Assumption #1: 'slow' test group is disabled (@Slow())
   [smoker]    [junit4] Completed [156/454] on J1 in 0.12s, 70 tests, 70 skipped
   [smoker]    [junit4] 
   [smoker]    [junit4] Suite: org.apache.lucene.search.TestFuzzyQuery
   [smoker]    [junit4] Completed [157/454] on J0 in 18.52s, 11 tests
   [smoker]    [junit4] 
   [smoker]    [junit4] Suite: org.apache.lucene.search.TestSortedNumericSortField
   [smoker]    [junit4] Completed [158/454] on J0 in 0.41s, 9 tests
   [smoker]    [junit4] 
   [smoker]    [junit4] Suite: org.apache.lucene.search.FuzzyTermOnShortTermsTest
   [smoker]    [junit4] Completed [159/454] on J1 in 0.40s, 1 test
   [smoker]    [junit4] 
   [smoker]    [junit4] Suite: org.apache.lucene.index.TestSumDocFreq
   [smoker]    [junit4] Completed [160/454] on J1 in 0.69s, 1 test
   [smoker]    [junit4] 
   [smoker]    [junit4] Suite: org.apache.lucene.util.automaton.FiniteStringsIteratorTest
   [smoker]    [junit4] Completed [161/454] on J0 in 1.22s, 7 tests
   [smoker]    [junit4] 
   [smoker]    [junit4] Suite: org.apache.lucene.index.TestIndexInput
   [smoker]    [junit4] Completed [162/454] on J0 in 3.89s, 2 tests
   [smoker]    [junit4] 
   [smoker]    [junit4] Suite: org.apache.lucene.search.TestComplexExplanations
   [smoker]    [junit4] Completed [163/454] on J1 in 5.36s, 21 tests
   [smoker]    [junit4] 
   [smoker]    [junit4] Suite: org.apache.lucene.search.TestElevationComparator
   [smoker]    [junit4] Completed [164/454] on J1 in 0.11s, 1 test
   [smoker]    [junit4] 
   [smoker]    [junit4] Suite: org.apache.lucene.search.spans.TestFieldMaskingSpanQuery
   [smoker]    [junit4] IGNOR/A 0.02s J0 | TestFieldMaskingSpanQuery.testSpans2
   [smoker]    [junit4]    > Assumption #1: Broken scoring: LUCENE-3723
   [smoker]    [junit4] IGNOR/A 0.02s J0 | TestFieldMaskingSpanQuery.testSimple2
   [smoker]    [junit4]    > Assumption #1: Broken scoring: LUCENE-3723
   [smoker]    [junit4] Completed [165/454] on J0 in 1.04s, 11 tests, 2 skipped
   [smoker]    [junit4] 
   [smoker]    [junit4] Suite: org.apache.lucene.util.TestVirtualMethod
   [smoker]    [junit4] Completed [166/454] on J1 in 0.10s, 2 tests
   [smoker]    [junit4] 
   [smoker]    [junit4] Suite: org.apache.lucene.index.TestMaxTermFrequency
   [smoker]    [junit4] Completed [167/454] on J0 in 0.78s, 1 test
   [smoker]    [junit4] 
   [smoker]    [junit4] Suite: org.apache.lucene.search.TestNeedsScores
   [smoker]    [junit4] Completed [168/454] on J0 in 0.24s, 4 tests
   [smoker]    [junit4] 
   [smoker]    [junit4] Suite: org.apache.lucene.search.spans.TestSpanMultiTermQueryWrapper
   [smoker]    [junit4] Completed [169/454] on J0 in 0.60s, 9 tests
   [smoker]    [junit4] 
   [smoker]    [junit4] Suite: org.apache.lucene.index.TestIndexingSequenceNumbers
   [smoker]    [junit4] IGNOR/A 0.00s J0 | TestIndexingSequenceNumbers.testStressConcurrentCommit
   [smoker]    [junit4]    > Assumption #1: 'slow' test group is disabled (@Slow())
   [smoker]    [junit4] IGNOR/A 0.00s J0 | TestIndexingSequenceNumbers.testStressConcurrentAddAndDeleteAndCommit
   [smoker]    [junit4]    > Assumption #1: 'slow' test group is disabled (@Slow())
   [smoker]    [junit4] IGNOR/A 0.00s J0 | TestIndexingSequenceNumbers.testStressUpdateSameID
   [smoker]    [junit4]    > Assumption #1: 'slow' test group is disabled (@Slow())
   [smoker]    [junit4] IGNOR/A 0.00s J0 | TestIndexingSequenceNumbers.testStressConcurrentDocValuesUpdatesCommit
   [smoker]    [junit4]    > Assumption #1: 'slow' test group is disabled (@Slow())
   [smoker]    [junit4] Completed [170/454] on J0 in 0.25s, 8 tests, 4 skipped
   [smoker]    [junit4] 
   [smoker]    [junit4] Suite: org.apache.lucene.TestMergeSchedulerExternal
   [smoker]    [junit4] Completed [171/454] on J1 in 3.74s, 2 tests
   [smoker]    [junit4] 
   [smoker]    [junit4] Suite: org.apache.lucene.store.TestRateLimiter
   [smoker]    [junit4] Completed [172/454] on J1 in 0.75s, 2 tests
   [smoker]    [junit4] 
   [smoker]    [junit4] Suite: org.apache.lucene.util.TestInPlaceMergeSorter
   [smoker]    [junit4] Completed [173/454] on J1 in 0.55s, 9 tests
   [smoker]    [junit4] 
   [smoker]    [junit4] Suite: org.apache.lucene.util.TestPriorityQueue
   [smoker]    [junit4] Completed [174/454] on J1 in 1.88s, 9 tests
   [smoker]    [junit4] 
   [smoker]    [junit4] Suite: org.apache.lucene.search.TestLongValuesSource
   [smoker]    [junit4] Completed [175/454] on J0 in 5.53s, 4 tests
   [smoker]    [junit4] 
   [smoker]    [junit4] Suite: org.apache.lucene.util.TestTimSorter
   [smoker]    [junit4] Completed [176/454] on J1 in 0.53s, 9 tests
   [smoker]    [junit4] 
   [smoker]    [junit4] Suite: org.apache.lucene.util.automaton.TestMinimize
   [smoker]    [junit4] Completed [177/454] on J1 in 10.15s, 3 tests
   [smoker]    [junit4] 
   [smoker]    [junit4] Suite: org.apache.lucene.index.TestParallelReaderEmptyIndex
   [smoker]    [junit4] Completed [178/454] on J1 in 0.24s, 2 tests
   [smoker]    [junit4] 
   [smoker]    [junit4] Suite: org.apache.lucene.codecs.lucene70.TestLucene70NormsFormat
   [smoker]    [junit4] IGNOR/A 0.00s J2 | TestLucene70NormsFormat.testSparseNCommonBig
   [smoker]    [junit4]    > Assumption #1: 'nightly' test group is disabled (@Nightly())
   [smoker]    [junit4] IGNOR/A 0.00s J2 | TestLucene70NormsFormat.testRamBytesUsed
   [smoker]    [junit4]    > Assumption #1: 'slow' test group is disabled (@Slow())
   [smoker]    [junit4] IGNOR/A 0.00s J2 | TestLucene70NormsFormat.testNCommonBig
   [smoker]    [junit4]    > Assumption #1: 'nightly' test group is disabled (@Nightly())
   [smoker]    [junit4] IGNOR/A 0.07s J2 | TestLucene70NormsFormat.testMergeStability
   [smoker]    [junit4]    > Assumption #1: The MockRandom PF randomizes content on the fly, so we can't check it
   [smoker]    [junit4] Completed [179/454] on J2 in 44.53s, 29 tests, 4 skipped
   [smoker]    [junit4] 
   [smoker]    [junit4] Suite: org.apache.lucene.search.spans.TestSpanBoostQuery
   [smoker]    [junit4] Completed [180/454] on J2 in 0.12s, 2 tests
   [smoker]    [junit4] 
   [smoker]    [junit4] Suite: org.apache.lucene.index.TestCheckIndex
   [smoker]    [junit4] Completed [181/454] on J1 in 4.60s, 4 tests
   [smoker]    [junit4] 
   [smoker]    [junit4] Suite: org.apache.lucene.util.TestFixedBitSet
   [smoker]    [junit4] Completed [182/454] on J2 in 9.08s, 19 tests
   [smoker]    [junit4] 
   [smoker]    [junit4] Suite: org.apache.lucene.index.TestSegmentTermEnum
   [smoker]    [junit4] Completed [183/454] on J2 in 0.27s, 2 tests
   [smoker]    [junit4] 
   [smoker]    [junit4] Suite: org.apache.lucene.codecs.lucene50.TestLucene50StoredFieldsFormat
   [smoker]    [junit4] IGNOR/A 0.00s J1 | TestLucene50StoredFieldsFormat.testBigDocuments
   [smoker]    [junit4]    > Assumption #1: 'nightly' test group is disabled (@Nightly())
   [smoker]    [junit4] IGNOR/A 0.00s J1 | TestLucene50StoredFieldsFormat.testRamBytesUsed
   [smoker]    [junit4]    > Assumption #1: 'slow' test group is disabled (@Slow())
   [smoker]    [junit4] Completed [184/454] on J1 in 7.31s, 17 tests, 2 skipped
   [smoker]    [junit4] 
   [smoker]    [junit4] Suite: org.apache.lucene.index.TestDuelingCodecsAtNight
   [smoker]    [junit4] IGNOR/A 0.00s J1 | TestDuelingCodecsAtNight.testEquals
   [smoker]    [junit4]    > Assumption #1: 'nightly' test group is disabled (@Nightly())
   [smoker]    [junit4] IGNOR/A 0.00s J1 | TestDuelingCodecsAtNight.testCrazyReaderEquals
   [smoker]    [junit4]    > Assumption #1: 'nightly' test group is disabled (@Nightly())
   [smoker]    [junit4] IGNOR/A 0.00s J1 | TestDuelingCodecsAtNight.testBigEquals
   [smoker]    [junit4]    > Assumption #1: 'nightly' test group is disabled (@Nightly())
   [smoker]    [junit4] Completed [185/454] on J1 in 0.06s, 3 tests, 3 skipped
   [smoker]    [junit4] 
   [smoker]    [junit4] Suite: org.apache.lucene.index.TestStressIndexing2
   [smoker]    [junit4] Completed [186/454] on J2 in 4.00s, 3 tests
   [smoker]    [junit4] 
   [smoker]    [junit4] Suite: org.apache.lucene.index.TestIndexFileDeleter
   [smoker]    [junit4] Completed [187/454] on J1 in 3.26s, 10 tests
   [smoker]    [junit4] 
   [smoker]    [junit4] Suite: org.apache.lucene.search.TestSortedSetSortField
   [smoker]    [junit4] Completed [188/454] on J2 in 0.19s, 7 tests
   [smoker]    [junit4] 
   [smoker]    [junit4] Suite: org.apache.lucene.util.TestCharsRefBuilder
   [smoker]    [junit4] Completed [189/454] on J2 in 0.15s, 2 tests
   [smoker]    [junit4] 
   [smoker]    [junit4] Suite: org.apache.lucene.index.TestIndexManyDocuments
   [smoker]    [junit4] Completed [190/454] on J2 in 2.04s, 1 test
   [smoker]    [junit4] 
   [smoker]    [junit4] Suite: org.apache.lucene.search.TestConjunctionDISI
   [smoker]    [junit4] Completed [191/454] on J2 in 19.58s, 5 tests
   [smoker]    [junit4] 
   [smoker]    [junit4] Suite: org.apache.lucene.search.TestTermRangeQuery
   [smoker]    [junit4] Completed [192/454] on J2 in 0.51s, 7 tests
   [smoker]    [junit4] 
   [smoker]    [junit4] Suite: org.apache.lucene.util.bkd.TestBKD
   [smoker]    [junit4] IGNOR/A 0.00s J0 | TestBKD.testRandomBinaryBig
   [smoker]    [junit4]    > Assumption #1: 'nightly' test group is disabled (@Nightly())
   [smoker]    [junit4] Completed [194/454] on J0 in 49.78s, 19 tests, 1 skipped
   [smoker]    [junit4] 
   [smoker]    [junit4] Suite: org.apache.lucene.search.TestCachingCollector
   [smoker]    [junit4] Completed [195/454] on J0 in 0.23s, 4 tests
   [smoker]    [junit4] 
   [smoker]    [junit4] Suite: org.apache.lucene.search.TestPointQueries
   [smoker]    [junit4] IGNOR/A 0.00s J1 | TestPointQueries.testRandomLongsBig
   [smoker]    [junit4]    > Assumption #1: 'nightly' test group is disabled (@Nightly())
   [smoker]    [junit4] IGNOR/A 0.00s J1 | TestPointQueries.testRandomBinaryBig
   [smoker]    [junit4]    > Assumption #1: 'nightly' test group is disabled (@Nightly())
   [smoker]    [junit4] Completed [196/454] on J1 in 47.93s, 49 tests, 2 skipped
   [smoker]    [junit4] 
   [smoker]    [junit4] Suite: org.apache.lucene.store.TestDirectory
   [smoker]    [junit4] Completed [197/454] on J1 in 0.88s, 4 tests
   [smoker]    [junit4] 
   [smoker]    [junit4] Suite: org.apache.lucene.search.spans.TestSpanFirstQuery
   [smoker]    [junit4] Completed [198/454] on J1 in 0.12s, 1 test
   [smoker]    [junit4] 
   [smoker]    [junit4] Suite: org.apache.lucene.index.TestParallelTermEnum
   [smoker]    [junit4] Completed [199/454] on J1 in 0.15s, 1 test
   [smoker]    [junit4] 
   [smoker]    [junit4] Suite: org.apache.lucene.codecs.TestCodecLoadingDeadlock
   [smoker]    [junit4] FAILURE 30.3s J0 | TestCodecLoadingDeadlock.testDeadlock <<<
   [smoker]    [junit4]    > Throwable #1: java.lang.AssertionError: Process did not exit after 30 secs -> classloader deadlock?
   [smoker]    [junit4]    > 	at __randomizedtesting.SeedInfo.seed([D2E196D489A307A1:DF8A77C08FF9AA77]:0)
   [smoker]    [junit4]    > 	at org.apache.lucene.codecs.TestCodecLoadingDeadlock.testDeadlock(TestCodecLoadingDeadlock.java:75)
   [smoker]    [junit4] Completed [200/454 (1!)] on J0 in 30.32s, 1 test, 1 failure <<< FAILURES!
   [smoker]    [junit4] 
   [smoker]    [junit4] Suite: org.apache.lucene.codecs.lucene50.TestLucene50StoredFieldsFormatHighCompression
   [smoker]    [junit4] IGNOR/A 0.00s J2 | TestLucene50StoredFieldsFormatHighCompression.testRamBytesUsed
   [smoker]    [junit4]    > Assumption #1: 'slow' test group is disabled (@Slow())
   [smoker]    [junit4] IGNOR/A 0.00s J2 | TestLucene50StoredFieldsFormatHighCompression.testBigDocuments
   [smoker]    [junit4]    > Assumption #1: 'nightly' test group is disabled (@Nightly())
   [smoker]    [junit4] Completed [201/454 (1!)] on J2 in 34.83s, 19 tests, 2 skipped
   [smoker]    [junit4] 
   [smoker]    [junit4] Suite: org.apache.lucene.util.TestRadixSelector
   [smoker]    [junit4] Completed [202/454 (1!)] on J2 in 5.94s, 2 tests
   [smoker]    [junit4] 
   [smoker]    [junit4] Suite: org.apache.lucene.search.TestFloatRangeFieldQueries
   [smoker]    [junit4] IGNOR/A 0.00s J0 | TestFloatRangeFieldQueries.testRandomBig
   [smoker]    [junit4]    > Assumption #1: 'nightly' test group is disabled (@Nightly())
   [smoker]    [junit4] Completed [203/454 (1!)] on J0 in 19.26s, 5 tests, 1 skipped
   [smoker]    [junit4] 
   [smoker]    [junit4] Suite: org.apache.lucene.search.TestMatchAllDocsQuery
   [smoker]    [junit4] Completed [204/454 (1!)] on J0 in 0.24s, 2 tests
   [smoker]    [junit4] 
   [smoker]    [junit4] Suite: org.apache.lucene.search.TestSimilarity
   [smoker]    [junit4] Completed [205/454 (1!)] on J0 in 0.14s, 1 test
   [smoker]    [junit4] 
   [smoker]    [junit4] Suite: org.apache.lucene.index.TestDirectoryReaderReopen
   [smoker]    [junit4] Completed [206/454 (1!)] on J0 in 4.84s, 14 tests
   [smoker]    [junit4] 
   [smoker]    [junit4] Suite: org.apache.lucene.index.TestCodecHoldsOpenFiles
   [smoker]    [junit4] Completed [207/454 (1!)] on J0 in 0.51s, 1 test
   [smoker]    [junit4] 
   [smoker]    [junit4] Suite: org.apache.lucene.search.spans.TestSpanCollection
   [smoker]    [junit4] Completed [208/454 (1!)] on J0 in 0.51s, 3 tests
   [smoker]    [junit4] 
   [smoker]    [junit4] Suite: org.apache.lucene.index.TestDocValuesIndexing
   [smoker]    [junit4] Completed [209/454 (1!)] on J0 in 3.45s, 34 tests
   [smoker]    [junit4] 
   [smoker]    [junit4] Suite: org.apache.lucene.search.TestMinShouldMatch2
   [smoker]    [junit4] Completed [210/454 (1!)] on J2 in 27.88s, 6 tests
   [smoker]    [junit4] 
   [smoker]    [junit4] Suite: org.apache.lucene.index.TestPointValues
   [smoker]    [junit4] Completed [211/454 (1!)] on J1 in 42.22s, 32 tests
   [smoker]    [junit4] 
   [smoker]    [junit4] Suite: org.apache.lucene.index.TestOmitTf
   [smoker]    [junit4] Completed [212/454 (1!)] on J1 in 2.15s, 6 tests
   [smoker]    [junit4] 
   [smoker]    [junit4] Suite: org.apache.lucene.index.TestIndexWriterMerging
   [smoker]    [junit4] IGNOR/A 0.00s J2 | TestIndexWriterMerging.testNoWaitClose
   [smoker]    [junit4]    > Assumption #1: 'slow' test group is disabled (@Slow())
   [smoker]    [junit4] Completed [213/454 (1!)] on J2 in 7.96s, 6 tests, 1 skipped
   [smoker]    [junit4] 
   [smoker]    [junit4] Suite: org.apache.lucene.util.fst.TestFSTs
   [smoker]    [junit4] IGNOR/A 0.00s J2 | TestFSTs.testRandomTermLookup
   [smoker]    [junit4]    > Assumption #1: 'slow' test group is disabled (@Slow())
   [smoker]    [junit4] IGNOR/A 0.00s J2 | TestFSTs.testExpandedCloseToRoot
   [smoker]    [junit4]    > Assumption #1: 'slow' test group is disabled (@Slow())
   [smoker]    [junit4] IGNOR/A 0.00s J2 | TestFSTs.testShortestPaths
   [smoker]    [junit4]    > Assumption #1: 'slow' test group is disabled (@Slow())
   [smoker]    [junit4] IGNOR/A 0.13s J2 | TestFSTs.testDuplicateFSAString
   [smoker]    [junit4]    > Assumption #1: 'slow' test group is disabled (@Slow())
   [smoker]    [junit4] IGNOR/A 0.00s J2 | TestFSTs.testRandomWords
   [smoker]    [junit4]    > Assumption #1: 'slow' test group is disabled (@Slow())
   [smoker]    [junit4] IGNOR/A 0.00s J2 | TestFSTs.testRejectNoLimits
   [smoker]    [junit4]    > Assumption #1: 'slow' test group is disabled (@Slow())
   [smoker]    [junit4] IGNOR/A 0.00s J2 | TestFSTs.testSimple
   [smoker]    [junit4]    > Assumption #1: 'slow' test group is disabled (@Slow())
   [smoker]    [junit4] IGNOR/A 0.00s J2 | TestFSTs.testSingleString
   [smoker]    [junit4]    > Assumption #1: 'slow' test group is disabled (@Slow())
   [smoker]    [junit4] IGNOR/A 0.00s J2 | TestFSTs.testFinalOutputOnEndState
   [smoker]    [junit4]    > Assumption #1: 'slow' test group is disabled (@Slow())
   [smoker]    [junit4] IGNOR/A 0.00s J2 | TestFSTs.testInternalFinalState
   [smoker]    [junit4]    > Assumption #1: 'slow' test group is disabled (@Slow())
   [smoker]    [junit4] IGNOR/A 0.00s J2 | TestFSTs.testLargeOutputsOnArrayArcs
   [smoker]    [junit4]    > Assumption #1: 'slow' test group is disabled (@Slow())
   [smoker]    [junit4] IGNOR/A 0.00s J2 | TestFSTs.testShortestPathsWFST
   [smoker]    [junit4]    > Assumption #1: 'slow' test group is disabled (@Slow())
   [smoker]    [junit4] IGNOR/A 0.00s J2 | TestFSTs.testShortestPathsRandom
   [smoker]    [junit4]    > Assumption #1: 'slow' test group is disabled (@Slow())
   [smoker]    [junit4] IGNOR/A 0.00s J2 | TestFSTs.testPrimaryKeys
   [smoker]    [junit4]    > Assumption #1: 'slow' test group is disabled (@Slow())
   [smoker]    [junit4] IGNOR/A 0.00s J2 | TestFSTs.testIllegallyModifyRootArc
   [smoker]    [junit4]    > Assumption #1: 'slow' test group is disabled (@Slow())
   [smoker]    [junit4] IGNOR/A 0.00s J2 | TestFSTs.testNonFinalStopNode
   [smoker]    [junit4]    > Assumption #1: 'slow' test group is disabled (@Slow())
   [smoker]    [junit4] IGNOR/A 0.00s J2 | TestFSTs.testShortestPathsWFSTRandom
   [smoker]    [junit4]    > Assumption #1: 'slow' test group is disabled (@Slow())
   [smoker]    [junit4] IGNOR/A 0.00s J2 | TestFSTs.testBasicFSA
   [smoker]    [junit4]    > Assumption #1: 'slow' test group is disabled (@Slow())
   [smoker]    [junit4] IGNOR/A 0.00s J2 | TestFSTs.testBigSet
   [smoker]    [junit4]    > Assumption #1: 'nightly' test group is disabled (@Nightly())
   [smoker]    [junit4] IGNOR/A 0.00s J2 | TestFSTs.testRealTerms
   [smoker]    [junit4]    > Assumption #1: 'slow' test group is disabled (@Slow())
   [smoker]    [junit4] Completed [214/454 (1!)] on J2 in 0.22s, 20 tests, 20 skipped
   [smoker]    [junit4] 
   [smoker]    [junit4] Suite: org.apache.lucene.util.fst.TestBytesStore
   [smoker]    [junit4] Completed [215/454 (1!)] on J2 in 6.88s, 1 test
   [smoker]    [junit4] 
   [smoker]    [junit4] Suite: org.apache.lucene.codecs.lucene50.TestLucene50TermVectorsFormat
   [smoker]    [junit4] IGNOR/A 0.00s J0 | TestLucene50TermVectorsFormat.testRamBytesUsed
   [smoker]    [junit4]    > Assumption #1: 'slow' test group is disabled (@Slow())
   [smoker]    [junit4] Completed [216/454 (1!)] on J0 in 41.58s, 17 tests, 1 skipped
   [smoker]    [junit4] 
   [smoker]    [junit4] Suite: org.apache.lucene.search.TestEarlyTermination
   [smoker]    [junit4] Completed [217/454 (1!)] on J0 in 0.18s, 1 test
   [smoker]    [junit4] 
   [smoker]    [junit4] Suite: org.apache.lucene.util.packed.TestPackedInts
   [smoker]    [junit4] IGNOR/A 0.00s J2 | TestPackedInts.testBlockReaderOverflow
   [smoker]    [junit4]    > Assumption #1: 'nightly' test group is disabled (@Nightly())
   [smoker]    [junit4] Completed [218/454 (1!)] on J2 in 46.60s, 28 tests, 3 skipped
   [smoker]    [junit4] 
   [smoker]    [junit4] Suite: org.apache.lucene.index.TestNumericDocValuesUpdates
   [smoker]    [junit4] Completed [219/454 (1!)] on J1 in 60.02s, 32 tests
   [smoker]    [junit4] 
   [smoker]    [junit4] Suite: org.apache.lucene.index.TestIndexWriterOnJRECrash
   [smoker]    [junit4] IGNOR/A 0.00s J1 | TestIndexWriterOnJRECrash.testNRTThreads
   [smoker]    [junit4]    > Assumption #1: 'nightly' test group is disabled (@Nightly())
   [smoker]    [junit4] Completed [220/454 (1!)] on J1 in 0.02s, 1 test, 1 skipped
   [smoker]    [junit4] 
   [smoker]    [junit4] Suite: org.apache.lucene.index.TestIndexWriterWithThreads
   [smoker]    [junit4] IGNOR/A 0.00s J2 | TestIndexWriterWithThreads.testIOExceptionDuringAbortWithThreads
   [smoker]    [junit4]    > Assumption #1: 'slow' test group is disabled (@Slow())
   [smoker]    [junit4] IGNOR/A 0.00s J2 | TestIndexWriterWithThreads.testIOExceptionDuringWriteSegmentOnlyOnce
   [smoker]    [junit4]    > Assumption #1: 'slow' test group is disabled (@Slow())
   [smoker]    [junit4] IGNOR/A 0.00s J2 | TestIndexWriterWithThreads.testCloseWithThreads
   [smoker]    [junit4]    > Assumption #1: 'slow' test group is disabled (@Slow())
   [smoker]    [junit4] IGNOR/A 0.00s J2 | TestIndexWriterWithThreads.testOpenTwoIndexWritersOnDifferentThreads
   [smoker]    [junit4]    > Assumption #1: 'slow' test group is disabled (@Slow())
   [smoker]    [junit4] IGNOR/A 0.00s J2 | TestIndexWriterWithThreads.testIOExceptionDuringWriteSegmentWithThreads
   [smoker]    [junit4]    > Assumption #1: 'slow' test group is disabled (@Slow())
   [smoker]    [junit4] IGNOR/A 0.00s J2 | TestIndexWriterWithThreads.testIOExceptionDuringWriteSegment
   [smoker]    [junit4]    > Assumption #1: 'slow' test group is disabled (@Slow())
   [smoker]    [junit4] IGNOR/A 0.00s J2 | TestIndexWriterWithThreads.testIOExceptionDuringAbortOnlyOnce
   [smoker]    [junit4]    > Assumption #1: 'slow' test group is disabled (@Slow())
   [smoker]    [junit4] IGNOR/A 0.00s J2 | TestIndexWriterWithThreads.testImmediateDiskFullWithThreads
   [smoker]    [junit4]    > Assumption #1: 'slow' test group is disabled (@Slow())
   [smoker]    [junit4] IGNOR/A 0.00s J2 | TestIndexWriterWithThreads.testIOExceptionDuringAbortWithThreadsOnlyOnce
   [smoker]    [junit4]    > Assumption #1: 'slow' test group is disabled (@Slow())
   [smoker]    [junit4] IGNOR/A 0.00s J2 | TestIndexWriterWithThreads.testRollbackAndCommitWithThreads
   [smoker]    [junit4]    > Assumption #1: 'slow' test group is disabled (@Slow())
   [smoker]    [junit4] IGNOR/A 0.00s J2 | TestIndexWriterWithThreads.testIOExceptionDuringAbort
   [smoker]    [junit4]    > Assumption #1: 'slow' test group is disabled (@Slow())
   [smoker]    [junit4] IGNOR/A 0.00s J2 | TestIndexWriterWithThreads.testIOExceptionDuringWriteSegmentWithThreadsOnlyOnce
   [smoker]    [junit4]    > Assumption #1: 'slow' test group is disabled (@Slow())
   [smoker]    [junit4] Completed [221/454 (1!)] on J2 in 0.02s, 12 tests, 12 skipped
   [smoker]    [junit4] 
   [smoker]    [junit4] Suite: org.apache.lucene.index.TestMultiDocValues
   [smoker]    [junit4] Completed [222/454 (1!)] on J1 in 1.69s, 7 tests
   [smoker]    [junit4] 
   [smoker]    [junit4] Suite: org.apache.lucene.index.TestIndexWriterExceptions2
   [smoker]    [junit4] Completed [223/454 (1!)] on J0 in 31.64s, 1 test
   [smoker]    [junit4] 
   [smoker]    [junit4] Suite: org.apache.lucene.util.automaton.TestLevenshteinAutomata
   [smoker]    [junit4] Completed [224/454 (1!)] on J1 in 10.53s, 4 tests
   [smoker]    [junit4] 
   [smoker]    [junit4] Suite: org.apache.lucene.index.Test2BPostings
   [smoker]    [junit4] IGNOR/A 0.00s J1 | Test2BPostings.test
   [smoker]    [junit4]    > Assumption #1: 'nightly' test group is disabled (@Nightly())
   [smoker]    [junit4] Completed [225/454 (1!)] on J1 in 0.03s, 1 test, 1 skipped
   [smoker]    [junit4] 
   [smoker]    [junit4] Suite: org.apache.lucene.analysis.TestGraphTokenizers
   [smoker]    [junit4] Completed [226/454 (1!)] on J2 in 27.55s, 23 tests
   [smoker]    [junit4] 
   [smoker]    [junit4] Suite: org.apache.lucene.index.TestAddIndexes
   [smoker]    [junit4] Completed [227/454 (1!)] on J2 in 9.46s, 25 tests
   [smoker]    [junit4] 
   [smoker]    [junit4] Suite: org.apache.lucene.store.TestMultiMMap
   [smoker]    [junit4] Completed [228/454 (1!)] on J2 in 15.30s, 54 tests
   [smoker]    [junit4] 
   [smoker]    [junit4] Suite: org.apache.lucene.index.TestDeletionPolicy
   [smoker]    [junit4] Completed [229/454 (1!)] on J2 in 6.99s, 6 tests
   [smoker]    [junit4] 
   [smoker]    [junit4] Suite: org.apache.lucene.index.TestIndexWriterNRTIsCurrent
   [smoker]    [junit4] Completed [230/454 (1!)] on J0 in 60.43s, 1 test
   [smoker]    [junit4] 
   [smoker]    [junit4] Suite: org.apache.lucene.search.spans.TestNearSpansOrdered
   [smoker]    [junit4] Completed [231/454 (1!)] on J0 in 1.74s, 19 tests
   [smoker]    [junit4] 
   [smoker]    [junit4] Suite: org.apache.lucene.analysis.TestCharFilter
   [smoker]    [junit4] Completed [232/454 (1!)] on J0 in 0.21s, 4 tests
   [smoker]    [junit4] 
   [smoker]    [junit4] Suite: org.apache.lucene.search.TestBooleanOr
   [smoker]    [junit4] Completed [233/454 (1!)] on J2 in 8.07s, 7 tests
   [smoker]    [junit4] 
   [smoker]    [junit4] Suite: org.apache.lucene.search.spans.TestBasics
   [smoker]    [junit4] Completed [234/454 (1!)] on J2 in 22.49s, 26 tests
   [smoker]    [junit4] 
   [smoker]    [junit4] Suite: org.apache.lucene.index.TestIndexWriterExceptions
   [smoker]    [junit4] IGNOR/A 0.00s J0 | TestIndexWriterExceptions.testTooManyTokens
   [smoker]    [junit4]    > Assumption #1: 'nightly' test group is disabled (@Nightly())
   [smoker]    [junit4] Completed [235/454 (1!)] on J0 in 34.53s, 34 tests, 1 skipped
   [smoker]    [junit4] 
   [smoker]    [junit4] Suite: org.apache.lucene.search.TestWildcardRandom
   [smoker]    [junit4] Completed [236/454 (1!)] on J0 in 0.77s, 1 test
   [smoker]    [junit4] 
   [smoker]    [junit4] Suite: org.apache.lucene.index.TestFlushByRamOrCountsPolicy
   [smoker]    [junit4] Completed [237/454 (1!)] on J2 in 12.02s, 5 tests
   [smoker]    [junit4] 
   [smoker]    [junit4] Suite: org.apache.lucene.search.TestApproximationSearchEquivalence
   [smoker]    [junit4] Completed [238/454 (1!)] on J0 in 2.76s, 10 tests
   [smoker]    [junit4] 
   [smoker]    [junit4] Suite: org.apache.lucene.util.TestMergedIterator
   [smoker]    [junit4] Completed [239/454 (1!)] on J0 in 2.53s, 25 tests
   [smoker]    [junit4] 
   [smoker]    [junit4] Suite: org.apache.lucene.search.TestSloppyPhraseQuery
   [smoker]    [junit4] Completed [240/454 (1!)] on J2 in 3.68s, 9 tests
   [smoker]    [junit4] 
   [smoker]    [junit4] Suite: org.apache.lucene.index.TestNRTThreads
   [smoker]    [junit4] Completed [241/454 (1!)] on J2 in 6.94s, 1 test
   [smoker]    [junit4] 
   [smoker]    [junit4] Suite: org.apache.lucene.index.TestDuelingCodecs
   [smoker]    [junit4] IGNOR/A 0.00s J2 | TestDuelingCodecs.testEquals
   [smoker]    [junit4]    > Assumption #1: 'slow' test group is disabled (@Slow())
   [smoker]    [junit4] IGNOR/A 0.00s J2 | TestDuelingCodecs.testCrazyReaderEquals
   [smoker]    [junit4]    > Assumption #1: 'slow' test group is disabled (@Slow())
   [smoker]    [junit4] Completed [242/454 (1!)] on J2 in 0.04s, 2 tests, 2 skipped
   [smoker]    [junit4] 
   [smoker]    [junit4] Suite: org.apache.lucene.search.TestBoolean2
   [smoker]    [junit4] Completed [243/454 (1!)] on J2 in 9.63s, 10 tests
   [smoker]    [junit4] 
   [smoker]    [junit4] Suite: org.apache.lucene.index.TestAtomicUpdate
   [smoker]    [junit4] Completed [244/454 (1!)] on J2 in 7.82s, 1 test
   [smoker]    [junit4] 
   [smoker]    [junit4] Suite

[...truncated too long message...]

kipped
   [smoker]    [junit4] 
   [smoker]    [junit4] Suite: org.apache.lucene.store.TestNIOFSDirectory
   [smoker]    [junit4] Completed [428/454 (1!)] on J0 in 5.54s, 42 tests
   [smoker]    [junit4] 
   [smoker]    [junit4] Suite: org.apache.lucene.store.TestTrackingDirectoryWrapper
   [smoker]    [junit4] IGNOR/A 0.03s J0 | TestTrackingDirectoryWrapper.testPendingDeletions
   [smoker]    [junit4]    > Assumption #1: we can only install VirusCheckingFS on an FSDirectory
   [smoker]    [junit4] IGNOR/A 0.00s J0 | TestTrackingDirectoryWrapper.testFsyncDoesntCreateNewFiles
   [smoker]    [junit4]    > Assumption #1: test only works for FSDirectory subclasses
   [smoker]    [junit4] Completed [429/454 (1!)] on J0 in 2.58s, 47 tests, 2 skipped
   [smoker]    [junit4] 
   [smoker]    [junit4] Suite: org.apache.lucene.util.TestDocIdSetBuilder
   [smoker]    [junit4] Completed [430/454 (1!)] on J0 in 2.07s, 7 tests
   [smoker]    [junit4] 
   [smoker]    [junit4] Suite: org.apache.lucene.util.TestFixedLengthBytesRefArray
   [smoker]    [junit4] Completed [431/454 (1!)] on J0 in 0.64s, 2 tests
   [smoker]    [junit4] 
   [smoker]    [junit4] Suite: org.apache.lucene.util.TestFrequencyTrackingRingBuffer
   [smoker]    [junit4] Completed [432/454 (1!)] on J0 in 0.80s, 2 tests
   [smoker]    [junit4] 
   [smoker]    [junit4] Suite: org.apache.lucene.util.TestIntroSorter
   [smoker]    [junit4] Completed [433/454 (1!)] on J0 in 0.50s, 9 tests
   [smoker]    [junit4] 
   [smoker]    [junit4] Suite: org.apache.lucene.util.TestLSBRadixSorter
   [smoker]    [junit4] Completed [434/454 (1!)] on J0 in 0.70s, 6 tests
   [smoker]    [junit4] 
   [smoker]    [junit4] Suite: org.apache.lucene.util.TestLongBitSet
   [smoker]    [junit4] IGNOR/A 0.00s J0 | TestLongBitSet.testHugeCapacity
   [smoker]    [junit4]    > Assumption #1: 'nightly' test group is disabled (@Nightly())
   [smoker]    [junit4] Completed [435/454 (1!)] on J0 in 1.65s, 9 tests, 1 skipped
   [smoker]    [junit4] 
   [smoker]    [junit4] Suite: org.apache.lucene.store.TestNativeFSLockFactory
   [smoker]    [junit4] Completed [436/454 (1!)] on J1 in 19.83s, 10 tests
   [smoker]    [junit4] 
   [smoker]    [junit4] Suite: org.apache.lucene.util.TestMSBRadixSorter
   [smoker]    [junit4] Completed [437/454 (1!)] on J0 in 9.29s, 8 tests
   [smoker]    [junit4] 
   [smoker]    [junit4] Suite: org.apache.lucene.util.TestNumericUtils
   [smoker]    [junit4] Completed [438/454 (1!)] on J0 in 6.41s, 24 tests
   [smoker]    [junit4] 
   [smoker]    [junit4] Suite: org.apache.lucene.store.TestSleepingLockWrapper
   [smoker]    [junit4] Completed [439/454 (1!)] on J2 in 28.27s, 6 tests
   [smoker]    [junit4] 
   [smoker]    [junit4] Suite: org.apache.lucene.util.TestQueryBuilder
   [smoker]    [junit4] Completed [440/454 (1!)] on J2 in 0.68s, 23 tests
   [smoker]    [junit4] 
   [smoker]    [junit4] Suite: org.apache.lucene.util.TestNotDocIdSet
   [smoker]    [junit4] Completed [441/454 (1!)] on J1 in 10.90s, 6 tests
   [smoker]    [junit4] 
   [smoker]    [junit4] Suite: org.apache.lucene.util.TestSPIClassIterator
   [smoker]    [junit4] Completed [442/454 (1!)] on J1 in 0.11s, 1 test
   [smoker]    [junit4] 
   [smoker]    [junit4] Suite: org.apache.lucene.util.TestRoaringDocIdSet
   [smoker]    [junit4] Completed [443/454 (1!)] on J2 in 5.85s, 5 tests
   [smoker]    [junit4] 
   [smoker]    [junit4] Suite: org.apache.lucene.util.TestSloppyMath
   [smoker]    [junit4] Completed [444/454 (1!)] on J1 in 6.17s, 8 tests
   [smoker]    [junit4] 
   [smoker]    [junit4] Suite: org.apache.lucene.util.TestSparseFixedBitDocIdSet
   [smoker]    [junit4] Completed [445/454 (1!)] on J2 in 7.36s, 5 tests
   [smoker]    [junit4] 
   [smoker]    [junit4] Suite: org.apache.lucene.util.TestSparseFixedBitSet
   [smoker]    [junit4] Completed [446/454 (1!)] on J1 in 5.77s, 11 tests
   [smoker]    [junit4] 
   [smoker]    [junit4] Suite: org.apache.lucene.util.TestTimSorterWorstCase
   [smoker]    [junit4] IGNOR/A 0.00s J1 | TestTimSorterWorstCase.testWorstCaseStackSize
   [smoker]    [junit4]    > Assumption #1: 'slow' test group is disabled (@Slow())
   [smoker]    [junit4] Completed [447/454 (1!)] on J1 in 0.00s, 1 test, 1 skipped
   [smoker]    [junit4] 
   [smoker]    [junit4] Suite: org.apache.lucene.util.automaton.TestOperations
   [smoker]    [junit4] Completed [448/454 (1!)] on J1 in 1.25s, 5 tests
   [smoker]    [junit4] 
   [smoker]    [junit4] Suite: org.apache.lucene.util.bkd.Test2BBKDPoints
   [smoker]    [junit4] IGNOR/A 0.00s J1 | Test2BBKDPoints.test2D
   [smoker]    [junit4]    > Assumption #1: 'monster' test group is disabled (@Monster(value=takes at least 4 hours and consumes many GB of temp disk space))
   [smoker]    [junit4] IGNOR/A 0.00s J1 | Test2BBKDPoints.test1D
   [smoker]    [junit4]    > Assumption #1: 'monster' test group is disabled (@Monster(value=takes at least 4 hours and consumes many GB of temp disk space))
   [smoker]    [junit4] Completed [449/454 (1!)] on J1 in 0.00s, 2 tests, 2 skipped
   [smoker]    [junit4] 
   [smoker]    [junit4] Suite: org.apache.lucene.util.TestOfflineSorter
   [smoker]    [junit4] IGNOR/A 0.00s J0 | TestOfflineSorter.testLargerRandom
   [smoker]    [junit4]    > Assumption #1: 'nightly' test group is disabled (@Nightly())
   [smoker]    [junit4] Completed [450/454 (1!)] on J0 in 19.27s, 15 tests, 1 skipped
   [smoker]    [junit4] 
   [smoker]    [junit4] Suite: org.apache.lucene.util.graph.TestGraphTokenStreamFiniteStrings
   [smoker]    [junit4] Completed [451/454 (1!)] on J0 in 0.16s, 12 tests
   [smoker]    [junit4] 
   [smoker]    [junit4] Suite: org.apache.lucene.util.bkd.TestMutablePointsReaderUtils
   [smoker]    [junit4] Completed [452/454 (1!)] on J1 in 4.54s, 3 tests
   [smoker]    [junit4] 
   [smoker]    [junit4] Suite: org.apache.lucene.util.packed.TestDirectPacked
   [smoker]    [junit4] Completed [453/454 (1!)] on J0 in 3.27s, 4 tests
   [smoker]    [junit4] 
   [smoker]    [junit4] Suite: org.apache.lucene.util.TestStringMSBRadixSorter
   [smoker]    [junit4] Completed [454/454 (1!)] on J2 in 8.08s, 7 tests
   [smoker]    [junit4] 
   [smoker]    [junit4] 
   [smoker]    [junit4] Tests with failures [seed: D2E196D489A307A1]:
   [smoker]    [junit4]   - org.apache.lucene.codecs.TestCodecLoadingDeadlock.testDeadlock
   [smoker]    [junit4] 
   [smoker]    [junit4] 
   [smoker]    [junit4] JVM J0:     1.08 ..   966.05 =   964.97s
   [smoker]    [junit4] JVM J1:     1.08 ..   964.34 =   963.27s
   [smoker]    [junit4] JVM J2:     1.08 ..   966.05 =   964.97s
   [smoker]    [junit4] Execution time total: 16 minutes 6 seconds
   [smoker]    [junit4] Tests summary: 454 suites (1 ignored), 3789 tests, 1 failure, 211 ignored (203 assumptions)
   [smoker] 
   [smoker] BUILD FAILED
   [smoker] /home/jenkins/jenkins-slave/workspace/Lucene-Solr-SmokeRelease-master/lucene/build/smokeTestRelease/tmp/unpack/lucene-8.0.0/build.xml:50: The following error occurred while executing this line:
   [smoker] /home/jenkins/jenkins-slave/workspace/Lucene-Solr-SmokeRelease-master/lucene/build/smokeTestRelease/tmp/unpack/lucene-8.0.0/common-build.xml:1458: The following error occurred while executing this line:
   [smoker] /home/jenkins/jenkins-slave/workspace/Lucene-Solr-SmokeRelease-master/lucene/build/smokeTestRelease/tmp/unpack/lucene-8.0.0/common-build.xml:985: There were test failures: 454 suites (1 ignored), 3789 tests, 1 failure, 211 ignored (203 assumptions) [seed: D2E196D489A307A1]
   [smoker] 
   [smoker] Total time: 16 minutes 31 seconds
   [smoker] 
   [smoker] 
   [smoker] Traceback (most recent call last):
   [smoker]   File "/home/jenkins/jenkins-slave/workspace/Lucene-Solr-SmokeRelease-master/dev-tools/scripts/smokeTestRelease.py", line 1484, in <module>
   [smoker]     main()
   [smoker]   File "/home/jenkins/jenkins-slave/workspace/Lucene-Solr-SmokeRelease-master/dev-tools/scripts/smokeTestRelease.py", line 1428, in main
   [smoker]     smokeTest(c.java, c.url, c.revision, c.version, c.tmp_dir, c.is_signed, ' '.join(c.test_args))
   [smoker]   File "/home/jenkins/jenkins-slave/workspace/Lucene-Solr-SmokeRelease-master/dev-tools/scripts/smokeTestRelease.py", line 1466, in smokeTest
   [smoker]     unpackAndVerify(java, 'lucene', tmpDir, 'lucene-%s-src.tgz' % version, gitRevision, version, testArgs, baseURL)
   [smoker]   File "/home/jenkins/jenkins-slave/workspace/Lucene-Solr-SmokeRelease-master/dev-tools/scripts/smokeTestRelease.py", line 622, in unpackAndVerify
   [smoker]     verifyUnpacked(java, project, artifact, unpackPath, gitRevision, version, testArgs, tmpDir, baseURL)
   [smoker]   File "/home/jenkins/jenkins-slave/workspace/Lucene-Solr-SmokeRelease-master/dev-tools/scripts/smokeTestRelease.py", line 721, in verifyUnpacked
   [smoker]     java.run_java8('ant clean test %s' % testArgs, '%s/test.log' % unpackPath)
   [smoker]   File "/home/jenkins/jenkins-slave/workspace/Lucene-Solr-SmokeRelease-master/dev-tools/scripts/smokeTestRelease.py", line 1233, in run_java
   [smoker]     run('%s; %s' % (cmd_prefix, cmd), logfile)
   [smoker]   File "/home/jenkins/jenkins-slave/workspace/Lucene-Solr-SmokeRelease-master/dev-tools/scripts/smokeTestRelease.py", line 547, in run
   [smoker]     raise RuntimeError('command "%s" failed; see log file %s' % (command, logPath))
   [smoker] RuntimeError: command "export JAVA_HOME="/home/jenkins/tools/java/latest1.8" PATH="/home/jenkins/tools/java/latest1.8/bin:$PATH" JAVACMD="/home/jenkins/tools/java/latest1.8/bin/java"; ant clean test -Dtests.slow=false" failed; see log file /home/jenkins/jenkins-slave/workspace/Lucene-Solr-SmokeRelease-master/lucene/build/smokeTestRelease/tmp/unpack/lucene-8.0.0/test.log

BUILD FAILED
/home/jenkins/jenkins-slave/workspace/Lucene-Solr-SmokeRelease-master/build.xml:606: exec returned: 1

Total time: 25 minutes 58 seconds
Build step 'Invoke Ant' marked build as failure
Email was triggered for: Failure - Any
Sending email for trigger: Failure - Any

Mime
View raw message