lucene-dev mailing list archives

Site index · List index
Message view « Date » · « Thread »
Top « Date » · « Thread »
From Apache Jenkins Server <jenk...@builds.apache.org>
Subject [JENKINS] Lucene-Solr-Tests-master - Build # 2015 - Unstable
Date Thu, 20 Jul 2017 03:03:55 GMT
Build: https://builds.apache.org/job/Lucene-Solr-Tests-master/2015/

7 tests failed.
FAILED:  org.apache.solr.cloud.CollectionsAPISolrJTest.testCreateCollectionWithPropertyParam

Error Message:


Stack Trace:
java.lang.AssertionError
	at __randomizedtesting.SeedInfo.seed([3AF176DCA7FCE1C7:3C6A042D2322219E]:0)
	at org.junit.Assert.fail(Assert.java:92)
	at org.junit.Assert.assertTrue(Assert.java:43)
	at org.junit.Assert.assertTrue(Assert.java:54)
	at org.apache.solr.cloud.CollectionsAPISolrJTest.testCreateCollectionWithPropertyParam(CollectionsAPISolrJTest.java:250)
	at sun.reflect.NativeMethodAccessorImpl.invoke0(Native Method)
	at sun.reflect.NativeMethodAccessorImpl.invoke(NativeMethodAccessorImpl.java:62)
	at sun.reflect.DelegatingMethodAccessorImpl.invoke(DelegatingMethodAccessorImpl.java:43)
	at java.lang.reflect.Method.invoke(Method.java:498)
	at com.carrotsearch.randomizedtesting.RandomizedRunner.invoke(RandomizedRunner.java:1713)
	at com.carrotsearch.randomizedtesting.RandomizedRunner$8.evaluate(RandomizedRunner.java:907)
	at com.carrotsearch.randomizedtesting.RandomizedRunner$9.evaluate(RandomizedRunner.java:943)
	at com.carrotsearch.randomizedtesting.RandomizedRunner$10.evaluate(RandomizedRunner.java:957)
	at com.carrotsearch.randomizedtesting.rules.SystemPropertiesRestoreRule$1.evaluate(SystemPropertiesRestoreRule.java:57)
	at org.apache.lucene.util.TestRuleSetupTeardownChained$1.evaluate(TestRuleSetupTeardownChained.java:49)
	at org.apache.lucene.util.AbstractBeforeAfterRule$1.evaluate(AbstractBeforeAfterRule.java:45)
	at org.apache.lucene.util.TestRuleThreadAndTestName$1.evaluate(TestRuleThreadAndTestName.java:48)
	at org.apache.lucene.util.TestRuleIgnoreAfterMaxFailures$1.evaluate(TestRuleIgnoreAfterMaxFailures.java:64)
	at org.apache.lucene.util.TestRuleMarkFailure$1.evaluate(TestRuleMarkFailure.java:47)
	at com.carrotsearch.randomizedtesting.rules.StatementAdapter.evaluate(StatementAdapter.java:36)
	at com.carrotsearch.randomizedtesting.ThreadLeakControl$StatementRunner.run(ThreadLeakControl.java:368)
	at com.carrotsearch.randomizedtesting.ThreadLeakControl.forkTimeoutingTask(ThreadLeakControl.java:817)
	at com.carrotsearch.randomizedtesting.ThreadLeakControl$3.evaluate(ThreadLeakControl.java:468)
	at com.carrotsearch.randomizedtesting.RandomizedRunner.runSingleTest(RandomizedRunner.java:916)
	at com.carrotsearch.randomizedtesting.RandomizedRunner$5.evaluate(RandomizedRunner.java:802)
	at com.carrotsearch.randomizedtesting.RandomizedRunner$6.evaluate(RandomizedRunner.java:852)
	at com.carrotsearch.randomizedtesting.RandomizedRunner$7.evaluate(RandomizedRunner.java:863)
	at com.carrotsearch.randomizedtesting.rules.StatementAdapter.evaluate(StatementAdapter.java:36)
	at com.carrotsearch.randomizedtesting.rules.SystemPropertiesRestoreRule$1.evaluate(SystemPropertiesRestoreRule.java:57)
	at org.apache.lucene.util.AbstractBeforeAfterRule$1.evaluate(AbstractBeforeAfterRule.java:45)
	at com.carrotsearch.randomizedtesting.rules.StatementAdapter.evaluate(StatementAdapter.java:36)
	at org.apache.lucene.util.TestRuleStoreClassName$1.evaluate(TestRuleStoreClassName.java:41)
	at com.carrotsearch.randomizedtesting.rules.NoShadowingOrOverridesOnMethodsRule$1.evaluate(NoShadowingOrOverridesOnMethodsRule.java:40)
	at com.carrotsearch.randomizedtesting.rules.NoShadowingOrOverridesOnMethodsRule$1.evaluate(NoShadowingOrOverridesOnMethodsRule.java:40)
	at com.carrotsearch.randomizedtesting.rules.StatementAdapter.evaluate(StatementAdapter.java:36)
	at com.carrotsearch.randomizedtesting.rules.StatementAdapter.evaluate(StatementAdapter.java:36)
	at com.carrotsearch.randomizedtesting.rules.StatementAdapter.evaluate(StatementAdapter.java:36)
	at org.apache.lucene.util.TestRuleAssertionsRequired$1.evaluate(TestRuleAssertionsRequired.java:53)
	at org.apache.lucene.util.TestRuleMarkFailure$1.evaluate(TestRuleMarkFailure.java:47)
	at org.apache.lucene.util.TestRuleIgnoreAfterMaxFailures$1.evaluate(TestRuleIgnoreAfterMaxFailures.java:64)
	at org.apache.lucene.util.TestRuleIgnoreTestSuites$1.evaluate(TestRuleIgnoreTestSuites.java:54)
	at com.carrotsearch.randomizedtesting.rules.StatementAdapter.evaluate(StatementAdapter.java:36)
	at com.carrotsearch.randomizedtesting.ThreadLeakControl$StatementRunner.run(ThreadLeakControl.java:368)
	at java.lang.Thread.run(Thread.java:748)


FAILED:  org.apache.solr.cloud.CollectionsAPISolrJTest.testAddAndDeleteReplica

Error Message:
Could not find collection : solrj_replicatests

Stack Trace:
org.apache.solr.common.SolrException: Could not find collection : solrj_replicatests
	at __randomizedtesting.SeedInfo.seed([3AF176DCA7FCE1C7:D4410F89A030F67D]:0)
	at org.apache.solr.common.cloud.ClusterState.getCollection(ClusterState.java:194)
	at org.apache.solr.cloud.SolrCloudTestCase.getCollectionState(SolrCloudTestCase.java:247)
	at org.apache.solr.cloud.CollectionsAPISolrJTest.testAddAndDeleteReplica(CollectionsAPISolrJTest.java:270)
	at sun.reflect.NativeMethodAccessorImpl.invoke0(Native Method)
	at sun.reflect.NativeMethodAccessorImpl.invoke(NativeMethodAccessorImpl.java:62)
	at sun.reflect.DelegatingMethodAccessorImpl.invoke(DelegatingMethodAccessorImpl.java:43)
	at java.lang.reflect.Method.invoke(Method.java:498)
	at com.carrotsearch.randomizedtesting.RandomizedRunner.invoke(RandomizedRunner.java:1713)
	at com.carrotsearch.randomizedtesting.RandomizedRunner$8.evaluate(RandomizedRunner.java:907)
	at com.carrotsearch.randomizedtesting.RandomizedRunner$9.evaluate(RandomizedRunner.java:943)
	at com.carrotsearch.randomizedtesting.RandomizedRunner$10.evaluate(RandomizedRunner.java:957)
	at com.carrotsearch.randomizedtesting.rules.SystemPropertiesRestoreRule$1.evaluate(SystemPropertiesRestoreRule.java:57)
	at org.apache.lucene.util.TestRuleSetupTeardownChained$1.evaluate(TestRuleSetupTeardownChained.java:49)
	at org.apache.lucene.util.AbstractBeforeAfterRule$1.evaluate(AbstractBeforeAfterRule.java:45)
	at org.apache.lucene.util.TestRuleThreadAndTestName$1.evaluate(TestRuleThreadAndTestName.java:48)
	at org.apache.lucene.util.TestRuleIgnoreAfterMaxFailures$1.evaluate(TestRuleIgnoreAfterMaxFailures.java:64)
	at org.apache.lucene.util.TestRuleMarkFailure$1.evaluate(TestRuleMarkFailure.java:47)
	at com.carrotsearch.randomizedtesting.rules.StatementAdapter.evaluate(StatementAdapter.java:36)
	at com.carrotsearch.randomizedtesting.ThreadLeakControl$StatementRunner.run(ThreadLeakControl.java:368)
	at com.carrotsearch.randomizedtesting.ThreadLeakControl.forkTimeoutingTask(ThreadLeakControl.java:817)
	at com.carrotsearch.randomizedtesting.ThreadLeakControl$3.evaluate(ThreadLeakControl.java:468)
	at com.carrotsearch.randomizedtesting.RandomizedRunner.runSingleTest(RandomizedRunner.java:916)
	at com.carrotsearch.randomizedtesting.RandomizedRunner$5.evaluate(RandomizedRunner.java:802)
	at com.carrotsearch.randomizedtesting.RandomizedRunner$6.evaluate(RandomizedRunner.java:852)
	at com.carrotsearch.randomizedtesting.RandomizedRunner$7.evaluate(RandomizedRunner.java:863)
	at com.carrotsearch.randomizedtesting.rules.StatementAdapter.evaluate(StatementAdapter.java:36)
	at com.carrotsearch.randomizedtesting.rules.SystemPropertiesRestoreRule$1.evaluate(SystemPropertiesRestoreRule.java:57)
	at org.apache.lucene.util.AbstractBeforeAfterRule$1.evaluate(AbstractBeforeAfterRule.java:45)
	at com.carrotsearch.randomizedtesting.rules.StatementAdapter.evaluate(StatementAdapter.java:36)
	at org.apache.lucene.util.TestRuleStoreClassName$1.evaluate(TestRuleStoreClassName.java:41)
	at com.carrotsearch.randomizedtesting.rules.NoShadowingOrOverridesOnMethodsRule$1.evaluate(NoShadowingOrOverridesOnMethodsRule.java:40)
	at com.carrotsearch.randomizedtesting.rules.NoShadowingOrOverridesOnMethodsRule$1.evaluate(NoShadowingOrOverridesOnMethodsRule.java:40)
	at com.carrotsearch.randomizedtesting.rules.StatementAdapter.evaluate(StatementAdapter.java:36)
	at com.carrotsearch.randomizedtesting.rules.StatementAdapter.evaluate(StatementAdapter.java:36)
	at com.carrotsearch.randomizedtesting.rules.StatementAdapter.evaluate(StatementAdapter.java:36)
	at org.apache.lucene.util.TestRuleAssertionsRequired$1.evaluate(TestRuleAssertionsRequired.java:53)
	at org.apache.lucene.util.TestRuleMarkFailure$1.evaluate(TestRuleMarkFailure.java:47)
	at org.apache.lucene.util.TestRuleIgnoreAfterMaxFailures$1.evaluate(TestRuleIgnoreAfterMaxFailures.java:64)
	at org.apache.lucene.util.TestRuleIgnoreTestSuites$1.evaluate(TestRuleIgnoreTestSuites.java:54)
	at com.carrotsearch.randomizedtesting.rules.StatementAdapter.evaluate(StatementAdapter.java:36)
	at com.carrotsearch.randomizedtesting.ThreadLeakControl$StatementRunner.run(ThreadLeakControl.java:368)
	at java.lang.Thread.run(Thread.java:748)


FAILED:  org.apache.solr.cloud.CollectionsAPISolrJTest.testCreateAndDeleteCollection

Error Message:
expected:<4> but was:<1>

Stack Trace:
java.lang.AssertionError: expected:<4> but was:<1>
	at __randomizedtesting.SeedInfo.seed([3AF176DCA7FCE1C7:3D247797806884CA]:0)
	at org.junit.Assert.fail(Assert.java:93)
	at org.junit.Assert.failNotEquals(Assert.java:647)
	at org.junit.Assert.assertEquals(Assert.java:128)
	at org.junit.Assert.assertEquals(Assert.java:472)
	at org.junit.Assert.assertEquals(Assert.java:456)
	at org.apache.solr.cloud.CollectionsAPISolrJTest.testCreateAndDeleteCollection(CollectionsAPISolrJTest.java:99)
	at sun.reflect.NativeMethodAccessorImpl.invoke0(Native Method)
	at sun.reflect.NativeMethodAccessorImpl.invoke(NativeMethodAccessorImpl.java:62)
	at sun.reflect.DelegatingMethodAccessorImpl.invoke(DelegatingMethodAccessorImpl.java:43)
	at java.lang.reflect.Method.invoke(Method.java:498)
	at com.carrotsearch.randomizedtesting.RandomizedRunner.invoke(RandomizedRunner.java:1713)
	at com.carrotsearch.randomizedtesting.RandomizedRunner$8.evaluate(RandomizedRunner.java:907)
	at com.carrotsearch.randomizedtesting.RandomizedRunner$9.evaluate(RandomizedRunner.java:943)
	at com.carrotsearch.randomizedtesting.RandomizedRunner$10.evaluate(RandomizedRunner.java:957)
	at com.carrotsearch.randomizedtesting.rules.SystemPropertiesRestoreRule$1.evaluate(SystemPropertiesRestoreRule.java:57)
	at org.apache.lucene.util.TestRuleSetupTeardownChained$1.evaluate(TestRuleSetupTeardownChained.java:49)
	at org.apache.lucene.util.AbstractBeforeAfterRule$1.evaluate(AbstractBeforeAfterRule.java:45)
	at org.apache.lucene.util.TestRuleThreadAndTestName$1.evaluate(TestRuleThreadAndTestName.java:48)
	at org.apache.lucene.util.TestRuleIgnoreAfterMaxFailures$1.evaluate(TestRuleIgnoreAfterMaxFailures.java:64)
	at org.apache.lucene.util.TestRuleMarkFailure$1.evaluate(TestRuleMarkFailure.java:47)
	at com.carrotsearch.randomizedtesting.rules.StatementAdapter.evaluate(StatementAdapter.java:36)
	at com.carrotsearch.randomizedtesting.ThreadLeakControl$StatementRunner.run(ThreadLeakControl.java:368)
	at com.carrotsearch.randomizedtesting.ThreadLeakControl.forkTimeoutingTask(ThreadLeakControl.java:817)
	at com.carrotsearch.randomizedtesting.ThreadLeakControl$3.evaluate(ThreadLeakControl.java:468)
	at com.carrotsearch.randomizedtesting.RandomizedRunner.runSingleTest(RandomizedRunner.java:916)
	at com.carrotsearch.randomizedtesting.RandomizedRunner$5.evaluate(RandomizedRunner.java:802)
	at com.carrotsearch.randomizedtesting.RandomizedRunner$6.evaluate(RandomizedRunner.java:852)
	at com.carrotsearch.randomizedtesting.RandomizedRunner$7.evaluate(RandomizedRunner.java:863)
	at com.carrotsearch.randomizedtesting.rules.StatementAdapter.evaluate(StatementAdapter.java:36)
	at com.carrotsearch.randomizedtesting.rules.SystemPropertiesRestoreRule$1.evaluate(SystemPropertiesRestoreRule.java:57)
	at org.apache.lucene.util.AbstractBeforeAfterRule$1.evaluate(AbstractBeforeAfterRule.java:45)
	at com.carrotsearch.randomizedtesting.rules.StatementAdapter.evaluate(StatementAdapter.java:36)
	at org.apache.lucene.util.TestRuleStoreClassName$1.evaluate(TestRuleStoreClassName.java:41)
	at com.carrotsearch.randomizedtesting.rules.NoShadowingOrOverridesOnMethodsRule$1.evaluate(NoShadowingOrOverridesOnMethodsRule.java:40)
	at com.carrotsearch.randomizedtesting.rules.NoShadowingOrOverridesOnMethodsRule$1.evaluate(NoShadowingOrOverridesOnMethodsRule.java:40)
	at com.carrotsearch.randomizedtesting.rules.StatementAdapter.evaluate(StatementAdapter.java:36)
	at com.carrotsearch.randomizedtesting.rules.StatementAdapter.evaluate(StatementAdapter.java:36)
	at com.carrotsearch.randomizedtesting.rules.StatementAdapter.evaluate(StatementAdapter.java:36)
	at org.apache.lucene.util.TestRuleAssertionsRequired$1.evaluate(TestRuleAssertionsRequired.java:53)
	at org.apache.lucene.util.TestRuleMarkFailure$1.evaluate(TestRuleMarkFailure.java:47)
	at org.apache.lucene.util.TestRuleIgnoreAfterMaxFailures$1.evaluate(TestRuleIgnoreAfterMaxFailures.java:64)
	at org.apache.lucene.util.TestRuleIgnoreTestSuites$1.evaluate(TestRuleIgnoreTestSuites.java:54)
	at com.carrotsearch.randomizedtesting.rules.StatementAdapter.evaluate(StatementAdapter.java:36)
	at com.carrotsearch.randomizedtesting.ThreadLeakControl$StatementRunner.run(ThreadLeakControl.java:368)
	at java.lang.Thread.run(Thread.java:748)


FAILED:  org.apache.solr.cloud.CollectionsAPISolrJTest.testCreateAndDeleteShard

Error Message:
expected:<6> but was:<1>

Stack Trace:
java.lang.AssertionError: expected:<6> but was:<1>
	at __randomizedtesting.SeedInfo.seed([3AF176DCA7FCE1C7:FFAFC2C021092B3A]:0)
	at org.junit.Assert.fail(Assert.java:93)
	at org.junit.Assert.failNotEquals(Assert.java:647)
	at org.junit.Assert.assertEquals(Assert.java:128)
	at org.junit.Assert.assertEquals(Assert.java:472)
	at org.junit.Assert.assertEquals(Assert.java:456)
	at org.apache.solr.cloud.CollectionsAPISolrJTest.testCreateAndDeleteShard(CollectionsAPISolrJTest.java:161)
	at sun.reflect.NativeMethodAccessorImpl.invoke0(Native Method)
	at sun.reflect.NativeMethodAccessorImpl.invoke(NativeMethodAccessorImpl.java:62)
	at sun.reflect.DelegatingMethodAccessorImpl.invoke(DelegatingMethodAccessorImpl.java:43)
	at java.lang.reflect.Method.invoke(Method.java:498)
	at com.carrotsearch.randomizedtesting.RandomizedRunner.invoke(RandomizedRunner.java:1713)
	at com.carrotsearch.randomizedtesting.RandomizedRunner$8.evaluate(RandomizedRunner.java:907)
	at com.carrotsearch.randomizedtesting.RandomizedRunner$9.evaluate(RandomizedRunner.java:943)
	at com.carrotsearch.randomizedtesting.RandomizedRunner$10.evaluate(RandomizedRunner.java:957)
	at com.carrotsearch.randomizedtesting.rules.SystemPropertiesRestoreRule$1.evaluate(SystemPropertiesRestoreRule.java:57)
	at org.apache.lucene.util.TestRuleSetupTeardownChained$1.evaluate(TestRuleSetupTeardownChained.java:49)
	at org.apache.lucene.util.AbstractBeforeAfterRule$1.evaluate(AbstractBeforeAfterRule.java:45)
	at org.apache.lucene.util.TestRuleThreadAndTestName$1.evaluate(TestRuleThreadAndTestName.java:48)
	at org.apache.lucene.util.TestRuleIgnoreAfterMaxFailures$1.evaluate(TestRuleIgnoreAfterMaxFailures.java:64)
	at org.apache.lucene.util.TestRuleMarkFailure$1.evaluate(TestRuleMarkFailure.java:47)
	at com.carrotsearch.randomizedtesting.rules.StatementAdapter.evaluate(StatementAdapter.java:36)
	at com.carrotsearch.randomizedtesting.ThreadLeakControl$StatementRunner.run(ThreadLeakControl.java:368)
	at com.carrotsearch.randomizedtesting.ThreadLeakControl.forkTimeoutingTask(ThreadLeakControl.java:817)
	at com.carrotsearch.randomizedtesting.ThreadLeakControl$3.evaluate(ThreadLeakControl.java:468)
	at com.carrotsearch.randomizedtesting.RandomizedRunner.runSingleTest(RandomizedRunner.java:916)
	at com.carrotsearch.randomizedtesting.RandomizedRunner$5.evaluate(RandomizedRunner.java:802)
	at com.carrotsearch.randomizedtesting.RandomizedRunner$6.evaluate(RandomizedRunner.java:852)
	at com.carrotsearch.randomizedtesting.RandomizedRunner$7.evaluate(RandomizedRunner.java:863)
	at com.carrotsearch.randomizedtesting.rules.StatementAdapter.evaluate(StatementAdapter.java:36)
	at com.carrotsearch.randomizedtesting.rules.SystemPropertiesRestoreRule$1.evaluate(SystemPropertiesRestoreRule.java:57)
	at org.apache.lucene.util.AbstractBeforeAfterRule$1.evaluate(AbstractBeforeAfterRule.java:45)
	at com.carrotsearch.randomizedtesting.rules.StatementAdapter.evaluate(StatementAdapter.java:36)
	at org.apache.lucene.util.TestRuleStoreClassName$1.evaluate(TestRuleStoreClassName.java:41)
	at com.carrotsearch.randomizedtesting.rules.NoShadowingOrOverridesOnMethodsRule$1.evaluate(NoShadowingOrOverridesOnMethodsRule.java:40)
	at com.carrotsearch.randomizedtesting.rules.NoShadowingOrOverridesOnMethodsRule$1.evaluate(NoShadowingOrOverridesOnMethodsRule.java:40)
	at com.carrotsearch.randomizedtesting.rules.StatementAdapter.evaluate(StatementAdapter.java:36)
	at com.carrotsearch.randomizedtesting.rules.StatementAdapter.evaluate(StatementAdapter.java:36)
	at com.carrotsearch.randomizedtesting.rules.StatementAdapter.evaluate(StatementAdapter.java:36)
	at org.apache.lucene.util.TestRuleAssertionsRequired$1.evaluate(TestRuleAssertionsRequired.java:53)
	at org.apache.lucene.util.TestRuleMarkFailure$1.evaluate(TestRuleMarkFailure.java:47)
	at org.apache.lucene.util.TestRuleIgnoreAfterMaxFailures$1.evaluate(TestRuleIgnoreAfterMaxFailures.java:64)
	at org.apache.lucene.util.TestRuleIgnoreTestSuites$1.evaluate(TestRuleIgnoreTestSuites.java:54)
	at com.carrotsearch.randomizedtesting.rules.StatementAdapter.evaluate(StatementAdapter.java:36)
	at com.carrotsearch.randomizedtesting.ThreadLeakControl$StatementRunner.run(ThreadLeakControl.java:368)
	at java.lang.Thread.run(Thread.java:748)


FAILED:  junit.framework.TestSuite.org.apache.solr.core.TestLazyCores

Error Message:
ObjectTracker found 6 object(s) that were not released!!! [MMapDirectory, MMapDirectory, SolrIndexSearcher, SolrCore, MMapDirectory, MDCAwareThreadPoolExecutor] org.apache.solr.common.util.ObjectReleaseTracker$ObjectTrackerException: org.apache.lucene.store.MMapDirectory  at org.apache.solr.common.util.ObjectReleaseTracker.track(ObjectReleaseTracker.java:42)  at org.apache.solr.core.CachingDirectoryFactory.get(CachingDirectoryFactory.java:348)  at org.apache.solr.core.SolrCore.getNewIndexDir(SolrCore.java:349)  at org.apache.solr.core.SolrCore.initIndex(SolrCore.java:709)  at org.apache.solr.core.SolrCore.<init>(SolrCore.java:934)  at org.apache.solr.core.SolrCore.<init>(SolrCore.java:843)  at org.apache.solr.core.CoreContainer.create(CoreContainer.java:969)  at org.apache.solr.core.CoreContainer.lambda$load$7(CoreContainer.java:610)  at com.codahale.metrics.InstrumentedExecutorService$InstrumentedCallable.call(InstrumentedExecutorService.java:197)  at java.util.concurrent.FutureTask.run(FutureTask.java:266)  at org.apache.solr.common.util.ExecutorUtil$MDCAwareThreadPoolExecutor.lambda$execute$0(ExecutorUtil.java:188)  at java.util.concurrent.ThreadPoolExecutor.runWorker(ThreadPoolExecutor.java:1142)  at java.util.concurrent.ThreadPoolExecutor$Worker.run(ThreadPoolExecutor.java:617)  at java.lang.Thread.run(Thread.java:748)  org.apache.solr.common.util.ObjectReleaseTracker$ObjectTrackerException: org.apache.lucene.store.MMapDirectory  at org.apache.solr.common.util.ObjectReleaseTracker.track(ObjectReleaseTracker.java:42)  at org.apache.solr.core.CachingDirectoryFactory.get(CachingDirectoryFactory.java:348)  at org.apache.solr.core.SolrCore.initSnapshotMetaDataManager(SolrCore.java:478)  at org.apache.solr.core.SolrCore.<init>(SolrCore.java:928)  at org.apache.solr.core.SolrCore.<init>(SolrCore.java:843)  at org.apache.solr.core.CoreContainer.create(CoreContainer.java:969)  at org.apache.solr.core.CoreContainer.lambda$load$7(CoreContainer.java:610)  at com.codahale.metrics.InstrumentedExecutorService$InstrumentedCallable.call(InstrumentedExecutorService.java:197)  at java.util.concurrent.FutureTask.run(FutureTask.java:266)  at org.apache.solr.common.util.ExecutorUtil$MDCAwareThreadPoolExecutor.lambda$execute$0(ExecutorUtil.java:188)  at java.util.concurrent.ThreadPoolExecutor.runWorker(ThreadPoolExecutor.java:1142)  at java.util.concurrent.ThreadPoolExecutor$Worker.run(ThreadPoolExecutor.java:617)  at java.lang.Thread.run(Thread.java:748)  org.apache.solr.common.util.ObjectReleaseTracker$ObjectTrackerException: org.apache.solr.search.SolrIndexSearcher  at org.apache.solr.common.util.ObjectReleaseTracker.track(ObjectReleaseTracker.java:42)  at org.apache.solr.search.SolrIndexSearcher.<init>(SolrIndexSearcher.java:323)  at org.apache.solr.core.SolrCore.openNewSearcher(SolrCore.java:2033)  at org.apache.solr.core.SolrCore.getSearcher(SolrCore.java:2185)  at org.apache.solr.core.SolrCore.initSearcher(SolrCore.java:1071)  at org.apache.solr.core.SolrCore.<init>(SolrCore.java:960)  at org.apache.solr.core.SolrCore.<init>(SolrCore.java:843)  at org.apache.solr.core.CoreContainer.create(CoreContainer.java:969)  at org.apache.solr.core.CoreContainer.lambda$load$7(CoreContainer.java:610)  at com.codahale.metrics.InstrumentedExecutorService$InstrumentedCallable.call(InstrumentedExecutorService.java:197)  at java.util.concurrent.FutureTask.run(FutureTask.java:266)  at org.apache.solr.common.util.ExecutorUtil$MDCAwareThreadPoolExecutor.lambda$execute$0(ExecutorUtil.java:188)  at java.util.concurrent.ThreadPoolExecutor.runWorker(ThreadPoolExecutor.java:1142)  at java.util.concurrent.ThreadPoolExecutor$Worker.run(ThreadPoolExecutor.java:617)  at java.lang.Thread.run(Thread.java:748)  org.apache.solr.common.util.ObjectReleaseTracker$ObjectTrackerException: org.apache.solr.core.SolrCore  at org.apache.solr.common.util.ObjectReleaseTracker.track(ObjectReleaseTracker.java:42)  at org.apache.solr.core.SolrCore.<init>(SolrCore.java:1019)  at org.apache.solr.core.SolrCore.<init>(SolrCore.java:843)  at org.apache.solr.core.CoreContainer.create(CoreContainer.java:969)  at org.apache.solr.core.CoreContainer.lambda$load$7(CoreContainer.java:610)  at com.codahale.metrics.InstrumentedExecutorService$InstrumentedCallable.call(InstrumentedExecutorService.java:197)  at java.util.concurrent.FutureTask.run(FutureTask.java:266)  at org.apache.solr.common.util.ExecutorUtil$MDCAwareThreadPoolExecutor.lambda$execute$0(ExecutorUtil.java:188)  at java.util.concurrent.ThreadPoolExecutor.runWorker(ThreadPoolExecutor.java:1142)  at java.util.concurrent.ThreadPoolExecutor$Worker.run(ThreadPoolExecutor.java:617)  at java.lang.Thread.run(Thread.java:748)  org.apache.solr.common.util.ObjectReleaseTracker$ObjectTrackerException: org.apache.lucene.store.MMapDirectory  at org.apache.solr.common.util.ObjectReleaseTracker.track(ObjectReleaseTracker.java:42)  at org.apache.solr.core.CachingDirectoryFactory.get(CachingDirectoryFactory.java:348)  at org.apache.solr.update.SolrIndexWriter.create(SolrIndexWriter.java:92)  at org.apache.solr.core.SolrCore.initIndex(SolrCore.java:741)  at org.apache.solr.core.SolrCore.<init>(SolrCore.java:934)  at org.apache.solr.core.SolrCore.<init>(SolrCore.java:843)  at org.apache.solr.core.CoreContainer.create(CoreContainer.java:969)  at org.apache.solr.core.CoreContainer.lambda$load$7(CoreContainer.java:610)  at com.codahale.metrics.InstrumentedExecutorService$InstrumentedCallable.call(InstrumentedExecutorService.java:197)  at java.util.concurrent.FutureTask.run(FutureTask.java:266)  at org.apache.solr.common.util.ExecutorUtil$MDCAwareThreadPoolExecutor.lambda$execute$0(ExecutorUtil.java:188)  at java.util.concurrent.ThreadPoolExecutor.runWorker(ThreadPoolExecutor.java:1142)  at java.util.concurrent.ThreadPoolExecutor$Worker.run(ThreadPoolExecutor.java:617)  at java.lang.Thread.run(Thread.java:748)  org.apache.solr.common.util.ObjectReleaseTracker$ObjectTrackerException: org.apache.solr.common.util.ExecutorUtil$MDCAwareThreadPoolExecutor  at org.apache.solr.common.util.ObjectReleaseTracker.track(ObjectReleaseTracker.java:42)  at org.apache.solr.core.SolrCore.<init>(SolrCore.java:872)  at org.apache.solr.core.SolrCore.<init>(SolrCore.java:843)  at org.apache.solr.core.CoreContainer.create(CoreContainer.java:969)  at org.apache.solr.core.CoreContainer.lambda$load$7(CoreContainer.java:610)  at com.codahale.metrics.InstrumentedExecutorService$InstrumentedCallable.call(InstrumentedExecutorService.java:197)  at java.util.concurrent.FutureTask.run(FutureTask.java:266)  at org.apache.solr.common.util.ExecutorUtil$MDCAwareThreadPoolExecutor.lambda$execute$0(ExecutorUtil.java:188)  at java.util.concurrent.ThreadPoolExecutor.runWorker(ThreadPoolExecutor.java:1142)  at java.util.concurrent.ThreadPoolExecutor$Worker.run(ThreadPoolExecutor.java:617)  at java.lang.Thread.run(Thread.java:748)  

Stack Trace:
java.lang.AssertionError: ObjectTracker found 6 object(s) that were not released!!! [MMapDirectory, MMapDirectory, SolrIndexSearcher, SolrCore, MMapDirectory, MDCAwareThreadPoolExecutor]
org.apache.solr.common.util.ObjectReleaseTracker$ObjectTrackerException: org.apache.lucene.store.MMapDirectory
	at org.apache.solr.common.util.ObjectReleaseTracker.track(ObjectReleaseTracker.java:42)
	at org.apache.solr.core.CachingDirectoryFactory.get(CachingDirectoryFactory.java:348)
	at org.apache.solr.core.SolrCore.getNewIndexDir(SolrCore.java:349)
	at org.apache.solr.core.SolrCore.initIndex(SolrCore.java:709)
	at org.apache.solr.core.SolrCore.<init>(SolrCore.java:934)
	at org.apache.solr.core.SolrCore.<init>(SolrCore.java:843)
	at org.apache.solr.core.CoreContainer.create(CoreContainer.java:969)
	at org.apache.solr.core.CoreContainer.lambda$load$7(CoreContainer.java:610)
	at com.codahale.metrics.InstrumentedExecutorService$InstrumentedCallable.call(InstrumentedExecutorService.java:197)
	at java.util.concurrent.FutureTask.run(FutureTask.java:266)
	at org.apache.solr.common.util.ExecutorUtil$MDCAwareThreadPoolExecutor.lambda$execute$0(ExecutorUtil.java:188)
	at java.util.concurrent.ThreadPoolExecutor.runWorker(ThreadPoolExecutor.java:1142)
	at java.util.concurrent.ThreadPoolExecutor$Worker.run(ThreadPoolExecutor.java:617)
	at java.lang.Thread.run(Thread.java:748)

org.apache.solr.common.util.ObjectReleaseTracker$ObjectTrackerException: org.apache.lucene.store.MMapDirectory
	at org.apache.solr.common.util.ObjectReleaseTracker.track(ObjectReleaseTracker.java:42)
	at org.apache.solr.core.CachingDirectoryFactory.get(CachingDirectoryFactory.java:348)
	at org.apache.solr.core.SolrCore.initSnapshotMetaDataManager(SolrCore.java:478)
	at org.apache.solr.core.SolrCore.<init>(SolrCore.java:928)
	at org.apache.solr.core.SolrCore.<init>(SolrCore.java:843)
	at org.apache.solr.core.CoreContainer.create(CoreContainer.java:969)
	at org.apache.solr.core.CoreContainer.lambda$load$7(CoreContainer.java:610)
	at com.codahale.metrics.InstrumentedExecutorService$InstrumentedCallable.call(InstrumentedExecutorService.java:197)
	at java.util.concurrent.FutureTask.run(FutureTask.java:266)
	at org.apache.solr.common.util.ExecutorUtil$MDCAwareThreadPoolExecutor.lambda$execute$0(ExecutorUtil.java:188)
	at java.util.concurrent.ThreadPoolExecutor.runWorker(ThreadPoolExecutor.java:1142)
	at java.util.concurrent.ThreadPoolExecutor$Worker.run(ThreadPoolExecutor.java:617)
	at java.lang.Thread.run(Thread.java:748)

org.apache.solr.common.util.ObjectReleaseTracker$ObjectTrackerException: org.apache.solr.search.SolrIndexSearcher
	at org.apache.solr.common.util.ObjectReleaseTracker.track(ObjectReleaseTracker.java:42)
	at org.apache.solr.search.SolrIndexSearcher.<init>(SolrIndexSearcher.java:323)
	at org.apache.solr.core.SolrCore.openNewSearcher(SolrCore.java:2033)
	at org.apache.solr.core.SolrCore.getSearcher(SolrCore.java:2185)
	at org.apache.solr.core.SolrCore.initSearcher(SolrCore.java:1071)
	at org.apache.solr.core.SolrCore.<init>(SolrCore.java:960)
	at org.apache.solr.core.SolrCore.<init>(SolrCore.java:843)
	at org.apache.solr.core.CoreContainer.create(CoreContainer.java:969)
	at org.apache.solr.core.CoreContainer.lambda$load$7(CoreContainer.java:610)
	at com.codahale.metrics.InstrumentedExecutorService$InstrumentedCallable.call(InstrumentedExecutorService.java:197)
	at java.util.concurrent.FutureTask.run(FutureTask.java:266)
	at org.apache.solr.common.util.ExecutorUtil$MDCAwareThreadPoolExecutor.lambda$execute$0(ExecutorUtil.java:188)
	at java.util.concurrent.ThreadPoolExecutor.runWorker(ThreadPoolExecutor.java:1142)
	at java.util.concurrent.ThreadPoolExecutor$Worker.run(ThreadPoolExecutor.java:617)
	at java.lang.Thread.run(Thread.java:748)

org.apache.solr.common.util.ObjectReleaseTracker$ObjectTrackerException: org.apache.solr.core.SolrCore
	at org.apache.solr.common.util.ObjectReleaseTracker.track(ObjectReleaseTracker.java:42)
	at org.apache.solr.core.SolrCore.<init>(SolrCore.java:1019)
	at org.apache.solr.core.SolrCore.<init>(SolrCore.java:843)
	at org.apache.solr.core.CoreContainer.create(CoreContainer.java:969)
	at org.apache.solr.core.CoreContainer.lambda$load$7(CoreContainer.java:610)
	at com.codahale.metrics.InstrumentedExecutorService$InstrumentedCallable.call(InstrumentedExecutorService.java:197)
	at java.util.concurrent.FutureTask.run(FutureTask.java:266)
	at org.apache.solr.common.util.ExecutorUtil$MDCAwareThreadPoolExecutor.lambda$execute$0(ExecutorUtil.java:188)
	at java.util.concurrent.ThreadPoolExecutor.runWorker(ThreadPoolExecutor.java:1142)
	at java.util.concurrent.ThreadPoolExecutor$Worker.run(ThreadPoolExecutor.java:617)
	at java.lang.Thread.run(Thread.java:748)

org.apache.solr.common.util.ObjectReleaseTracker$ObjectTrackerException: org.apache.lucene.store.MMapDirectory
	at org.apache.solr.common.util.ObjectReleaseTracker.track(ObjectReleaseTracker.java:42)
	at org.apache.solr.core.CachingDirectoryFactory.get(CachingDirectoryFactory.java:348)
	at org.apache.solr.update.SolrIndexWriter.create(SolrIndexWriter.java:92)
	at org.apache.solr.core.SolrCore.initIndex(SolrCore.java:741)
	at org.apache.solr.core.SolrCore.<init>(SolrCore.java:934)
	at org.apache.solr.core.SolrCore.<init>(SolrCore.java:843)
	at org.apache.solr.core.CoreContainer.create(CoreContainer.java:969)
	at org.apache.solr.core.CoreContainer.lambda$load$7(CoreContainer.java:610)
	at com.codahale.metrics.InstrumentedExecutorService$InstrumentedCallable.call(InstrumentedExecutorService.java:197)
	at java.util.concurrent.FutureTask.run(FutureTask.java:266)
	at org.apache.solr.common.util.ExecutorUtil$MDCAwareThreadPoolExecutor.lambda$execute$0(ExecutorUtil.java:188)
	at java.util.concurrent.ThreadPoolExecutor.runWorker(ThreadPoolExecutor.java:1142)
	at java.util.concurrent.ThreadPoolExecutor$Worker.run(ThreadPoolExecutor.java:617)
	at java.lang.Thread.run(Thread.java:748)

org.apache.solr.common.util.ObjectReleaseTracker$ObjectTrackerException: org.apache.solr.common.util.ExecutorUtil$MDCAwareThreadPoolExecutor
	at org.apache.solr.common.util.ObjectReleaseTracker.track(ObjectReleaseTracker.java:42)
	at org.apache.solr.core.SolrCore.<init>(SolrCore.java:872)
	at org.apache.solr.core.SolrCore.<init>(SolrCore.java:843)
	at org.apache.solr.core.CoreContainer.create(CoreContainer.java:969)
	at org.apache.solr.core.CoreContainer.lambda$load$7(CoreContainer.java:610)
	at com.codahale.metrics.InstrumentedExecutorService$InstrumentedCallable.call(InstrumentedExecutorService.java:197)
	at java.util.concurrent.FutureTask.run(FutureTask.java:266)
	at org.apache.solr.common.util.ExecutorUtil$MDCAwareThreadPoolExecutor.lambda$execute$0(ExecutorUtil.java:188)
	at java.util.concurrent.ThreadPoolExecutor.runWorker(ThreadPoolExecutor.java:1142)
	at java.util.concurrent.ThreadPoolExecutor$Worker.run(ThreadPoolExecutor.java:617)
	at java.lang.Thread.run(Thread.java:748)


	at __randomizedtesting.SeedInfo.seed([3AF176DCA7FCE1C7]:0)
	at org.junit.Assert.fail(Assert.java:93)
	at org.junit.Assert.assertTrue(Assert.java:43)
	at org.junit.Assert.assertNull(Assert.java:551)
	at org.apache.solr.SolrTestCaseJ4.teardownTestCases(SolrTestCaseJ4.java:296)
	at sun.reflect.GeneratedMethodAccessor35.invoke(Unknown Source)
	at sun.reflect.DelegatingMethodAccessorImpl.invoke(DelegatingMethodAccessorImpl.java:43)
	at java.lang.reflect.Method.invoke(Method.java:498)
	at com.carrotsearch.randomizedtesting.RandomizedRunner.invoke(RandomizedRunner.java:1713)
	at com.carrotsearch.randomizedtesting.RandomizedRunner$7.evaluate(RandomizedRunner.java:870)
	at com.carrotsearch.randomizedtesting.rules.StatementAdapter.evaluate(StatementAdapter.java:36)
	at com.carrotsearch.randomizedtesting.rules.SystemPropertiesRestoreRule$1.evaluate(SystemPropertiesRestoreRule.java:57)
	at org.apache.lucene.util.AbstractBeforeAfterRule$1.evaluate(AbstractBeforeAfterRule.java:45)
	at com.carrotsearch.randomizedtesting.rules.StatementAdapter.evaluate(StatementAdapter.java:36)
	at org.apache.lucene.util.TestRuleStoreClassName$1.evaluate(TestRuleStoreClassName.java:41)
	at com.carrotsearch.randomizedtesting.rules.NoShadowingOrOverridesOnMethodsRule$1.evaluate(NoShadowingOrOverridesOnMethodsRule.java:40)
	at com.carrotsearch.randomizedtesting.rules.NoShadowingOrOverridesOnMethodsRule$1.evaluate(NoShadowingOrOverridesOnMethodsRule.java:40)
	at com.carrotsearch.randomizedtesting.rules.StatementAdapter.evaluate(StatementAdapter.java:36)
	at com.carrotsearch.randomizedtesting.rules.StatementAdapter.evaluate(StatementAdapter.java:36)
	at com.carrotsearch.randomizedtesting.rules.StatementAdapter.evaluate(StatementAdapter.java:36)
	at org.apache.lucene.util.TestRuleAssertionsRequired$1.evaluate(TestRuleAssertionsRequired.java:53)
	at org.apache.lucene.util.TestRuleMarkFailure$1.evaluate(TestRuleMarkFailure.java:47)
	at org.apache.lucene.util.TestRuleIgnoreAfterMaxFailures$1.evaluate(TestRuleIgnoreAfterMaxFailures.java:64)
	at org.apache.lucene.util.TestRuleIgnoreTestSuites$1.evaluate(TestRuleIgnoreTestSuites.java:54)
	at com.carrotsearch.randomizedtesting.rules.StatementAdapter.evaluate(StatementAdapter.java:36)
	at com.carrotsearch.randomizedtesting.ThreadLeakControl$StatementRunner.run(ThreadLeakControl.java:368)
	at java.lang.Thread.run(Thread.java:748)


FAILED:  junit.framework.TestSuite.org.apache.solr.core.TestLazyCores

Error Message:
1 thread leaked from SUITE scope at org.apache.solr.core.TestLazyCores:     1) Thread[id=10789, name=searcherExecutor-4465-thread-1, state=WAITING, group=TGRP-TestLazyCores]         at sun.misc.Unsafe.park(Native Method)         at java.util.concurrent.locks.LockSupport.park(LockSupport.java:175)         at java.util.concurrent.locks.AbstractQueuedSynchronizer$ConditionObject.await(AbstractQueuedSynchronizer.java:2039)         at java.util.concurrent.LinkedBlockingQueue.take(LinkedBlockingQueue.java:442)         at java.util.concurrent.ThreadPoolExecutor.getTask(ThreadPoolExecutor.java:1067)         at java.util.concurrent.ThreadPoolExecutor.runWorker(ThreadPoolExecutor.java:1127)         at java.util.concurrent.ThreadPoolExecutor$Worker.run(ThreadPoolExecutor.java:617)         at java.lang.Thread.run(Thread.java:748)

Stack Trace:
com.carrotsearch.randomizedtesting.ThreadLeakError: 1 thread leaked from SUITE scope at org.apache.solr.core.TestLazyCores: 
   1) Thread[id=10789, name=searcherExecutor-4465-thread-1, state=WAITING, group=TGRP-TestLazyCores]
        at sun.misc.Unsafe.park(Native Method)
        at java.util.concurrent.locks.LockSupport.park(LockSupport.java:175)
        at java.util.concurrent.locks.AbstractQueuedSynchronizer$ConditionObject.await(AbstractQueuedSynchronizer.java:2039)
        at java.util.concurrent.LinkedBlockingQueue.take(LinkedBlockingQueue.java:442)
        at java.util.concurrent.ThreadPoolExecutor.getTask(ThreadPoolExecutor.java:1067)
        at java.util.concurrent.ThreadPoolExecutor.runWorker(ThreadPoolExecutor.java:1127)
        at java.util.concurrent.ThreadPoolExecutor$Worker.run(ThreadPoolExecutor.java:617)
        at java.lang.Thread.run(Thread.java:748)
	at __randomizedtesting.SeedInfo.seed([3AF176DCA7FCE1C7]:0)


FAILED:  junit.framework.TestSuite.org.apache.solr.core.TestLazyCores

Error Message:
There are still zombie threads that couldn't be terminated:    1) Thread[id=10789, name=searcherExecutor-4465-thread-1, state=WAITING, group=TGRP-TestLazyCores]         at sun.misc.Unsafe.park(Native Method)         at java.util.concurrent.locks.LockSupport.park(LockSupport.java:175)         at java.util.concurrent.locks.AbstractQueuedSynchronizer$ConditionObject.await(AbstractQueuedSynchronizer.java:2039)         at java.util.concurrent.LinkedBlockingQueue.take(LinkedBlockingQueue.java:442)         at java.util.concurrent.ThreadPoolExecutor.getTask(ThreadPoolExecutor.java:1067)         at java.util.concurrent.ThreadPoolExecutor.runWorker(ThreadPoolExecutor.java:1127)         at java.util.concurrent.ThreadPoolExecutor$Worker.run(ThreadPoolExecutor.java:617)         at java.lang.Thread.run(Thread.java:748)

Stack Trace:
com.carrotsearch.randomizedtesting.ThreadLeakError: There are still zombie threads that couldn't be terminated:
   1) Thread[id=10789, name=searcherExecutor-4465-thread-1, state=WAITING, group=TGRP-TestLazyCores]
        at sun.misc.Unsafe.park(Native Method)
        at java.util.concurrent.locks.LockSupport.park(LockSupport.java:175)
        at java.util.concurrent.locks.AbstractQueuedSynchronizer$ConditionObject.await(AbstractQueuedSynchronizer.java:2039)
        at java.util.concurrent.LinkedBlockingQueue.take(LinkedBlockingQueue.java:442)
        at java.util.concurrent.ThreadPoolExecutor.getTask(ThreadPoolExecutor.java:1067)
        at java.util.concurrent.ThreadPoolExecutor.runWorker(ThreadPoolExecutor.java:1127)
        at java.util.concurrent.ThreadPoolExecutor$Worker.run(ThreadPoolExecutor.java:617)
        at java.lang.Thread.run(Thread.java:748)
	at __randomizedtesting.SeedInfo.seed([3AF176DCA7FCE1C7]:0)




Build Log:
[...truncated 10845 lines...]
   [junit4] Suite: org.apache.solr.cloud.CollectionsAPISolrJTest
   [junit4]   2> Creating dataDir: /home/jenkins/jenkins-slave/workspace/Lucene-Solr-Tests-master/solr/build/solr-core/test/J2/temp/solr.cloud.CollectionsAPISolrJTest_3AF176DCA7FCE1C7-001/init-core-data-001
   [junit4]   2> 112987 WARN  (SUITE-CollectionsAPISolrJTest-seed#[3AF176DCA7FCE1C7]-worker) [    ] o.a.s.SolrTestCaseJ4 startTrackingSearchers: numOpens=16 numCloses=16
   [junit4]   2> 113049 INFO  (SUITE-CollectionsAPISolrJTest-seed#[3AF176DCA7FCE1C7]-worker) [    ] o.a.s.SolrTestCaseJ4 Using PointFields (NUMERIC_POINTS_SYSPROP=true) w/NUMERIC_DOCVALUES_SYSPROP=true
   [junit4]   2> 113051 INFO  (SUITE-CollectionsAPISolrJTest-seed#[3AF176DCA7FCE1C7]-worker) [    ] o.a.s.SolrTestCaseJ4 Randomized ssl (true) and clientAuth (true) via: @org.apache.solr.util.RandomizeSSL(reason=, value=NaN, ssl=NaN, clientAuth=NaN)
   [junit4]   2> 113085 INFO  (SUITE-CollectionsAPISolrJTest-seed#[3AF176DCA7FCE1C7]-worker) [    ] o.a.s.c.MiniSolrCloudCluster Starting cluster of 4 servers in /home/jenkins/jenkins-slave/workspace/Lucene-Solr-Tests-master/solr/build/solr-core/test/J2/temp/solr.cloud.CollectionsAPISolrJTest_3AF176DCA7FCE1C7-001/tempDir-001
   [junit4]   2> 113086 INFO  (SUITE-CollectionsAPISolrJTest-seed#[3AF176DCA7FCE1C7]-worker) [    ] o.a.s.c.ZkTestServer STARTING ZK TEST SERVER
   [junit4]   2> 113112 INFO  (Thread-83) [    ] o.a.s.c.ZkTestServer client port:0.0.0.0/0.0.0.0:0
   [junit4]   2> 113112 INFO  (Thread-83) [    ] o.a.s.c.ZkTestServer Starting server
   [junit4]   2> 113114 ERROR (Thread-83) [    ] o.a.z.s.ZooKeeperServer ZKShutdownHandler is not registered, so ZooKeeper server won't take any action on ERROR or SHUTDOWN server state changes
   [junit4]   2> 113212 INFO  (SUITE-CollectionsAPISolrJTest-seed#[3AF176DCA7FCE1C7]-worker) [    ] o.a.s.c.ZkTestServer start zk server on port:43251
   [junit4]   2> 113676 INFO  (jetty-launcher-65-thread-2) [    ] o.e.j.s.Server jetty-9.3.14.v20161028
   [junit4]   2> 113702 INFO  (jetty-launcher-65-thread-1) [    ] o.e.j.s.Server jetty-9.3.14.v20161028
   [junit4]   2> 113703 INFO  (jetty-launcher-65-thread-3) [    ] o.e.j.s.Server jetty-9.3.14.v20161028
   [junit4]   2> 113704 INFO  (jetty-launcher-65-thread-1) [    ] o.e.j.s.h.ContextHandler Started o.e.j.s.ServletContextHandler@3b5ffc7{/solr,null,AVAILABLE}
   [junit4]   2> 113715 INFO  (jetty-launcher-65-thread-2) [    ] o.e.j.s.h.ContextHandler Started o.e.j.s.ServletContextHandler@3a108c15{/solr,null,AVAILABLE}
   [junit4]   2> 113716 INFO  (jetty-launcher-65-thread-4) [    ] o.e.j.s.Server jetty-9.3.14.v20161028
   [junit4]   2> 113717 INFO  (jetty-launcher-65-thread-1) [    ] o.e.j.s.AbstractConnector Started ServerConnector@486c6552{SSL,[ssl, http/1.1]}{127.0.0.1:42929}
   [junit4]   2> 113717 INFO  (jetty-launcher-65-thread-1) [    ] o.e.j.s.Server Started @124225ms
   [junit4]   2> 113717 INFO  (jetty-launcher-65-thread-1) [    ] o.a.s.c.s.e.JettySolrRunner Jetty properties: {hostContext=/solr, hostPort=42929}
   [junit4]   2> 113717 ERROR (jetty-launcher-65-thread-1) [    ] o.a.s.s.StartupLoggingUtils Missing Java Option solr.log.dir. Logging may be missing or incomplete.
   [junit4]   2> 113717 INFO  (jetty-launcher-65-thread-1) [    ] o.a.s.s.SolrDispatchFilter  ___      _       Welcome to Apache Solr? version 8.0.0
   [junit4]   2> 113717 INFO  (jetty-launcher-65-thread-1) [    ] o.a.s.s.SolrDispatchFilter / __| ___| |_ _   Starting in cloud mode on port null
   [junit4]   2> 113717 INFO  (jetty-launcher-65-thread-1) [    ] o.a.s.s.SolrDispatchFilter \__ \/ _ \ | '_|  Install dir: null, Default config dir: null
   [junit4]   2> 113717 INFO  (jetty-launcher-65-thread-1) [    ] o.a.s.s.SolrDispatchFilter |___/\___/_|_|    Start time: 2017-07-20T01:46:21.436Z
   [junit4]   2> 113764 INFO  (jetty-launcher-65-thread-4) [    ] o.e.j.s.h.ContextHandler Started o.e.j.s.ServletContextHandler@3ed57c06{/solr,null,AVAILABLE}
   [junit4]   2> 113765 INFO  (jetty-launcher-65-thread-4) [    ] o.e.j.s.AbstractConnector Started ServerConnector@6d3613a8{SSL,[ssl, http/1.1]}{127.0.0.1:45081}
   [junit4]   2> 113765 INFO  (jetty-launcher-65-thread-4) [    ] o.e.j.s.Server Started @124273ms
   [junit4]   2> 113765 INFO  (jetty-launcher-65-thread-4) [    ] o.a.s.c.s.e.JettySolrRunner Jetty properties: {hostContext=/solr, hostPort=45081}
   [junit4]   2> 113765 ERROR (jetty-launcher-65-thread-4) [    ] o.a.s.s.StartupLoggingUtils Missing Java Option solr.log.dir. Logging may be missing or incomplete.
   [junit4]   2> 113765 INFO  (jetty-launcher-65-thread-4) [    ] o.a.s.s.SolrDispatchFilter  ___      _       Welcome to Apache Solr? version 8.0.0
   [junit4]   2> 113765 INFO  (jetty-launcher-65-thread-4) [    ] o.a.s.s.SolrDispatchFilter / __| ___| |_ _   Starting in cloud mode on port null
   [junit4]   2> 113765 INFO  (jetty-launcher-65-thread-4) [    ] o.a.s.s.SolrDispatchFilter \__ \/ _ \ | '_|  Install dir: null, Default config dir: null
   [junit4]   2> 113765 INFO  (jetty-launcher-65-thread-4) [    ] o.a.s.s.SolrDispatchFilter |___/\___/_|_|    Start time: 2017-07-20T01:46:21.484Z
   [junit4]   2> 113784 INFO  (jetty-launcher-65-thread-3) [    ] o.e.j.s.h.ContextHandler Started o.e.j.s.ServletContextHandler@62576888{/solr,null,AVAILABLE}
   [junit4]   2> 113785 INFO  (jetty-launcher-65-thread-3) [    ] o.e.j.s.AbstractConnector Started ServerConnector@25c683e4{SSL,[ssl, http/1.1]}{127.0.0.1:38950}
   [junit4]   2> 113785 INFO  (jetty-launcher-65-thread-3) [    ] o.e.j.s.Server Started @124293ms
   [junit4]   2> 113785 INFO  (jetty-launcher-65-thread-3) [    ] o.a.s.c.s.e.JettySolrRunner Jetty properties: {hostContext=/solr, hostPort=38950}
   [junit4]   2> 113785 ERROR (jetty-launcher-65-thread-3) [    ] o.a.s.s.StartupLoggingUtils Missing Java Option solr.log.dir. Logging may be missing or incomplete.
   [junit4]   2> 113785 INFO  (jetty-launcher-65-thread-3) [    ] o.a.s.s.SolrDispatchFilter  ___      _       Welcome to Apache Solr? version 8.0.0
   [junit4]   2> 113785 INFO  (jetty-launcher-65-thread-3) [    ] o.a.s.s.SolrDispatchFilter / __| ___| |_ _   Starting in cloud mode on port null
   [junit4]   2> 113785 INFO  (jetty-launcher-65-thread-3) [    ] o.a.s.s.SolrDispatchFilter \__ \/ _ \ | '_|  Install dir: null, Default config dir: null
   [junit4]   2> 113786 INFO  (jetty-launcher-65-thread-3) [    ] o.a.s.s.SolrDispatchFilter |___/\___/_|_|    Start time: 2017-07-20T01:46:21.504Z
   [junit4]   2> 113787 INFO  (jetty-launcher-65-thread-2) [    ] o.e.j.s.AbstractConnector Started ServerConnector@8d87fc0{SSL,[ssl, http/1.1]}{127.0.0.1:37021}
   [junit4]   2> 113787 INFO  (jetty-launcher-65-thread-2) [    ] o.e.j.s.Server Started @124295ms
   [junit4]   2> 113787 INFO  (jetty-launcher-65-thread-2) [    ] o.a.s.c.s.e.JettySolrRunner Jetty properties: {hostContext=/solr, hostPort=37021}
   [junit4]   2> 113787 ERROR (jetty-launcher-65-thread-2) [    ] o.a.s.s.StartupLoggingUtils Missing Java Option solr.log.dir. Logging may be missing or incomplete.
   [junit4]   2> 113787 INFO  (jetty-launcher-65-thread-2) [    ] o.a.s.s.SolrDispatchFilter  ___      _       Welcome to Apache Solr? version 8.0.0
   [junit4]   2> 113873 INFO  (jetty-launcher-65-thread-2) [    ] o.a.s.s.SolrDispatchFilter / __| ___| |_ _   Starting in cloud mode on port null
   [junit4]   2> 113873 INFO  (jetty-launcher-65-thread-2) [    ] o.a.s.s.SolrDispatchFilter \__ \/ _ \ | '_|  Install dir: null, Default config dir: null
   [junit4]   2> 113873 INFO  (jetty-launcher-65-thread-2) [    ] o.a.s.s.SolrDispatchFilter |___/\___/_|_|    Start time: 2017-07-20T01:46:21.592Z
   [junit4]   2> 114048 INFO  (jetty-launcher-65-thread-3) [    ] o.a.s.s.SolrDispatchFilter solr.xml found in ZooKeeper. Loading...
   [junit4]   2> 114060 INFO  (jetty-launcher-65-thread-4) [    ] o.a.s.s.SolrDispatchFilter solr.xml found in ZooKeeper. Loading...
   [junit4]   2> 114068 INFO  (jetty-launcher-65-thread-1) [    ] o.a.s.s.SolrDispatchFilter solr.xml found in ZooKeeper. Loading...
   [junit4]   2> 114178 INFO  (jetty-launcher-65-thread-2) [    ] o.a.s.s.SolrDispatchFilter solr.xml found in ZooKeeper. Loading...
   [junit4]   2> 114229 INFO  (jetty-launcher-65-thread-4) [    ] o.a.s.c.ZkContainer Zookeeper client=127.0.0.1:43251/solr
   [junit4]   2> 114239 INFO  (jetty-launcher-65-thread-3) [    ] o.a.s.c.ZkContainer Zookeeper client=127.0.0.1:43251/solr
   [junit4]   2> 114491 INFO  (jetty-launcher-65-thread-1) [    ] o.a.s.c.ZkContainer Zookeeper client=127.0.0.1:43251/solr
   [junit4]   2> 114747 INFO  (jetty-launcher-65-thread-2) [    ] o.a.s.c.ZkContainer Zookeeper client=127.0.0.1:43251/solr
   [junit4]   2> 115353 WARN  (NIOServerCxn.Factory:0.0.0.0/0.0.0.0:0) [    ] o.a.z.s.NIOServerCnxn caught end of stream exception
   [junit4]   2> EndOfStreamException: Unable to read additional data from client sessionid 0x15d5daca1200008, likely client has closed socket
   [junit4]   2> 	at org.apache.zookeeper.server.NIOServerCnxn.doIO(NIOServerCnxn.java:239)
   [junit4]   2> 	at org.apache.zookeeper.server.NIOServerCnxnFactory.run(NIOServerCnxnFactory.java:203)
   [junit4]   2> 	at java.lang.Thread.run(Thread.java:748)
   [junit4]   2> 115499 INFO  (jetty-launcher-65-thread-3) [n:127.0.0.1:38950_solr    ] o.a.s.c.Overseer Overseer (id=null) closing
   [junit4]   2> 115500 INFO  (jetty-launcher-65-thread-3) [n:127.0.0.1:38950_solr    ] o.a.s.c.OverseerElectionContext I am going to be the leader 127.0.0.1:38950_solr
   [junit4]   2> 115501 INFO  (jetty-launcher-65-thread-3) [n:127.0.0.1:38950_solr    ] o.a.s.c.Overseer Overseer (id=98337762891005962-127.0.0.1:38950_solr-n_0000000000) starting
   [junit4]   2> 115621 INFO  (jetty-launcher-65-thread-3) [n:127.0.0.1:38950_solr    ] o.a.s.c.ZkController Register node as live in ZooKeeper:/live_nodes/127.0.0.1:38950_solr
   [junit4]   2> 115824 INFO  (OverseerStateUpdate-98337762891005962-127.0.0.1:38950_solr-n_0000000000) [n:127.0.0.1:38950_solr    ] o.a.s.c.c.ZkStateReader Updated live nodes from ZooKeeper... (0) -> (1)
   [junit4]   2> 116117 INFO  (jetty-launcher-65-thread-1) [n:127.0.0.1:42929_solr    ] o.a.s.c.c.ZkStateReader Updated live nodes from ZooKeeper... (0) -> (1)
   [junit4]   2> 116308 INFO  (jetty-launcher-65-thread-2) [n:127.0.0.1:37021_solr    ] o.a.s.c.c.ZkStateReader Updated live nodes from ZooKeeper... (0) -> (1)
   [junit4]   2> 116336 INFO  (jetty-launcher-65-thread-1) [n:127.0.0.1:42929_solr    ] o.a.s.c.Overseer Overseer (id=null) closing
   [junit4]   2> 116347 INFO  (jetty-launcher-65-thread-3) [n:127.0.0.1:38950_solr    ] o.a.s.m.r.SolrJmxReporter JMX monitoring for 'solr_38950.solr.node' (registry 'solr.node') enabled at server: com.sun.jmx.mbeanserver.JmxMBeanServer@2c480323
   [junit4]   2> 116420 INFO  (jetty-launcher-65-thread-3) [n:127.0.0.1:38950_solr    ] o.a.s.m.r.SolrJmxReporter JMX monitoring for 'solr_38950.solr.jvm' (registry 'solr.jvm') enabled at server: com.sun.jmx.mbeanserver.JmxMBeanServer@2c480323
   [junit4]   2> 116420 INFO  (jetty-launcher-65-thread-3) [n:127.0.0.1:38950_solr    ] o.a.s.m.r.SolrJmxReporter JMX monitoring for 'solr_38950.solr.jetty' (registry 'solr.jetty') enabled at server: com.sun.jmx.mbeanserver.JmxMBeanServer@2c480323
   [junit4]   2> 116455 INFO  (jetty-launcher-65-thread-3) [n:127.0.0.1:38950_solr    ] o.a.s.c.CorePropertiesLocator Found 0 core definitions underneath /home/jenkins/jenkins-slave/workspace/Lucene-Solr-Tests-master/solr/build/solr-core/test/J2/temp/solr.cloud.CollectionsAPISolrJTest_3AF176DCA7FCE1C7-001/tempDir-001/node3/.
   [junit4]   2> 116463 INFO  (jetty-launcher-65-thread-1) [n:127.0.0.1:42929_solr    ] o.a.s.c.ZkController Register node as live in ZooKeeper:/live_nodes/127.0.0.1:42929_solr
   [junit4]   2> 116503 INFO  (jetty-launcher-65-thread-2) [n:127.0.0.1:37021_solr    ] o.a.s.c.Overseer Overseer (id=null) closing
   [junit4]   2> 116512 INFO  (zkCallback-86-thread-1-processing-n:127.0.0.1:38950_solr) [n:127.0.0.1:38950_solr    ] o.a.s.c.c.ZkStateReader Updated live nodes from ZooKeeper... (1) -> (2)
   [junit4]   2> 116513 INFO  (zkCallback-88-thread-1-processing-n:127.0.0.1:37021_solr) [n:127.0.0.1:37021_solr    ] o.a.s.c.c.ZkStateReader Updated live nodes from ZooKeeper... (1) -> (2)
   [junit4]   2> 116514 INFO  (jetty-launcher-65-thread-2) [n:127.0.0.1:37021_solr    ] o.a.s.c.ZkController Register node as live in ZooKeeper:/live_nodes/127.0.0.1:37021_solr
   [junit4]   2> 116549 INFO  (zkCallback-88-thread-1-processing-n:127.0.0.1:37021_solr) [n:127.0.0.1:37021_solr    ] o.a.s.c.c.ZkStateReader Updated live nodes from ZooKeeper... (2) -> (3)
   [junit4]   2> 116549 INFO  (zkCallback-86-thread-1-processing-n:127.0.0.1:38950_solr) [n:127.0.0.1:38950_solr    ] o.a.s.c.c.ZkStateReader Updated live nodes from ZooKeeper... (2) -> (3)
   [junit4]   2> 116686 INFO  (zkCallback-87-thread-1-processing-n:127.0.0.1:42929_solr) [n:127.0.0.1:42929_solr    ] o.a.s.c.c.ZkStateReader Updated live nodes from ZooKeeper... (1) -> (3)
   [junit4]   2> 117163 INFO  (jetty-launcher-65-thread-4) [n:127.0.0.1:45081_solr    ] o.a.s.c.c.ZkStateReader Updated live nodes from ZooKeeper... (0) -> (3)
   [junit4]   2> 117165 INFO  (jetty-launcher-65-thread-4) [n:127.0.0.1:45081_solr    ] o.a.s.c.Overseer Overseer (id=null) closing
   [junit4]   2> 117179 INFO  (jetty-launcher-65-thread-4) [n:127.0.0.1:45081_solr    ] o.a.s.c.ZkController Register node as live in ZooKeeper:/live_nodes/127.0.0.1:45081_solr
   [junit4]   2> 117180 INFO  (zkCallback-88-thread-1-processing-n:127.0.0.1:37021_solr) [n:127.0.0.1:37021_solr    ] o.a.s.c.c.ZkStateReader Updated live nodes from ZooKeeper... (3) -> (4)
   [junit4]   2> 117180 INFO  (zkCallback-87-thread-1-processing-n:127.0.0.1:42929_solr) [n:127.0.0.1:42929_solr    ] o.a.s.c.c.ZkStateReader Updated live nodes from ZooKeeper... (3) -> (4)
   [junit4]   2> 117357 INFO  (zkCallback-79-thread-1-processing-n:127.0.0.1:45081_solr) [n:127.0.0.1:45081_solr    ] o.a.s.c.c.ZkStateReader Updated live nodes from ZooKeeper... (3) -> (4)
   [junit4]   2> 117419 INFO  (zkCallback-86-thread-2-processing-n:127.0.0.1:38950_solr) [n:127.0.0.1:38950_solr    ] o.a.s.c.c.ZkStateReader Updated live nodes from ZooKeeper... (3) -> (4)
   [junit4]   2> 118355 INFO  (jetty-launcher-65-thread-4) [n:127.0.0.1:45081_solr    ] o.a.s.m.r.SolrJmxReporter JMX monitoring for 'solr_45081.solr.node' (registry 'solr.node') enabled at server: com.sun.jmx.mbeanserver.JmxMBeanServer@2c480323
   [junit4]   2> 118371 INFO  (jetty-launcher-65-thread-1) [n:127.0.0.1:42929_solr    ] o.a.s.m.r.SolrJmxReporter JMX monitoring for 'solr_42929.solr.node' (registry 'solr.node') enabled at server: com.sun.jmx.mbeanserver.JmxMBeanServer@2c480323
   [junit4]   2> 118391 INFO  (jetty-launcher-65-thread-2) [n:127.0.0.1:37021_solr    ] o.a.s.m.r.SolrJmxReporter JMX monitoring for 'solr_37021.solr.node' (registry 'solr.node') enabled at server: com.sun.jmx.mbeanserver.JmxMBeanServer@2c480323
   [junit4]   2> 118407 INFO  (jetty-launcher-65-thread-4) [n:127.0.0.1:45081_solr    ] o.a.s.m.r.SolrJmxReporter JMX monitoring for 'solr_45081.solr.jvm' (registry 'solr.jvm') enabled at server: com.sun.jmx.mbeanserver.JmxMBeanServer@2c480323
   [junit4]   2> 118407 INFO  (jetty-launcher-65-thread-4) [n:127.0.0.1:45081_solr    ] o.a.s.m.r.SolrJmxReporter JMX monitoring for 'solr_45081.solr.jetty' (registry 'solr.jetty') enabled at server: com.sun.jmx.mbeanserver.JmxMBeanServer@2c480323
   [junit4]   2> 118426 INFO  (jetty-launcher-65-thread-2) [n:127.0.0.1:37021_solr    ] o.a.s.m.r.SolrJmxReporter JMX monitoring for 'solr_37021.solr.jvm' (registry 'solr.jvm') enabled at server: com.sun.jmx.mbeanserver.JmxMBeanServer@2c480323
   [junit4]   2> 118427 INFO  (jetty-launcher-65-thread-2) [n:127.0.0.1:37021_solr    ] o.a.s.m.r.SolrJmxReporter JMX monitoring for 'solr_37021.solr.jetty' (registry 'solr.jetty') enabled at server: com.sun.jmx.mbeanserver.JmxMBeanServer@2c480323
   [junit4]   2> 118427 INFO  (jetty-launcher-65-thread-2) [n:127.0.0.1:37021_solr    ] o.a.s.c.CorePropertiesLocator Found 0 core definitions underneath /home/jenkins/jenkins-slave/workspace/Lucene-Solr-Tests-master/solr/build/solr-core/test/J2/temp/solr.cloud.CollectionsAPISolrJTest_3AF176DCA7FCE1C7-001/tempDir-001/node2/.
   [junit4]   2> 118441 INFO  (jetty-launcher-65-thread-1) [n:127.0.0.1:42929_solr    ] o.a.s.m.r.SolrJmxReporter JMX monitoring for 'solr_42929.solr.jvm' (registry 'solr.jvm') enabled at server: com.sun.jmx.mbeanserver.JmxMBeanServer@2c480323
   [junit4]   2> 118441 INFO  (jetty-launcher-65-thread-1) [n:127.0.0.1:42929_solr    ] o.a.s.m.r.SolrJmxReporter JMX monitoring for 'solr_42929.solr.jetty' (registry 'solr.jetty') enabled at server: com.sun.jmx.mbeanserver.JmxMBeanServer@2c480323
   [junit4]   2> 118442 INFO  (jetty-launcher-65-thread-1) [n:127.0.0.1:42929_solr    ] o.a.s.c.CorePropertiesLocator Found 0 core definitions underneath /home/jenkins/jenkins-slave/workspace/Lucene-Solr-Tests-master/solr/build/solr-core/test/J2/temp/solr.cloud.CollectionsAPISolrJTest_3AF176DCA7FCE1C7-001/tempDir-001/node1/.
   [junit4]   2> 118495 INFO  (jetty-launcher-65-thread-4) [n:127.0.0.1:45081_solr    ] o.a.s.c.CorePropertiesLocator Found 0 core definitions underneath /home/jenkins/jenkins-slave/workspace/Lucene-Solr-Tests-master/solr/build/solr-core/test/J2/temp/solr.cloud.CollectionsAPISolrJTest_3AF176DCA7FCE1C7-001/tempDir-001/node4/.
   [junit4]   2> 119344 INFO  (SUITE-CollectionsAPISolrJTest-seed#[3AF176DCA7FCE1C7]-worker) [    ] o.a.s.c.c.ZkStateReader Updated live nodes from ZooKeeper... (0) -> (4)
   [junit4]   2> 119344 INFO  (SUITE-CollectionsAPISolrJTest-seed#[3AF176DCA7FCE1C7]-worker) [    ] o.a.s.c.s.i.ZkClientClusterStateProvider Cluster at 127.0.0.1:43251/solr ready
   [junit4]   2> 119573 INFO  (TEST-CollectionsAPISolrJTest.testCreateWithDefaultConfigSet-seed#[3AF176DCA7FCE1C7]) [    ] o.a.s.SolrTestCaseJ4 ###Starting testCreateWithDefaultConfigSet
   [junit4]   2> 120237 INFO  (qtp570287040-459) [n:127.0.0.1:38950_solr    ] o.a.s.h.a.CollectionsHandler Invoked Collection Action :create with params pullReplicas=0&replicationFactor=2&name=solrj_default_configset&nrtReplicas=2&action=CREATE&numShards=2&tlogReplicas=0&wt=javabin&version=2 and sendToOCPQueue=true
   [junit4]   2> 120302 INFO  (OverseerThreadFactory-143-thread-1-processing-n:127.0.0.1:38950_solr) [n:127.0.0.1:38950_solr    ] o.a.s.c.CreateCollectionCmd Create collection solrj_default_configset
   [junit4]   2> 120318 INFO  (OverseerThreadFactory-143-thread-1-processing-n:127.0.0.1:38950_solr) [n:127.0.0.1:38950_solr    ] o.a.s.c.CreateCollectionCmd Only _default config set found, using it.
   [junit4]   2> 120320 INFO  (OverseerThreadFactory-143-thread-1-processing-n:127.0.0.1:38950_solr) [n:127.0.0.1:38950_solr    ] o.a.s.c.c.ZkConfigManager Copying zk node /configs/_default/protwords.txt to /configs/solrj_default_configset/protwords.txt
   [junit4]   2> 120339 INFO  (OverseerThreadFactory-143-thread-1-processing-n:127.0.0.1:38950_solr) [n:127.0.0.1:38950_solr    ] o.a.s.c.c.ZkConfigManager Copying zk node /configs/_default/managed-schema to /configs/solrj_default_configset/managed-schema
   [junit4]   2> 120340 INFO  (OverseerThreadFactory-143-thread-1-processing-n:127.0.0.1:38950_solr) [n:127.0.0.1:38950_solr    ] o.a.s.c.c.ZkConfigManager Copying zk node /configs/_default/solrconfig.xml to /configs/solrj_default_configset/solrconfig.xml
   [junit4]   2> 120342 INFO  (OverseerThreadFactory-143-thread-1-processing-n:127.0.0.1:38950_solr) [n:127.0.0.1:38950_solr    ] o.a.s.c.c.ZkConfigManager Copying zk node /configs/_default/synonyms.txt to /configs/solrj_default_configset/synonyms.txt
   [junit4]   2> 120369 INFO  (OverseerThreadFactory-143-thread-1-processing-n:127.0.0.1:38950_solr) [n:127.0.0.1:38950_solr    ] o.a.s.c.c.ZkConfigManager Copying zk node /configs/_default/stopwords.txt to /configs/solrj_default_configset/stopwords.txt
   [junit4]   2> 120370 INFO  (OverseerThreadFactory-143-thread-1-processing-n:127.0.0.1:38950_solr) [n:127.0.0.1:38950_solr    ] o.a.s.c.c.ZkConfigManager Copying zk node /configs/_default/params.json to /configs/solrj_default_configset/params.json
   [junit4]   2> 120399 INFO  (OverseerThreadFactory-143-thread-1-processing-n:127.0.0.1:38950_solr) [n:127.0.0.1:38950_solr    ] o.a.s.c.c.ZkConfigManager Copying zk node /configs/_default/lang/contractions_it.txt to /configs/solrj_default_configset/lang/contractions_it.txt
   [junit4]   2> 120401 INFO  (OverseerThreadFactory-143-thread-1-processing-n:127.0.0.1:38950_solr) [n:127.0.0.1:38950_solr    ] o.a.s.c.c.ZkConfigManager Copying zk node /configs/_default/lang/stopwords_no.txt to /configs/solrj_default_configset/lang/stopwords_no.txt
   [junit4]   2> 120402 INFO  (OverseerThreadFactory-143-thread-1-processing-n:127.0.0.1:38950_solr) [n:127.0.0.1:38950_solr    ] o.a.s.c.c.ZkConfigManager Copying zk node /configs/_default/lang/stopwords_hy.txt to /configs/solrj_default_configset/lang/stopwords_hy.txt
   [junit4]   2> 120402 INFO  (OverseerThreadFactory-143-thread-1-processing-n:127.0.0.1:38950_solr) [n:127.0.0.1:38950_solr    ] o.a.s.c.c.ZkConfigManager Copying zk node /configs/_default/lang/stemdict_nl.txt to /configs/solrj_default_configset/lang/stemdict_nl.txt
   [junit4]   2> 120436 INFO  (OverseerThreadFactory-143-thread-1-processing-n:127.0.0.1:38950_solr) [n:127.0.0.1:38950_solr    ] o.a.s.c.c.ZkConfigManager Copying zk node /configs/_default/lang/contractions_ca.txt to /configs/solrj_default_configset/lang/contractions_ca.txt
   [junit4]   2> 120437 INFO  (OverseerThreadFactory-143-thread-1-processing-n:127.0.0.1:38950_solr) [n:127.0.0.1:38950_solr    ] o.a.s.c.c.ZkConfigManager Copying zk node /configs/_default/lang/stopwords_id.txt to /configs/solrj_default_configset/lang/stopwords_id.txt
   [junit4]   2> 120438 INFO  (OverseerThreadFactory-143-thread-1-processing-n:127.0.0.1:38950_solr) [n:127.0.0.1:38950_solr    ] o.a.s.c.c.ZkConfigManager Copying zk node /configs/_default/lang/stopwords_ga.txt to /configs/solrj_default_configset/lang/stopwords_ga.txt
   [junit4]   2> 120439 INFO  (OverseerThreadFactory-143-thread-1-processing-n:127.0.0.1:38950_solr) [n:127.0.0.1:38950_solr    ] o.a.s.c.c.ZkConfigManager Copying zk node /configs/_default/lang/stopwords_da.txt to /configs/solrj_default_configset/lang/stopwords_da.txt
   [junit4]   2> 120457 INFO  (OverseerThreadFactory-143-thread-1-processing-n:127.0.0.1:38950_solr) [n:127.0.0.1:38950_solr    ] o.a.s.c.c.ZkConfigManager Copying zk node /configs/_default/lang/stopwords_hi.txt to /configs/solrj_default_configset/lang/stopwords_hi.txt
   [junit4]   2> 120457 INFO  (OverseerThreadFactory-143-thread-1-processing-n:127.0.0.1:38950_solr) [n:127.0.0.1:38950_solr    ] o.a.s.c.c.ZkConfigManager Copying zk node /configs/_default/lang/stopwords_ja.txt to /configs/solrj_default_configset/lang/stopwords_ja.txt
   [junit4]   2> 120458 INFO  (OverseerThreadFactory-143-thread-1-processing-n:127.0.0.1:38950_solr) [n:127.0.0.1:38950_solr    ] o.a.s.c.c.ZkConfigManager Copying zk node /configs/_default/lang/stopwords_pt.txt to /configs/solrj_default_configset/lang/stopwords_pt.txt
   [junit4]   2> 120459 INFO  (OverseerThreadFactory-143-thread-1-processing-n:127.0.0.1:38950_solr) [n:127.0.0.1:38950_solr    ] o.a.s.c.c.ZkConfigManager Copying zk node /configs/_default/lang/stopwords_hu.txt to /configs/solrj_default_configset/lang/stopwords_hu.txt
   [junit4]   2> 120493 INFO  (OverseerThreadFactory-143-thread-1-processing-n:127.0.0.1:38950_solr) [n:127.0.0.1:38950_solr    ] o.a.s.c.c.ZkConfigManager Copying zk node /configs/_default/lang/stopwords_el.txt to /configs/solrj_default_configset/lang/stopwords_el.txt
   [junit4]   2> 120494 INFO  (OverseerThreadFactory-143-thread-1-processing-n:127.0.0.1:38950_solr) [n:127.0.0.1:38950_solr    ] o.a.s.c.c.ZkConfigManager Copying zk node /configs/_default/lang/stopwords_ru.txt to /configs/solrj_default_configset/lang/stopwords_ru.txt
   [junit4]   2> 120495 INFO  (OverseerThreadFactory-143-thread-1-processing-n:127.0.0.1:38950_solr) [n:127.0.0.1:38950_solr    ] o.a.s.c.c.ZkConfigManager Copying zk node /configs/_default/lang/stopwords_tr.txt to /configs/solrj_default_configset/lang/stopwords_tr.txt
   [junit4]   2> 120496 INFO  (OverseerThreadFactory-143-thread-1-processing-n:127.0.0.1:38950_solr) [n:127.0.0.1:38950_solr    ] o.a.s.c.c.ZkConfigManager Copying zk node /configs/_default/lang/stopwords_ar.txt to /configs/solrj_default_configset/lang/stopwords_ar.txt
   [junit4]   2> 120509 INFO  (OverseerThreadFactory-143-thread-1-processing-n:127.0.0.1:38950_solr) [n:127.0.0.1:38950_solr    ] o.a.s.c.c.ZkConfigManager Copying zk node /configs/_default/lang/userdict_ja.txt to /configs/solrj_default_configset/lang/userdict_ja.txt
   [junit4]   2> 120510 INFO  (OverseerThreadFactory-143-thread-1-processing-n:127.0.0.1:38950_solr) [n:127.0.0.1:38950_solr    ] o.a.s.c.c.ZkConfigManager Copying zk node /configs/_default/lang/stopwords_it.txt to /configs/solrj_default_configset/lang/stopwords_it.txt
   [junit4]   2> 120511 INFO  (OverseerThreadFactory-143-thread-1-processing-n:127.0.0.1:38950_solr) [n:127.0.0.1:38950_solr    ] o.a.s.c.c.ZkConfigManager Copying zk node /configs/_default/lang/stopwords_eu.txt to /configs/solrj_default_configset/lang/stopwords_eu.txt
   [junit4]   2> 120512 INFO  (OverseerThreadFactory-143-thread-1-processing-n:127.0.0.1:38950_solr) [n:127.0.0.1:38950_solr    ] o.a.s.c.c.ZkConfigManager Copying zk node /configs/_default/lang/stopwords_cz.txt to /configs/solrj_default_configset/lang/stopwords_cz.txt
   [junit4]   2> 120546 INFO  (OverseerThreadFactory-143-thread-1-processing-n:127.0.0.1:38950_solr) [n:127.0.0.1:38950_solr    ] o.a.s.c.c.ZkConfigManager Copying zk node /configs/_default/lang/stoptags_ja.txt to /configs/solrj_default_configset/lang/stoptags_ja.txt
   [junit4]   2> 120547 INFO  (OverseerThreadFactory-143-thread-1-processing-n:127.0.0.1:38950_solr) [n:127.0.0.1:38950_solr    ] o.a.s.c.c.ZkConfigManager Copying zk node /configs/_default/lang/contractions_fr.txt to /configs/solrj_default_configset/lang/contractions_fr.txt
   [junit4]   2> 120548 INFO  (OverseerThreadFactory-143-thread-1-processing-n:127.0.0.1:38950_solr) [n:127.0.0.1:38950_solr    ] o.a.s.c.c.ZkConfigManager Copying zk node /configs/_default/lang/stopwords_fa.txt to /configs/solrj_default_configset/lang/stopwords_fa.txt
   [junit4]   2> 120549 INFO  (OverseerThreadFactory-143-thread-1-processing-n:127.0.0.1:38950_solr) [n:127.0.0.1:38950_solr    ] o.a.s.c.c.ZkConfigManager Copying zk node /configs/_default/lang/stopwords_de.txt to /configs/solrj_default_configset/lang/stopwords_de.txt
   [junit4]   2> 120567 INFO  (OverseerThreadFactory-143-thread-1-processing-n:127.0.0.1:38950_solr) [n:127.0.0.1:38950_solr    ] o.a.s.c.c.ZkConfigManager Copying zk node /configs/_default/lang/contractions_ga.txt to /configs/solrj_default_configset/lang/contractions_ga.txt
   [junit4]   2> 120568 INFO  (OverseerThreadFactory-143-thread-1-processing-n:127.0.0.1:38950_solr) [n:127.0.0.1:38950_solr    ] o.a.s.c.c.ZkConfigManager Copying zk node /configs/_default/lang/stopwords_ca.txt to /configs/solrj_default_configset/lang/stopwords_ca.txt
   [junit4]   2> 120569 INFO  (OverseerThreadFactory-143-thread-1-processing-n:127.0.0.1:38950_solr) [n:127.0.0.1:38950_solr    ] o.a.s.c.c.ZkConfigManager Copying zk node /configs/_default/lang/stopwords_nl.txt to /configs/solrj_default_configset/lang/stopwords_nl.txt
   [junit4]   2> 120603 INFO  (OverseerThreadFactory-143-thread-1-processing-n:127.0.0.1:38950_solr) [n:127.0.0.1:38950_solr    ] o.a.s.c.c.ZkConfigManager Copying zk node /configs/_default/lang/stopwords_bg.txt to /configs/solrj_default_configset/lang/stopwords_bg.txt
   [junit4]   2> 120604 INFO  (OverseerThreadFactory-143-thread-1-processing-n:127.0.0.1:38950_solr) [n:127.0.0.1:38950_solr    ] o.a.s.c.c.ZkConfigManager Copying zk node /configs/_default/lang/stopwords_es.txt to /configs/solrj_default_configset/lang/stopwords_es.txt
   [junit4]   2> 120605 INFO  (OverseerThreadFactory-143-thread-1-processing-n:127.0.0.1:38950_solr) [n:127.0.0.1:38950_solr    ] o.a.s.c.c.ZkConfigManager Copying zk node /configs/_default/lang/stopwords_en.txt to /configs/solrj_default_configset/lang/stopwords_en.txt
   [junit4]   2> 120639 INFO  (OverseerThreadFactory-143-thread-1-processing-n:127.0.0.1:38950_solr) [n:127.0.0.1:38950_solr    ] o.a.s.c.c.ZkConfigManager Copying zk node /configs/_default/lang/stopwords_lv.txt to /configs/solrj_default_configset/lang/stopwords_lv.txt
   [junit4]   2> 120640 INFO  (OverseerThreadFactory-143-thread-1-processing-n:127.0.0.1:38950_solr) [n:127.0.0.1:38950_solr    ] o.a.s.c.c.ZkConfigManager Copying zk node /configs/_default/lang/stopwords_th.txt to /configs/solrj_default_configset/lang/stopwords_th.txt
   [junit4]   2> 120641 INFO  (OverseerThreadFactory-143-thread-1-processing-n:127.0.0.1:38950_solr) [n:127.0.0.1:38950_solr    ] o.a.s.c.c.ZkConfigManager Copying zk node /configs/_default/lang/stopwords_ro.txt to /configs/solrj_default_configset/lang/stopwords_ro.txt
   [junit4]   2> 120642 INFO  (OverseerThreadFactory-143-thread-1-processing-n:127.0.0.1:38950_solr) [n:127.0.0.1:38950_solr    ] o.a.s.c.c.ZkConfigManager Copying zk node /configs/_default/lang/stopwords_fr.txt to /configs/solrj_default_configset/lang/stopwords_fr.txt
   [junit4]   2> 120655 INFO  (OverseerThreadFactory-143-thread-1-processing-n:127.0.0.1:38950_solr) [n:127.0.0.1:38950_solr    ] o.a.s.c.c.ZkConfigManager Copying zk node /configs/_default/lang/stopwords_sv.txt to /configs/solrj_default_configset/lang/stopwords_sv.txt
   [junit4]   2> 120656 INFO  (OverseerThreadFactory-143-thread-1-processing-n:127.0.0.1:38950_solr) [n:127.0.0.1:38950_solr    ] o.a.s.c.c.ZkConfigManager Copying zk node /configs/_default/lang/stopwords_fi.txt to /configs/solrj_default_configset/lang/stopwords_fi.txt
   [junit4]   2> 120657 INFO  (OverseerThreadFactory-143-thread-1-processing-n:127.0.0.1:38950_solr) [n:127.0.0.1:38950_solr    ] o.a.s.c.c.ZkConfigManager Copying zk node /configs/_default/lang/hyphenations_ga.txt to /configs/solrj_default_configset/lang/hyphenations_ga.txt
   [junit4]   2> 120658 INFO  (OverseerThreadFactory-143-thread-1-processing-n:127.0.0.1:38950_solr) [n:127.0.0.1:38950_solr    ] o.a.s.c.c.ZkConfigManager Copying zk node /configs/_default/lang/stopwords_gl.txt to /configs/solrj_default_configset/lang/stopwords_gl.txt
   [junit4]   2> 121220 INFO  (OverseerStateUpdate-98337762891005962-127.0.0.1:38950_solr-n_0000000000) [n:127.0.0.1:38950_solr    ] o.a.s.c.o.SliceMutator createReplica() {
   [junit4]   2>   "operation":"ADDREPLICA",
   [junit4]   2>   "collection":"solrj_default_configset",
   [junit4]   2>   "shard":"shard1",
   [junit4]   2>   "core":"solrj_default_configset_shard1_replica_n1",
   [junit4]   2>   "state":"down",
   [junit4]   2>   "base_url":"https://127.0.0.1:38950/solr",
   [junit4]   2>   "type":"NRT"} 
   [junit4]   2> 121435 INFO  (OverseerStateUpdate-98337762891005962-127.0.0.1:38950_solr-n_0000000000) [n:127.0.0.1:38950_solr    ] o.a.s.c.o.SliceMutator createReplica() {
   [junit4]   2>   "operation":"ADDREPLICA",
   [junit4]   2>   "collection":"solrj_default_configset",
   [junit4]   2>   "shard":"shard1",
   [junit4]   2>   "core":"solrj_default_configset_shard1_replica_n2",
   [junit4]   2>   "state":"down",
   [junit4]   2>   "base_url":"https://127.0.0.1:42929/solr",
   [junit4]   2>   "type":"NRT"} 
   [junit4]   2> 121508 INFO  (OverseerStateUpdate-98337762891005962-127.0.0.1:38950_solr-n_0000000000) [n:127.0.0.1:38950_solr    ] o.a.s.c.o.SliceMutator createReplica() {
   [junit4]   2>   "operation":"ADDREPLICA",
   [junit4]   2>   "collection":"solrj_default_configset",
   [junit4]   2>   "shard":"shard2",
   [junit4]   2>   "core":"solrj_default_configset_shard2_replica_n1",
   [junit4]   2>   "state":"down",
   [junit4]   2>   "base_url":"https://127.0.0.1:37021/solr",
   [junit4]   2>   "type":"NRT"} 
   [junit4]   2> 121601 INFO  (OverseerStateUpdate-98337762891005962-127.0.0.1:38950_solr-n_0000000000) [n:127.0.0.1:38950_solr    ] o.a.s.c.o.SliceMutator createReplica() {
   [junit4]   2>   "operation":"ADDREPLICA",
   [junit4]   2>   "collection":"solrj_default_configset",
   [junit4]   2>   "shard":"shard2",
   [junit4]   2>   "core":"solrj_default_configset_shard2_replica_n2",
   [junit4]   2>   "state":"down",
   [junit4]   2>   "base_url":"https://127.0.0.1:45081/solr",
   [junit4]   2>   "type":"NRT"} 
   [junit4]   2> 122591 INFO  (qtp570287040-461) [n:127.0.0.1:38950_solr    ] o.a.s.h.a.CoreAdminOperation core create command qt=/admin/cores&coreNodeName=core_node1&collection.configName=solrj_default_configset&newCollection=true&name=solrj_default_configset_shard1_replica_n1&action=CREATE&numShards=2&collection=solrj_default_configset&shard=shard1&wt=javabin&version=2&replicaType=NRT
   [junit4]   2> 122591 INFO  (qtp570287040-461) [n:127.0.0.1:38950_solr    ] o.a.s.c.TransientSolrCoreCacheDefault Allocating transient cache for 2147483647 transient cores
   [junit4]   2> 122832 INFO  (qtp1285710212-439) [n:127.0.0.1:37021_solr    ] o.a.s.h.a.CoreAdminOperation core create command qt=/admin/cores&coreNodeName=core_node3&collection.configName=solrj_default_configset&newCollection=true&name=solrj_default_configset_shard2_replica_n1&action=CREATE&numShards=2&collection=solrj_default_configset&shard=shard2&wt=javabin&version=2&replicaType=NRT
   [junit4]   2> 122833 INFO  (qtp1285710212-439) [n:127.0.0.1:37021_solr    ] o.a.s.c.TransientSolrCoreCacheDefault Allocating transient cache for 2147483647 transient cores
   [junit4]   2> 122920 INFO  (qtp1224914305-431) [n:127.0.0.1:42929_solr    ] o.a.s.h.a.CoreAdminOperation core create command qt=/admin/cores&coreNodeName=core_node2&collection.configName=solrj_default_configset&newCollection=true&name=solrj_default_configset_shard1_replica_n2&action=CREATE&numShards=2&collection=solrj_default_configset&shard=shard1&wt=javabin&version=2&replicaType=NRT
   [junit4]   2> 122921 INFO  (qtp1224914305-431) [n:127.0.0.1:42929_solr    ] o.a.s.c.TransientSolrCoreCacheDefault Allocating transient cache for 2147483647 transient cores
   [junit4]   2> 122958 INFO  (qtp1132645971-449) [n:127.0.0.1:45081_solr    ] o.a.s.h.a.CoreAdminOperation core create command qt=/admin/cores&coreNodeName=core_node4&collection.configName=solrj_default_configset&newCollection=true&name=solrj_default_configset_shard2_replica_n2&action=CREATE&numShards=2&collection=solrj_default_configset&shard=shard2&wt=javabin&version=2&replicaType=NRT
   [junit4]   2> 122958 INFO  (qtp1132645971-449) [n:127.0.0.1:45081_solr    ] o.a.s.c.TransientSolrCoreCacheDefault Allocating transient cache for 2147483647 transient cores
   [junit4]   2> 123008 INFO  (zkCallback-88-thread-1-processing-n:127.0.0.1:37021_solr) [n:127.0.0.1:37021_solr    ] o.a.s.c.c.ZkStateReader A cluster state change: [WatchedEvent state:SyncConnected type:NodeDataChanged path:/collections/solrj_default_configset/state.json] for collection [solrj_default_configset] has occurred - updating... (live nodes size: [4])
   [junit4]   2> 123015 INFO  (zkCallback-87-thread-1-processing-n:127.0.0.1:42929_solr) [n:127.0.0.1:42929_solr    ] o.a.s.c.c.ZkStateReader A cluster state change: [WatchedEvent state:SyncConnected type:NodeDataChanged path:/collections/solrj_default_configset/state.json] for collection [solrj_default_configset] has occurred - updating... (live nodes size: [4])
   [junit4]   2> 123020 INFO  (zkCallback-86-thread-2-processing-n:127.0.0.1:38950_solr) [n:127.0.0.1:38950_solr    ] o.a.s.c.c.ZkStateReader A cluster state change: [WatchedEvent state:SyncConnected type:NodeDataChanged path:/collections/solrj_default_configset/state.json] for collection [solrj_default_configset] has occurred - updating... (live nodes size: [4])
   [junit4]   2> 123024 INFO  (zkCallback-86-thread-1-processing-n:127.0.0.1:38950_solr) [n:127.0.0.1:38950_solr    ] o.a.s.c.c.ZkStateReader A cluster state change: [WatchedEvent state:SyncConnected type:NodeDataChanged path:/collections/solrj_default_configset/state.json] for collection [solrj_default_configset] has occurred - updating... (live nodes size: [4])
   [junit4]   2> 123045 INFO  (zkCallback-88-thread-2-processing-n:127.0.0.1:37021_solr) [n:127.0.0.1:37021_solr    ] o.a.s.c.c.ZkStateReader A cluster state change: [WatchedEvent state:SyncConnected type:NodeDataChanged path:/collections/solrj_default_configset/state.json] for collection [solrj_default_configset] has occurred - updating... (live nodes size: [4])
   [junit4]   2> 123468 INFO  (zkCallback-88-thread-2-processing-n:127.0.0.1:37021_solr) [n:127.0.0.1:37021_solr    ] o.a.s.c.c.ZkStateReader A cluster state change: [WatchedEvent state:SyncConnected type:NodeDataChanged path:/collections/solrj_default_configset/state.json] for collection [solrj_default_configset] has occurred - updating... (live nodes size: [4])
   [junit4]   2> 123468 INFO  (zkCallback-88-thread-1-processing-n:127.0.0.1:37021_solr) [n:127.0.0.1:37021_solr    ] o.a.s.c.c.ZkStateReader A cluster state change: [WatchedEvent state:SyncConnected type:NodeDataChanged path:/collections/solrj_default_configset/state.json] for collection [solrj_default_configset] has occurred - updating... (live nodes size: [4])
   [junit4]   2> 123472 INFO  (zkCallback-87-thread-1-processing-n:127.0.0.1:42929_solr) [n:127.0.0.1:42929_solr    ] o.a.s.c.c.ZkStateReader A cluster state change: [WatchedEvent state:SyncConnected type:NodeDataChanged path:/collections/solrj_default_configset/state.json] for collection [solrj_default_configset] has occurred - updating... (live nodes size: [4])
   [junit4]   2> 123474 INFO  (zkCallback-86-thread-1-processing-n:127.0.0.1:38950_solr) [n:127.0.0.1:38950_solr    ] o.a.s.c.c.ZkStateReader A cluster state change: [WatchedEvent state:SyncConnected type:NodeDataChanged path:/collections/solrj_default_configset/state.json] for collection [solrj_default_configset] has occurred - updating... (live nodes size: [4])
   [junit4]   2> 123483 INFO  (zkCallback-86-thread-2-processing-n:127.0.0.1:38950_solr) [n:127.0.0.1:38950_solr    ] o.a.s.c.c.ZkStateReader A cluster state change: [WatchedEvent state:SyncConnected type:NodeDataChanged path:/collections/solrj_default_configset/state.json] for collection [solrj_default_configset] has occurred - updating... (live nodes size: [4])
   [junit4]   2> 123484 INFO  (zkCallback-79-thread-1-processing-n:127.0.0.1:45081_solr) [n:127.0.0.1:45081_solr    ] o.a.s.c.c.ZkStateReader A cluster state change: [WatchedEvent state:SyncConnected type:NodeDataChanged path:/collections/solrj_default_configset/state.json] for collection [solrj_default_configset] has occurred - updating... (live nodes size: [4])
   [junit4]   2> 123484 INFO  (zkCallback-87-thread-2-processing-n:127.0.0.1:42929_solr) [n:127.0.0.1:42929_solr    ] o.a.s.c.c.ZkStateReader A cluster state change: [WatchedEvent state:SyncConnected type:NodeDataChanged path:/collections/solrj_default_configset/state.json] for collection [solrj_default_configset] has occurred - updating... (live nodes size: [4])
   [junit4]   2> 123484 INFO  (zkCallback-79-thread-2-processing-n:127.0.0.1:45081_solr) [n:127.0.0.1:45081_solr    ] o.a.s.c.c.ZkStateReader A cluster state change: [WatchedEvent state:SyncConnected type:NodeDataChanged path:/collections/solrj_default_configset/state.json] for collection [solrj_default_configset] has occurred - updating... (live nodes size: [4])
   [junit4]   2> 124017 INFO  (qtp570287040-461) [n:127.0.0.1:38950_solr c:solrj_default_configset s:shard1 r:core_node1 x:solrj_default_configset_shard1_replica_n1] o.a.s.c.RequestParams conf resource params.json loaded . version : 0 
   [junit4]   2> 124018 INFO  (qtp570287040-461) [n:127.0.0.1:38950_solr c:solrj_default_configset s:shard1 r:core_node1 x:solrj_default_configset_shard1_replica_n1] o.a.s.c.RequestParams request params refreshed to version 0
   [junit4]   2> 124020 WARN  (qtp570287040-461) [n:127.0.0.1:38950_solr c:solrj_default_configset s:shard1 r:core_node1 x:solrj_default_configset_shard1_replica_n1] o.a.s.c.SolrConfig Couldn't add files from /home/jenkins/jenkins-slave/workspace/Lucene-Solr-Tests-master/solr/build/solr-core/test/J2/temp/solr.cloud.CollectionsAPISolrJTest_3AF176DCA7FCE1C7-001/tempDir-001/node3/solrj_default_configset_shard1_replica_n1/../../../../contrib/extraction/lib filtered by .*\.jar to classpath: /home/jenkins/jenkins-slave/workspace/Lucene-Solr-Tests-master/solr/build/solr-core/test/J2/temp/solr.cloud.CollectionsAPISolrJTest_3AF176DCA7FCE1C7-001/tempDir-001/node3/solrj_default_configset_shard1_replica_n1/../../../../contrib/extraction/lib
   [junit4]   2> 124199 WARN  (qtp570287040-461) [n:127.0.0.1:38950_solr c:solrj_default_configset s:shard1 r:core_node1 x:solrj_default_configset_shard1_replica_n1] o.a.s.c.SolrConfig Couldn't add files from /home/jenkins/jenkins-slave/workspace/Lucene-Solr-Tests-master/solr/build/solr-core/test/J2/temp/solr.cloud.CollectionsAPISolrJTest_3AF176DCA7FCE1C7-001/tempDir-001/node3/solrj_default_configset_shard1_replica_n1/../../../../dist filtered by solr-cell-\d.*\.jar to classpath: /home/jenkins/jenkins-slave/workspace/Lucene-Solr-Tests-master/solr/build/solr-core/test/J2/temp/solr.cloud.CollectionsAPISolrJTest_3AF176DCA7FCE1C7-001/tempDir-001/node3/solrj_default_configset_shard1_replica_n1/../../../../dist
   [junit4]   2> 124199 WARN  (qtp570287040-461) [n:127.0.0.1:38950_solr c:solrj_default_configset s:shard1 r:core_node1 x:solrj_default_configset_shard1_replica_n1] o.a.s.c.SolrConfig Couldn't add files from /home/jenkins/jenkins-slave/workspace/Lucene-Solr-Tests-master/solr/build/solr-core/test/J2/temp/solr.cloud.CollectionsAPISolrJTest_3AF176DCA7FCE1C7-001/tempDir-001/node3/solrj_default_configset_shard1_replica_n1/../../../../contrib/clustering/lib filtered by .*\.jar to classpath: /home/jenkins/jenkins-slave/workspace/Lucene-Solr-Tests-master/solr/build/solr-core/test/J2/temp/solr.cloud.CollectionsAPISolrJTest_3AF176DCA7FCE1C7-001/tempDir-001/node3/solrj_default_configset_shard1_replica_n1/../../../../contrib/clustering/lib
   [junit4]   2> 124200 WARN  (qtp570287040-461) [n:127.0.0.1:38950_solr c:solrj_default_configset s:shard1 r:core_node1 x:solrj_default_configset_shard1_replica_n1] o.a.s.c.SolrConfig Couldn't add files from /home/jenkins/jenkins-slave/workspace/Lucene-Solr-Tests-master/solr/build/solr-core/test/J2/temp/solr.cloud.CollectionsAPISolrJTest_3AF176DCA7FCE1C7-001/tempDir-001/node3/solrj_default_configset_shard1_replica_n1/../../../../dist filtered by solr-clustering-\d.*\.jar to classpath: /home/jenkins/jenkins-slave/workspace/Lucene-Solr-Tests-master/solr/build/solr-core/test/J2/temp/solr.cloud.CollectionsAPISolrJTest_3AF176DCA7FCE1C7-001/tempDir-001/node3/solrj_default_configset_shard1_replica_n1/../../../../dist
   [junit4]   2> 124200 WARN  (qtp570287040-461) [n:127.0.0.1:38950_solr c:solrj_default_configset s:shard1 r:core_node1 x:solrj_default_configset_shard1_replica_n1] o.a.s.c.SolrConfig Couldn't add files from /home/jenkins/jenkins-slave/workspace/Lucene-Solr-Tests-master/solr/build/solr-core/test/J2/temp/solr.cloud.CollectionsAPISolrJTest_3AF176DCA7FCE1C7-001/tempDir-001/node3/solrj_default_configset_shard1_replica_n1/../../../../contrib/langid/lib filtered by .*\.jar to classpath: /home/jenkins/jenkins-slave/workspace/Lucene-Solr-Tests-master/solr/build/solr-core/test/J2/temp/solr.cloud.CollectionsAPISolrJTest_3AF176DCA7FCE1C7-001/tempDir-001/node3/solrj_default_configset_shard1_replica_n1/../../../../contrib/langid/lib
   [junit4]   2> 124200 WARN  (qtp570287040-461) [n:127.0.0.1:38950_solr c:solrj_default_configset s:shard1 r:core_node1 x:solrj_default_configset_shard1_replica_n1] o.a.s.c.SolrConfig Couldn't add files from /home/jenkins/jenkins-slave/workspace/Lucene-Solr-Tests-master/solr/build/solr-core/test/J2/temp/solr.cloud.CollectionsAPISolrJTest_3AF176DCA7FCE1C7-001/tempDir-001/node3/solrj_default_configset_shard1_replica_n1/../../../../dist filtered by solr-langid-\d.*\.jar to classpath: /home/jenkins/jenkins-slave/workspace/Lucene-Solr-Tests-master/solr/build/solr-core/test/J2/temp/solr.cloud.CollectionsAPISolrJTest_3AF176DCA7FCE1C7-001/tempDir-001/node3/solrj_default_configset_shard1_replica_n1/../../../../dist
   [junit4]   2> 124200 WARN  (qtp570287040-461) [n:127.0.0.1:38950_solr c:solrj_default_configset s:shard1 r:core_node1 x:solrj_default_configset_shard1_replica_n1] o.a.s.c.SolrConfig Couldn't add files from /home/jenkins/jenkins-slave/workspace/Lucene-Solr-Tests-master/solr/build/solr-core/test/J2/temp/solr.cloud.CollectionsAPISolrJTest_3AF176DCA7FCE1C7-001/tempDir-001/node3/solrj_default_configset_shard1_replica_n1/../../../../contrib/velocity/lib filtered by .*\.jar to classpath: /home/jenkins/jenkins-slave/workspace/Lucene-Solr-Tests-master/solr/build/solr-core/test/J2/temp/solr.cloud.CollectionsAPISolrJTest_3AF176DCA7FCE1C7-001/tempDir-001/node3/solrj_default_configset_shard1_replica_n1/../../../../contrib/velocity/lib
   [junit4]   2> 124200 WARN  (qtp570287040-461) [n:127.0.0.1:38950_solr c:solrj_default_configset s:shard1 r:core_node1 x:solrj_default_configset_shard1_replica_n1] o.a.s.c.SolrConfig Couldn't add files from /home/jenkins/jenkins-slave/workspace/Lucene-Solr-Tests-master/solr/build/solr-core/test/J2/temp/solr.cloud.CollectionsAPISolrJTest_3AF176DCA7FCE1C7-001/tempDir-001/node3/solrj_default_configset_shard1_replica_n1/../../../../dist filtered by solr-velocity-\d.*\.jar to classpath: /home/jenkins/jenkins-slave/workspace/Lucene-Solr-Tests-master/solr/build/solr-core/test/J2/temp/solr.cloud.CollectionsAPISolrJTest_3AF176DCA7FCE1C7-001/tempDir-001/node3/solrj_default_configset_shard1_replica_n1/../../../../dist
   [junit4]   2> 124297 INFO  (qtp1224914305-431) [n:127.0.0.1:42929_solr c:solrj_default_configset s:shard1 r:core_node2 x:solrj_default_configset_shard1_replica_n2] o.a.s.c.RequestParams conf resource params.json loaded . version : 0 
   [junit4]   2> 124369 INFO  (qtp1224914305-431) [n:127.0.0.1:42929_solr c:solrj_default_configset s:shard1 r:core_node2 x:solrj_default_configset_shard1_replica_n2] o.a.s.c.RequestParams request params refreshed to version 0
   [junit4]   2> 124370 WARN  (qtp1224914305-431) [n:127.0.0.1:42929_solr c:solrj_default_configset s:shard1 r:core_node2 x:solrj_default_configset_shard1_replica_n2] o.a.s.c.SolrConfig Couldn't add files from /home/jenkins/jenkins-slave/workspace/Lucene-Solr-Tests-master/solr/build/solr-core/test/J2/temp/solr.cloud.CollectionsAPISolrJTest_3AF176DCA7FCE1C7-001/tempDir-001/node1/solrj_default_configset_shard1_replica_n2/../../../../contrib/extraction/lib filtered by .*\.jar to classpath: /home/jenkins/jenkins-slave/workspace/Lucene-Solr-Tests-master/solr/build/solr-core/test/J2/temp/solr.cloud.CollectionsAPISolrJTest_3AF176DCA7FCE1C7-001/tempDir-001/node1/solrj_default_configset_shard1_replica_n2/../../../../contrib/extraction/lib
   [junit4]   2> 124370 WARN  (qtp1224914305-431) [n:127.0.0.1:42929_solr c:solrj_default_configset s:shard1 r:core_node2 x:solrj_default_configset_shard1_replica_n2] o.a.s.c.SolrConfig Couldn't add files from /home/jenkins/jenkins-slave/workspace/Lucene-Solr-Tests-master/solr/build/solr-core/test/J2/temp/solr.cloud.CollectionsAPISolrJTest_3AF176DCA7FCE1C7-001/tempDir-001/node1/solrj_default_configset_shard1_replica_n2/../../../../dist filtered by solr-cell-\d.*\.jar to classpath: /home/jenkins/jenkins-slave/workspace/Lucene-Solr-Tests-master/solr/build/solr-core/test/J2/temp/solr.cloud.CollectionsAPISolrJTest_3AF176DCA7FCE1C7-001/tempDir-001/node1/solrj_default_configset_shard1_replica_n2/../../../../dist
   [junit4]   2> 124370 WARN  (qtp1224914305-431) [n:127.0.0.1:42929_solr c:solrj_default_configset s:shard1 r:core_node2 x:solrj_default_configset_shard1_replica_n2] o.a.s.c.SolrConfig Couldn't add files from /home/jenkins/jenkins-slave/workspace/Lucene-Solr-Tests-master/solr/build/solr-core/test/J2/temp/solr.cloud.CollectionsAPISolrJTest_3AF176DCA7FCE1C7-001/tempDir-001/node1/solrj_default_configset_shard1_replica_n2/../../../../contrib/clustering/lib filtered by .*\.jar to classpath: /home/jenkins/jenkins-slave/workspace/Lucene-Solr-Tests-master/solr/build/solr-core/test/J2/temp/solr.cloud.CollectionsAPISolrJTest_3AF176DCA7FCE1C7-001/tempDir-001/node1/solrj_default_configset_shard1_replica_n2/../../../../contrib/clustering/lib
   [junit4]   2> 124370 WARN  (qtp1224914305-431) [n:127.0.0.1:42929_solr c:solrj_default_configset s:shard1 r:core_node2 x:solrj_default_configset_shard1_replica_n2] o.a.s.c.SolrConfig Couldn't add files from /home/jenkins/jenkins-slave/workspace/Lucene-Solr-Tests-master/solr/build/solr-core/test/J2/temp/solr.cloud.CollectionsAPISolrJTest_3AF176DCA7FCE1C7-001/tempDir-001/node1/solrj_default_configset_shard1_replica_n2/../../../../dist filtered by solr-clustering-\d.*\.jar to classpath: /home/jenkins/jenkins-slave/workspace/Lucene-Solr-Tests-master/solr/build/solr-core/test/J2/temp/solr.cloud.CollectionsAPISolrJTest_3AF176DCA7FCE1C7-001/tempDir-001/node1/solrj_default_configset_shard1_replica_n2/../../../../dist
   [junit4]   2> 124371 WARN  (qtp1224914305-431) [n:127.0.0.1:42929_solr c:solrj_default_configset s:shard1 r:core_node2 x:solrj_default_configset_shard1_replica_n2] o.a.s.c.SolrConfig Couldn't add files from /home/jenkins/jenkins-slave/workspace/Lucene-Solr-Tests-master/solr/build/solr-core/test/J2/temp/solr.cloud.CollectionsAPISolrJTest_3AF176DCA7FCE1C7-001/tempDir-001/node1/solrj_default_configset_shard1_replica_n2/../../../../contrib/langid/lib filtered by .*\.jar to classpath: /home/jenkins/jenkins-slave/workspace/Lucene-Solr-Tests-master/solr/build/solr-core/test/J2/temp/solr.cloud.CollectionsAPISolrJTest_3AF176DCA7FCE1C7-001/tempDir-001/node1/solrj_default_configset_shard1_replica_n2/../../../../contrib/langid/lib
   [junit4]   2> 124371 WARN  (qtp1224914305-431) [n:127.0.0.1:42929_solr c:solrj_default_configset s:shard1 r:core_node2 x:solrj_default_configset_shard1_replica_n2] o.a.s.c.SolrConfig Couldn't add files from /home/jenkins/jenkins-slave/workspace/Lucene-Solr-Tests-master/solr/build/solr-core/test/J2/temp/solr.cloud.CollectionsAPISolrJTest_3AF176DCA7FCE1C7-001/tempDir-001/node1/solrj_default_configset_shard1_replica_n2/../../../../dist filtered by solr-langid-\d.*\.jar to classpath: /home/jenkins/jenkins-slave/workspace/Lucene-Solr-Tests-master/solr/build/solr-core/test/J2/temp/solr.cloud.CollectionsAPISolrJTest_3AF176DCA7FCE1C7-001/tempDir-001/node1/solrj_default_configset_shard1_replica_n2/../../../../dist
   [junit4]   2> 124371 WARN  (qtp1224914305-431) [n:127.0.0.1:42929_solr c:solrj_default_configset s:shard1 r:core_node2 x:solrj_default_configset_shard1_replica_n2] o.a.s.c.SolrConfig Couldn't add files from /home/jenkins/jenkins-slave/workspace/Lucene-Solr-Tests-master/solr/build/solr-core/test/J2/temp/solr.cloud.CollectionsAPISolrJTest_3AF176DCA7FCE1C7-001/tempDir-001/node1/solrj_default_configset_shard1_replica_n2/../../../../contrib/velocity/lib filtered by .*\.jar to classpath: /home/jenkins/jenkins-slave/workspace/Lucene-Solr-Tests-master/solr/build/solr-core/test/J2/temp/solr.cloud.CollectionsAPISolrJTest_3AF176DCA7FCE1C7-001/tempDir-001/node1/solrj_default_configset_shard1_replica_n2/../../../../contrib/velocity/lib
   [junit4]   2> 124371 WARN  (qtp1224914305-431) [n:127.0.0.1:42929_solr c:solrj_default_configset s:shard1 r:core_node2 x:solrj_default_configset_shard1_replica_n2] o.a.s.c.SolrConfig Couldn't add files from /home/jenkins/jenkins-slave/workspace/Lucene-Solr-Tests-master/solr/build/solr-core/test/J2/temp/solr.cloud.CollectionsAPISolrJTest_3AF176DCA7FCE1C7-001/tempDir-001/node1/solrj_default_configset_shard1_replica_n2/../../../../dist filtered by solr-velocity-\d.*\.jar to classpath: /home/jenkins/jenkins-slave/workspace/Lucene-Solr-Tests-master/solr/build/solr-core/test/J2/temp/solr.cloud.CollectionsAPISolrJTest_3AF176DCA7FCE1C7-001/tempDir-001/node1/solrj_default_configset_shard1_replica_n2/../../../../dist
   [junit4]   2> 124770 INFO  (qtp570287040-461) [n:127.0.0.1:38950_solr c:solrj_default_configset s:shard1 r:core_node1 x:solrj_default_configset_shard1_replica_n1] o.a.s.c.SolrConfig Using Lucene MatchVersion: 8.0.0
   [junit4]   2> 124773 INFO  (qtp1224914305-431) [n:127.0.0.1:42929_solr c:sol

[...truncated too long message...]

   > 	at org.apache.solr.core.CoreContainer.lambda$load$7(CoreContainer.java:610)
   [junit4]    > 	at com.codahale.metrics.InstrumentedExecutorService$InstrumentedCallable.call(InstrumentedExecutorService.java:197)
   [junit4]    > 	at java.util.concurrent.FutureTask.run(FutureTask.java:266)
   [junit4]    > 	at org.apache.solr.common.util.ExecutorUtil$MDCAwareThreadPoolExecutor.lambda$execute$0(ExecutorUtil.java:188)
   [junit4]    > 	at java.util.concurrent.ThreadPoolExecutor.runWorker(ThreadPoolExecutor.java:1142)
   [junit4]    > 	at java.util.concurrent.ThreadPoolExecutor$Worker.run(ThreadPoolExecutor.java:617)
   [junit4]    > 	at java.lang.Thread.run(Thread.java:748)
   [junit4]    > org.apache.solr.common.util.ObjectReleaseTracker$ObjectTrackerException: org.apache.lucene.store.MMapDirectory
   [junit4]    > 	at org.apache.solr.common.util.ObjectReleaseTracker.track(ObjectReleaseTracker.java:42)
   [junit4]    > 	at org.apache.solr.core.CachingDirectoryFactory.get(CachingDirectoryFactory.java:348)
   [junit4]    > 	at org.apache.solr.core.SolrCore.initSnapshotMetaDataManager(SolrCore.java:478)
   [junit4]    > 	at org.apache.solr.core.SolrCore.<init>(SolrCore.java:928)
   [junit4]    > 	at org.apache.solr.core.SolrCore.<init>(SolrCore.java:843)
   [junit4]    > 	at org.apache.solr.core.CoreContainer.create(CoreContainer.java:969)
   [junit4]    > 	at org.apache.solr.core.CoreContainer.lambda$load$7(CoreContainer.java:610)
   [junit4]    > 	at com.codahale.metrics.InstrumentedExecutorService$InstrumentedCallable.call(InstrumentedExecutorService.java:197)
   [junit4]    > 	at java.util.concurrent.FutureTask.run(FutureTask.java:266)
   [junit4]    > 	at org.apache.solr.common.util.ExecutorUtil$MDCAwareThreadPoolExecutor.lambda$execute$0(ExecutorUtil.java:188)
   [junit4]    > 	at java.util.concurrent.ThreadPoolExecutor.runWorker(ThreadPoolExecutor.java:1142)
   [junit4]    > 	at java.util.concurrent.ThreadPoolExecutor$Worker.run(ThreadPoolExecutor.java:617)
   [junit4]    > 	at java.lang.Thread.run(Thread.java:748)
   [junit4]    > org.apache.solr.common.util.ObjectReleaseTracker$ObjectTrackerException: org.apache.solr.search.SolrIndexSearcher
   [junit4]    > 	at org.apache.solr.common.util.ObjectReleaseTracker.track(ObjectReleaseTracker.java:42)
   [junit4]    > 	at org.apache.solr.search.SolrIndexSearcher.<init>(SolrIndexSearcher.java:323)
   [junit4]    > 	at org.apache.solr.core.SolrCore.openNewSearcher(SolrCore.java:2033)
   [junit4]    > 	at org.apache.solr.core.SolrCore.getSearcher(SolrCore.java:2185)
   [junit4]    > 	at org.apache.solr.core.SolrCore.initSearcher(SolrCore.java:1071)
   [junit4]    > 	at org.apache.solr.core.SolrCore.<init>(SolrCore.java:960)
   [junit4]    > 	at org.apache.solr.core.SolrCore.<init>(SolrCore.java:843)
   [junit4]    > 	at org.apache.solr.core.CoreContainer.create(CoreContainer.java:969)
   [junit4]    > 	at org.apache.solr.core.CoreContainer.lambda$load$7(CoreContainer.java:610)
   [junit4]    > 	at com.codahale.metrics.InstrumentedExecutorService$InstrumentedCallable.call(InstrumentedExecutorService.java:197)
   [junit4]    > 	at java.util.concurrent.FutureTask.run(FutureTask.java:266)
   [junit4]    > 	at org.apache.solr.common.util.ExecutorUtil$MDCAwareThreadPoolExecutor.lambda$execute$0(ExecutorUtil.java:188)
   [junit4]    > 	at java.util.concurrent.ThreadPoolExecutor.runWorker(ThreadPoolExecutor.java:1142)
   [junit4]    > 	at java.util.concurrent.ThreadPoolExecutor$Worker.run(ThreadPoolExecutor.java:617)
   [junit4]    > 	at java.lang.Thread.run(Thread.java:748)
   [junit4]    > org.apache.solr.common.util.ObjectReleaseTracker$ObjectTrackerException: org.apache.solr.core.SolrCore
   [junit4]    > 	at org.apache.solr.common.util.ObjectReleaseTracker.track(ObjectReleaseTracker.java:42)
   [junit4]    > 	at org.apache.solr.core.SolrCore.<init>(SolrCore.java:1019)
   [junit4]    > 	at org.apache.solr.core.SolrCore.<init>(SolrCore.java:843)
   [junit4]    > 	at org.apache.solr.core.CoreContainer.create(CoreContainer.java:969)
   [junit4]    > 	at org.apache.solr.core.CoreContainer.lambda$load$7(CoreContainer.java:610)
   [junit4]    > 	at com.codahale.metrics.InstrumentedExecutorService$InstrumentedCallable.call(InstrumentedExecutorService.java:197)
   [junit4]    > 	at java.util.concurrent.FutureTask.run(FutureTask.java:266)
   [junit4]    > 	at org.apache.solr.common.util.ExecutorUtil$MDCAwareThreadPoolExecutor.lambda$execute$0(ExecutorUtil.java:188)
   [junit4]    > 	at java.util.concurrent.ThreadPoolExecutor.runWorker(ThreadPoolExecutor.java:1142)
   [junit4]    > 	at java.util.concurrent.ThreadPoolExecutor$Worker.run(ThreadPoolExecutor.java:617)
   [junit4]    > 	at java.lang.Thread.run(Thread.java:748)
   [junit4]    > org.apache.solr.common.util.ObjectReleaseTracker$ObjectTrackerException: org.apache.lucene.store.MMapDirectory
   [junit4]    > 	at org.apache.solr.common.util.ObjectReleaseTracker.track(ObjectReleaseTracker.java:42)
   [junit4]    > 	at org.apache.solr.core.CachingDirectoryFactory.get(CachingDirectoryFactory.java:348)
   [junit4]    > 	at org.apache.solr.update.SolrIndexWriter.create(SolrIndexWriter.java:92)
   [junit4]    > 	at org.apache.solr.core.SolrCore.initIndex(SolrCore.java:741)
   [junit4]    > 	at org.apache.solr.core.SolrCore.<init>(SolrCore.java:934)
   [junit4]    > 	at org.apache.solr.core.SolrCore.<init>(SolrCore.java:843)
   [junit4]    > 	at org.apache.solr.core.CoreContainer.create(CoreContainer.java:969)
   [junit4]    > 	at org.apache.solr.core.CoreContainer.lambda$load$7(CoreContainer.java:610)
   [junit4]    > 	at com.codahale.metrics.InstrumentedExecutorService$InstrumentedCallable.call(InstrumentedExecutorService.java:197)
   [junit4]    > 	at java.util.concurrent.FutureTask.run(FutureTask.java:266)
   [junit4]    > 	at org.apache.solr.common.util.ExecutorUtil$MDCAwareThreadPoolExecutor.lambda$execute$0(ExecutorUtil.java:188)
   [junit4]    > 	at java.util.concurrent.ThreadPoolExecutor.runWorker(ThreadPoolExecutor.java:1142)
   [junit4]    > 	at java.util.concurrent.ThreadPoolExecutor$Worker.run(ThreadPoolExecutor.java:617)
   [junit4]    > 	at java.lang.Thread.run(Thread.java:748)
   [junit4]    > org.apache.solr.common.util.ObjectReleaseTracker$ObjectTrackerException: org.apache.solr.common.util.ExecutorUtil$MDCAwareThreadPoolExecutor
   [junit4]    > 	at org.apache.solr.common.util.ObjectReleaseTracker.track(ObjectReleaseTracker.java:42)
   [junit4]    > 	at org.apache.solr.core.SolrCore.<init>(SolrCore.java:872)
   [junit4]    > 	at org.apache.solr.core.SolrCore.<init>(SolrCore.java:843)
   [junit4]    > 	at org.apache.solr.core.CoreContainer.create(CoreContainer.java:969)
   [junit4]    > 	at org.apache.solr.core.CoreContainer.lambda$load$7(CoreContainer.java:610)
   [junit4]    > 	at com.codahale.metrics.InstrumentedExecutorService$InstrumentedCallable.call(InstrumentedExecutorService.java:197)
   [junit4]    > 	at java.util.concurrent.FutureTask.run(FutureTask.java:266)
   [junit4]    > 	at org.apache.solr.common.util.ExecutorUtil$MDCAwareThreadPoolExecutor.lambda$execute$0(ExecutorUtil.java:188)
   [junit4]    > 	at java.util.concurrent.ThreadPoolExecutor.runWorker(ThreadPoolExecutor.java:1142)
   [junit4]    > 	at java.util.concurrent.ThreadPoolExecutor$Worker.run(ThreadPoolExecutor.java:617)
   [junit4]    > 	at java.lang.Thread.run(Thread.java:748)
   [junit4]    > 	at __randomizedtesting.SeedInfo.seed([3AF176DCA7FCE1C7]:0)
   [junit4]    > 	at org.apache.solr.SolrTestCaseJ4.teardownTestCases(SolrTestCaseJ4.java:296)
   [junit4]    > 	at java.lang.Thread.run(Thread.java:748)Throwable #2: com.carrotsearch.randomizedtesting.ThreadLeakError: 1 thread leaked from SUITE scope at org.apache.solr.core.TestLazyCores: 
   [junit4]    >    1) Thread[id=10789, name=searcherExecutor-4465-thread-1, state=WAITING, group=TGRP-TestLazyCores]
   [junit4]    >         at sun.misc.Unsafe.park(Native Method)
   [junit4]    >         at java.util.concurrent.locks.LockSupport.park(LockSupport.java:175)
   [junit4]    >         at java.util.concurrent.locks.AbstractQueuedSynchronizer$ConditionObject.await(AbstractQueuedSynchronizer.java:2039)
   [junit4]    >         at java.util.concurrent.LinkedBlockingQueue.take(LinkedBlockingQueue.java:442)
   [junit4]    >         at java.util.concurrent.ThreadPoolExecutor.getTask(ThreadPoolExecutor.java:1067)
   [junit4]    >         at java.util.concurrent.ThreadPoolExecutor.runWorker(ThreadPoolExecutor.java:1127)
   [junit4]    >         at java.util.concurrent.ThreadPoolExecutor$Worker.run(ThreadPoolExecutor.java:617)
   [junit4]    >         at java.lang.Thread.run(Thread.java:748)
   [junit4]    > 	at __randomizedtesting.SeedInfo.seed([3AF176DCA7FCE1C7]:0)Throwable #3: com.carrotsearch.randomizedtesting.ThreadLeakError: There are still zombie threads that couldn't be terminated:
   [junit4]    >    1) Thread[id=10789, name=searcherExecutor-4465-thread-1, state=WAITING, group=TGRP-TestLazyCores]
   [junit4]    >         at sun.misc.Unsafe.park(Native Method)
   [junit4]    >         at java.util.concurrent.locks.LockSupport.park(LockSupport.java:175)
   [junit4]    >         at java.util.concurrent.locks.AbstractQueuedSynchronizer$ConditionObject.await(AbstractQueuedSynchronizer.java:2039)
   [junit4]    >         at java.util.concurrent.LinkedBlockingQueue.take(LinkedBlockingQueue.java:442)
   [junit4]    >         at java.util.concurrent.ThreadPoolExecutor.getTask(ThreadPoolExecutor.java:1067)
   [junit4]    >         at java.util.concurrent.ThreadPoolExecutor.runWorker(ThreadPoolExecutor.java:1127)
   [junit4]    >         at java.util.concurrent.ThreadPoolExecutor$Worker.run(ThreadPoolExecutor.java:617)
   [junit4]    >         at java.lang.Thread.run(Thread.java:748)
   [junit4]    > 	at __randomizedtesting.SeedInfo.seed([3AF176DCA7FCE1C7]:0)
   [junit4] Completed [376/728 (2!)] on J0 in 70.40s, 9 tests, 1 failure, 2 errors, 1 skipped <<< FAILURES!

[...truncated 44305 lines...]

Mime
View raw message