lucene-dev mailing list archives

Site index · List index
Message view « Date » · « Thread »
Top « Date » · « Thread »
From Apache Jenkins Server <jenk...@builds.apache.org>
Subject [JENKINS] Lucene-Solr-Tests-7.x - Build # 8 - Unstable
Date Wed, 05 Jul 2017 21:45:57 GMT
Build: https://builds.apache.org/job/Lucene-Solr-Tests-7.x/8/

3 tests failed.
FAILED:  org.apache.solr.cloud.ChaosMonkeyNothingIsSafeWithPullReplicasTest.test

Error Message:
Timeout occured while waiting response from server at: http://127.0.0.1:52106

Stack Trace:
org.apache.solr.client.solrj.SolrServerException: Timeout occured while waiting response from server at: http://127.0.0.1:52106
	at __randomizedtesting.SeedInfo.seed([5593F8D3D14E3F5C:DDC7C7097FB252A4]:0)
	at org.apache.solr.client.solrj.impl.HttpSolrClient.executeMethod(HttpSolrClient.java:637)
	at org.apache.solr.client.solrj.impl.HttpSolrClient.request(HttpSolrClient.java:252)
	at org.apache.solr.client.solrj.impl.HttpSolrClient.request(HttpSolrClient.java:241)
	at org.apache.solr.client.solrj.impl.LBHttpSolrClient.doRequest(LBHttpSolrClient.java:483)
	at org.apache.solr.client.solrj.impl.LBHttpSolrClient.request(LBHttpSolrClient.java:413)
	at org.apache.solr.client.solrj.impl.CloudSolrClient.sendRequest(CloudSolrClient.java:1121)
	at org.apache.solr.client.solrj.impl.CloudSolrClient.requestWithRetryOnStaleState(CloudSolrClient.java:862)
	at org.apache.solr.client.solrj.impl.CloudSolrClient.request(CloudSolrClient.java:793)
	at org.apache.solr.client.solrj.SolrClient.request(SolrClient.java:1219)
	at org.apache.solr.cloud.AbstractFullDistribZkTestBase.createCollection(AbstractFullDistribZkTestBase.java:1667)
	at org.apache.solr.cloud.AbstractFullDistribZkTestBase.createCollection(AbstractFullDistribZkTestBase.java:1694)
	at org.apache.solr.cloud.ChaosMonkeyNothingIsSafeWithPullReplicasTest.test(ChaosMonkeyNothingIsSafeWithPullReplicasTest.java:297)
	at sun.reflect.NativeMethodAccessorImpl.invoke0(Native Method)
	at sun.reflect.NativeMethodAccessorImpl.invoke(NativeMethodAccessorImpl.java:62)
	at sun.reflect.DelegatingMethodAccessorImpl.invoke(DelegatingMethodAccessorImpl.java:43)
	at java.lang.reflect.Method.invoke(Method.java:498)
	at com.carrotsearch.randomizedtesting.RandomizedRunner.invoke(RandomizedRunner.java:1713)
	at com.carrotsearch.randomizedtesting.RandomizedRunner$8.evaluate(RandomizedRunner.java:907)
	at com.carrotsearch.randomizedtesting.RandomizedRunner$9.evaluate(RandomizedRunner.java:943)
	at com.carrotsearch.randomizedtesting.RandomizedRunner$10.evaluate(RandomizedRunner.java:957)
	at org.apache.solr.BaseDistributedSearchTestCase$ShardsRepeatRule$ShardsFixedStatement.callStatement(BaseDistributedSearchTestCase.java:985)
	at org.apache.solr.BaseDistributedSearchTestCase$ShardsRepeatRule$ShardsStatement.evaluate(BaseDistributedSearchTestCase.java:960)
	at com.carrotsearch.randomizedtesting.rules.SystemPropertiesRestoreRule$1.evaluate(SystemPropertiesRestoreRule.java:57)
	at org.apache.lucene.util.TestRuleSetupTeardownChained$1.evaluate(TestRuleSetupTeardownChained.java:49)
	at org.apache.lucene.util.AbstractBeforeAfterRule$1.evaluate(AbstractBeforeAfterRule.java:45)
	at org.apache.lucene.util.TestRuleThreadAndTestName$1.evaluate(TestRuleThreadAndTestName.java:48)
	at org.apache.lucene.util.TestRuleIgnoreAfterMaxFailures$1.evaluate(TestRuleIgnoreAfterMaxFailures.java:64)
	at org.apache.lucene.util.TestRuleMarkFailure$1.evaluate(TestRuleMarkFailure.java:47)
	at com.carrotsearch.randomizedtesting.rules.StatementAdapter.evaluate(StatementAdapter.java:36)
	at com.carrotsearch.randomizedtesting.ThreadLeakControl$StatementRunner.run(ThreadLeakControl.java:368)
	at com.carrotsearch.randomizedtesting.ThreadLeakControl.forkTimeoutingTask(ThreadLeakControl.java:817)
	at com.carrotsearch.randomizedtesting.ThreadLeakControl$3.evaluate(ThreadLeakControl.java:468)
	at com.carrotsearch.randomizedtesting.RandomizedRunner.runSingleTest(RandomizedRunner.java:916)
	at com.carrotsearch.randomizedtesting.RandomizedRunner$5.evaluate(RandomizedRunner.java:802)
	at com.carrotsearch.randomizedtesting.RandomizedRunner$6.evaluate(RandomizedRunner.java:852)
	at com.carrotsearch.randomizedtesting.RandomizedRunner$7.evaluate(RandomizedRunner.java:863)
	at com.carrotsearch.randomizedtesting.rules.StatementAdapter.evaluate(StatementAdapter.java:36)
	at com.carrotsearch.randomizedtesting.rules.SystemPropertiesRestoreRule$1.evaluate(SystemPropertiesRestoreRule.java:57)
	at org.apache.lucene.util.AbstractBeforeAfterRule$1.evaluate(AbstractBeforeAfterRule.java:45)
	at com.carrotsearch.randomizedtesting.rules.StatementAdapter.evaluate(StatementAdapter.java:36)
	at org.apache.lucene.util.TestRuleStoreClassName$1.evaluate(TestRuleStoreClassName.java:41)
	at com.carrotsearch.randomizedtesting.rules.NoShadowingOrOverridesOnMethodsRule$1.evaluate(NoShadowingOrOverridesOnMethodsRule.java:40)
	at com.carrotsearch.randomizedtesting.rules.NoShadowingOrOverridesOnMethodsRule$1.evaluate(NoShadowingOrOverridesOnMethodsRule.java:40)
	at com.carrotsearch.randomizedtesting.rules.StatementAdapter.evaluate(StatementAdapter.java:36)
	at com.carrotsearch.randomizedtesting.rules.StatementAdapter.evaluate(StatementAdapter.java:36)
	at com.carrotsearch.randomizedtesting.rules.StatementAdapter.evaluate(StatementAdapter.java:36)
	at org.apache.lucene.util.TestRuleAssertionsRequired$1.evaluate(TestRuleAssertionsRequired.java:53)
	at org.apache.lucene.util.TestRuleMarkFailure$1.evaluate(TestRuleMarkFailure.java:47)
	at org.apache.lucene.util.TestRuleIgnoreAfterMaxFailures$1.evaluate(TestRuleIgnoreAfterMaxFailures.java:64)
	at org.apache.lucene.util.TestRuleIgnoreTestSuites$1.evaluate(TestRuleIgnoreTestSuites.java:54)
	at com.carrotsearch.randomizedtesting.rules.StatementAdapter.evaluate(StatementAdapter.java:36)
	at com.carrotsearch.randomizedtesting.ThreadLeakControl$StatementRunner.run(ThreadLeakControl.java:368)
	at java.lang.Thread.run(Thread.java:748)
Caused by: java.net.SocketTimeoutException: Read timed out
	at java.net.SocketInputStream.socketRead0(Native Method)
	at java.net.SocketInputStream.socketRead(SocketInputStream.java:116)
	at java.net.SocketInputStream.read(SocketInputStream.java:171)
	at java.net.SocketInputStream.read(SocketInputStream.java:141)
	at org.apache.http.impl.io.SessionInputBufferImpl.streamRead(SessionInputBufferImpl.java:139)
	at org.apache.http.impl.io.SessionInputBufferImpl.fillBuffer(SessionInputBufferImpl.java:155)
	at org.apache.http.impl.io.SessionInputBufferImpl.readLine(SessionInputBufferImpl.java:284)
	at org.apache.http.impl.conn.DefaultHttpResponseParser.parseHead(DefaultHttpResponseParser.java:140)
	at org.apache.http.impl.conn.DefaultHttpResponseParser.parseHead(DefaultHttpResponseParser.java:57)
	at org.apache.http.impl.io.AbstractMessageParser.parse(AbstractMessageParser.java:261)
	at org.apache.http.impl.DefaultBHttpClientConnection.receiveResponseHeader(DefaultBHttpClientConnection.java:165)
	at org.apache.http.impl.conn.CPoolProxy.receiveResponseHeader(CPoolProxy.java:167)
	at org.apache.http.protocol.HttpRequestExecutor.doReceiveResponse(HttpRequestExecutor.java:272)
	at org.apache.http.protocol.HttpRequestExecutor.execute(HttpRequestExecutor.java:124)
	at org.apache.http.impl.execchain.MainClientExec.execute(MainClientExec.java:271)
	at org.apache.http.impl.execchain.ProtocolExec.execute(ProtocolExec.java:184)
	at org.apache.http.impl.execchain.RetryExec.execute(RetryExec.java:88)
	at org.apache.http.impl.execchain.RedirectExec.execute(RedirectExec.java:110)
	at org.apache.http.impl.client.InternalHttpClient.doExecute(InternalHttpClient.java:184)
	at org.apache.http.impl.client.CloseableHttpClient.execute(CloseableHttpClient.java:82)
	at org.apache.http.impl.client.CloseableHttpClient.execute(CloseableHttpClient.java:55)
	at org.apache.solr.client.solrj.impl.HttpSolrClient.executeMethod(HttpSolrClient.java:523)
	... 52 more


FAILED:  junit.framework.TestSuite.org.apache.solr.cloud.ChaosMonkeyNothingIsSafeWithPullReplicasTest

Error Message:
7 threads leaked from SUITE scope at org.apache.solr.cloud.ChaosMonkeyNothingIsSafeWithPullReplicasTest:     1) Thread[id=1303, name=Connection evictor, state=TIMED_WAITING, group=TGRP-ChaosMonkeyNothingIsSafeWithPullReplicasTest]         at java.lang.Thread.sleep(Native Method)         at org.apache.http.impl.client.IdleConnectionEvictor$1.run(IdleConnectionEvictor.java:66)         at java.lang.Thread.run(Thread.java:748)    2) Thread[id=1305, name=TEST-ChaosMonkeyNothingIsSafeWithPullReplicasTest.test-seed#[5593F8D3D14E3F5C]-EventThread, state=WAITING, group=TGRP-ChaosMonkeyNothingIsSafeWithPullReplicasTest]         at sun.misc.Unsafe.park(Native Method)         at java.util.concurrent.locks.LockSupport.park(LockSupport.java:175)         at java.util.concurrent.locks.AbstractQueuedSynchronizer$ConditionObject.await(AbstractQueuedSynchronizer.java:2039)         at java.util.concurrent.LinkedBlockingQueue.take(LinkedBlockingQueue.java:442)         at org.apache.zookeeper.ClientCnxn$EventThread.run(ClientCnxn.java:501)    3) Thread[id=1538, name=zkCallback-332-thread-2, state=TIMED_WAITING, group=TGRP-ChaosMonkeyNothingIsSafeWithPullReplicasTest]         at sun.misc.Unsafe.park(Native Method)         at java.util.concurrent.locks.LockSupport.parkNanos(LockSupport.java:215)         at java.util.concurrent.SynchronousQueue$TransferStack.awaitFulfill(SynchronousQueue.java:460)         at java.util.concurrent.SynchronousQueue$TransferStack.transfer(SynchronousQueue.java:362)         at java.util.concurrent.SynchronousQueue.poll(SynchronousQueue.java:941)         at java.util.concurrent.ThreadPoolExecutor.getTask(ThreadPoolExecutor.java:1066)         at java.util.concurrent.ThreadPoolExecutor.runWorker(ThreadPoolExecutor.java:1127)         at java.util.concurrent.ThreadPoolExecutor$Worker.run(ThreadPoolExecutor.java:617)         at java.lang.Thread.run(Thread.java:748)    4) Thread[id=1304, name=TEST-ChaosMonkeyNothingIsSafeWithPullReplicasTest.test-seed#[5593F8D3D14E3F5C]-SendThread(127.0.0.1:46738), state=TIMED_WAITING, group=TGRP-ChaosMonkeyNothingIsSafeWithPullReplicasTest]         at java.lang.Thread.sleep(Native Method)         at org.apache.zookeeper.client.StaticHostProvider.next(StaticHostProvider.java:101)         at org.apache.zookeeper.ClientCnxn$SendThread.startConnect(ClientCnxn.java:997)         at org.apache.zookeeper.ClientCnxn$SendThread.run(ClientCnxn.java:1060)    5) Thread[id=1306, name=zkCallback-332-thread-1, state=TIMED_WAITING, group=TGRP-ChaosMonkeyNothingIsSafeWithPullReplicasTest]         at sun.misc.Unsafe.park(Native Method)         at java.util.concurrent.locks.LockSupport.parkNanos(LockSupport.java:215)         at java.util.concurrent.SynchronousQueue$TransferStack.awaitFulfill(SynchronousQueue.java:460)         at java.util.concurrent.SynchronousQueue$TransferStack.transfer(SynchronousQueue.java:362)         at java.util.concurrent.SynchronousQueue.poll(SynchronousQueue.java:941)         at java.util.concurrent.ThreadPoolExecutor.getTask(ThreadPoolExecutor.java:1066)         at java.util.concurrent.ThreadPoolExecutor.runWorker(ThreadPoolExecutor.java:1127)         at java.util.concurrent.ThreadPoolExecutor$Worker.run(ThreadPoolExecutor.java:617)         at java.lang.Thread.run(Thread.java:748)    6) Thread[id=1570, name=zkCallback-332-thread-4, state=TIMED_WAITING, group=TGRP-ChaosMonkeyNothingIsSafeWithPullReplicasTest]         at sun.misc.Unsafe.park(Native Method)         at java.util.concurrent.locks.LockSupport.parkNanos(LockSupport.java:215)         at java.util.concurrent.SynchronousQueue$TransferStack.awaitFulfill(SynchronousQueue.java:460)         at java.util.concurrent.SynchronousQueue$TransferStack.transfer(SynchronousQueue.java:362)         at java.util.concurrent.SynchronousQueue.poll(SynchronousQueue.java:941)         at java.util.concurrent.ThreadPoolExecutor.getTask(ThreadPoolExecutor.java:1066)         at java.util.concurrent.ThreadPoolExecutor.runWorker(ThreadPoolExecutor.java:1127)         at java.util.concurrent.ThreadPoolExecutor$Worker.run(ThreadPoolExecutor.java:617)         at java.lang.Thread.run(Thread.java:748)    7) Thread[id=1539, name=zkCallback-332-thread-3, state=TIMED_WAITING, group=TGRP-ChaosMonkeyNothingIsSafeWithPullReplicasTest]         at sun.misc.Unsafe.park(Native Method)         at java.util.concurrent.locks.LockSupport.parkNanos(LockSupport.java:215)         at java.util.concurrent.SynchronousQueue$TransferStack.awaitFulfill(SynchronousQueue.java:460)         at java.util.concurrent.SynchronousQueue$TransferStack.transfer(SynchronousQueue.java:362)         at java.util.concurrent.SynchronousQueue.poll(SynchronousQueue.java:941)         at java.util.concurrent.ThreadPoolExecutor.getTask(ThreadPoolExecutor.java:1066)         at java.util.concurrent.ThreadPoolExecutor.runWorker(ThreadPoolExecutor.java:1127)         at java.util.concurrent.ThreadPoolExecutor$Worker.run(ThreadPoolExecutor.java:617)         at java.lang.Thread.run(Thread.java:748)

Stack Trace:
com.carrotsearch.randomizedtesting.ThreadLeakError: 7 threads leaked from SUITE scope at org.apache.solr.cloud.ChaosMonkeyNothingIsSafeWithPullReplicasTest: 
   1) Thread[id=1303, name=Connection evictor, state=TIMED_WAITING, group=TGRP-ChaosMonkeyNothingIsSafeWithPullReplicasTest]
        at java.lang.Thread.sleep(Native Method)
        at org.apache.http.impl.client.IdleConnectionEvictor$1.run(IdleConnectionEvictor.java:66)
        at java.lang.Thread.run(Thread.java:748)
   2) Thread[id=1305, name=TEST-ChaosMonkeyNothingIsSafeWithPullReplicasTest.test-seed#[5593F8D3D14E3F5C]-EventThread, state=WAITING, group=TGRP-ChaosMonkeyNothingIsSafeWithPullReplicasTest]
        at sun.misc.Unsafe.park(Native Method)
        at java.util.concurrent.locks.LockSupport.park(LockSupport.java:175)
        at java.util.concurrent.locks.AbstractQueuedSynchronizer$ConditionObject.await(AbstractQueuedSynchronizer.java:2039)
        at java.util.concurrent.LinkedBlockingQueue.take(LinkedBlockingQueue.java:442)
        at org.apache.zookeeper.ClientCnxn$EventThread.run(ClientCnxn.java:501)
   3) Thread[id=1538, name=zkCallback-332-thread-2, state=TIMED_WAITING, group=TGRP-ChaosMonkeyNothingIsSafeWithPullReplicasTest]
        at sun.misc.Unsafe.park(Native Method)
        at java.util.concurrent.locks.LockSupport.parkNanos(LockSupport.java:215)
        at java.util.concurrent.SynchronousQueue$TransferStack.awaitFulfill(SynchronousQueue.java:460)
        at java.util.concurrent.SynchronousQueue$TransferStack.transfer(SynchronousQueue.java:362)
        at java.util.concurrent.SynchronousQueue.poll(SynchronousQueue.java:941)
        at java.util.concurrent.ThreadPoolExecutor.getTask(ThreadPoolExecutor.java:1066)
        at java.util.concurrent.ThreadPoolExecutor.runWorker(ThreadPoolExecutor.java:1127)
        at java.util.concurrent.ThreadPoolExecutor$Worker.run(ThreadPoolExecutor.java:617)
        at java.lang.Thread.run(Thread.java:748)
   4) Thread[id=1304, name=TEST-ChaosMonkeyNothingIsSafeWithPullReplicasTest.test-seed#[5593F8D3D14E3F5C]-SendThread(127.0.0.1:46738), state=TIMED_WAITING, group=TGRP-ChaosMonkeyNothingIsSafeWithPullReplicasTest]
        at java.lang.Thread.sleep(Native Method)
        at org.apache.zookeeper.client.StaticHostProvider.next(StaticHostProvider.java:101)
        at org.apache.zookeeper.ClientCnxn$SendThread.startConnect(ClientCnxn.java:997)
        at org.apache.zookeeper.ClientCnxn$SendThread.run(ClientCnxn.java:1060)
   5) Thread[id=1306, name=zkCallback-332-thread-1, state=TIMED_WAITING, group=TGRP-ChaosMonkeyNothingIsSafeWithPullReplicasTest]
        at sun.misc.Unsafe.park(Native Method)
        at java.util.concurrent.locks.LockSupport.parkNanos(LockSupport.java:215)
        at java.util.concurrent.SynchronousQueue$TransferStack.awaitFulfill(SynchronousQueue.java:460)
        at java.util.concurrent.SynchronousQueue$TransferStack.transfer(SynchronousQueue.java:362)
        at java.util.concurrent.SynchronousQueue.poll(SynchronousQueue.java:941)
        at java.util.concurrent.ThreadPoolExecutor.getTask(ThreadPoolExecutor.java:1066)
        at java.util.concurrent.ThreadPoolExecutor.runWorker(ThreadPoolExecutor.java:1127)
        at java.util.concurrent.ThreadPoolExecutor$Worker.run(ThreadPoolExecutor.java:617)
        at java.lang.Thread.run(Thread.java:748)
   6) Thread[id=1570, name=zkCallback-332-thread-4, state=TIMED_WAITING, group=TGRP-ChaosMonkeyNothingIsSafeWithPullReplicasTest]
        at sun.misc.Unsafe.park(Native Method)
        at java.util.concurrent.locks.LockSupport.parkNanos(LockSupport.java:215)
        at java.util.concurrent.SynchronousQueue$TransferStack.awaitFulfill(SynchronousQueue.java:460)
        at java.util.concurrent.SynchronousQueue$TransferStack.transfer(SynchronousQueue.java:362)
        at java.util.concurrent.SynchronousQueue.poll(SynchronousQueue.java:941)
        at java.util.concurrent.ThreadPoolExecutor.getTask(ThreadPoolExecutor.java:1066)
        at java.util.concurrent.ThreadPoolExecutor.runWorker(ThreadPoolExecutor.java:1127)
        at java.util.concurrent.ThreadPoolExecutor$Worker.run(ThreadPoolExecutor.java:617)
        at java.lang.Thread.run(Thread.java:748)
   7) Thread[id=1539, name=zkCallback-332-thread-3, state=TIMED_WAITING, group=TGRP-ChaosMonkeyNothingIsSafeWithPullReplicasTest]
        at sun.misc.Unsafe.park(Native Method)
        at java.util.concurrent.locks.LockSupport.parkNanos(LockSupport.java:215)
        at java.util.concurrent.SynchronousQueue$TransferStack.awaitFulfill(SynchronousQueue.java:460)
        at java.util.concurrent.SynchronousQueue$TransferStack.transfer(SynchronousQueue.java:362)
        at java.util.concurrent.SynchronousQueue.poll(SynchronousQueue.java:941)
        at java.util.concurrent.ThreadPoolExecutor.getTask(ThreadPoolExecutor.java:1066)
        at java.util.concurrent.ThreadPoolExecutor.runWorker(ThreadPoolExecutor.java:1127)
        at java.util.concurrent.ThreadPoolExecutor$Worker.run(ThreadPoolExecutor.java:617)
        at java.lang.Thread.run(Thread.java:748)
	at __randomizedtesting.SeedInfo.seed([5593F8D3D14E3F5C]:0)


FAILED:  junit.framework.TestSuite.org.apache.solr.cloud.ChaosMonkeyNothingIsSafeWithPullReplicasTest

Error Message:
There are still zombie threads that couldn't be terminated:    1) Thread[id=1538, name=zkCallback-332-thread-2, state=TIMED_WAITING, group=TGRP-ChaosMonkeyNothingIsSafeWithPullReplicasTest]         at sun.misc.Unsafe.park(Native Method)         at java.util.concurrent.locks.LockSupport.parkNanos(LockSupport.java:215)         at java.util.concurrent.SynchronousQueue$TransferStack.awaitFulfill(SynchronousQueue.java:460)         at java.util.concurrent.SynchronousQueue$TransferStack.transfer(SynchronousQueue.java:362)         at java.util.concurrent.SynchronousQueue.poll(SynchronousQueue.java:941)         at java.util.concurrent.ThreadPoolExecutor.getTask(ThreadPoolExecutor.java:1066)         at java.util.concurrent.ThreadPoolExecutor.runWorker(ThreadPoolExecutor.java:1127)         at java.util.concurrent.ThreadPoolExecutor$Worker.run(ThreadPoolExecutor.java:617)         at java.lang.Thread.run(Thread.java:748)    2) Thread[id=1304, name=TEST-ChaosMonkeyNothingIsSafeWithPullReplicasTest.test-seed#[5593F8D3D14E3F5C]-SendThread(127.0.0.1:46738), state=TIMED_WAITING, group=TGRP-ChaosMonkeyNothingIsSafeWithPullReplicasTest]         at java.lang.Thread.sleep(Native Method)         at org.apache.zookeeper.client.StaticHostProvider.next(StaticHostProvider.java:101)         at org.apache.zookeeper.ClientCnxn$SendThread.startConnect(ClientCnxn.java:997)         at org.apache.zookeeper.ClientCnxn$SendThread.run(ClientCnxn.java:1060)    3) Thread[id=1306, name=zkCallback-332-thread-1, state=TIMED_WAITING, group=TGRP-ChaosMonkeyNothingIsSafeWithPullReplicasTest]         at sun.misc.Unsafe.park(Native Method)         at java.util.concurrent.locks.LockSupport.parkNanos(LockSupport.java:215)         at java.util.concurrent.SynchronousQueue$TransferStack.awaitFulfill(SynchronousQueue.java:460)         at java.util.concurrent.SynchronousQueue$TransferStack.transfer(SynchronousQueue.java:362)         at java.util.concurrent.SynchronousQueue.poll(SynchronousQueue.java:941)         at java.util.concurrent.ThreadPoolExecutor.getTask(ThreadPoolExecutor.java:1066)         at java.util.concurrent.ThreadPoolExecutor.runWorker(ThreadPoolExecutor.java:1127)         at java.util.concurrent.ThreadPoolExecutor$Worker.run(ThreadPoolExecutor.java:617)         at java.lang.Thread.run(Thread.java:748)    4) Thread[id=1570, name=zkCallback-332-thread-4, state=TIMED_WAITING, group=TGRP-ChaosMonkeyNothingIsSafeWithPullReplicasTest]         at sun.misc.Unsafe.park(Native Method)         at java.util.concurrent.locks.LockSupport.parkNanos(LockSupport.java:215)         at java.util.concurrent.SynchronousQueue$TransferStack.awaitFulfill(SynchronousQueue.java:460)         at java.util.concurrent.SynchronousQueue$TransferStack.transfer(SynchronousQueue.java:362)         at java.util.concurrent.SynchronousQueue.poll(SynchronousQueue.java:941)         at java.util.concurrent.ThreadPoolExecutor.getTask(ThreadPoolExecutor.java:1066)         at java.util.concurrent.ThreadPoolExecutor.runWorker(ThreadPoolExecutor.java:1127)         at java.util.concurrent.ThreadPoolExecutor$Worker.run(ThreadPoolExecutor.java:617)         at java.lang.Thread.run(Thread.java:748)    5) Thread[id=1539, name=zkCallback-332-thread-3, state=TIMED_WAITING, group=TGRP-ChaosMonkeyNothingIsSafeWithPullReplicasTest]         at sun.misc.Unsafe.park(Native Method)         at java.util.concurrent.locks.LockSupport.parkNanos(LockSupport.java:215)         at java.util.concurrent.SynchronousQueue$TransferStack.awaitFulfill(SynchronousQueue.java:460)         at java.util.concurrent.SynchronousQueue$TransferStack.transfer(SynchronousQueue.java:362)         at java.util.concurrent.SynchronousQueue.poll(SynchronousQueue.java:941)         at java.util.concurrent.ThreadPoolExecutor.getTask(ThreadPoolExecutor.java:1066)         at java.util.concurrent.ThreadPoolExecutor.runWorker(ThreadPoolExecutor.java:1127)         at java.util.concurrent.ThreadPoolExecutor$Worker.run(ThreadPoolExecutor.java:617)         at java.lang.Thread.run(Thread.java:748)

Stack Trace:
com.carrotsearch.randomizedtesting.ThreadLeakError: There are still zombie threads that couldn't be terminated:
   1) Thread[id=1538, name=zkCallback-332-thread-2, state=TIMED_WAITING, group=TGRP-ChaosMonkeyNothingIsSafeWithPullReplicasTest]
        at sun.misc.Unsafe.park(Native Method)
        at java.util.concurrent.locks.LockSupport.parkNanos(LockSupport.java:215)
        at java.util.concurrent.SynchronousQueue$TransferStack.awaitFulfill(SynchronousQueue.java:460)
        at java.util.concurrent.SynchronousQueue$TransferStack.transfer(SynchronousQueue.java:362)
        at java.util.concurrent.SynchronousQueue.poll(SynchronousQueue.java:941)
        at java.util.concurrent.ThreadPoolExecutor.getTask(ThreadPoolExecutor.java:1066)
        at java.util.concurrent.ThreadPoolExecutor.runWorker(ThreadPoolExecutor.java:1127)
        at java.util.concurrent.ThreadPoolExecutor$Worker.run(ThreadPoolExecutor.java:617)
        at java.lang.Thread.run(Thread.java:748)
   2) Thread[id=1304, name=TEST-ChaosMonkeyNothingIsSafeWithPullReplicasTest.test-seed#[5593F8D3D14E3F5C]-SendThread(127.0.0.1:46738), state=TIMED_WAITING, group=TGRP-ChaosMonkeyNothingIsSafeWithPullReplicasTest]
        at java.lang.Thread.sleep(Native Method)
        at org.apache.zookeeper.client.StaticHostProvider.next(StaticHostProvider.java:101)
        at org.apache.zookeeper.ClientCnxn$SendThread.startConnect(ClientCnxn.java:997)
        at org.apache.zookeeper.ClientCnxn$SendThread.run(ClientCnxn.java:1060)
   3) Thread[id=1306, name=zkCallback-332-thread-1, state=TIMED_WAITING, group=TGRP-ChaosMonkeyNothingIsSafeWithPullReplicasTest]
        at sun.misc.Unsafe.park(Native Method)
        at java.util.concurrent.locks.LockSupport.parkNanos(LockSupport.java:215)
        at java.util.concurrent.SynchronousQueue$TransferStack.awaitFulfill(SynchronousQueue.java:460)
        at java.util.concurrent.SynchronousQueue$TransferStack.transfer(SynchronousQueue.java:362)
        at java.util.concurrent.SynchronousQueue.poll(SynchronousQueue.java:941)
        at java.util.concurrent.ThreadPoolExecutor.getTask(ThreadPoolExecutor.java:1066)
        at java.util.concurrent.ThreadPoolExecutor.runWorker(ThreadPoolExecutor.java:1127)
        at java.util.concurrent.ThreadPoolExecutor$Worker.run(ThreadPoolExecutor.java:617)
        at java.lang.Thread.run(Thread.java:748)
   4) Thread[id=1570, name=zkCallback-332-thread-4, state=TIMED_WAITING, group=TGRP-ChaosMonkeyNothingIsSafeWithPullReplicasTest]
        at sun.misc.Unsafe.park(Native Method)
        at java.util.concurrent.locks.LockSupport.parkNanos(LockSupport.java:215)
        at java.util.concurrent.SynchronousQueue$TransferStack.awaitFulfill(SynchronousQueue.java:460)
        at java.util.concurrent.SynchronousQueue$TransferStack.transfer(SynchronousQueue.java:362)
        at java.util.concurrent.SynchronousQueue.poll(SynchronousQueue.java:941)
        at java.util.concurrent.ThreadPoolExecutor.getTask(ThreadPoolExecutor.java:1066)
        at java.util.concurrent.ThreadPoolExecutor.runWorker(ThreadPoolExecutor.java:1127)
        at java.util.concurrent.ThreadPoolExecutor$Worker.run(ThreadPoolExecutor.java:617)
        at java.lang.Thread.run(Thread.java:748)
   5) Thread[id=1539, name=zkCallback-332-thread-3, state=TIMED_WAITING, group=TGRP-ChaosMonkeyNothingIsSafeWithPullReplicasTest]
        at sun.misc.Unsafe.park(Native Method)
        at java.util.concurrent.locks.LockSupport.parkNanos(LockSupport.java:215)
        at java.util.concurrent.SynchronousQueue$TransferStack.awaitFulfill(SynchronousQueue.java:460)
        at java.util.concurrent.SynchronousQueue$TransferStack.transfer(SynchronousQueue.java:362)
        at java.util.concurrent.SynchronousQueue.poll(SynchronousQueue.java:941)
        at java.util.concurrent.ThreadPoolExecutor.getTask(ThreadPoolExecutor.java:1066)
        at java.util.concurrent.ThreadPoolExecutor.runWorker(ThreadPoolExecutor.java:1127)
        at java.util.concurrent.ThreadPoolExecutor$Worker.run(ThreadPoolExecutor.java:617)
        at java.lang.Thread.run(Thread.java:748)
	at __randomizedtesting.SeedInfo.seed([5593F8D3D14E3F5C]:0)




Build Log:
[...truncated 11088 lines...]
   [junit4] Suite: org.apache.solr.cloud.ChaosMonkeyNothingIsSafeWithPullReplicasTest
   [junit4]   2> Creating dataDir: /x1/jenkins/jenkins-slave/workspace/Lucene-Solr-Tests-7.x/solr/build/solr-core/test/J2/temp/solr.cloud.ChaosMonkeyNothingIsSafeWithPullReplicasTest_5593F8D3D14E3F5C-001/init-core-data-001
   [junit4]   2> 125018 WARN  (SUITE-ChaosMonkeyNothingIsSafeWithPullReplicasTest-seed#[5593F8D3D14E3F5C]-worker) [    ] o.a.s.SolrTestCaseJ4 startTrackingSearchers: numOpens=1979 numCloses=1979
   [junit4]   2> 125018 INFO  (SUITE-ChaosMonkeyNothingIsSafeWithPullReplicasTest-seed#[5593F8D3D14E3F5C]-worker) [    ] o.a.s.SolrTestCaseJ4 Using PointFields (NUMERIC_POINTS_SYSPROP=true) w/NUMERIC_DOCVALUES_SYSPROP=false
   [junit4]   2> 125019 INFO  (SUITE-ChaosMonkeyNothingIsSafeWithPullReplicasTest-seed#[5593F8D3D14E3F5C]-worker) [    ] o.a.s.SolrTestCaseJ4 Randomized ssl (false) and clientAuth (false) via: @org.apache.solr.SolrTestCaseJ4$SuppressSSL(bugUrl=https://issues.apache.org/jira/browse/SOLR-5776)
   [junit4]   2> 125020 INFO  (SUITE-ChaosMonkeyNothingIsSafeWithPullReplicasTest-seed#[5593F8D3D14E3F5C]-worker) [    ] o.a.s.BaseDistributedSearchTestCase Setting hostContext system property: /
   [junit4]   2> 125023 INFO  (TEST-ChaosMonkeyNothingIsSafeWithPullReplicasTest.test-seed#[5593F8D3D14E3F5C]) [    ] o.a.s.c.ChaosMonkeyNothingIsSafeWithPullReplicasTest Starting ChaosMonkey test with 1 shards and 4 nodes
   [junit4]   2> 125025 INFO  (TEST-ChaosMonkeyNothingIsSafeWithPullReplicasTest.test-seed#[5593F8D3D14E3F5C]) [    ] o.a.s.c.ZkTestServer STARTING ZK TEST SERVER
   [junit4]   2> 125026 INFO  (Thread-179) [    ] o.a.s.c.ZkTestServer client port:0.0.0.0/0.0.0.0:0
   [junit4]   2> 125026 INFO  (Thread-179) [    ] o.a.s.c.ZkTestServer Starting server
   [junit4]   2> 125033 ERROR (Thread-179) [    ] o.a.z.s.ZooKeeperServer ZKShutdownHandler is not registered, so ZooKeeper server won't take any action on ERROR or SHUTDOWN server state changes
   [junit4]   2> 125126 INFO  (TEST-ChaosMonkeyNothingIsSafeWithPullReplicasTest.test-seed#[5593F8D3D14E3F5C]) [    ] o.a.s.c.ZkTestServer start zk server on port:46738
   [junit4]   2> 125179 INFO  (TEST-ChaosMonkeyNothingIsSafeWithPullReplicasTest.test-seed#[5593F8D3D14E3F5C]) [    ] o.a.s.c.AbstractZkTestCase put /x1/jenkins/jenkins-slave/workspace/Lucene-Solr-Tests-7.x/solr/core/src/test-files/solr/collection1/conf/solrconfig-tlog.xml to /configs/conf1/solrconfig.xml
   [junit4]   2> 125181 INFO  (TEST-ChaosMonkeyNothingIsSafeWithPullReplicasTest.test-seed#[5593F8D3D14E3F5C]) [    ] o.a.s.c.AbstractZkTestCase put /x1/jenkins/jenkins-slave/workspace/Lucene-Solr-Tests-7.x/solr/core/src/test-files/solr/collection1/conf/schema15.xml to /configs/conf1/schema.xml
   [junit4]   2> 125183 INFO  (TEST-ChaosMonkeyNothingIsSafeWithPullReplicasTest.test-seed#[5593F8D3D14E3F5C]) [    ] o.a.s.c.AbstractZkTestCase put /x1/jenkins/jenkins-slave/workspace/Lucene-Solr-Tests-7.x/solr/core/src/test-files/solr/collection1/conf/solrconfig.snippet.randomindexconfig.xml to /configs/conf1/solrconfig.snippet.randomindexconfig.xml
   [junit4]   2> 125184 INFO  (TEST-ChaosMonkeyNothingIsSafeWithPullReplicasTest.test-seed#[5593F8D3D14E3F5C]) [    ] o.a.s.c.AbstractZkTestCase put /x1/jenkins/jenkins-slave/workspace/Lucene-Solr-Tests-7.x/solr/core/src/test-files/solr/collection1/conf/stopwords.txt to /configs/conf1/stopwords.txt
   [junit4]   2> 125185 INFO  (TEST-ChaosMonkeyNothingIsSafeWithPullReplicasTest.test-seed#[5593F8D3D14E3F5C]) [    ] o.a.s.c.AbstractZkTestCase put /x1/jenkins/jenkins-slave/workspace/Lucene-Solr-Tests-7.x/solr/core/src/test-files/solr/collection1/conf/protwords.txt to /configs/conf1/protwords.txt
   [junit4]   2> 125187 INFO  (TEST-ChaosMonkeyNothingIsSafeWithPullReplicasTest.test-seed#[5593F8D3D14E3F5C]) [    ] o.a.s.c.AbstractZkTestCase put /x1/jenkins/jenkins-slave/workspace/Lucene-Solr-Tests-7.x/solr/core/src/test-files/solr/collection1/conf/currency.xml to /configs/conf1/currency.xml
   [junit4]   2> 125188 INFO  (TEST-ChaosMonkeyNothingIsSafeWithPullReplicasTest.test-seed#[5593F8D3D14E3F5C]) [    ] o.a.s.c.AbstractZkTestCase put /x1/jenkins/jenkins-slave/workspace/Lucene-Solr-Tests-7.x/solr/core/src/test-files/solr/collection1/conf/enumsConfig.xml to /configs/conf1/enumsConfig.xml
   [junit4]   2> 125189 INFO  (TEST-ChaosMonkeyNothingIsSafeWithPullReplicasTest.test-seed#[5593F8D3D14E3F5C]) [    ] o.a.s.c.AbstractZkTestCase put /x1/jenkins/jenkins-slave/workspace/Lucene-Solr-Tests-7.x/solr/core/src/test-files/solr/collection1/conf/open-exchange-rates.json to /configs/conf1/open-exchange-rates.json
   [junit4]   2> 125191 INFO  (TEST-ChaosMonkeyNothingIsSafeWithPullReplicasTest.test-seed#[5593F8D3D14E3F5C]) [    ] o.a.s.c.AbstractZkTestCase put /x1/jenkins/jenkins-slave/workspace/Lucene-Solr-Tests-7.x/solr/core/src/test-files/solr/collection1/conf/mapping-ISOLatin1Accent.txt to /configs/conf1/mapping-ISOLatin1Accent.txt
   [junit4]   2> 125192 INFO  (TEST-ChaosMonkeyNothingIsSafeWithPullReplicasTest.test-seed#[5593F8D3D14E3F5C]) [    ] o.a.s.c.AbstractZkTestCase put /x1/jenkins/jenkins-slave/workspace/Lucene-Solr-Tests-7.x/solr/core/src/test-files/solr/collection1/conf/old_synonyms.txt to /configs/conf1/old_synonyms.txt
   [junit4]   2> 125193 INFO  (TEST-ChaosMonkeyNothingIsSafeWithPullReplicasTest.test-seed#[5593F8D3D14E3F5C]) [    ] o.a.s.c.AbstractZkTestCase put /x1/jenkins/jenkins-slave/workspace/Lucene-Solr-Tests-7.x/solr/core/src/test-files/solr/collection1/conf/synonyms.txt to /configs/conf1/synonyms.txt
   [junit4]   2> 125195 INFO  (TEST-ChaosMonkeyNothingIsSafeWithPullReplicasTest.test-seed#[5593F8D3D14E3F5C]) [    ] o.a.s.c.AbstractFullDistribZkTestBase Will use TLOG replicas unless explicitly asked otherwise
   [junit4]   2> 125507 INFO  (TEST-ChaosMonkeyNothingIsSafeWithPullReplicasTest.test-seed#[5593F8D3D14E3F5C]) [    ] o.e.j.s.Server jetty-9.3.14.v20161028
   [junit4]   2> 125509 INFO  (TEST-ChaosMonkeyNothingIsSafeWithPullReplicasTest.test-seed#[5593F8D3D14E3F5C]) [    ] o.e.j.s.h.ContextHandler Started o.e.j.s.ServletContextHandler@719649ed{/,null,AVAILABLE}
   [junit4]   2> 125510 INFO  (TEST-ChaosMonkeyNothingIsSafeWithPullReplicasTest.test-seed#[5593F8D3D14E3F5C]) [    ] o.e.j.s.AbstractConnector Started ServerConnector@375fcea8{HTTP/1.1,[http/1.1]}{127.0.0.1:52106}
   [junit4]   2> 125510 INFO  (TEST-ChaosMonkeyNothingIsSafeWithPullReplicasTest.test-seed#[5593F8D3D14E3F5C]) [    ] o.e.j.s.Server Started @128637ms
   [junit4]   2> 125510 INFO  (TEST-ChaosMonkeyNothingIsSafeWithPullReplicasTest.test-seed#[5593F8D3D14E3F5C]) [    ] o.a.s.c.s.e.JettySolrRunner Jetty properties: {solr.data.dir=/x1/jenkins/jenkins-slave/workspace/Lucene-Solr-Tests-7.x/solr/build/solr-core/test/J2/temp/solr.cloud.ChaosMonkeyNothingIsSafeWithPullReplicasTest_5593F8D3D14E3F5C-001/tempDir-001/control/data, replicaType=NRT, hostContext=/, hostPort=52106, coreRootDirectory=/x1/jenkins/jenkins-slave/workspace/Lucene-Solr-Tests-7.x/solr/build/solr-core/test/J2/temp/solr.cloud.ChaosMonkeyNothingIsSafeWithPullReplicasTest_5593F8D3D14E3F5C-001/control-001/cores}
   [junit4]   2> 125510 ERROR (TEST-ChaosMonkeyNothingIsSafeWithPullReplicasTest.test-seed#[5593F8D3D14E3F5C]) [    ] o.a.s.s.StartupLoggingUtils Missing Java Option solr.log.dir. Logging may be missing or incomplete.
   [junit4]   2> 125511 INFO  (TEST-ChaosMonkeyNothingIsSafeWithPullReplicasTest.test-seed#[5593F8D3D14E3F5C]) [    ] o.a.s.s.SolrDispatchFilter  ___      _       Welcome to Apache Solr? version 7.1.0
   [junit4]   2> 125511 INFO  (TEST-ChaosMonkeyNothingIsSafeWithPullReplicasTest.test-seed#[5593F8D3D14E3F5C]) [    ] o.a.s.s.SolrDispatchFilter / __| ___| |_ _   Starting in cloud mode on port null
   [junit4]   2> 125511 INFO  (TEST-ChaosMonkeyNothingIsSafeWithPullReplicasTest.test-seed#[5593F8D3D14E3F5C]) [    ] o.a.s.s.SolrDispatchFilter \__ \/ _ \ | '_|  Install dir: null, Default config dir: null
   [junit4]   2> 125511 INFO  (TEST-ChaosMonkeyNothingIsSafeWithPullReplicasTest.test-seed#[5593F8D3D14E3F5C]) [    ] o.a.s.s.SolrDispatchFilter |___/\___/_|_|    Start time: 2017-07-05T20:59:03.595Z
   [junit4]   2> 125525 INFO  (TEST-ChaosMonkeyNothingIsSafeWithPullReplicasTest.test-seed#[5593F8D3D14E3F5C]) [    ] o.a.s.s.SolrDispatchFilter Loading solr.xml from SolrHome (not found in ZooKeeper)
   [junit4]   2> 125525 INFO  (TEST-ChaosMonkeyNothingIsSafeWithPullReplicasTest.test-seed#[5593F8D3D14E3F5C]) [    ] o.a.s.c.SolrXmlConfig Loading container configuration from /x1/jenkins/jenkins-slave/workspace/Lucene-Solr-Tests-7.x/solr/build/solr-core/test/J2/temp/solr.cloud.ChaosMonkeyNothingIsSafeWithPullReplicasTest_5593F8D3D14E3F5C-001/control-001/solr.xml
   [junit4]   2> 125532 INFO  (TEST-ChaosMonkeyNothingIsSafeWithPullReplicasTest.test-seed#[5593F8D3D14E3F5C]) [    ] o.a.s.c.SolrXmlConfig MBean server found: com.sun.jmx.mbeanserver.JmxMBeanServer@4a8e8af7, but no JMX reporters were configured - adding default JMX reporter.
   [junit4]   2> 125557 INFO  (TEST-ChaosMonkeyNothingIsSafeWithPullReplicasTest.test-seed#[5593F8D3D14E3F5C]) [    ] o.a.s.c.ZkContainer Zookeeper client=127.0.0.1:46738/solr
   [junit4]   2> 125692 INFO  (TEST-ChaosMonkeyNothingIsSafeWithPullReplicasTest.test-seed#[5593F8D3D14E3F5C]) [n:127.0.0.1:52106_    ] o.a.s.c.Overseer Overseer (id=null) closing
   [junit4]   2> 125693 INFO  (TEST-ChaosMonkeyNothingIsSafeWithPullReplicasTest.test-seed#[5593F8D3D14E3F5C]) [n:127.0.0.1:52106_    ] o.a.s.c.OverseerElectionContext I am going to be the leader 127.0.0.1:52106_
   [junit4]   2> 125694 INFO  (TEST-ChaosMonkeyNothingIsSafeWithPullReplicasTest.test-seed#[5593F8D3D14E3F5C]) [n:127.0.0.1:52106_    ] o.a.s.c.Overseer Overseer (id=98257360854122500-127.0.0.1:52106_-n_0000000000) starting
   [junit4]   2> 125703 INFO  (TEST-ChaosMonkeyNothingIsSafeWithPullReplicasTest.test-seed#[5593F8D3D14E3F5C]) [n:127.0.0.1:52106_    ] o.a.s.c.ZkController Register node as live in ZooKeeper:/live_nodes/127.0.0.1:52106_
   [junit4]   2> 125706 INFO  (zkCallback-325-thread-1-processing-n:127.0.0.1:52106_) [n:127.0.0.1:52106_    ] o.a.s.c.c.ZkStateReader Updated live nodes from ZooKeeper... (0) -> (1)
   [junit4]   2> 125875 INFO  (TEST-ChaosMonkeyNothingIsSafeWithPullReplicasTest.test-seed#[5593F8D3D14E3F5C]) [n:127.0.0.1:52106_    ] o.a.s.m.r.SolrJmxReporter JMX monitoring for 'solr.node' (registry 'solr.node') enabled at server: com.sun.jmx.mbeanserver.JmxMBeanServer@4a8e8af7
   [junit4]   2> 125880 INFO  (TEST-ChaosMonkeyNothingIsSafeWithPullReplicasTest.test-seed#[5593F8D3D14E3F5C]) [n:127.0.0.1:52106_    ] o.a.s.m.r.SolrJmxReporter JMX monitoring for 'solr.jvm' (registry 'solr.jvm') enabled at server: com.sun.jmx.mbeanserver.JmxMBeanServer@4a8e8af7
   [junit4]   2> 125881 INFO  (TEST-ChaosMonkeyNothingIsSafeWithPullReplicasTest.test-seed#[5593F8D3D14E3F5C]) [n:127.0.0.1:52106_    ] o.a.s.m.r.SolrJmxReporter JMX monitoring for 'solr.jetty' (registry 'solr.jetty') enabled at server: com.sun.jmx.mbeanserver.JmxMBeanServer@4a8e8af7
   [junit4]   2> 125882 INFO  (TEST-ChaosMonkeyNothingIsSafeWithPullReplicasTest.test-seed#[5593F8D3D14E3F5C]) [n:127.0.0.1:52106_    ] o.a.s.c.CorePropertiesLocator Found 0 core definitions underneath /x1/jenkins/jenkins-slave/workspace/Lucene-Solr-Tests-7.x/solr/build/solr-core/test/J2/temp/solr.cloud.ChaosMonkeyNothingIsSafeWithPullReplicasTest_5593F8D3D14E3F5C-001/control-001/cores
   [junit4]   2> 125911 INFO  (TEST-ChaosMonkeyNothingIsSafeWithPullReplicasTest.test-seed#[5593F8D3D14E3F5C]) [    ] o.a.s.c.c.ZkStateReader Updated live nodes from ZooKeeper... (0) -> (1)
   [junit4]   2> 125912 INFO  (TEST-ChaosMonkeyNothingIsSafeWithPullReplicasTest.test-seed#[5593F8D3D14E3F5C]) [    ] o.a.s.c.s.i.ZkClientClusterStateProvider Cluster at 127.0.0.1:46738/solr ready
   [junit4]   2> 125914 INFO  (qtp355098886-1269) [n:127.0.0.1:52106_    ] o.a.s.h.a.CollectionsHandler Invoked Collection Action :create with params replicationFactor=1&collection.configName=conf1&name=control_collection&nrtReplicas=1&action=CREATE&numShards=1&createNodeSet=127.0.0.1:52106_&wt=javabin&version=2 and sendToOCPQueue=true
   [junit4]   2> 125917 INFO  (OverseerThreadFactory-347-thread-1-processing-n:127.0.0.1:52106_) [n:127.0.0.1:52106_    ] o.a.s.c.CreateCollectionCmd Create collection control_collection
   [junit4]   2> 126024 INFO  (qtp355098886-1267) [n:127.0.0.1:52106_    ] o.a.s.h.a.CoreAdminOperation core create command qt=/admin/cores&collection.configName=conf1&newCollection=true&name=control_collection_shard1_replica_n1&action=CREATE&numShards=1&collection=control_collection&shard=shard1&wt=javabin&version=2&replicaType=NRT
   [junit4]   2> 126025 INFO  (qtp355098886-1267) [n:127.0.0.1:52106_    ] o.a.s.c.TransientSolrCoreCacheDefault Allocating transient cache for 4 transient cores
   [junit4]   2> 126135 INFO  (zkCallback-325-thread-2-processing-n:127.0.0.1:52106_) [n:127.0.0.1:52106_    ] o.a.s.c.c.ZkStateReader A cluster state change: [WatchedEvent state:SyncConnected type:NodeDataChanged path:/collections/control_collection/state.json] for collection [control_collection] has occurred - updating... (live nodes size: [1])
   [junit4]   2> 127063 INFO  (qtp355098886-1267) [n:127.0.0.1:52106_ c:control_collection s:shard1  x:control_collection_shard1_replica_n1] o.a.s.c.SolrConfig Using Lucene MatchVersion: 7.1.0
   [junit4]   2> 127239 INFO  (qtp355098886-1267) [n:127.0.0.1:52106_ c:control_collection s:shard1  x:control_collection_shard1_replica_n1] o.a.s.s.IndexSchema [control_collection_shard1_replica_n1] Schema name=test
   [junit4]   2> 127322 INFO  (qtp355098886-1267) [n:127.0.0.1:52106_ c:control_collection s:shard1  x:control_collection_shard1_replica_n1] o.a.s.s.IndexSchema Loaded schema test/1.6 with uniqueid field id
   [junit4]   2> 127343 INFO  (qtp355098886-1267) [n:127.0.0.1:52106_ c:control_collection s:shard1  x:control_collection_shard1_replica_n1] o.a.s.c.CoreContainer Creating SolrCore 'control_collection_shard1_replica_n1' using configuration from collection control_collection, trusted=true
   [junit4]   2> 127344 INFO  (qtp355098886-1267) [n:127.0.0.1:52106_ c:control_collection s:shard1  x:control_collection_shard1_replica_n1] o.a.s.m.r.SolrJmxReporter JMX monitoring for 'solr.core.control_collection.shard1.replica_n1' (registry 'solr.core.control_collection.shard1.replica_n1') enabled at server: com.sun.jmx.mbeanserver.JmxMBeanServer@4a8e8af7
   [junit4]   2> 127350 INFO  (qtp355098886-1267) [n:127.0.0.1:52106_ c:control_collection s:shard1  x:control_collection_shard1_replica_n1] o.a.s.c.SolrCore solr.RecoveryStrategy.Builder
   [junit4]   2> 127350 INFO  (qtp355098886-1267) [n:127.0.0.1:52106_ c:control_collection s:shard1  x:control_collection_shard1_replica_n1] o.a.s.c.SolrCore [[control_collection_shard1_replica_n1] ] Opening new SolrCore at [/x1/jenkins/jenkins-slave/workspace/Lucene-Solr-Tests-7.x/solr/build/solr-core/test/J2/temp/solr.cloud.ChaosMonkeyNothingIsSafeWithPullReplicasTest_5593F8D3D14E3F5C-001/control-001/cores/control_collection_shard1_replica_n1], dataDir=[/x1/jenkins/jenkins-slave/workspace/Lucene-Solr-Tests-7.x/solr/build/solr-core/test/J2/temp/solr.cloud.ChaosMonkeyNothingIsSafeWithPullReplicasTest_5593F8D3D14E3F5C-001/control-001/cores/control_collection_shard1_replica_n1/data/]
   [junit4]   2> 127355 INFO  (qtp355098886-1267) [n:127.0.0.1:52106_ c:control_collection s:shard1  x:control_collection_shard1_replica_n1] o.a.s.u.RandomMergePolicy RandomMergePolicy wrapping class org.apache.lucene.index.LogDocMergePolicy: [LogDocMergePolicy: minMergeSize=1000, mergeFactor=27, maxMergeSize=9223372036854775807, maxMergeSizeForForcedMerge=9223372036854775807, calibrateSizeByDeletes=true, maxMergeDocs=2147483647, maxCFSSegmentSizeMB=8.796093022207999E12, noCFSRatio=0.0]
   [junit4]   2> 127390 WARN  (qtp355098886-1267) [n:127.0.0.1:52106_ c:control_collection s:shard1  x:control_collection_shard1_replica_n1] o.a.s.c.RequestHandlers INVALID paramSet a in requestHandler {type = requestHandler,name = /dump,class = DumpRequestHandler,attributes = {initParams=a, name=/dump, class=DumpRequestHandler},args = {defaults={a=A,b=B}}}
   [junit4]   2> 127476 INFO  (qtp355098886-1267) [n:127.0.0.1:52106_ c:control_collection s:shard1  x:control_collection_shard1_replica_n1] o.a.s.u.UpdateHandler Using UpdateLog implementation: org.apache.solr.update.UpdateLog
   [junit4]   2> 127476 INFO  (qtp355098886-1267) [n:127.0.0.1:52106_ c:control_collection s:shard1  x:control_collection_shard1_replica_n1] o.a.s.u.UpdateLog Initializing UpdateLog: dataDir= defaultSyncLevel=FLUSH numRecordsToKeep=100 maxNumLogsToKeep=10 numVersionBuckets=65536
   [junit4]   2> 127478 INFO  (qtp355098886-1267) [n:127.0.0.1:52106_ c:control_collection s:shard1  x:control_collection_shard1_replica_n1] o.a.s.u.CommitTracker Hard AutoCommit: if uncommited for 15000ms; 
   [junit4]   2> 127478 INFO  (qtp355098886-1267) [n:127.0.0.1:52106_ c:control_collection s:shard1  x:control_collection_shard1_replica_n1] o.a.s.u.CommitTracker Soft AutoCommit: disabled
   [junit4]   2> 127480 INFO  (qtp355098886-1267) [n:127.0.0.1:52106_ c:control_collection s:shard1  x:control_collection_shard1_replica_n1] o.a.s.u.RandomMergePolicy RandomMergePolicy wrapping class org.apache.lucene.index.TieredMergePolicy: [TieredMergePolicy: maxMergeAtOnce=23, maxMergeAtOnceExplicit=29, maxMergedSegmentMB=64.376953125, floorSegmentMB=1.75, forceMergeDeletesPctAllowed=20.321838811054604, segmentsPerTier=47.0, maxCFSSegmentSizeMB=8.796093022207999E12, noCFSRatio=0.6426337359257952
   [junit4]   2> 127482 INFO  (qtp355098886-1267) [n:127.0.0.1:52106_ c:control_collection s:shard1  x:control_collection_shard1_replica_n1] o.a.s.s.SolrIndexSearcher Opening [Searcher@6b78710[control_collection_shard1_replica_n1] main]
   [junit4]   2> 127486 INFO  (qtp355098886-1267) [n:127.0.0.1:52106_ c:control_collection s:shard1  x:control_collection_shard1_replica_n1] o.a.s.r.ManagedResourceStorage Configured ZooKeeperStorageIO with znodeBase: /configs/conf1
   [junit4]   2> 127486 INFO  (qtp355098886-1267) [n:127.0.0.1:52106_ c:control_collection s:shard1  x:control_collection_shard1_replica_n1] o.a.s.r.ManagedResourceStorage Loaded null at path _rest_managed.json using ZooKeeperStorageIO:path=/configs/conf1
   [junit4]   2> 127487 INFO  (qtp355098886-1267) [n:127.0.0.1:52106_ c:control_collection s:shard1  x:control_collection_shard1_replica_n1] o.a.s.h.ReplicationHandler Commits will be reserved for  10000
   [junit4]   2> 127495 INFO  (searcherExecutor-350-thread-1-processing-n:127.0.0.1:52106_ x:control_collection_shard1_replica_n1 s:shard1 c:control_collection) [n:127.0.0.1:52106_ c:control_collection s:shard1  x:control_collection_shard1_replica_n1] o.a.s.c.SolrCore [control_collection_shard1_replica_n1] Registered new searcher Searcher@6b78710[control_collection_shard1_replica_n1] main{ExitableDirectoryReader(UninvertingDirectoryReader())}
   [junit4]   2> 127495 INFO  (qtp355098886-1267) [n:127.0.0.1:52106_ c:control_collection s:shard1  x:control_collection_shard1_replica_n1] o.a.s.u.UpdateLog Could not find max version in index or recent updates, using new clock 1572117776253845504
   [junit4]   2> 127508 INFO  (qtp355098886-1267) [n:127.0.0.1:52106_ c:control_collection s:shard1  x:control_collection_shard1_replica_n1] o.a.s.c.ShardLeaderElectionContext Enough replicas found to continue.
   [junit4]   2> 127509 INFO  (qtp355098886-1267) [n:127.0.0.1:52106_ c:control_collection s:shard1  x:control_collection_shard1_replica_n1] o.a.s.c.ShardLeaderElectionContext I may be the new leader - try and sync
   [junit4]   2> 127509 INFO  (qtp355098886-1267) [n:127.0.0.1:52106_ c:control_collection s:shard1  x:control_collection_shard1_replica_n1] o.a.s.c.SyncStrategy Sync replicas to http://127.0.0.1:52106/control_collection_shard1_replica_n1/
   [junit4]   2> 127509 INFO  (qtp355098886-1267) [n:127.0.0.1:52106_ c:control_collection s:shard1  x:control_collection_shard1_replica_n1] o.a.s.c.SyncStrategy Sync Success - now sync replicas to me
   [junit4]   2> 127509 INFO  (qtp355098886-1267) [n:127.0.0.1:52106_ c:control_collection s:shard1  x:control_collection_shard1_replica_n1] o.a.s.c.SyncStrategy http://127.0.0.1:52106/control_collection_shard1_replica_n1/ has no replicas
   [junit4]   2> 127509 INFO  (qtp355098886-1267) [n:127.0.0.1:52106_ c:control_collection s:shard1  x:control_collection_shard1_replica_n1] o.a.s.c.ShardLeaderElectionContext Found all replicas participating in election, clear LIR
   [junit4]   2> 127513 INFO  (qtp355098886-1267) [n:127.0.0.1:52106_ c:control_collection s:shard1  x:control_collection_shard1_replica_n1] o.a.s.c.ShardLeaderElectionContext I am the new leader: http://127.0.0.1:52106/control_collection_shard1_replica_n1/ shard1
   [junit4]   2> 127616 INFO  (zkCallback-325-thread-2-processing-n:127.0.0.1:52106_) [n:127.0.0.1:52106_    ] o.a.s.c.c.ZkStateReader A cluster state change: [WatchedEvent state:SyncConnected type:NodeDataChanged path:/collections/control_collection/state.json] for collection [control_collection] has occurred - updating... (live nodes size: [1])
   [junit4]   2> 127664 INFO  (qtp355098886-1267) [n:127.0.0.1:52106_ c:control_collection s:shard1  x:control_collection_shard1_replica_n1] o.a.s.c.ZkController I am the leader, no recovery necessary
   [junit4]   2> 127667 INFO  (qtp355098886-1267) [n:127.0.0.1:52106_ c:control_collection s:shard1  x:control_collection_shard1_replica_n1] o.a.s.s.HttpSolrCall [admin] webapp=null path=/admin/cores params={qt=/admin/cores&collection.configName=conf1&newCollection=true&name=control_collection_shard1_replica_n1&action=CREATE&numShards=1&collection=control_collection&shard=shard1&wt=javabin&version=2&replicaType=NRT} status=0 QTime=1642
   [junit4]   2> 127677 INFO  (qtp355098886-1269) [n:127.0.0.1:52106_    ] o.a.s.h.a.CollectionsHandler Wait for new collection to be active for at most 30 seconds. Check all shard replicas
   [junit4]   2> 127777 INFO  (zkCallback-325-thread-1-processing-n:127.0.0.1:52106_) [n:127.0.0.1:52106_    ] o.a.s.c.c.ZkStateReader A cluster state change: [WatchedEvent state:SyncConnected type:NodeDataChanged path:/collections/control_collection/state.json] for collection [control_collection] has occurred - updating... (live nodes size: [1])
   [junit4]   2> 127920 INFO  (OverseerCollectionConfigSetProcessor-98257360854122500-127.0.0.1:52106_-n_0000000000) [n:127.0.0.1:52106_    ] o.a.s.c.OverseerTaskQueue Response ZK path: /overseer/collection-queue-work/qnr-0000000000 doesn't exist.  Requestor may have disconnected from ZooKeeper
   [junit4]   2> 128677 INFO  (qtp355098886-1269) [n:127.0.0.1:52106_    ] o.a.s.s.HttpSolrCall [admin] webapp=null path=/admin/collections params={replicationFactor=1&collection.configName=conf1&name=control_collection&nrtReplicas=1&action=CREATE&numShards=1&createNodeSet=127.0.0.1:52106_&wt=javabin&version=2} status=0 QTime=2763
   [junit4]   2> 128719 INFO  (TEST-ChaosMonkeyNothingIsSafeWithPullReplicasTest.test-seed#[5593F8D3D14E3F5C]) [    ] o.a.s.c.c.ZkStateReader Updated live nodes from ZooKeeper... (0) -> (1)
   [junit4]   2> 128720 INFO  (TEST-ChaosMonkeyNothingIsSafeWithPullReplicasTest.test-seed#[5593F8D3D14E3F5C]) [    ] o.a.s.c.s.i.ZkClientClusterStateProvider Cluster at 127.0.0.1:46738/solr ready
   [junit4]   2> 128720 INFO  (TEST-ChaosMonkeyNothingIsSafeWithPullReplicasTest.test-seed#[5593F8D3D14E3F5C]) [    ] o.a.s.c.ChaosMonkey monkey: init - expire sessions:false cause connection loss:false
   [junit4]   2> 128722 INFO  (qtp355098886-1266) [n:127.0.0.1:52106_    ] o.a.s.h.a.CollectionsHandler Invoked Collection Action :create with params replicationFactor=1&collection.configName=conf1&name=collection1&nrtReplicas=1&action=CREATE&numShards=1&createNodeSet=&stateFormat=1&wt=javabin&version=2 and sendToOCPQueue=true
   [junit4]   2> 128725 INFO  (OverseerThreadFactory-347-thread-2-processing-n:127.0.0.1:52106_) [n:127.0.0.1:52106_    ] o.a.s.c.CreateCollectionCmd Create collection collection1
   [junit4]   2> 128726 WARN  (OverseerThreadFactory-347-thread-2-processing-n:127.0.0.1:52106_) [n:127.0.0.1:52106_    ] o.a.s.c.CreateCollectionCmd It is unusual to create a collection (collection1) without cores.
   [junit4]   2> 128932 INFO  (qtp355098886-1266) [n:127.0.0.1:52106_    ] o.a.s.h.a.CollectionsHandler Wait for new collection to be active for at most 30 seconds. Check all shard replicas
   [junit4]   2> 128932 INFO  (qtp355098886-1266) [n:127.0.0.1:52106_    ] o.a.s.s.HttpSolrCall [admin] webapp=null path=/admin/collections params={replicationFactor=1&collection.configName=conf1&name=collection1&nrtReplicas=1&action=CREATE&numShards=1&createNodeSet=&stateFormat=1&wt=javabin&version=2} status=0 QTime=210
   [junit4]   2> 129079 INFO  (TEST-ChaosMonkeyNothingIsSafeWithPullReplicasTest.test-seed#[5593F8D3D14E3F5C]) [    ] o.a.s.c.AbstractFullDistribZkTestBase create jetty 1 in directory /x1/jenkins/jenkins-slave/workspace/Lucene-Solr-Tests-7.x/solr/build/solr-core/test/J2/temp/solr.cloud.ChaosMonkeyNothingIsSafeWithPullReplicasTest_5593F8D3D14E3F5C-001/shard-1-001 of type TLOG
   [junit4]   2> 129080 INFO  (TEST-ChaosMonkeyNothingIsSafeWithPullReplicasTest.test-seed#[5593F8D3D14E3F5C]) [    ] o.e.j.s.Server jetty-9.3.14.v20161028
   [junit4]   2> 129085 INFO  (TEST-ChaosMonkeyNothingIsSafeWithPullReplicasTest.test-seed#[5593F8D3D14E3F5C]) [    ] o.e.j.s.h.ContextHandler Started o.e.j.s.ServletContextHandler@1da87013{/,null,AVAILABLE}
   [junit4]   2> 129086 INFO  (TEST-ChaosMonkeyNothingIsSafeWithPullReplicasTest.test-seed#[5593F8D3D14E3F5C]) [    ] o.e.j.s.AbstractConnector Started ServerConnector@473cc128{HTTP/1.1,[http/1.1]}{127.0.0.1:48679}
   [junit4]   2> 129086 INFO  (TEST-ChaosMonkeyNothingIsSafeWithPullReplicasTest.test-seed#[5593F8D3D14E3F5C]) [    ] o.e.j.s.Server Started @132213ms
   [junit4]   2> 129086 INFO  (TEST-ChaosMonkeyNothingIsSafeWithPullReplicasTest.test-seed#[5593F8D3D14E3F5C]) [    ] o.a.s.c.s.e.JettySolrRunner Jetty properties: {solr.data.dir=/x1/jenkins/jenkins-slave/workspace/Lucene-Solr-Tests-7.x/solr/build/solr-core/test/J2/temp/solr.cloud.ChaosMonkeyNothingIsSafeWithPullReplicasTest_5593F8D3D14E3F5C-001/tempDir-001/jetty1, replicaType=TLOG, solrconfig=solrconfig.xml, hostContext=/, hostPort=48679, coreRootDirectory=/x1/jenkins/jenkins-slave/workspace/Lucene-Solr-Tests-7.x/solr/build/solr-core/test/J2/temp/solr.cloud.ChaosMonkeyNothingIsSafeWithPullReplicasTest_5593F8D3D14E3F5C-001/shard-1-001/cores}
   [junit4]   2> 129086 ERROR (TEST-ChaosMonkeyNothingIsSafeWithPullReplicasTest.test-seed#[5593F8D3D14E3F5C]) [    ] o.a.s.s.StartupLoggingUtils Missing Java Option solr.log.dir. Logging may be missing or incomplete.
   [junit4]   2> 129086 INFO  (TEST-ChaosMonkeyNothingIsSafeWithPullReplicasTest.test-seed#[5593F8D3D14E3F5C]) [    ] o.a.s.s.SolrDispatchFilter  ___      _       Welcome to Apache Solr? version 7.1.0
   [junit4]   2> 129086 INFO  (TEST-ChaosMonkeyNothingIsSafeWithPullReplicasTest.test-seed#[5593F8D3D14E3F5C]) [    ] o.a.s.s.SolrDispatchFilter / __| ___| |_ _   Starting in cloud mode on port null
   [junit4]   2> 129086 INFO  (TEST-ChaosMonkeyNothingIsSafeWithPullReplicasTest.test-seed#[5593F8D3D14E3F5C]) [    ] o.a.s.s.SolrDispatchFilter \__ \/ _ \ | '_|  Install dir: null, Default config dir: null
   [junit4]   2> 129087 INFO  (TEST-ChaosMonkeyNothingIsSafeWithPullReplicasTest.test-seed#[5593F8D3D14E3F5C]) [    ] o.a.s.s.SolrDispatchFilter |___/\___/_|_|    Start time: 2017-07-05T20:59:07.171Z
   [junit4]   2> 129096 INFO  (TEST-ChaosMonkeyNothingIsSafeWithPullReplicasTest.test-seed#[5593F8D3D14E3F5C]) [    ] o.a.s.s.SolrDispatchFilter Loading solr.xml from SolrHome (not found in ZooKeeper)
   [junit4]   2> 129096 INFO  (TEST-ChaosMonkeyNothingIsSafeWithPullReplicasTest.test-seed#[5593F8D3D14E3F5C]) [    ] o.a.s.c.SolrXmlConfig Loading container configuration from /x1/jenkins/jenkins-slave/workspace/Lucene-Solr-Tests-7.x/solr/build/solr-core/test/J2/temp/solr.cloud.ChaosMonkeyNothingIsSafeWithPullReplicasTest_5593F8D3D14E3F5C-001/shard-1-001/solr.xml
   [junit4]   2> 129102 INFO  (TEST-ChaosMonkeyNothingIsSafeWithPullReplicasTest.test-seed#[5593F8D3D14E3F5C]) [    ] o.a.s.c.SolrXmlConfig MBean server found: com.sun.jmx.mbeanserver.JmxMBeanServer@4a8e8af7, but no JMX reporters were configured - adding default JMX reporter.
   [junit4]   2> 129260 INFO  (TEST-ChaosMonkeyNothingIsSafeWithPullReplicasTest.test-seed#[5593F8D3D14E3F5C]) [    ] o.a.s.c.ZkContainer Zookeeper client=127.0.0.1:46738/solr
   [junit4]   2> 129287 INFO  (TEST-ChaosMonkeyNothingIsSafeWithPullReplicasTest.test-seed#[5593F8D3D14E3F5C]) [n:127.0.0.1:48679_    ] o.a.s.c.c.ZkStateReader Updated live nodes from ZooKeeper... (0) -> (1)
   [junit4]   2> 129289 INFO  (TEST-ChaosMonkeyNothingIsSafeWithPullReplicasTest.test-seed#[5593F8D3D14E3F5C]) [n:127.0.0.1:48679_    ] o.a.s.c.Overseer Overseer (id=null) closing
   [junit4]   2> 129291 INFO  (TEST-ChaosMonkeyNothingIsSafeWithPullReplicasTest.test-seed#[5593F8D3D14E3F5C]) [n:127.0.0.1:48679_    ] o.a.s.c.ZkController Register node as live in ZooKeeper:/live_nodes/127.0.0.1:48679_
   [junit4]   2> 129293 INFO  (zkCallback-325-thread-1-processing-n:127.0.0.1:52106_) [n:127.0.0.1:52106_    ] o.a.s.c.c.ZkStateReader Updated live nodes from ZooKeeper... (1) -> (2)
   [junit4]   2> 129293 INFO  (zkCallback-332-thread-1) [    ] o.a.s.c.c.ZkStateReader Updated live nodes from ZooKeeper... (1) -> (2)
   [junit4]   2> 129313 INFO  (zkCallback-337-thread-1-processing-n:127.0.0.1:48679_) [n:127.0.0.1:48679_    ] o.a.s.c.c.ZkStateReader Updated live nodes from ZooKeeper... (1) -> (2)
   [junit4]   2> 129425 INFO  (TEST-ChaosMonkeyNothingIsSafeWithPullReplicasTest.test-seed#[5593F8D3D14E3F5C]) [n:127.0.0.1:48679_    ] o.a.s.m.r.SolrJmxReporter JMX monitoring for 'solr.node' (registry 'solr.node') enabled at server: com.sun.jmx.mbeanserver.JmxMBeanServer@4a8e8af7
   [junit4]   2> 129436 INFO  (TEST-ChaosMonkeyNothingIsSafeWithPullReplicasTest.test-seed#[5593F8D3D14E3F5C]) [n:127.0.0.1:48679_    ] o.a.s.m.r.SolrJmxReporter JMX monitoring for 'solr.jvm' (registry 'solr.jvm') enabled at server: com.sun.jmx.mbeanserver.JmxMBeanServer@4a8e8af7
   [junit4]   2> 129436 INFO  (TEST-ChaosMonkeyNothingIsSafeWithPullReplicasTest.test-seed#[5593F8D3D14E3F5C]) [n:127.0.0.1:48679_    ] o.a.s.m.r.SolrJmxReporter JMX monitoring for 'solr.jetty' (registry 'solr.jetty') enabled at server: com.sun.jmx.mbeanserver.JmxMBeanServer@4a8e8af7
   [junit4]   2> 129438 INFO  (TEST-ChaosMonkeyNothingIsSafeWithPullReplicasTest.test-seed#[5593F8D3D14E3F5C]) [n:127.0.0.1:48679_    ] o.a.s.c.CorePropertiesLocator Found 0 core definitions underneath /x1/jenkins/jenkins-slave/workspace/Lucene-Solr-Tests-7.x/solr/build/solr-core/test/J2/temp/solr.cloud.ChaosMonkeyNothingIsSafeWithPullReplicasTest_5593F8D3D14E3F5C-001/shard-1-001/cores
   [junit4]   2> 129477 INFO  (qtp1344339448-1311) [n:127.0.0.1:48679_    ] o.a.s.h.a.CollectionsHandler Invoked Collection Action :addreplica with params node=127.0.0.1:48679_&action=ADDREPLICA&collection=collection1&shard=shard1&type=TLOG&wt=javabin&version=2 and sendToOCPQueue=true
   [junit4]   2> 129485 INFO  (OverseerCollectionConfigSetProcessor-98257360854122500-127.0.0.1:52106_-n_0000000000) [n:127.0.0.1:52106_    ] o.a.s.c.OverseerTaskQueue Response ZK path: /overseer/collection-queue-work/qnr-0000000002 doesn't exist.  Requestor may have disconnected from ZooKeeper
   [junit4]   2> 129490 INFO  (OverseerThreadFactory-347-thread-3-processing-n:127.0.0.1:52106_) [n:127.0.0.1:52106_    ] o.a.s.c.AddReplicaCmd Node Identified 127.0.0.1:48679_ for creating new replica
   [junit4]   2> 129493 INFO  (qtp1344339448-1309) [n:127.0.0.1:48679_    ] o.a.s.h.a.CoreAdminOperation core create command qt=/admin/cores&collection.configName=conf1&name=collection1_shard1_replica_t0&action=CREATE&collection=collection1&shard=shard1&wt=javabin&version=2&replicaType=TLOG
   [junit4]   2> 129493 INFO  (qtp1344339448-1309) [n:127.0.0.1:48679_    ] o.a.s.c.TransientSolrCoreCacheDefault Allocating transient cache for 4 transient cores
   [junit4]   2> 130530 INFO  (qtp1344339448-1309) [n:127.0.0.1:48679_ c:collection1 s:shard1  x:collection1_shard1_replica_t0] o.a.s.c.SolrConfig Using Lucene MatchVersion: 7.1.0
   [junit4]   2> 130548 INFO  (qtp1344339448-1309) [n:127.0.0.1:48679_ c:collection1 s:shard1  x:collection1_shard1_replica_t0] o.a.s.s.IndexSchema [collection1_shard1_replica_t0] Schema name=test
   [junit4]   2> 130678 INFO  (qtp1344339448-1309) [n:127.0.0.1:48679_ c:collection1 s:shard1  x:collection1_shard1_replica_t0] o.a.s.s.IndexSchema Loaded schema test/1.6 with uniqueid field id
   [junit4]   2> 130715 INFO  (qtp1344339448-1309) [n:127.0.0.1:48679_ c:collection1 s:shard1  x:collection1_shard1_replica_t0] o.a.s.c.CoreContainer Creating SolrCore 'collection1_shard1_replica_t0' using configuration from collection collection1, trusted=true
   [junit4]   2> 130716 INFO  (qtp1344339448-1309) [n:127.0.0.1:48679_ c:collection1 s:shard1  x:collection1_shard1_replica_t0] o.a.s.m.r.SolrJmxReporter JMX monitoring for 'solr.core.collection1.shard1.replica_t0' (registry 'solr.core.collection1.shard1.replica_t0') enabled at server: com.sun.jmx.mbeanserver.JmxMBeanServer@4a8e8af7
   [junit4]   2> 130717 INFO  (qtp1344339448-1309) [n:127.0.0.1:48679_ c:collection1 s:shard1  x:collection1_shard1_replica_t0] o.a.s.c.SolrCore solr.RecoveryStrategy.Builder
   [junit4]   2> 130717 INFO  (qtp1344339448-1309) [n:127.0.0.1:48679_ c:collection1 s:shard1  x:collection1_shard1_replica_t0] o.a.s.c.SolrCore [[collection1_shard1_replica_t0] ] Opening new SolrCore at [/x1/jenkins/jenkins-slave/workspace/Lucene-Solr-Tests-7.x/solr/build/solr-core/test/J2/temp/solr.cloud.ChaosMonkeyNothingIsSafeWithPullReplicasTest_5593F8D3D14E3F5C-001/shard-1-001/cores/collection1_shard1_replica_t0], dataDir=[/x1/jenkins/jenkins-slave/workspace/Lucene-Solr-Tests-7.x/solr/build/solr-core/test/J2/temp/solr.cloud.ChaosMonkeyNothingIsSafeWithPullReplicasTest_5593F8D3D14E3F5C-001/shard-1-001/cores/collection1_shard1_replica_t0/data/]
   [junit4]   2> 130721 INFO  (qtp1344339448-1309) [n:127.0.0.1:48679_ c:collection1 s:shard1  x:collection1_shard1_replica_t0] o.a.s.u.RandomMergePolicy RandomMergePolicy wrapping class org.apache.lucene.index.LogDocMergePolicy: [LogDocMergePolicy: minMergeSize=1000, mergeFactor=27, maxMergeSize=9223372036854775807, maxMergeSizeForForcedMerge=9223372036854775807, calibrateSizeByDeletes=true, maxMergeDocs=2147483647, maxCFSSegmentSizeMB=8.796093022207999E12, noCFSRatio=0.0]
   [junit4]   2> 130741 WARN  (qtp1344339448-1309) [n:127.0.0.1:48679_ c:collection1 s:shard1  x:collection1_shard1_replica_t0] o.a.s.c.RequestHandlers INVALID paramSet a in requestHandler {type = requestHandler,name = /dump,class = DumpRequestHandler,attributes = {initParams=a, name=/dump, class=DumpRequestHandler},args = {defaults={a=A,b=B}}}
   [junit4]   2> 130905 INFO  (qtp1344339448-1309) [n:127.0.0.1:48679_ c:collection1 s:shard1  x:collection1_shard1_replica_t0] o.a.s.u.UpdateHandler Using UpdateLog implementation: org.apache.solr.update.UpdateLog
   [junit4]   2> 130906 INFO  (qtp1344339448-1309) [n:127.0.0.1:48679_ c:collection1 s:shard1  x:collection1_shard1_replica_t0] o.a.s.u.UpdateLog Initializing UpdateLog: dataDir= defaultSyncLevel=FLUSH numRecordsToKeep=100 maxNumLogsToKeep=10 numVersionBuckets=65536
   [junit4]   2> 130907 INFO  (qtp1344339448-1309) [n:127.0.0.1:48679_ c:collection1 s:shard1  x:collection1_shard1_replica_t0] o.a.s.u.CommitTracker Hard AutoCommit: if uncommited for 15000ms; 
   [junit4]   2> 130907 INFO  (qtp1344339448-1309) [n:127.0.0.1:48679_ c:collection1 s:shard1  x:collection1_shard1_replica_t0] o.a.s.u.CommitTracker Soft AutoCommit: disabled
   [junit4]   2> 130909 INFO  (qtp1344339448-1309) [n:127.0.0.1:48679_ c:collection1 s:shard1  x:collection1_shard1_replica_t0] o.a.s.u.RandomMergePolicy RandomMergePolicy wrapping class org.apache.lucene.index.TieredMergePolicy: [TieredMergePolicy: maxMergeAtOnce=23, maxMergeAtOnceExplicit=29, maxMergedSegmentMB=64.376953125, floorSegmentMB=1.75, forceMergeDeletesPctAllowed=20.321838811054604, segmentsPerTier=47.0, maxCFSSegmentSizeMB=8.796093022207999E12, noCFSRatio=0.6426337359257952
   [junit4]   2> 130910 INFO  (qtp1344339448-1309) [n:127.0.0.1:48679_ c:collection1 s:shard1  x:collection1_shard1_replica_t0] o.a.s.s.SolrIndexSearcher Opening [Searcher@3bfa2f0b[collection1_shard1_replica_t0] main]
   [junit4]   2> 130912 INFO  (qtp1344339448-1309) [n:127.0.0.1:48679_ c:collection1 s:shard1  x:collection1_shard1_replica_t0] o.a.s.r.ManagedResourceStorage Configured ZooKeeperStorageIO with znodeBase: /configs/conf1
   [junit4]   2> 130912 INFO  (qtp1344339448-1309) [n:127.0.0.1:48679_ c:collection1 s:shard1  x:collection1_shard1_replica_t0] o.a.s.r.ManagedResourceStorage Loaded null at path _rest_managed.json using ZooKeeperStorageIO:path=/configs/conf1
   [junit4]   2> 130913 INFO  (qtp1344339448-1309) [n:127.0.0.1:48679_ c:collection1 s:shard1  x:collection1_shard1_replica_t0] o.a.s.h.ReplicationHandler Commits will be reserved for  10000
   [junit4]   2> 130915 INFO  (searcherExecutor-361-thread-1-processing-n:127.0.0.1:48679_ x:collection1_shard1_replica_t0 s:shard1 c:collection1) [n:127.0.0.1:48679_ c:collection1 s:shard1  x:collection1_shard1_replica_t0] o.a.s.c.SolrCore [collection1_shard1_replica_t0] Registered new searcher Searcher@3bfa2f0b[collection1_shard1_replica_t0] main{ExitableDirectoryReader(UninvertingDirectoryReader())}
   [junit4]   2> 130916 INFO  (qtp1344339448-1309) [n:127.0.0.1:48679_ c:collection1 s:shard1  x:collection1_shard1_replica_t0] o.a.s.u.UpdateLog Could not find max version in index or recent updates, using new clock 1572117779841024000
   [junit4]   2> 130927 INFO  (qtp1344339448-1309) [n:127.0.0.1:48679_ c:collection1 s:shard1  x:collection1_shard1_replica_t0] o.a.s.c.ShardLeaderElectionContext Enough replicas found to continue.
   [junit4]   2> 130927 INFO  (qtp1344339448-1309) [n:127.0.0.1:48679_ c:collection1 s:shard1  x:collection1_shard1_replica_t0] o.a.s.c.ShardLeaderElectionContext I may be the new leader - try and sync
   [junit4]   2> 130927 INFO  (qtp1344339448-1309) [n:127.0.0.1:48679_ c:collection1 s:shard1  x:collection1_shard1_replica_t0] o.a.s.c.SyncStrategy Sync replicas to http://127.0.0.1:48679/collection1_shard1_replica_t0/
   [junit4]   2> 130927 INFO  (qtp1344339448-1309) [n:127.0.0.1:48679_ c:collection1 s:shard1  x:collection1_shard1_replica_t0] o.a.s.c.SyncStrategy Sync Success - now sync replicas to me
   [junit4]   2> 130927 INFO  (qtp1344339448-1309) [n:127.0.0.1:48679_ c:collection1 s:shard1  x:collection1_shard1_replica_t0] o.a.s.c.SyncStrategy http://127.0.0.1:48679/collection1_shard1_replica_t0/ has no replicas
   [junit4]   2> 130927 INFO  (qtp1344339448-1309) [n:127.0.0.1:48679_ c:collection1 s:shard1  x:collection1_shard1_replica_t0] o.a.s.c.ShardLeaderElectionContext Found all replicas participating in election, clear LIR
   [junit4]   2> 130928 INFO  (qtp1344339448-1309) [n:127.0.0.1:48679_ c:collection1 s:shard1  x:collection1_shard1_replica_t0] o.a.s.c.ZkController collection1_shard1_replica_t0 stopping background replication from leader
   [junit4]   2> 130933 INFO  (qtp1344339448-1309) [n:127.0.0.1:48679_ c:collection1 s:shard1  x:collection1_shard1_replica_t0] o.a.s.c.ShardLeaderElectionContext I am the new leader: http://127.0.0.1:48679/collection1_shard1_replica_t0/ shard1
   [junit4]   2> 131084 INFO  (qtp1344339448-1309) [n:127.0.0.1:48679_ c:collection1 s:shard1  x:collection1_shard1_replica_t0] o.a.s.c.ZkController I am the leader, no recovery necessary
   [junit4]   2> 131087 INFO  (qtp1344339448-1309) [n:127.0.0.1:48679_ c:collection1 s:shard1  x:collection1_shard1_replica_t0] o.a.s.s.HttpSolrCall [admin] webapp=null path=/admin/cores params={qt=/admin/cores&collection.configName=conf1&name=collection1_shard1_replica_t0&action=CREATE&collection=collection1&shard=shard1&wt=javabin&version=2&replicaType=TLOG} status=0 QTime=1595
   [junit4]   2> 131095 INFO  (qtp1344339448-1311) [n:127.0.0.1:48679_    ] o.a.s.s.HttpSolrCall [admin] webapp=null path=/admin/collections params={node=127.0.0.1:48679_&action=ADDREPLICA&collection=collection1&shard=shard1&type=TLOG&wt=javabin&version=2} status=0 QTime=1618
   [junit4]   2> 131395 INFO  (TEST-ChaosMonkeyNothingIsSafeWithPullReplicasTest.test-seed#[5593F8D3D14E3F5C]) [    ] o.a.s.c.AbstractFullDistribZkTestBase create jetty 2 in directory /x1/jenkins/jenkins-slave/workspace/Lucene-Solr-Tests-7.x/solr/build/solr-core/test/J2/temp/solr.cloud.ChaosMonkeyNothingIsSafeWithPullReplicasTest_5593F8D3D14E3F5C-001/shard-2-001 of type TLOG
   [junit4]   2> 131395 INFO  (TEST-ChaosMonkeyNothingIsSafeWithPullReplicasTest.test-seed#[5593F8D3D14E3F5C]) [    ] o.e.j.s.Server jetty-9.3.14.v20161028
   [junit4]   2> 131397 INFO  (TEST-ChaosMonkeyNothingIsSafeWithPullReplicasTest.test-seed#[5593F8D3D14E3F5C]) [    ] o.e.j.s.h.ContextHandler Started o.e.j.s.ServletContextHandler@91115b7{/,null,AVAILABLE}
   [junit4]   2> 131397 INFO  (TEST-ChaosMonkeyNothingIsSafeWithPullReplicasTest.test-seed#[5593F8D3D14E3F5C]) [    ] o.e.j.s.AbstractConnector Started ServerConnector@425df432{HTTP/1.1,[http/1.1]}{127.0.0.1:43828}
   [junit4]   2> 131397 INFO  (TEST-ChaosMonkeyNothingIsSafeWithPullReplicasTest.test-seed#[5593F8D3D14E3F5C]) [    ] o.e.j.s.Server Started @134525ms
   [junit4]   2> 131397 INFO  (TEST-ChaosMonkeyNothingIsSafeWithPullReplicasTest.test-seed#[5593F8D3D14E3F5C]) [    ] o.a.s.c.s.e.JettySolrRunner Jetty properties: {solr.data.dir=/x1/jenkins/jenkins-slave/workspace/Lucene-Solr-Tests-7.x/solr/build/solr-core/test/J2/temp/solr.cloud.ChaosMonkeyNothingIsSafeWithPullReplicasTest_5593F8D3D14E3F5C-001/tempDir-001/jetty2, replicaType=TLOG, solrconfig=solrconfig.xml, hostContext=/, hostPort=43828, coreRootDirectory=/x1/jenkins/jenkins-slave/workspace/Lucene-Solr-Tests-7.x/solr/build/solr-core/test/J2/../../../../../../../../../../x1/jenkins/jenkins-slave/workspace/Lucene-Solr-Tests-7.x/solr/build/solr-core/test/J2/temp/solr.cloud.ChaosMonkeyNothingIsSafeWithPullReplicasTest_5593F8D3D14E3F5C-001/shard-2-001/cores}
   [junit4]   2> 131398 ERROR (TEST-ChaosMonkeyNothingIsSafeWithPullReplicasTest.test-seed#[5593F8D3D14E3F5C]) [    ] o.a.s.s.StartupLoggingUtils Missing Java Option solr.log.dir. Logging may be missing or incomplete.
   [junit4]   2> 131399 INFO  (TEST-ChaosMonkeyNothingIsSafeWithPullReplicasTest.test-seed#[5593F8D3D14E3F5C]) [    ] o.a.s.s.SolrDispatchFilter  ___      _       Welcome to Apache Solr? version 7.1.0
   [junit4]   2> 131399 INFO  (TEST-ChaosMonkeyNothingIsSafeWithPullReplicasTest.test-seed#[5593F8D3D14E3F5C]) [    ] o.a.s.s.SolrDispatchFilter / __| ___| |_ _   Starting in cloud mode on port null
   [junit4]   2> 131399 INFO  (TEST-ChaosMonkeyNothingIsSafeWithPullReplicasTest.test-seed#[5593F8D3D14E3F5C]) [    ] o.a.s.s.SolrDispatchFilter \__ \/ _ \ | '_|  Install dir: null, Default config dir: null
   [junit4]   2> 131399 INFO  (TEST-ChaosMonkeyNothingIsSafeWithPullReplicasTest.test-seed#[5593F8D3D14E3F5C]) [    ] o.a.s.s.SolrDispatchFilter |___/\___/_|_|    Start time: 2017-07-05T20:59:09.483Z
   [junit4]   2> 131445 INFO  (TEST-ChaosMonkeyNothingIsSafeWithPullReplicasTest.test-seed#[5593F8D3D14E3F5C]) [    ] o.a.s.s.SolrDispatchFilter Loading solr.xml from SolrHome (not found in ZooKeeper)
   [junit4]   2> 131445 INFO  (TEST-ChaosMonkeyNothingIsSafeWithPullReplicasTest.test-seed#[5593F8D3D14E3F5C]) [    ] o.a.s.c.SolrXmlConfig Loading container configuration from /x1/jenkins/jenkins-slave/workspace/Lucene-Solr-Tests-7.x/solr/build/solr-core/test/J2/temp/solr.cloud.ChaosMonkeyNothingIsSafeWithPullReplicasTest_5593F8D3D14E3F5C-001/shard-2-001/solr.xml
   [junit4]   2> 131453 INFO  (TEST-ChaosMonkeyNothingIsSafeWithPullReplicasTest.test-seed#[5593F8D3D14E3F5C]) [    ] o.a.s.c.SolrXmlConfig MBean server found: com.sun.jmx.mbeanserver.JmxMBeanServer@4a8e8af7, but no JMX reporters were configured - adding default JMX reporter.
   [junit4]   2> 131463 INFO  (TEST-ChaosMonkeyNothingIsSafeWithPullReplicasTest.test-seed#[5593F8D3D14E3F5C]) [    ] o.a.s.c.ZkContainer Zookeeper client=127.0.0.1:46738/solr
   [junit4]   2> 131484 INFO  (TEST-ChaosMonkeyNothingIsSafeWithPullReplicasTest.test-seed#[5593F8D3D14E3F5C]) [n:127.0.0.1:43828_    ] o.a.s.c.c.ZkStateReader Updated live nodes from ZooKeeper... (0) -> (2)
   [junit4]   2> 131487 INFO  (OverseerCollectionConfigSetProcessor-98257360854122500-127.0.0.1:52106_-n_0000000000) [n:127.0.0.1:52106_    ] o.a.s.c.OverseerTaskQueue Response ZK path: /overseer/collection-queue-work/qnr-0000000004 doesn't exist.  Requestor may have disconnected from ZooKeeper
   [junit4]   2> 131489 INFO  (TEST-ChaosMonkeyNothingIsSafeWithPullReplicasTest.test-seed#[5593F8D3D14E3F5C]) [n:127.0.0.1:43828_    ] o.a.s.c.Overseer Overseer (id=null) closing
   [junit4]   2> 131491 INFO  (TEST-ChaosMonkeyNothingIsSafeWithPullReplicasTest.test-seed#[5593F8D3D14E3F5C]) [n:127.0.0.1:43828_    ] o.a.s.c.ZkController Register node as live in ZooKeeper:/live_nodes/127.0.0.1:43828_
   [junit4]   2> 131493 INFO  (zkCallback-325-thread-1-processing-n:127.0.0.1:52106_) [n:127.0.0.1:52106_    ] o.a.s.c.c.ZkStateReader Updated live nodes from ZooKeeper... (2) -> (3)
   [junit4]   2> 131493 INFO  (zkCallback-332-thread-1) [    ] o.a.s.c.c.ZkStateReader Updated live nodes from ZooKeeper... (2) -> (3)
   [junit4]   2> 131493 INFO  (zkCallback-337-thread-1-processing-n:127.0.0.1:48679_) [n:127.0.0.1:48679_    ] o.a.s.c.c.ZkStateReader Updated live nodes from ZooKeeper... (2) -> (3)
   [junit4]   2> 131505 INFO  (zkCallback-343-thread-1-processing-n:127.0.0.1:43828_) [n:127.0.0.1:43828_    ] o.a.s.c.c.ZkStateReader Updated live nodes from ZooKeeper... (2) -> (3)
   [junit4]   2> 131658 INFO  (TEST-ChaosMonkeyNothingIsSafeWithPullReplicasTest.test-seed#[5593F8D3D14E3F5C]) [n:127.0.0.1:43828_    ] o.a.s.m.r.SolrJmxReporter JMX monitoring for 'solr.node' (registry 'solr.node') enabled at server: com.sun.jmx.mbeanserver.JmxMBeanServer@4a8e8af7
   [junit4]   2> 131678 INFO  (TEST-ChaosMonkeyNothingIsSafeWithPullReplicasTest.test-seed#[5593F8D3D14E3F5C]) [n:127.0.0.1:43828_    ] o.a.s.m.r.SolrJmxReporter JMX monitoring for 'solr.jvm' (registry 'solr.jvm') enabled at server: com.sun.jmx.mbeanserver.JmxMBeanServer@4a8e8af7
   [junit4]   2> 131678 INFO  (TEST-ChaosMonkeyNothingIsSafeWithPullReplicasTest.test-seed#[5593F8D3D14E3F5C]) [n:127.0.0.1:43828_    ] o.a.s.m.r.SolrJmxReporter JMX monitoring for 'solr.jetty' (registry 'solr.jetty') enabled at server: com.sun.jmx.mbeanserver.JmxMBeanServer@4a8e8af7
   [junit4]   2> 131680 INFO  (TEST-ChaosMonkeyNothingIsSafeWithPullReplicasTest.test-seed#[5593F8D3D14E3F5C]) [n:127.0.0.1:43828_    ] o.a.s.c.CorePropertiesLocator Found 0 core definitions underneath /x1/jenkins/jenkins-slave/workspace/Lucene-Solr-Tests-7.x/solr/build/solr-core/test/J2/../../../../../../../../../../x1/jenkins/jenkins-slave/workspace/Lucene-Solr-Tests-7.x/solr/build/solr-core/test/J2/temp/solr.cloud.ChaosMonkeyNothingIsSafeWithPullReplicasTest_5593F8D3D14E3F5C-001/shard-2-001/cores
   [junit4]   2> 131767 INFO  (qtp1344339448-1312) [n:127.0.0.1:48679_    ] o.a.s.h.a.CollectionsHandler Invoked Collection Action :addreplica with params node=127.0.0.1:43828_&action=ADDREPLICA&collection=collection1&shard=shard1&type=TLOG&wt=javabin&version=2 and sendToOCPQueue=true
   [junit4]   2> 131774 INFO  (OverseerThreadFactory-347-thread-4-processing-n:127.0.0.1:52106_) [n:127.0.0.1:52106_    ] o.a.s.c.AddReplicaCmd Node Identified 127.0.0.1:43828_ for creating new replica
   [junit4]   2> 131778 INFO  (qtp1529475204-1340) [n:127.0.0.1:43828_    ] o.a.s.h.a.CoreAdminOperation core create command qt=/admin/cores&collection.configName=conf1&name=collection1_shard1_replica_t1&action=CREATE&collection=collection1&shard=shard1&wt=javabin&version=2&replicaType=TLOG
   [junit4]   2> 131778 INFO  (qtp1529475204-1340) [n:127.0.0.1:43828_    ] o.a.s.c.TransientSolrCoreCacheDefault Allocating transient cache for 4 transient cores
   [junit4]   2> 132820 INFO  (qtp1529475204-1340) [n:127.0.0.1:43828_ c:collection1 s:shard1  x:collection1_shard1_replica_t1] o.a.s.c.SolrConfig Using Lucene MatchVersion: 7.1.0
   [junit4]   2> 132855 INFO  (qtp1529475204-1340) [n:127.0.0.1:43828_ c:collection1 s:shard1  x:collection1_shard1_replica_t1] o.a.s.s.IndexSchema [collection1_shard1_replica_t1] Schema name=test
   [junit4]   2> 132978 INFO  (qtp1529475204-1340) [n:127.0.0.1:43828_ c:collection1 s:shard1  x:collection1_shard1_replica_t1] o.a.s.s.IndexSchema Loaded schema test/1.6 with uniqueid field id
   [junit4]   2> 133034 INFO  (qtp1529475204-1340) [n:127.0.0.1:43828_ c:collection1 s:shard1  x:collection1_shard1_replica_t1] o.a.s.c.CoreContainer Creating SolrCore 'collection1_shard1_replica_t1' using configuration from collection collection1, trusted=true
   [junit4]   2> 133035 INFO  (qtp1529475204-1340) [n:127.0.0.1:43828_ c:collection1 s:shard1  x:collection1_shard1_replica_t1] o.a.s.m.r.SolrJmxReporter JMX monitoring for 'solr.core.collection1.shard1.replica_t1' (registry 'solr.core.collection1.shard1.replica_t1') enabled at server: com.sun.jmx.mbeanserver.JmxMBeanServer@4a8e8af7
   [junit4]   2> 133035 INFO  (qtp1529475204-1340) [n:127.0.0.1:43828_ c:collection1 s:shard1  x:collection1_shard1_replica_t1] o.a.s.c.SolrCore solr.RecoveryStrategy.Builder
   [junit4]   2> 133035 INFO  (qtp1529475204-1340) [n:127.0.0.1:43828_ c:collection1 s:shard1  x:collection1_shard1_replica_t1] o.a.s.c.SolrCore [[collection1_shard1_replica_t1] ] Opening new SolrCore at [/x1/jenkins/jenkins-slave/workspace/Lucene-Solr-Tests-7.x/solr/build/solr-core/test/J2/temp/solr.cloud.ChaosMonkeyNothingIsSafeWithPullReplicasTest_5593F8D3D14E3F5C-001/shard-2-001/cores/collection1_shard1_replica_t1], dataDir=[/x1/jenkins/jenkins-slave/workspace/Lucene-Solr-Tests-7.x/solr/build/solr-core/test/J2/../../../../../../../../../../x1/jenkins/jenkins-slave/workspace/Lucene-Solr-Tests-7.x/solr/build/solr-core/test/J2/temp/solr.cloud.ChaosMonkeyNothingIsSafeWithPullReplicasTest_5593F8D3D14E3F5C-001/shard-2-001/cores/collection1_shard1_replica_t1/data/]
   [junit4]   2> 133040 INFO  (qtp1529475204-1340) [n:127.0.0.1:43828_ c:collection1 s:shard1  x:collection1_shard1_replica_t1] o.a.s.u.RandomMergePolicy RandomMergePolicy wrapping class org.apache.lucene.index.LogDocMergePolicy: [LogDocMergePolicy: minMergeSize=1000, mergeFactor=27, maxMergeSize=9223372036854775807, maxMergeSizeForForcedMerge=9223372036854775807, calibrateSizeByDeletes=true, maxMergeDocs=2147483647, maxCFSSegmentSizeMB=8.796093022207999E12, noCFSRatio=0.0]
   [junit4]   2> 133074 WARN  (qtp1529475204-1340) [n:127.0.0.1:43828_ c:collection1 s:shard1  x:collection1_shard1_replica_t1] o.a.s.c.RequestHandlers INVALID paramSet a in requestHandler {type = requestHandler,name = /dump,class = DumpRequestHandler,attributes = {initParams=a, name=/dump, class=DumpRequestHandler},args = {defaults={a=A,b=B}}}
   [junit4]   2> 133147 INFO  (qtp1529475204-1340) [n:127.0.0.1:43828_ c:collection1 s:shard1  x:collection1_shard1_replica_t1] o.a.s.u.UpdateHandler Using UpdateLog implementation: org.apache.solr.update.UpdateLog
   [junit4]   2> 133147 INFO  (qtp1529475204-1340) [n:127.0.0.1:43828_ c:collection1 s:shard1  x:collection1_shard1_replica_t1] o.a.s.u.UpdateLog Initializing UpdateLog: dataDir= defaultSyncLevel=FLUSH numRecordsToKeep=100 maxNumLogsToKeep=10 numVersionBuckets=65536
   [junit4]   2> 133148 INFO  (qtp1529475204-1340) [n:127.0.0.1:43828_ c:collection1 s:shard1  x:collection1_shard1_replica_t1] o.a.s.u.CommitTracker Hard AutoCommit: if uncommited for 15000ms; 
   [junit4]   2> 133148 INFO  (qtp1529475204-1340) [n:127.0.0.1:43828_ c:collection1 s:shard1  x:collection1_shard1_replica_t1] o.a.s.u.CommitTracker Soft AutoCommit: disabled
   [junit4]   2> 133150 INFO  (qtp1529475204-1340) [n:127.0.0.1:43828_ c:collection1 s:shard1  x:collection1_shard1_replica_t1] o.a.s.u.RandomMergePolicy RandomMergePolicy wrapping class org.apache.lucene.index.TieredMergePolicy: [TieredMergePolicy: maxMergeAtOnce=23, maxMergeAtOnceExplicit=29, maxMergedSegmentMB=64.376953125, floorSegmentMB=1.75, forceMergeDeletesPctAllowed=20.321838811054604, segmentsPerTier=47.0, maxCFSSegmentSizeMB=8.796093022207999E12, noCFSRatio=0.6426337359257952
   [junit4]   2> 133151 INFO  (qtp1529475204-1340) [n:127.0.0.1:43828_ c:collection1 s:shard1  x:collection1_shard1_replica_t1] o.a.s.s.SolrIndexSearcher Opening [Searcher@6817215f[collection1_shard1_replica_t1] main]
   [junit4]   2> 133152 INFO  (qtp1529475204-1340) [n:127.0.0.1:43828_ c:collection1 s:shard1  x:collection1_shard1_replica_t1] o.a.s.r.ManagedResourceStorage Configured ZooKeeperStorageIO with znodeBase: /configs/conf1
   [junit4]   2> 133153 INFO  (qtp1529475204-1340) [n:127.0.0.1:43828_ c:collection1 s:shard1  x:collection1_shard1_replica_t1] o.a.s.r.ManagedResourceStorage Loaded null at path _rest_managed.json using ZooKeeperStorageIO:path=/configs/conf1
   [junit4]   2> 133154 INFO  (qtp1529475204-1340) [n:127.0.0.1:43828_ c:collection1 s:shard1  x:collection1_shard1_replica_t1] o.a.s.h.ReplicationHandler Commits will be reserved for  10000
   [junit4]   2> 133154 INFO  (qtp1529475204-1340) [n:127.0.0.1:43828_ c:collection1 s:shard1  x:collection1_shard1_replica_t1] o.a.s.u.UpdateLog Could not find max version in index or recent updates, using new clock 1572117782187737088
   [junit4]   2> 133162 INFO  (searcherExecutor-372-thread-1-processing-n:127.0.0.1:43828_ x:collection1_shard1_replica_t1 s:shard1 c:collection1) [n:127.0.0.1:43828_ c:collection1 s:shard1  x:collection1_shard1_replica_t1] o.a.s.c.SolrCore [collection1_shard1_replica_t1] Registered new searcher Searcher@6817215f[collection1_shard1_replica_t1] main{ExitableDirectoryReader(UninvertingDirectoryReader())}
   [junit4]   2> 133162 INFO  (qtp1529475204-1340) [n:127.0.0.1:43828_ c:collection1 s:shard1  x:collection1_shard1_replica_t1] o.a.s.c.ZkController Core needs to recover:collection1_shard1_replica_t1
   [junit4]   2> 133163 INFO  (updateExecutor-340-thread-1-processing-n:127.0.0.1:43828_ x:collection1_shard1_replica_t1 s:shard1 c:collection1) [n:127.0.0.1:43828_ c:collection1 s:shard1 r:core_node2 x:collection1_shard1_replica_t1] o.a.s.u.DefaultSolrCoreState Running recovery
   [junit4]   2> 133163 INFO  (recoveryExecutor-341-thread-1-processing-n:127.0.0.1:43828_ x:collection1_shard1_replica_t1 s:shard1 c:collection1 r:core_node2) [n:127.0.0.1:43828_ c:collection1 s:shard1 r:core_node2 x:collection1_shard1_replica_t1] o.a.s.c.RecoveryStrategy Starting recovery process. recoveringAfterStartup=true
   [junit4]   2> 133164 INFO  (recoveryExecutor-341-thread-1-processing-n:127.0.0.1:43828_ x:collection1_shard1_replica_t1 s:shard1 c:collection1 r:core_node2) [n:127.0.0.1:43828_ c:collection1 s:shard1 r:core_node2 x:collection1_shard1_replica_t1] o.a.s.c.RecoveryStrategy ###### startupVersions=[[]]
   [junit4]   2> 133164 INFO  (recoveryExecutor-341-thread-1-processing-n:127.0.0.1:43828_ x:collection1_shard1_replica_t1 s:shard1 c:collection1 r:core_node2) [n:127.0.0.1:43828_ c:collection1 s:shard1 r:core_node2 x:collection1_shard1_replica_t1] o.a.s.c.ZkController collection1_shard1_replica_t1 stopping background replication from leader
   [junit4]   2> 133164 INFO  (recoveryExecutor-341-thread-1-processing-n:127.0.0.1:43828_ x:collection1_shard1_replica_t1 s:shard1 c:collection1 r:core_node2) [n:127.0.0.1:43828_ c:collection1 s:shard1 r:core_node2 x:collection1_shard1_replica_t1] o.a.s.c.RecoveryStrategy Begin buffering updates. core=[collection1_shard1_replica_t1]
   [junit4]   2> 133164 INFO  (recoveryExecutor-341-thread-1-processing-n:127.0.0.1:43828_ x:collection1_shard1_replica_t1 s:shard1 c:collection1 r:core_node2) [n:127.0.0.1:43828_ c:collection1 s:shard1 r:core_node2 x:collection1_shard1_replica_t1] o.a.s.u.UpdateLog Starting to buffer updates. FSUpdateLog{state=ACTIVE, tlog=null}
   [junit4]   2> 133164 INFO  (recoveryExecutor-341-thread-1-processing-n:127.0.0.1:43828_ x:collection1_shard1_replica_t1 s:shard1 c:collection1 r:core_node2) [n:127.0.0.1:43828_ c:collection1 s:shard1 r:core_node2 x:collection1_shard1_replica_t1] o.a.s.c.RecoveryStrategy Publishing state of core [collection1_shard1_replica_t1] as recovering, leader is [http://127.0.0.1:48679/collection1_shard1_replica_t0/] and I am [http://127.0.0.1:43828/collection1_shard1_replica_t1/]
   [junit4]   2> 133165 INFO  (qtp1529475204-1340) [n:127.0.0.1:43828_ c:collection1 s:shard1  x:collection1_shard1_replica_t1] o.a.s.s.HttpSolrCall [admin] webapp=null path=/admin/cores params={qt=/admin/cores&collection.configName=conf1&name=collection1_shard1_replica_t1&action=CREATE&collection=collection1&shard=shard1&wt=javabin&version=2&replicaType=TLOG} status=0 QTime=1386
   [junit4]   2> 133169 INFO  (qtp1344339448-1312) [n:127.0.0.1:48679_    ] o.a.s.s.HttpSolrCall [admin] webapp=null path=/admin/collections params={node=127.0.0.1:43828_&action=ADDREPLICA&collection=collection1&shard=shard1&type=TLOG&wt=javabin&version=2} status=0 QTime=1401
   [junit4]   2> 133175 INFO  (recoveryExecutor-341-thread-1-processing-n:127.0.0.1:43828_ x:collection1_shard1_replica_t1 s:shard1 c:collection1 r:core_node2) [n:127.0.0.1:43828_ c:collection1 s:shard1 r:core_node2 x:collection1_shard1_replica_t1] o.a.s.c.RecoveryStrategy Sending prep recovery command to [http://127.0.0.1:48679]; [WaitForState: action=PREPRECOVERY&core=collection1_shard1_replica_t0&nodeName=127.0.0.1:43828_&coreNodeName=core_node2&state=recovering&checkLive=true&onlyIfLeader=true&onlyIfLeaderActive=true]
   [junit4]   2> 133186 INFO  (qtp1344339448-1315) [n:127.0.0.1:48679_    ] o.a.s.h.a.PrepRecoveryOp Going to wait for coreNodeName: core_node2, state: recovering, checkLive: true, onlyIfLeader: true, onlyIfLeaderActive: true, maxTime: 183 s
   [junit4]   2> 133186 INFO  (qtp1344339448-1315) [n:127.0.0.1:48679_    ] o.a.s.h.a.PrepRecoveryOp In WaitForState(recovering): collection=collection1, shard=shard1, thisCore=collection1_shard1_replica_t0, leaderDoesNotNeedRecovery=false, isLeader? true, live=true, checkLive=true, currentState=down, localState=active, nodeName=127.0.0.1:43828_, coreNodeName=core_node2, onlyIfActiveCheckResult=false, nodeProps: core_node2:{"core":"collection1_shard1_replica_t1","base_url":"http://127.0.0.1:43828","node_name":"127.0.0.1:43828_","state":"down","type":"TLOG"}
   [junit4]   2> 133398 INFO  (TEST-ChaosMonkeyNothingIsSafeWithPullReplicasTest.test-seed#[5593F8D3D14E3F5C]) [    ] o.a.s.c.AbstractFullDistribZkTestBase create jetty 3 in directory /x1/jenkins/jenkins-slave/workspace/Lucene-Solr-Tests-7.x/solr/build/solr-core/test/J2/temp/solr.cloud.ChaosMonkeyNothingIsSafeWithPullReplicasTest_5593F8D3D14E3F5C-001/shard-3-001 of type TLOG
   [junit4]   2> 133399 INFO  (TEST-ChaosMonkeyNothingIsSafeWithPullReplicasTest.test-seed#[5593F8D3D14E3F5C]) [    ] o.e.j.s.Server jetty-9.3.14.v20161028
   [junit4]   2> 133400 INFO  (TEST-ChaosMonkeyNothingIsSafeWithPullReplicasTest.test-seed#[5593F8D3D14E3F5C]) [    ] o.e.j.s.h.ContextHandler Started o.e.j.s.ServletContextHandler@6bd284ef{/,null,AVAILABLE}
   [junit4]   2> 133401 INFO  (TEST-ChaosMonkeyNothingIsSafeWithPullReplicasTest.test-seed#[5593F8D3D14E3F5C]) [    ] o.e.j.s.AbstractConnector Started ServerConnector@21fc25b0{HTTP/1.1,[http/1.1]}{127.0.0.1:46511}
   [junit4]   2> 133411 INFO  (TEST-ChaosMonkeyNothingIsSafeWithPullReplicasTest.test-seed#[5593F8D3D14E3F5C]) [    ] o.e.j.s.Server Started @136528ms
   [junit4]   2> 133411 INFO  (TEST-ChaosMonkeyNothingIsSafeWithPullReplicasTest.test-seed#[5593F8D3D14E3F5C]) [    ] o.a.s.c.s.e.JettySolrRunner Jetty properties: {solr.data.dir=/x1/jenkins/jenkins-slave/workspace/Lucene-Solr-Tests-7.x/solr/build/solr-core/test/J2/temp/solr.cloud.ChaosMonkeyNothingIsSafeWithPullReplicasTest_5593F8D3D14E3F5C-001/tempDir-001/jetty3, replicaType=TLOG, solrconfig=solrconfig.xml, hostContext=/, hostPort=46511, coreRootDirectory=/x1/jenkins/jenkins-slave/workspace/Lucene-Solr-Tests-7.x/solr/build/solr-core/test/J2/temp/solr.cloud.ChaosMonkeyNothingIsSafeWithPullReplicasTest_5593F8D3D14E3F5C-001/shard-3-001/cores}
   [junit4]   2> 133412 ERROR (TEST-ChaosMonkeyNothingIsSafeWithPullReplicasTest.test-seed#[5593F8D3D14E3F5C]) [    ] o.a.s.s.StartupLoggingUtils Missing Java Option solr.log.dir. Logging may be missing or incomplete.
   [junit4]   2> 133424 INFO  (TEST-ChaosMonkeyNothingIsSafeWithPullReplicasTest.test-seed#[5593F8D3D14E3F5C]) [    ] o.a.s.s.SolrDispatchFilter  ___      _       Welcome to Apache Solr? version 7.1.0
   [junit4]   2> 133424 INFO  (TEST-ChaosMonkeyNothingIsSafeWithPullReplicasTest.test-seed#[5593F8D3D14E3F5C]) [    ] o.a.s.s.SolrDispatchFilter / __| ___| |_ _   Starting in cloud mode on port null
   [junit4]   2> 133424 INFO  (TEST-ChaosMonkeyNothingIsSafeWithPullReplicasTest.test-seed#[5593F8D3D14E3F5C]) [    ] o.a.s.s.SolrDispatchFilter \__ \/ _ \ | '_|  Install dir: null, Default config dir: null
   [junit4]   2> 133424 INFO  (TEST-ChaosMonkeyNothingIsSafeWithPullReplicasTest.test-seed#[5593F8D3D14E3F5C]) [    ] o.a.s.s.SolrDispatchFilter |___/\___/_|_|    Start time: 2017-07-05T20:59:11.508Z
   [junit4]   2> 133449 INFO  (TEST-ChaosMonkeyNothingIsSafeWithPullReplicasTest.test-seed#[5593F8D3D14E3F5C]) [    ] o.a.s.s.SolrDispatchFilter Loading solr.xml from SolrHome (not found in ZooKeeper)
   [junit4]   2> 133449 INFO  (TEST-ChaosMonkeyNothingIsSafeWithPullReplicasTest.test-seed#[5593F8D3D14E3F5C]) [    ] o.a.s.c.SolrXmlConfig Loading container configuration from /x1/jenkins/jenkins-slave/workspace/Lucene-Solr-Tests-7.x/solr/build/solr-core/test/J2/temp/solr.cloud.ChaosMonkeyNothingIsSafeWithPullReplicasTest_5593F8D3D14E3F5C-001/shard-3-001/solr.xml
   [junit4]   2> 133455 INFO  (TEST-ChaosMonkeyNothingIsSafeWithPullReplicasTest.test-seed#[5593F8D3D14E3F5C]) [    ] o.a.s.c.SolrXmlConfig MBean server found: com.sun.jmx.mbeanserver.JmxMBeanServer@4a8e8af7, but no JMX reporters were configured - adding default JMX reporter.
   [junit4]   2> 133462 INFO  (TEST-ChaosMonkeyNothingIsSafeWithPullReplicasTest.test-seed#[5593F8D3D14E3F5C]) [    ] o.a.s.c.ZkContainer Zookeeper client=127.0.0.1:46738/solr
   [junit4]   2> 133481 INFO  (TEST-ChaosMonkeyNothingIsSafeWithPullReplicasTest.test-seed#[5593F8D3D14E3F5C]) [n:127.0.0.1:46511_    ] o.a.s.c.c.ZkStateReader Updated live nodes from ZooKeeper... (0) -> (3)
   [junit4]   2> 133484 INFO  (TEST-ChaosMonkeyNothingIsSafeWithPullReplicasTest.test-seed#[5593F8D3D14E3F5C]) [n:127.0.0.1:46511_    ] o.a.s.c.Overseer Overseer (id=null) closing
   [junit4]   2> 133486 INFO  (TEST-ChaosMonkeyNothingIsSafeWithPullReplicasTest.test-seed#[5593F8D3D14E3F5C]) [n:127.0.0.1:46511_    ] o.a.s.c.ZkController Register node as live in ZooKeeper:/live_nodes/127.0.0.1:46511_
   [junit4]   2> 133487 INFO  (zkCallback-325-thread-1-processing-n:127.0.0.1:52106_) [n:127.0.0.1:52106_    ] o.a.s.c.c.ZkStateReader Updated live nodes from ZooKeeper... (3) -> (4)
   [junit4]   2> 133488 INFO  (zkCallback-343-thread-1-processing-n:127.0.0.1:43828_) [n:127.0.0.1:43828_    ] o.a.s.c.c.ZkStateReader Updated live nodes from ZooKeeper... (3) -> (4)
   [junit4]   2> 133488 INFO  (zkCallback-350-thread-1-processing-n:127.0.0.1:46511_) [n:127.0.0.1:46511_    ] o.a.s.c.c.ZkStateReader Updated live nodes from ZooKeeper... (3) -> (4)
   [junit4]   2> 133488 INFO  (zkCallback-337-thread-1-processing-n:127.0.0.1:48679_) [n:127.0.0.1:48679_    ] o.a.s.c.c.ZkSt

[...truncated too long message...]

eue.take(LinkedBlockingQueue.java:442)
   [junit4]    >         at org.apache.zookeeper.ClientCnxn$EventThread.run(ClientCnxn.java:501)
   [junit4]    >    3) Thread[id=1538, name=zkCallback-332-thread-2, state=TIMED_WAITING, group=TGRP-ChaosMonkeyNothingIsSafeWithPullReplicasTest]
   [junit4]    >         at sun.misc.Unsafe.park(Native Method)
   [junit4]    >         at java.util.concurrent.locks.LockSupport.parkNanos(LockSupport.java:215)
   [junit4]    >         at java.util.concurrent.SynchronousQueue$TransferStack.awaitFulfill(SynchronousQueue.java:460)
   [junit4]    >         at java.util.concurrent.SynchronousQueue$TransferStack.transfer(SynchronousQueue.java:362)
   [junit4]    >         at java.util.concurrent.SynchronousQueue.poll(SynchronousQueue.java:941)
   [junit4]    >         at java.util.concurrent.ThreadPoolExecutor.getTask(ThreadPoolExecutor.java:1066)
   [junit4]    >         at java.util.concurrent.ThreadPoolExecutor.runWorker(ThreadPoolExecutor.java:1127)
   [junit4]    >         at java.util.concurrent.ThreadPoolExecutor$Worker.run(ThreadPoolExecutor.java:617)
   [junit4]    >         at java.lang.Thread.run(Thread.java:748)
   [junit4]    >    4) Thread[id=1304, name=TEST-ChaosMonkeyNothingIsSafeWithPullReplicasTest.test-seed#[5593F8D3D14E3F5C]-SendThread(127.0.0.1:46738), state=TIMED_WAITING, group=TGRP-ChaosMonkeyNothingIsSafeWithPullReplicasTest]
   [junit4]    >         at java.lang.Thread.sleep(Native Method)
   [junit4]    >         at org.apache.zookeeper.client.StaticHostProvider.next(StaticHostProvider.java:101)
   [junit4]    >         at org.apache.zookeeper.ClientCnxn$SendThread.startConnect(ClientCnxn.java:997)
   [junit4]    >         at org.apache.zookeeper.ClientCnxn$SendThread.run(ClientCnxn.java:1060)
   [junit4]    >    5) Thread[id=1306, name=zkCallback-332-thread-1, state=TIMED_WAITING, group=TGRP-ChaosMonkeyNothingIsSafeWithPullReplicasTest]
   [junit4]    >         at sun.misc.Unsafe.park(Native Method)
   [junit4]    >         at java.util.concurrent.locks.LockSupport.parkNanos(LockSupport.java:215)
   [junit4]    >         at java.util.concurrent.SynchronousQueue$TransferStack.awaitFulfill(SynchronousQueue.java:460)
   [junit4]    >         at java.util.concurrent.SynchronousQueue$TransferStack.transfer(SynchronousQueue.java:362)
   [junit4]    >         at java.util.concurrent.SynchronousQueue.poll(SynchronousQueue.java:941)
   [junit4]    >         at java.util.concurrent.ThreadPoolExecutor.getTask(ThreadPoolExecutor.java:1066)
   [junit4]    >         at java.util.concurrent.ThreadPoolExecutor.runWorker(ThreadPoolExecutor.java:1127)
   [junit4]    >         at java.util.concurrent.ThreadPoolExecutor$Worker.run(ThreadPoolExecutor.java:617)
   [junit4]    >         at java.lang.Thread.run(Thread.java:748)
   [junit4]    >    6) Thread[id=1570, name=zkCallback-332-thread-4, state=TIMED_WAITING, group=TGRP-ChaosMonkeyNothingIsSafeWithPullReplicasTest]
   [junit4]    >         at sun.misc.Unsafe.park(Native Method)
   [junit4]    >         at java.util.concurrent.locks.LockSupport.parkNanos(LockSupport.java:215)
   [junit4]    >         at java.util.concurrent.SynchronousQueue$TransferStack.awaitFulfill(SynchronousQueue.java:460)
   [junit4]    >         at java.util.concurrent.SynchronousQueue$TransferStack.transfer(SynchronousQueue.java:362)
   [junit4]    >         at java.util.concurrent.SynchronousQueue.poll(SynchronousQueue.java:941)
   [junit4]    >         at java.util.concurrent.ThreadPoolExecutor.getTask(ThreadPoolExecutor.java:1066)
   [junit4]    >         at java.util.concurrent.ThreadPoolExecutor.runWorker(ThreadPoolExecutor.java:1127)
   [junit4]    >         at java.util.concurrent.ThreadPoolExecutor$Worker.run(ThreadPoolExecutor.java:617)
   [junit4]    >         at java.lang.Thread.run(Thread.java:748)
   [junit4]    >    7) Thread[id=1539, name=zkCallback-332-thread-3, state=TIMED_WAITING, group=TGRP-ChaosMonkeyNothingIsSafeWithPullReplicasTest]
   [junit4]    >         at sun.misc.Unsafe.park(Native Method)
   [junit4]    >         at java.util.concurrent.locks.LockSupport.parkNanos(LockSupport.java:215)
   [junit4]    >         at java.util.concurrent.SynchronousQueue$TransferStack.awaitFulfill(SynchronousQueue.java:460)
   [junit4]    >         at java.util.concurrent.SynchronousQueue$TransferStack.transfer(SynchronousQueue.java:362)
   [junit4]    >         at java.util.concurrent.SynchronousQueue.poll(SynchronousQueue.java:941)
   [junit4]    >         at java.util.concurrent.ThreadPoolExecutor.getTask(ThreadPoolExecutor.java:1066)
   [junit4]    >         at java.util.concurrent.ThreadPoolExecutor.runWorker(ThreadPoolExecutor.java:1127)
   [junit4]    >         at java.util.concurrent.ThreadPoolExecutor$Worker.run(ThreadPoolExecutor.java:617)
   [junit4]    >         at java.lang.Thread.run(Thread.java:748)
   [junit4]    > 	at __randomizedtesting.SeedInfo.seed([5593F8D3D14E3F5C]:0)Throwable #2: com.carrotsearch.randomizedtesting.ThreadLeakError: There are still zombie threads that couldn't be terminated:
   [junit4]    >    1) Thread[id=1538, name=zkCallback-332-thread-2, state=TIMED_WAITING, group=TGRP-ChaosMonkeyNothingIsSafeWithPullReplicasTest]
   [junit4]    >         at sun.misc.Unsafe.park(Native Method)
   [junit4]    >         at java.util.concurrent.locks.LockSupport.parkNanos(LockSupport.java:215)
   [junit4]    >         at java.util.concurrent.SynchronousQueue$TransferStack.awaitFulfill(SynchronousQueue.java:460)
   [junit4]    >         at java.util.concurrent.SynchronousQueue$TransferStack.transfer(SynchronousQueue.java:362)
   [junit4]    >         at java.util.concurrent.SynchronousQueue.poll(SynchronousQueue.java:941)
   [junit4]    >         at java.util.concurrent.ThreadPoolExecutor.getTask(ThreadPoolExecutor.java:1066)
   [junit4]    >         at java.util.concurrent.ThreadPoolExecutor.runWorker(ThreadPoolExecutor.java:1127)
   [junit4]    >         at java.util.concurrent.ThreadPoolExecutor$Worker.run(ThreadPoolExecutor.java:617)
   [junit4]    >         at java.lang.Thread.run(Thread.java:748)
   [junit4]    >    2) Thread[id=1304, name=TEST-ChaosMonkeyNothingIsSafeWithPullReplicasTest.test-seed#[5593F8D3D14E3F5C]-SendThread(127.0.0.1:46738), state=TIMED_WAITING, group=TGRP-ChaosMonkeyNothingIsSafeWithPullReplicasTest]
   [junit4]    >         at java.lang.Thread.sleep(Native Method)
   [junit4]    >         at org.apache.zookeeper.client.StaticHostProvider.next(StaticHostProvider.java:101)
   [junit4]    >         at org.apache.zookeeper.ClientCnxn$SendThread.startConnect(ClientCnxn.java:997)
   [junit4]    >         at org.apache.zookeeper.ClientCnxn$SendThread.run(ClientCnxn.java:1060)
   [junit4]    >    3) Thread[id=1306, name=zkCallback-332-thread-1, state=TIMED_WAITING, group=TGRP-ChaosMonkeyNothingIsSafeWithPullReplicasTest]
   [junit4]    >         at sun.misc.Unsafe.park(Native Method)
   [junit4]    >         at java.util.concurrent.locks.LockSupport.parkNanos(LockSupport.java:215)
   [junit4]    >         at java.util.concurrent.SynchronousQueue$TransferStack.awaitFulfill(SynchronousQueue.java:460)
   [junit4]    >         at java.util.concurrent.SynchronousQueue$TransferStack.transfer(SynchronousQueue.java:362)
   [junit4]    >         at java.util.concurrent.SynchronousQueue.poll(SynchronousQueue.java:941)
   [junit4]    >         at java.util.concurrent.ThreadPoolExecutor.getTask(ThreadPoolExecutor.java:1066)
   [junit4]    >         at java.util.concurrent.ThreadPoolExecutor.runWorker(ThreadPoolExecutor.java:1127)
   [junit4]    >         at java.util.concurrent.ThreadPoolExecutor$Worker.run(ThreadPoolExecutor.java:617)
   [junit4]    >         at java.lang.Thread.run(Thread.java:748)
   [junit4]    >    4) Thread[id=1570, name=zkCallback-332-thread-4, state=TIMED_WAITING, group=TGRP-ChaosMonkeyNothingIsSafeWithPullReplicasTest]
   [junit4]    >         at sun.misc.Unsafe.park(Native Method)
   [junit4]    >         at java.util.concurrent.locks.LockSupport.parkNanos(LockSupport.java:215)
   [junit4]    >         at java.util.concurrent.SynchronousQueue$TransferStack.awaitFulfill(SynchronousQueue.java:460)
   [junit4]    >         at java.util.concurrent.SynchronousQueue$TransferStack.transfer(SynchronousQueue.java:362)
   [junit4]    >         at java.util.concurrent.SynchronousQueue.poll(SynchronousQueue.java:941)
   [junit4]    >         at java.util.concurrent.ThreadPoolExecutor.getTask(ThreadPoolExecutor.java:1066)
   [junit4]    >         at java.util.concurrent.ThreadPoolExecutor.runWorker(ThreadPoolExecutor.java:1127)
   [junit4]    >         at java.util.concurrent.ThreadPoolExecutor$Worker.run(ThreadPoolExecutor.java:617)
   [junit4]    >         at java.lang.Thread.run(Thread.java:748)
   [junit4]    >    5) Thread[id=1539, name=zkCallback-332-thread-3, state=TIMED_WAITING, group=TGRP-ChaosMonkeyNothingIsSafeWithPullReplicasTest]
   [junit4]    >         at sun.misc.Unsafe.park(Native Method)
   [junit4]    >         at java.util.concurrent.locks.LockSupport.parkNanos(LockSupport.java:215)
   [junit4]    >         at java.util.concurrent.SynchronousQueue$TransferStack.awaitFulfill(SynchronousQueue.java:460)
   [junit4]    >         at java.util.concurrent.SynchronousQueue$TransferStack.transfer(SynchronousQueue.java:362)
   [junit4]    >         at java.util.concurrent.SynchronousQueue.poll(SynchronousQueue.java:941)
   [junit4]    >         at java.util.concurrent.ThreadPoolExecutor.getTask(ThreadPoolExecutor.java:1066)
   [junit4]    >         at java.util.concurrent.ThreadPoolExecutor.runWorker(ThreadPoolExecutor.java:1127)
   [junit4]    >         at java.util.concurrent.ThreadPoolExecutor$Worker.run(ThreadPoolExecutor.java:617)
   [junit4]    >         at java.lang.Thread.run(Thread.java:748)
   [junit4]    > 	at __randomizedtesting.SeedInfo.seed([5593F8D3D14E3F5C]:0)
   [junit4] Completed [94/726 (1!)] on J2 in 132.83s, 1 test, 3 errors <<< FAILURES!

[...truncated 45425 lines...]

Mime
View raw message