lucene-dev mailing list archives

Site index · List index
Message view « Date » · « Thread »
Top « Date » · « Thread »
From Steve Rowe <sar...@gmail.com>
Subject Re: [JENKINS] Lucene-Solr-NightlyTests-master - Build # 1352 - Still Failing
Date Wed, 12 Jul 2017 13:26:17 GMT
I created <https://issues.apache.org/jira/browse/INFRA-14572> for the "lucene2” disk
space problem.

On Hipchat Chris Thistlthwaite (@christ) said he would start looking at the box.

--
Steve
www.lucidworks.com

> On Jul 12, 2017, at 8:54 AM, Steve Rowe <sarowe@gmail.com> wrote:
> 
> Looks like the new lucene2 node has run out of disk space.  I’ll go ask about it on
Infra’s hipchat channel.
> 
> --
> Steve
> www.lucidworks.com
> 
>> On Jul 12, 2017, at 3:11 AM, Apache Jenkins Server <jenkins@builds.apache.org>
wrote:
>> 
>> Build: https://builds.apache.org/job/Lucene-Solr-NightlyTests-master/1352/
>> 
>> 1 tests failed.
>> FAILED:  TEST-org.apache.lucene.search.TestSimpleExplanationsWithFillerDocs.xml.[empty]
>> 
>> Error Message:
>> 
>> 
>> Stack Trace:
>> Test report file /home/jenkins/jenkins-slave/workspace/Lucene-Solr-NightlyTests-master/checkout/lucene/build/core/test/TEST-org.apache.lucene.search.TestSimpleExplanationsWithFillerDocs.xml
was length 0
>> 
>> 
>> 
>> Build Log:
>> [...truncated 262 lines...]
>>  [junit4] JVM J0: stderr was not empty, see: /home/jenkins/jenkins-slave/workspace/Lucene-Solr-NightlyTests-master/checkout/lucene/build/core/test/temp/junit4-J0-20170712_070941_6163200394456052706494.syserr
>>  [junit4] >>> JVM J0 emitted unexpected output (verbatim) ----
>>  [junit4] WARN: Unhandled exception in event serialization. -> java.security.PrivilegedActionException:
java.io.IOException: No space left on device
>>  [junit4] 	at java.security.AccessController.doPrivileged(Native Method)
>>  [junit4] 	at com.carrotsearch.ant.tasks.junit4.events.Serializer.flushQueue(Serializer.java:114)
>>  [junit4] 	at com.carrotsearch.ant.tasks.junit4.events.Serializer.serialize(Serializer.java:99)
>>  [junit4] 	at com.carrotsearch.ant.tasks.junit4.slave.SlaveMain$3$2.write(SlaveMain.java:472)
>>  [junit4] 	at java.io.BufferedOutputStream.flushBuffer(BufferedOutputStream.java:82)
>>  [junit4] 	at java.io.BufferedOutputStream.flush(BufferedOutputStream.java:140)
>>  [junit4] 	at java.io.PrintStream.flush(PrintStream.java:338)
>>  [junit4] 	at java.io.FilterOutputStream.flush(FilterOutputStream.java:140)
>>  [junit4] 	at java.io.PrintStream.write(PrintStream.java:482)
>>  [junit4] 	at sun.nio.cs.StreamEncoder.writeBytes(StreamEncoder.java:221)
>>  [junit4] 	at sun.nio.cs.StreamEncoder.implWrite(StreamEncoder.java:282)
>>  [junit4] 	at sun.nio.cs.StreamEncoder.write(StreamEncoder.java:125)
>>  [junit4] 	at sun.nio.cs.StreamEncoder.write(StreamEncoder.java:135)
>>  [junit4] 	at java.io.OutputStreamWriter.write(OutputStreamWriter.java:220)
>>  [junit4] 	at java.io.Writer.write(Writer.java:157)
>>  [junit4] 	at java.util.logging.StreamHandler.publish(StreamHandler.java:224)
>>  [junit4] 	at java.util.logging.ConsoleHandler.publish(ConsoleHandler.java:116)
>>  [junit4] 	at java.util.logging.Logger.log(Logger.java:738)
>>  [junit4] 	at java.util.logging.Logger.doLog(Logger.java:765)
>>  [junit4] 	at java.util.logging.Logger.log(Logger.java:876)
>>  [junit4] 	at com.carrotsearch.randomizedtesting.RandomizedRunner$QueueUncaughtExceptionsHandler.uncaughtException(RandomizedRunner.java:531)
>>  [junit4] 	at java.lang.ThreadGroup.uncaughtException(ThreadGroup.java:1057)
>>  [junit4] 	at java.lang.ThreadGroup.uncaughtException(ThreadGroup.java:1052)
>>  [junit4] 	at java.lang.ThreadGroup.uncaughtException(ThreadGroup.java:1052)
>>  [junit4] 	at com.carrotsearch.randomizedtesting.RunnerThreadGroup.uncaughtException(RunnerThreadGroup.java:28)
>>  [junit4] 	at java.lang.Thread.dispatchUncaughtException(Thread.java:1959)
>>  [junit4] Caused by: java.io.IOException: No space left on device
>>  [junit4] 	at java.io.FileOutputStream.writeBytes(Native Method)
>>  [junit4] 	at java.io.FileOut
>>  [junit4] putStream.write(FileOutputStream.java:326)
>>  [junit4] 	at java.io.BufferedOutputStream.write(BufferedOutputStream.java:122)
>>  [junit4] 	at com.carrotsearch.ant.tasks.junit4.slave.EventsOutputStream.write(EventsOutputStream.java:28)
>>  [junit4] 	at sun.nio.cs.StreamEncoder.writeBytes(StreamEncoder.java:221)
>>  [junit4] 	at sun.nio.cs.StreamEncoder.implWrite(StreamEncoder.java:282)
>>  [junit4] 	at sun.nio.cs.StreamEncoder.write(StreamEncoder.java:125)
>>  [junit4] 	at sun.nio.cs.StreamEncoder.write(StreamEncoder.java:135)
>>  [junit4] 	at java.io.OutputStreamWriter.write(OutputStreamWriter.java:220)
>>  [junit4] 	at com.carrotsearch.ant.tasks.junit4.gson.stream.JsonWriter.string(JsonWriter.java:572)
>>  [junit4] 	at com.carrotsearch.ant.tasks.junit4.gson.stream.JsonWriter.value(JsonWriter.java:415)
>>  [junit4] 	at com.carrotsearch.ant.tasks.junit4.events.AbstractEvent.writeBinaryProperty(AbstractEvent.java:36)
>>  [junit4] 	at com.carrotsearch.ant.tasks.junit4.events.AppendStdErrEvent.serialize(AppendStdErrEvent.java:30)
>>  [junit4] 	at com.carrotsearch.ant.tasks.junit4.events.Serializer$2.run(Serializer.java:119)
>>  [junit4] 	at com.carrotsearch.ant.tasks.junit4.events.Serializer$2.run(Serializer.java:114)
>>  [junit4] 	... 26 more
>>  [junit4] <<< JVM J0: EOF ----
>> 
>> [...truncated 4 lines...]
>>  [junit4] JVM J1: stderr was not empty, see: /home/jenkins/jenkins-slave/workspace/Lucene-Solr-NightlyTests-master/checkout/lucene/build/core/test/temp/junit4-J1-20170712_070941_6343353887351313582581.syserr
>>  [junit4] >>> JVM J1 emitted unexpected output (verbatim) ----
>>  [junit4] WARN: Unhandled exception in event serialization. -> java.security.PrivilegedActionException:
java.io.IOException: No space left on device
>>  [junit4] 	at java.security.AccessController.doPrivileged(Native Method)
>>  [junit4] 	at com.carrotsearch.ant.tasks.junit4.events.Serializer.flushQueue(Serializer.java:114)
>>  [junit4] 	at com.carrotsearch.ant.tasks.junit4.events.Serializer.serialize(Serializer.java:99)
>>  [junit4] 	at com.carrotsearch.ant.tasks.junit4.slave.RunListenerEmitter.testRunStarted(RunListenerEmitter.java:40)
>>  [junit4] 	at com.carrotsearch.ant.tasks.junit4.slave.NoExceptionRunListenerDecorator.testRunStarted(NoExceptionRunListenerDecorator.java:23)
>>  [junit4] 	at com.carrotsearch.ant.tasks.junit4.slave.BeforeAfterRunListenerDecorator.testRunStarted(BeforeAfterRunListenerDecorator.java:24)
>>  [junit4] 	at com.carrotsearch.ant.tasks.junit4.slave.OrderedRunNotifier$1.notifyListener(OrderedRunNotifier.java:82)
>>  [junit4] 	at com.carrotsearch.ant.tasks.junit4.slave.OrderedRunNotifier$SafeNotifier.run(OrderedRunNotifier.java:63)
>>  [junit4] 	at com.carrotsearch.ant.tasks.junit4.slave.OrderedRunNotifier$SafeNotifier.run(OrderedRunNotifier.java:49)
>>  [junit4] 	at com.carrotsearch.ant.tasks.junit4.slave.OrderedRunNotifier.fireTestRunStarted(OrderedRunNotifier.java:79)
>>  [junit4] 	at com.carrotsearch.ant.tasks.junit4.slave.SlaveMain.execute(SlaveMain.java:249)
>>  [junit4] 	at com.carrotsearch.ant.tasks.junit4.slave.SlaveMain.main(SlaveMain.java:368)
>>  [junit4] 	at com.carrotsearch.ant.tasks.junit4.slave.SlaveMainSafe.main(SlaveMainSafe.java:13)
>>  [junit4] Caused by: java.io.IOException: No space left on device
>>  [junit4] 	at java.io.FileOutputStream.writeBytes(Native Method)
>>  [junit4] 	at java.io.FileOutputStream.write(FileOutputStream.java:326)
>>  [junit4] 	at java.io.BufferedOutputStream.flushBuffer(BufferedOutputStream.java:82)
>>  [junit4] 	at java.io.BufferedOutputStream.write(BufferedOutputStream.java:121)
>>  [junit4] 	at com.carrotsearch.ant.tasks.junit4.slave.EventsOutputStream.write(EventsOutputStream.java:28)
>>  [junit4] 	at sun.nio.cs.StreamEncoder.writeBytes(StreamEncoder.java:221)
>>  [junit4] 	at sun.nio.cs.StreamEncoder.implWrite(StreamEncoder.java:282)
>>  [junit4] 	at sun.nio.cs.StreamEncoder.write(StreamEncoder.java:125)
>>  [junit4] 	at sun.nio.cs.Strea
>>  [junit4] mEncoder.write(StreamEncoder.java:135)
>>  [junit4] 	at java.io.OutputStreamWriter.write(OutputStreamWriter.java:220)
>>  [junit4] 	at com.carrotsearch.ant.tasks.junit4.gson.stream.JsonWriter.string(JsonWriter.java:572)
>>  [junit4] 	at com.carrotsearch.ant.tasks.junit4.gson.stream.JsonWriter.value(JsonWriter.java:415)
>>  [junit4] 	at com.carrotsearch.ant.tasks.junit4.events.JsonHelpers.writeDescription(JsonHelpers.java:24)
>>  [junit4] 	at com.carrotsearch.ant.tasks.junit4.events.JsonHelpers.writeDescription(JsonHelpers.java:31)
>>  [junit4] 	at com.carrotsearch.ant.tasks.junit4.events.AbstractEvent.writeDescription(AbstractEvent.java:119)
>>  [junit4] 	at com.carrotsearch.ant.tasks.junit4.events.AbstractEventWithDescription.serialize(AbstractEventWithDescription.java:29)
>>  [junit4] 	at com.carrotsearch.ant.tasks.junit4.events.SuiteStartedEvent.serialize(SuiteStartedEvent.java:36)
>>  [junit4] 	at com.carrotsearch.ant.tasks.junit4.events.Serializer$2.run(Serializer.java:119)
>>  [junit4] 	at com.carrotsearch.ant.tasks.junit4.events.Serializer$2.run(Serializer.java:114)
>>  [junit4] 	... 13 more
>>  [junit4] <<< JVM J1: EOF ----
>> 
>>  [junit4] JVM J2: stderr was not empty, see: /home/jenkins/jenkins-slave/workspace/Lucene-Solr-NightlyTests-master/checkout/lucene/build/core/test/temp/junit4-J2-20170712_070941_6345429632897914706142.syserr
>>  [junit4] >>> JVM J2 emitted unexpected output (verbatim) ----
>>  [junit4] WARN: Unhandled exception in event serialization. -> java.security.PrivilegedActionException:
java.io.IOException: No space left on device
>>  [junit4] 	at java.security.AccessController.doPrivileged(Native Method)
>>  [junit4] 	at com.carrotsearch.ant.tasks.junit4.events.Serializer.flushQueue(Serializer.java:114)
>>  [junit4] 	at com.carrotsearch.ant.tasks.junit4.events.Serializer.serialize(Serializer.java:99)
>>  [junit4] 	at com.carrotsearch.ant.tasks.junit4.slave.RunListenerEmitter.testFailure(RunListenerEmitter.java:54)
>>  [junit4] 	at com.carrotsearch.ant.tasks.junit4.slave.NoExceptionRunListenerDecorator.testFailure(NoExceptionRunListenerDecorator.java:55)
>>  [junit4] 	at com.carrotsearch.ant.tasks.junit4.slave.BeforeAfterRunListenerDecorator.testFailure(BeforeAfterRunListenerDecorator.java:60)
>>  [junit4] 	at com.carrotsearch.ant.tasks.junit4.slave.OrderedRunNotifier$4.notifyListener(OrderedRunNotifier.java:129)
>>  [junit4] 	at com.carrotsearch.ant.tasks.junit4.slave.OrderedRunNotifier$SafeNotifier.run(OrderedRunNotifier.java:63)
>>  [junit4] 	at com.carrotsearch.ant.tasks.junit4.slave.OrderedRunNotifier.fireTestFailure(OrderedRunNotifier.java:126)
>>  [junit4] 	at com.carrotsearch.randomizedtesting.ThreadLeakControl$SubNotifier.fireTestFailure(ThreadLeakControl.java:184)
>>  [junit4] 	at com.carrotsearch.randomizedtesting.RandomizedRunner.fireTestFailure(RandomizedRunner.java:834)
>>  [junit4] 	at com.carrotsearch.randomizedtesting.RandomizedRunner.runSingleTest(RandomizedRunner.java:922)
>>  [junit4] 	at com.carrotsearch.randomizedtesting.RandomizedRunner$5.evaluate(RandomizedRunner.java:802)
>>  [junit4] 	at com.carrotsearch.randomizedtesting.RandomizedRunner$6.evaluate(RandomizedRunner.java:852)
>>  [junit4] 	at com.carrotsearch.randomizedtesting.RandomizedRunner$7.evaluate(RandomizedRunner.java:863)
>>  [junit4] 	at org.apache.lucene.util.AbstractBeforeAfterRule$1.evaluate(AbstractBeforeAfterRule.java:45)
>>  [junit4] 	at com.carrotsearch.randomizedtesting.rules.StatementAdapter.evaluate(StatementAdapter.java:36)
>>  [junit4] 	at org.apache.lucene.util.TestRuleStoreClassName$1.evaluate(TestRuleStoreClassName.java:41)
>>  [junit4] 	at com.carrotsearch.randomizedtesting.rules.NoShadowingOrOverridesOnMethodsRule$1.evaluate(NoShadowingOrOverr
>>  [junit4] idesOnMethodsRule.java:40)
>>  [junit4] 	at com.carrotsearch.randomizedtesting.rules.NoShadowingOrOverridesOnMethodsRule$1.evaluate(NoShadowingOrOverridesOnMethodsRule.java:40)
>>  [junit4] 	at com.carrotsearch.randomizedtesting.rules.StatementAdapter.evaluate(StatementAdapter.java:36)
>>  [junit4] 	at com.carrotsearch.randomizedtesting.rules.StatementAdapter.evaluate(StatementAdapter.java:36)
>>  [junit4] 	at com.carrotsearch.randomizedtesting.rules.StatementAdapter.evaluate(StatementAdapter.java:36)
>>  [junit4] 	at org.apache.lucene.util.TestRuleAssertionsRequired$1.evaluate(TestRuleAssertionsRequired.java:53)
>>  [junit4] 	at org.apache.lucene.util.TestRuleMarkFailure$1.evaluate(TestRuleMarkFailure.java:47)
>>  [junit4] 	at org.apache.lucene.util.TestRuleIgnoreAfterMaxFailures$1.evaluate(TestRuleIgnoreAfterMaxFailures.java:64)
>>  [junit4] 	at org.apache.lucene.util.TestRuleIgnoreTestSuites$1.evaluate(TestRuleIgnoreTestSuites.java:54)
>>  [junit4] 	at com.carrotsearch.randomizedtesting.rules.StatementAdapter.evaluate(StatementAdapter.java:36)
>>  [junit4] 	at com.carrotsearch.randomizedtesting.ThreadLeakControl$StatementRunner.run(ThreadLeakControl.java:368)
>>  [junit4] 	at java.lang.Thread.run(Thread.java:748)
>>  [junit4] Caused by: java.io.IOException: No space left on device
>>  [junit4] 	at java.io.FileOutputStream.writeBytes(Native Method)
>>  [junit4] 	at java.io.FileOutputStream.write(FileOutputStream.java:326)
>>  [junit4] 	at java.io.BufferedOutputStream.write(BufferedOutputStream.java:122)
>>  [junit4] 	at com.carrotsearch.ant.tasks.junit4.slave.EventsOutputStream.write(EventsOutputStream.java:28)
>>  [junit4] 	at sun.nio.cs.StreamEncoder.writeBytes(StreamEncoder.java:221)
>>  [junit4] 	at sun.nio.cs.StreamEncoder.implWrite(StreamEncoder.java:282)
>>  [junit4] 	at sun.nio.cs.StreamEncoder.write(StreamEncoder.java:125)
>>  [junit4] 	at sun.nio.cs.StreamEncoder.write(StreamEncoder.java:135)
>>  [junit4] 	at java.io.OutputStreamWriter.write(OutputStreamWriter.java:220)
>>  [junit4] 	at com.carrotsearch.ant.tasks.junit4.gson.stream.JsonWriter.string(JsonWriter.java:566)
>>  [junit4] 	at com.carrotsearch.ant.tasks.junit4.gson.stream.JsonWriter.value(JsonWriter.java:415)
>>  [junit4] 	at com.carrotsearch.ant.tasks.junit4.events.FailureEvent.serialize(FailureEvent.java:46)
>>  [junit4] 	at com.carrotsearch.ant.tasks.junit4
>>  [junit4] .events.Serializer$2.run(Serializer.java:119)
>>  [junit4] 	at com.carrotsearch.ant.tasks.junit4.events.Serializer$2.run(Serializer.java:114)
>>  [junit4] 	... 30 more
>>  [junit4] <<< JVM J2: EOF ----
>> 
>> [...truncated 2 lines...]
>>  [junit4] ERROR: JVM J0 ended with an exception, command line: /usr/local/asfpackages/java/jdk1.8.0_131/jre/bin/java
-XX:+HeapDumpOnOutOfMemoryError -XX:HeapDumpPath=/home/jenkins/jenkins-slave/workspace/Lucene-Solr-NightlyTests-master/checkout/heapdumps
-ea -esa -Dtests.prefix=tests -Dtests.seed=55E4911CB74D62C9 -Xmx512M -Dtests.iters= -Dtests.verbose=false
-Dtests.infostream=false -Dtests.codec=random -Dtests.postingsformat=random -Dtests.docvaluesformat=random
-Dtests.locale=random -Dtests.timezone=random -Dtests.directory=random -Dtests.linedocsfile=/home/jenkins/jenkins-slave/workspace/Lucene-Solr-NightlyTests-master/test-data/enwiki.random.lines.txt
-Dtests.luceneMatchVersion=8.0.0 -Dtests.cleanthreads=perMethod -Djava.util.logging.config.file=/home/jenkins/jenkins-slave/workspace/Lucene-Solr-NightlyTests-master/checkout/lucene/tools/junit4/logging.properties
-Dtests.nightly=true -Dtests.weekly=false -Dtests.monster=false -Dtests.slow=true -Dtests.asserts=true
-Dtests.multiplier=2 -DtempDir=./temp -Djava.io.tmpdir=./temp -Djunit4.tempDir=/home/jenkins/jenkins-slave/workspace/Lucene-Solr-NightlyTests-master/checkout/lucene/build/core/test/temp
-Dcommon.dir=/home/jenkins/jenkins-slave/workspace/Lucene-Solr-NightlyTests-master/checkout/lucene
-Dclover.db.dir=/home/jenkins/jenkins-slave/workspace/Lucene-Solr-NightlyTests-master/checkout/lucene/build/clover/db
-Djava.security.policy=/home/jenkins/jenkins-slave/workspace/Lucene-Solr-NightlyTests-master/checkout/lucene/tools/junit4/tests.policy
-Dtests.LUCENE_VERSION=8.0.0 -Djetty.testMode=1 -Djetty.insecurerandom=1 -Dsolr.directoryFactory=org.apache.solr.core.MockDirectoryFactory
-Djava.awt.headless=true -Djdk.map.althashing.threshold=0 -Dtests.src.home=/home/jenkins/jenkins-slave/workspace/Lucene-Solr-NightlyTests-master/checkout
-Djunit4.childvm.cwd=/home/jenkins/jenkins-slave/workspace/Lucene-Solr-NightlyTests-master/checkout/lucene/build/core/test/J0
-Djunit4.childvm.id=0 -Djunit4.childvm.count=3 -Dtests.leaveTemporary=false -Dtests.filterstacks=true
-Djava.security.manager=org.apache.lucene.util.TestSecurityManager -Dfile.encoding=ISO-8859-1
-classpath /home/jenkins/jenkins-slave/workspace/Lucene-Solr-NightlyTests-master/checkout/lucene/build/codecs/classes/java:/home/jenkins/jenkins-slave/workspace/Lucene-Solr-NightlyTests-master/checkout/lucene/build/test-framework/classes/java:/home/jenkins/jenkins-slave/workspace/Lucene-Solr-NightlyTests-master/checkout/lucene/test-framework/lib/junit-4.10.jar:/home/jenkins/jenkins-slave/workspace/Lucene-Solr-NightlyTests-master/checkout/lucene/test-framework/lib/randomizedtesting-runner-2.5.2.jar:/home/jenkins/jenkins-slave/workspace/Lucene-Solr-NightlyTests-master/checkout/lucene/build/core/classes/java:/home/jenkins/jenkins-slave/workspace/Lucene-Solr-NightlyTests-master/checkout/lucene/build/core/classes/test:/home/jenkins/tools/ant/apache-ant-1.8.4/lib/ant-launcher.jar:/home/jenkins/.ant/lib/ivy-2.3.0.jar:/home/jenkins/tools/ant/apache-ant-1.8.4/lib/ant-apache-oro.jar:/home/jenkins/tools/ant/apache-ant-1.8.4/lib/ant-javamail.jar:/home/jenkins/tools/ant/apache-ant-1.8.4/lib/ant-jsch.jar:/home/jenkins/tools/ant/apache-ant-1.8.4/lib/ant-apache-resolver.jar:/home/jenkins/tools/ant/apache-ant-1.8.4/lib/ant-apache-bsf.jar:/home/jenkins/tools/ant/apache-ant-1.8.4/lib/ant-commons-logging.jar:/home/jenkins/tools/ant/apache-ant-1.8.4/lib/ant-apache-xalan2.jar:/home/jenkins/tools/ant/apache-ant-1.8.4/lib/ant-jdepend.jar:/home/jenkins/tools/ant/apache-ant-1.8.4/lib/ant-junit.jar:/home/jenkins/tools/ant/apache-ant-1.8.4/lib/ant-netrexx.jar:/home/jenkins/tools/ant/apache-ant-1.8.4/lib/ant-commons-net.jar:/home/jenkins/tools/ant/apache-ant-1.8.4/lib/ant-apache-regexp.jar:/home/jenkins/tools/ant/apache-ant-1.8.4/lib/ant-jai.jar:/home/jenkins/tools/ant/apache-ant-1.8.4/lib/ant-junit4.jar:/home/jenkins/tools/ant/apache-ant-1.8.4/lib/ant-testutil.jar:/home/jenkins/tools/ant/apache-ant-1.8.4/lib/ant-jmf.jar:/home/jenkins/tools/ant/apache-ant-1.8.4/lib/ant-antlr.jar:/home/jenkins/tools/ant/apache-ant-1.8.4/lib/ant-swing.jar:/home/jenkins/tools/ant/apache-ant-1.8.4/lib/ant.jar:/home/jenkins/tools/ant/apache-ant-1.8.4/lib/ant-apache-bcel.jar:/home/jenkins/tools/ant/apache-ant-1.8.4/lib/ant-apache-log4j.jar:/usr/local/asfpackages/java/jdk1.8.0_131/lib/tools.jar:/home/jenkins/.ivy2/cache/com.carrotsearch.randomizedtesting/junit4-ant/jars/junit4-ant-2.5.2.jar
com.carrotsearch.ant.tasks.junit4.slave.SlaveMainSafe -eventsfile /home/jenkins/jenkins-slave/workspace/Lucene-Solr-NightlyTests-master/checkout/lucene/build/core/test/temp/junit4-J0-20170712_070941_6163348084582467318555.events
@/home/jenkins/jenkins-slave/workspace/Lucene-Solr-NightlyTests-master/checkout/lucene/build/core/test/temp/junit4-J0-20170712_070941_6166850120803246205.suites
-stdin
>>  [junit4] ERROR: JVM J0 ended with an exception: Quit event not received from the
forked process? This may indicate JVM crash or runner bugs.
>>  [junit4] 	at com.carrotsearch.ant.tasks.junit4.JUnit4.executeSlave(JUnit4.java:1540)
>>  [junit4] 	at com.carrotsearch.ant.tasks.junit4.JUnit4.access$000(JUnit4.java:126)
>>  [junit4] 	at com.carrotsearch.ant.tasks.junit4.JUnit4$2.call(JUnit4.java:982)
>>  [junit4] 	at com.carrotsearch.ant.tasks.junit4.JUnit4$2.call(JUnit4.java:979)
>>  [junit4] 	at java.util.concurrent.FutureTask.run(FutureTask.java:266)
>>  [junit4] 	at java.util.concurrent.ThreadPoolExecutor.runWorker(ThreadPoolExecutor.java:1142)
>>  [junit4] 	at java.util.concurrent.ThreadPoolExecutor$Worker.run(ThreadPoolExecutor.java:617)
>>  [junit4] 	at java.lang.Thread.run(Thread.java:748)
>>  [junit4] ERROR: JVM J1 ended with an exception, command line: /usr/local/asfpackages/java/jdk1.8.0_131/jre/bin/java
-XX:+HeapDumpOnOutOfMemoryError -XX:HeapDumpPath=/home/jenkins/jenkins-slave/workspace/Lucene-Solr-NightlyTests-master/checkout/heapdumps
-ea -esa -Dtests.prefix=tests -Dtests.seed=55E4911CB74D62C9 -Xmx512M -Dtests.iters= -Dtests.verbose=false
-Dtests.infostream=false -Dtests.codec=random -Dtests.postingsformat=random -Dtests.docvaluesformat=random
-Dtests.locale=random -Dtests.timezone=random -Dtests.directory=random -Dtests.linedocsfile=/home/jenkins/jenkins-slave/workspace/Lucene-Solr-NightlyTests-master/test-data/enwiki.random.lines.txt
-Dtests.luceneMatchVersion=8.0.0 -Dtests.cleanthreads=perMethod -Djava.util.logging.config.file=/home/jenkins/jenkins-slave/workspace/Lucene-Solr-NightlyTests-master/checkout/lucene/tools/junit4/logging.properties
-Dtests.nightly=true -Dtests.weekly=false -Dtests.monster=false -Dtests.slow=true -Dtests.asserts=true
-Dtests.multiplier=2 -DtempDir=./temp -Djava.io.tmpdir=./temp -Djunit4.tempDir=/home/jenkins/jenkins-slave/workspace/Lucene-Solr-NightlyTests-master/checkout/lucene/build/core/test/temp
-Dcommon.dir=/home/jenkins/jenkins-slave/workspace/Lucene-Solr-NightlyTests-master/checkout/lucene
-Dclover.db.dir=/home/jenkins/jenkins-slave/workspace/Lucene-Solr-NightlyTests-master/checkout/lucene/build/clover/db
-Djava.security.policy=/home/jenkins/jenkins-slave/workspace/Lucene-Solr-NightlyTests-master/checkout/lucene/tools/junit4/tests.policy
-Dtests.LUCENE_VERSION=8.0.0 -Djetty.testMode=1 -Djetty.insecurerandom=1 -Dsolr.directoryFactory=org.apache.solr.core.MockDirectoryFactory
-Djava.awt.headless=true -Djdk.map.althashing.threshold=0 -Dtests.src.home=/home/jenkins/jenkins-slave/workspace/Lucene-Solr-NightlyTests-master/checkout
-Djunit4.childvm.cwd=/home/jenkins/jenkins-slave/workspace/Lucene-Solr-NightlyTests-master/checkout/lucene/build/core/test/J1
-Djunit4.childvm.id=1 -Djunit4.childvm.count=3 -Dtests.leaveTemporary=false -Dtests.filterstacks=true
-Djava.security.manager=org.apache.lucene.util.TestSecurityManager -Dfile.encoding=ISO-8859-1
-classpath /home/jenkins/jenkins-slave/workspace/Lucene-Solr-NightlyTests-master/checkout/lucene/build/codecs/classes/java:/home/jenkins/jenkins-slave/workspace/Lucene-Solr-NightlyTests-master/checkout/lucene/build/test-framework/classes/java:/home/jenkins/jenkins-slave/workspace/Lucene-Solr-NightlyTests-master/checkout/lucene/test-framework/lib/junit-4.10.jar:/home/jenkins/jenkins-slave/workspace/Lucene-Solr-NightlyTests-master/checkout/lucene/test-framework/lib/randomizedtesting-runner-2.5.2.jar:/home/jenkins/jenkins-slave/workspace/Lucene-Solr-NightlyTests-master/checkout/lucene/build/core/classes/java:/home/jenkins/jenkins-slave/workspace/Lucene-Solr-NightlyTests-master/checkout/lucene/build/core/classes/test:/home/jenkins/tools/ant/apache-ant-1.8.4/lib/ant-launcher.jar:/home/jenkins/.ant/lib/ivy-2.3.0.jar:/home/jenkins/tools/ant/apache-ant-1.8.4/lib/ant-apache-oro.jar:/home/jenkins/tools/ant/apache-ant-1.8.4/lib/ant-javamail.jar:/home/jenkins/tools/ant/apache-ant-1.8.4/lib/ant-jsch.jar:/home/jenkins/tools/ant/apache-ant-1.8.4/lib/ant-apache-resolver.jar:/home/jenkins/tools/ant/apache-ant-1.8.4/lib/ant-apache-bsf.jar:/home/jenkins/tools/ant/apache-ant-1.8.4/lib/ant-commons-logging.jar:/home/jenkins/tools/ant/apache-ant-1.8.4/lib/ant-apache-xalan2.jar:/home/jenkins/tools/ant/apache-ant-1.8.4/lib/ant-jdepend.jar:/home/jenkins/tools/ant/apache-ant-1.8.4/lib/ant-junit.jar:/home/jenkins/tools/ant/apache-ant-1.8.4/lib/ant-netrexx.jar:/home/jenkins/tools/ant/apache-ant-1.8.4/lib/ant-commons-net.jar:/home/jenkins/tools/ant/apache-ant-1.8.4/lib/ant-apache-regexp.jar:/home/jenkins/tools/ant/apache-ant-1.8.4/lib/ant-jai.jar:/home/jenkins/tools/ant/apache-ant-1.8.4/lib/ant-junit4.jar:/home/jenkins/tools/ant/apache-ant-1.8.4/lib/ant-testutil.jar:/home/jenkins/tools/ant/apache-ant-1.8.4/lib/ant-jmf.jar:/home/jenkins/tools/ant/apache-ant-1.8.4/lib/ant-antlr.jar:/home/jenkins/tools/ant/apache-ant-1.8.4/lib/ant-swing.jar:/home/jenkins/tools/ant/apache-ant-1.8.4/lib/ant.jar:/home/jenkins/tools/ant/apache-ant-1.8.4/lib/ant-apache-bcel.jar:/home/jenkins/tools/ant/apache-ant-1.8.4/lib/ant-apache-log4j.jar:/usr/local/asfpackages/java/jdk1.8.0_131/lib/tools.jar:/home/jenkins/.ivy2/cache/com.carrotsearch.randomizedtesting/junit4-ant/jars/junit4-ant-2.5.2.jar
com.carrotsearch.ant.tasks.junit4.slave.SlaveMainSafe -eventsfile /home/jenkins/jenkins-slave/workspace/Lucene-Solr-NightlyTests-master/checkout/lucene/build/core/test/temp/junit4-J1-20170712_070941_6341196093693912703591.events
@/home/jenkins/jenkins-slave/workspace/Lucene-Solr-NightlyTests-master/checkout/lucene/build/core/test/temp/junit4-J1-20170712_070941_6348978994367824159899.suites
-stdin
>>  [junit4] ERROR: JVM J1 ended with an exception: Quit event not received from the
forked process? This may indicate JVM crash or runner bugs.
>>  [junit4] 	at com.carrotsearch.ant.tasks.junit4.JUnit4.executeSlave(JUnit4.java:1540)
>>  [junit4] 	at com.carrotsearch.ant.tasks.junit4.JUnit4.access$000(JUnit4.java:126)
>>  [junit4] 	at com.carrotsearch.ant.tasks.junit4.JUnit4$2.call(JUnit4.java:982)
>>  [junit4] 	at com.carrotsearch.ant.tasks.junit4.JUnit4$2.call(JUnit4.java:979)
>>  [junit4] 	at java.util.concurrent.FutureTask.run(FutureTask.java:266)
>>  [junit4] 	at java.util.concurrent.ThreadPoolExecutor.runWorker(ThreadPoolExecutor.java:1142)
>>  [junit4] 	at java.util.concurrent.ThreadPoolExecutor$Worker.run(ThreadPoolExecutor.java:617)
>>  [junit4] 	at java.lang.Thread.run(Thread.java:748)
>>  [junit4] ERROR: JVM J2 ended with an exception, command line: /usr/local/asfpackages/java/jdk1.8.0_131/jre/bin/java
-XX:+HeapDumpOnOutOfMemoryError -XX:HeapDumpPath=/home/jenkins/jenkins-slave/workspace/Lucene-Solr-NightlyTests-master/checkout/heapdumps
-ea -esa -Dtests.prefix=tests -Dtests.seed=55E4911CB74D62C9 -Xmx512M -Dtests.iters= -Dtests.verbose=false
-Dtests.infostream=false -Dtests.codec=random -Dtests.postingsformat=random -Dtests.docvaluesformat=random
-Dtests.locale=random -Dtests.timezone=random -Dtests.directory=random -Dtests.linedocsfile=/home/jenkins/jenkins-slave/workspace/Lucene-Solr-NightlyTests-master/test-data/enwiki.random.lines.txt
-Dtests.luceneMatchVersion=8.0.0 -Dtests.cleanthreads=perMethod -Djava.util.logging.config.file=/home/jenkins/jenkins-slave/workspace/Lucene-Solr-NightlyTests-master/checkout/lucene/tools/junit4/logging.properties
-Dtests.nightly=true -Dtests.weekly=false -Dtests.monster=false -Dtests.slow=true -Dtests.asserts=true
-Dtests.multiplier=2 -DtempDir=./temp -Djava.io.tmpdir=./temp -Djunit4.tempDir=/home/jenkins/jenkins-slave/workspace/Lucene-Solr-NightlyTests-master/checkout/lucene/build/core/test/temp
-Dcommon.dir=/home/jenkins/jenkins-slave/workspace/Lucene-Solr-NightlyTests-master/checkout/lucene
-Dclover.db.dir=/home/jenkins/jenkins-slave/workspace/Lucene-Solr-NightlyTests-master/checkout/lucene/build/clover/db
-Djava.security.policy=/home/jenkins/jenkins-slave/workspace/Lucene-Solr-NightlyTests-master/checkout/lucene/tools/junit4/tests.policy
-Dtests.LUCENE_VERSION=8.0.0 -Djetty.testMode=1 -Djetty.insecurerandom=1 -Dsolr.directoryFactory=org.apache.solr.core.MockDirectoryFactory
-Djava.awt.headless=true -Djdk.map.althashing.threshold=0 -Dtests.src.home=/home/jenkins/jenkins-slave/workspace/Lucene-Solr-NightlyTests-master/checkout
-Djunit4.childvm.cwd=/home/jenkins/jenkins-slave/workspace/Lucene-Solr-NightlyTests-master/checkout/lucene/build/core/test/J2
-Djunit4.childvm.id=2 -Djunit4.childvm.count=3 -Dtests.leaveTemporary=false -Dtests.filterstacks=true
-Djava.security.manager=org.apache.lucene.util.TestSecurityManager -Dfile.encoding=ISO-8859-1
-classpath /home/jenkins/jenkins-slave/workspace/Lucene-Solr-NightlyTests-master/checkout/lucene/build/codecs/classes/java:/home/jenkins/jenkins-slave/workspace/Lucene-Solr-NightlyTests-master/checkout/lucene/build/test-framework/classes/java:/home/jenkins/jenkins-slave/workspace/Lucene-Solr-NightlyTests-master/checkout/lucene/test-framework/lib/junit-4.10.jar:/home/jenkins/jenkins-slave/workspace/Lucene-Solr-NightlyTests-master/checkout/lucene/test-framework/lib/randomizedtesting-runner-2.5.2.jar:/home/jenkins/jenkins-slave/workspace/Lucene-Solr-NightlyTests-master/checkout/lucene/build/core/classes/java:/home/jenkins/jenkins-slave/workspace/Lucene-Solr-NightlyTests-master/checkout/lucene/build/core/classes/test:/home/jenkins/tools/ant/apache-ant-1.8.4/lib/ant-launcher.jar:/home/jenkins/.ant/lib/ivy-2.3.0.jar:/home/jenkins/tools/ant/apache-ant-1.8.4/lib/ant-apache-oro.jar:/home/jenkins/tools/ant/apache-ant-1.8.4/lib/ant-javamail.jar:/home/jenkins/tools/ant/apache-ant-1.8.4/lib/ant-jsch.jar:/home/jenkins/tools/ant/apache-ant-1.8.4/lib/ant-apache-resolver.jar:/home/jenkins/tools/ant/apache-ant-1.8.4/lib/ant-apache-bsf.jar:/home/jenkins/tools/ant/apache-ant-1.8.4/lib/ant-commons-logging.jar:/home/jenkins/tools/ant/apache-ant-1.8.4/lib/ant-apache-xalan2.jar:/home/jenkins/tools/ant/apache-ant-1.8.4/lib/ant-jdepend.jar:/home/jenkins/tools/ant/apache-ant-1.8.4/lib/ant-junit.jar:/home/jenkins/tools/ant/apache-ant-1.8.4/lib/ant-netrexx.jar:/home/jenkins/tools/ant/apache-ant-1.8.4/lib/ant-commons-net.jar:/home/jenkins/tools/ant/apache-ant-1.8.4/lib/ant-apache-regexp.jar:/home/jenkins/tools/ant/apache-ant-1.8.4/lib/ant-jai.jar:/home/jenkins/tools/ant/apache-ant-1.8.4/lib/ant-junit4.jar:/home/jenkins/tools/ant/apache-ant-1.8.4/lib/ant-testutil.jar:/home/jenkins/tools/ant/apache-ant-1.8.4/lib/ant-jmf.jar:/home/jenkins/tools/ant/apache-ant-1.8.4/lib/ant-antlr.jar:/home/jenkins/tools/ant/apache-ant-1.8.4/lib/ant-swing.jar:/home/jenkins/tools/ant/apache-ant-1.8.4/lib/ant.jar:/home/jenkins/tools/ant/apache-ant-1.8.4/lib/ant-apache-bcel.jar:/home/jenkins/tools/ant/apache-ant-1.8.4/lib/ant-apache-log4j.jar:/usr/local/asfpackages/java/jdk1.8.0_131/lib/tools.jar:/home/jenkins/.ivy2/cache/com.carrotsearch.randomizedtesting/junit4-ant/jars/junit4-ant-2.5.2.jar
com.carrotsearch.ant.tasks.junit4.slave.SlaveMainSafe -eventsfile /home/jenkins/jenkins-slave/workspace/Lucene-Solr-NightlyTests-master/checkout/lucene/build/core/test/temp/junit4-J2-20170712_070941_6343973825201621029068.events
@/home/jenkins/jenkins-slave/workspace/Lucene-Solr-NightlyTests-master/checkout/lucene/build/core/test/temp/junit4-J2-20170712_070941_6345414770058120710840.suites
-stdin
>>  [junit4] ERROR: JVM J2 ended with an exception: Quit event not received from the
forked process? This may indicate JVM crash or runner bugs.
>>  [junit4] 	at com.carrotsearch.ant.tasks.junit4.JUnit4.executeSlave(JUnit4.java:1540)
>>  [junit4] 	at com.carrotsearch.ant.tasks.junit4.JUnit4.access$000(JUnit4.java:126)
>>  [junit4] 	at com.carrotsearch.ant.tasks.junit4.JUnit4$2.call(JUnit4.java:982)
>>  [junit4] 	at com.carrotsearch.ant.tasks.junit4.JUnit4$2.call(JUnit4.java:979)
>>  [junit4] 	at java.util.concurrent.FutureTask.run(FutureTask.java:266)
>>  [junit4] 	at java.util.concurrent.ThreadPoolExecutor.runWorker(ThreadPoolExecutor.java:1142)
>>  [junit4] 	at java.util.concurrent.ThreadPoolExecutor$Worker.run(ThreadPoolExecutor.java:617)
>>  [junit4] 	at java.lang.Thread.run(Thread.java:748)
>> 
>> BUILD FAILED
>> /home/jenkins/jenkins-slave/workspace/Lucene-Solr-NightlyTests-master/checkout/build.xml:818:
The following error occurred while executing this line:
>> /home/jenkins/jenkins-slave/workspace/Lucene-Solr-NightlyTests-master/checkout/build.xml:754:
The following error occurred while executing this line:
>> /home/jenkins/jenkins-slave/workspace/Lucene-Solr-NightlyTests-master/checkout/build.xml:59:
The following error occurred while executing this line:
>> /home/jenkins/jenkins-slave/workspace/Lucene-Solr-NightlyTests-master/checkout/lucene/build.xml:50:
The following error occurred while executing this line:
>> /home/jenkins/jenkins-slave/workspace/Lucene-Solr-NightlyTests-master/checkout/lucene/common-build.xml:1455:
The following error occurred while executing this line:
>> /home/jenkins/jenkins-slave/workspace/Lucene-Solr-NightlyTests-master/checkout/lucene/common-build.xml:985:
At least one slave process threw an exception, first: Quit event not received from the forked
process? This may indicate JVM crash or runner bugs.
>> 
>> Total time: 2 minutes 1 second
>> Build step 'Invoke Ant' marked build as failure
>> Archiving artifacts
>> No artifacts from Lucene-Solr-NightlyTests-master #1349 to compare, so performing
full copy of artifacts
>> Recording test results
>> Email was triggered for: Failure - Any
>> Sending email for trigger: Failure - Any
>> 
>> ---------------------------------------------------------------------
>> To unsubscribe, e-mail: dev-unsubscribe@lucene.apache.org
>> For additional commands, e-mail: dev-help@lucene.apache.org
> 


---------------------------------------------------------------------
To unsubscribe, e-mail: dev-unsubscribe@lucene.apache.org
For additional commands, e-mail: dev-help@lucene.apache.org


Mime
View raw message