lucene-dev mailing list archives

Site index · List index
Message view « Date » · « Thread »
Top « Date » · « Thread »
From Policeman Jenkins Server <jenk...@thetaphi.de>
Subject [JENKINS] Lucene-Solr-master-Linux (64bit/jdk1.8.0_144) - Build # 20376 - Still Unstable!
Date Sat, 26 Aug 2017 13:53:08 GMT
Build: https://jenkins.thetaphi.de/job/Lucene-Solr-master-Linux/20376/
Java: 64bit/jdk1.8.0_144 -XX:-UseCompressedOops -XX:+UseConcMarkSweepGC

1 tests failed.
FAILED:  org.apache.solr.metrics.reporters.SolrSlf4jReporterTest.testReporter

Error Message:
count1=7, count2=7 - no 'solr.node' logs in: {numFound=0,start=0,docs=[]}

Stack Trace:
java.lang.AssertionError: count1=7, count2=7 - no 'solr.node' logs in: {numFound=0,start=0,docs=[]}
	at __randomizedtesting.SeedInfo.seed([CEC0AA9A433E04B0:912487AD283297F5]:0)
	at org.junit.Assert.fail(Assert.java:93)
	at org.apache.solr.metrics.reporters.SolrSlf4jReporterTest.testReporter(SolrSlf4jReporterTest.java:90)
	at sun.reflect.NativeMethodAccessorImpl.invoke0(Native Method)
	at sun.reflect.NativeMethodAccessorImpl.invoke(NativeMethodAccessorImpl.java:62)
	at sun.reflect.DelegatingMethodAccessorImpl.invoke(DelegatingMethodAccessorImpl.java:43)
	at java.lang.reflect.Method.invoke(Method.java:498)
	at com.carrotsearch.randomizedtesting.RandomizedRunner.invoke(RandomizedRunner.java:1713)
	at com.carrotsearch.randomizedtesting.RandomizedRunner$8.evaluate(RandomizedRunner.java:907)
	at com.carrotsearch.randomizedtesting.RandomizedRunner$9.evaluate(RandomizedRunner.java:943)
	at com.carrotsearch.randomizedtesting.RandomizedRunner$10.evaluate(RandomizedRunner.java:957)
	at com.carrotsearch.randomizedtesting.rules.SystemPropertiesRestoreRule$1.evaluate(SystemPropertiesRestoreRule.java:57)
	at org.apache.lucene.util.TestRuleSetupTeardownChained$1.evaluate(TestRuleSetupTeardownChained.java:49)
	at org.apache.lucene.util.AbstractBeforeAfterRule$1.evaluate(AbstractBeforeAfterRule.java:45)
	at org.apache.lucene.util.TestRuleThreadAndTestName$1.evaluate(TestRuleThreadAndTestName.java:48)
	at org.apache.lucene.util.TestRuleIgnoreAfterMaxFailures$1.evaluate(TestRuleIgnoreAfterMaxFailures.java:64)
	at org.apache.lucene.util.TestRuleMarkFailure$1.evaluate(TestRuleMarkFailure.java:47)
	at com.carrotsearch.randomizedtesting.rules.StatementAdapter.evaluate(StatementAdapter.java:36)
	at com.carrotsearch.randomizedtesting.ThreadLeakControl$StatementRunner.run(ThreadLeakControl.java:368)
	at com.carrotsearch.randomizedtesting.ThreadLeakControl.forkTimeoutingTask(ThreadLeakControl.java:817)
	at com.carrotsearch.randomizedtesting.ThreadLeakControl$3.evaluate(ThreadLeakControl.java:468)
	at com.carrotsearch.randomizedtesting.RandomizedRunner.runSingleTest(RandomizedRunner.java:916)
	at com.carrotsearch.randomizedtesting.RandomizedRunner$5.evaluate(RandomizedRunner.java:802)
	at com.carrotsearch.randomizedtesting.RandomizedRunner$6.evaluate(RandomizedRunner.java:852)
	at com.carrotsearch.randomizedtesting.RandomizedRunner$7.evaluate(RandomizedRunner.java:863)
	at com.carrotsearch.randomizedtesting.rules.StatementAdapter.evaluate(StatementAdapter.java:36)
	at com.carrotsearch.randomizedtesting.rules.SystemPropertiesRestoreRule$1.evaluate(SystemPropertiesRestoreRule.java:57)
	at org.apache.lucene.util.AbstractBeforeAfterRule$1.evaluate(AbstractBeforeAfterRule.java:45)
	at com.carrotsearch.randomizedtesting.rules.StatementAdapter.evaluate(StatementAdapter.java:36)
	at org.apache.lucene.util.TestRuleStoreClassName$1.evaluate(TestRuleStoreClassName.java:41)
	at com.carrotsearch.randomizedtesting.rules.NoShadowingOrOverridesOnMethodsRule$1.evaluate(NoShadowingOrOverridesOnMethodsRule.java:40)
	at com.carrotsearch.randomizedtesting.rules.NoShadowingOrOverridesOnMethodsRule$1.evaluate(NoShadowingOrOverridesOnMethodsRule.java:40)
	at com.carrotsearch.randomizedtesting.rules.StatementAdapter.evaluate(StatementAdapter.java:36)
	at com.carrotsearch.randomizedtesting.rules.StatementAdapter.evaluate(StatementAdapter.java:36)
	at com.carrotsearch.randomizedtesting.rules.StatementAdapter.evaluate(StatementAdapter.java:36)
	at org.apache.lucene.util.TestRuleAssertionsRequired$1.evaluate(TestRuleAssertionsRequired.java:53)
	at org.apache.lucene.util.TestRuleMarkFailure$1.evaluate(TestRuleMarkFailure.java:47)
	at org.apache.lucene.util.TestRuleIgnoreAfterMaxFailures$1.evaluate(TestRuleIgnoreAfterMaxFailures.java:64)
	at org.apache.lucene.util.TestRuleIgnoreTestSuites$1.evaluate(TestRuleIgnoreTestSuites.java:54)
	at com.carrotsearch.randomizedtesting.rules.StatementAdapter.evaluate(StatementAdapter.java:36)
	at com.carrotsearch.randomizedtesting.ThreadLeakControl$StatementRunner.run(ThreadLeakControl.java:368)
	at java.lang.Thread.run(Thread.java:748)




Build Log:
[...truncated 12825 lines...]
   [junit4] Suite: org.apache.solr.metrics.reporters.SolrSlf4jReporterTest
   [junit4]   2> Creating dataDir: /home/jenkins/workspace/Lucene-Solr-master-Linux/solr/build/solr-core/test/J1/temp/solr.metrics.reporters.SolrSlf4jReporterTest_CEC0AA9A433E04B0-001/init-core-data-001
   [junit4]   2> 2479640 WARN  (SUITE-SolrSlf4jReporterTest-seed#[CEC0AA9A433E04B0]-worker)
[    ] o.a.s.SolrTestCaseJ4 startTrackingSearchers: numOpens=8 numCloses=8
   [junit4]   2> 2479640 INFO  (SUITE-SolrSlf4jReporterTest-seed#[CEC0AA9A433E04B0]-worker)
[    ] o.a.s.SolrTestCaseJ4 Using PointFields (NUMERIC_POINTS_SYSPROP=true) w/NUMERIC_DOCVALUES_SYSPROP=true
   [junit4]   2> 2479641 INFO  (SUITE-SolrSlf4jReporterTest-seed#[CEC0AA9A433E04B0]-worker)
[    ] o.a.s.SolrTestCaseJ4 Randomized ssl (false) and clientAuth (true) via: @org.apache.solr.util.RandomizeSSL(reason=,
ssl=NaN, value=NaN, clientAuth=NaN)
   [junit4]   2> 2479641 INFO  (SUITE-SolrSlf4jReporterTest-seed#[CEC0AA9A433E04B0]-worker)
[    ] o.a.s.SolrTestCaseJ4 SecureRandom sanity checks: test.solr.allowed.securerandom=null
& java.security.egd=file:/dev/./urandom
   [junit4]   2> 2479649 INFO  (TEST-SolrSlf4jReporterTest.testReporter-seed#[CEC0AA9A433E04B0])
[    ] o.a.s.SolrTestCaseJ4 ###Starting testReporter
   [junit4]   2> 2486692 INFO  (TEST-SolrSlf4jReporterTest.testReporter-seed#[CEC0AA9A433E04B0])
[    ] o.a.s.SolrTestCaseJ4 ###Ending testReporter
   [junit4]   2> NOTE: reproduce with: ant test  -Dtestcase=SolrSlf4jReporterTest -Dtests.method=testReporter
-Dtests.seed=CEC0AA9A433E04B0 -Dtests.multiplier=3 -Dtests.slow=true -Dtests.locale=ja-JP-u-ca-japanese-x-lvariant-JP
-Dtests.timezone=Africa/Abidjan -Dtests.asserts=true -Dtests.file.encoding=UTF-8
   [junit4] FAILURE 7.05s J1 | SolrSlf4jReporterTest.testReporter <<<
   [junit4]    > Throwable #1: java.lang.AssertionError: count1=7, count2=7 - no 'solr.node'
logs in: {numFound=0,start=0,docs=[]}
   [junit4]    > 	at __randomizedtesting.SeedInfo.seed([CEC0AA9A433E04B0:912487AD283297F5]:0)
   [junit4]    > 	at org.apache.solr.metrics.reporters.SolrSlf4jReporterTest.testReporter(SolrSlf4jReporterTest.java:90)
   [junit4]    > 	at java.lang.Thread.run(Thread.java:748)
   [junit4]   2> 2486694 INFO  (SUITE-SolrSlf4jReporterTest-seed#[CEC0AA9A433E04B0]-worker)
[    ] o.a.s.SolrTestCaseJ4 ###deleteCore
   [junit4]   2> NOTE: leaving temporary files on disk at: /home/jenkins/workspace/Lucene-Solr-master-Linux/solr/build/solr-core/test/J1/temp/solr.metrics.reporters.SolrSlf4jReporterTest_CEC0AA9A433E04B0-001
   [junit4]   2> NOTE: test params are: codec=Asserting(Lucene70), sim=RandomSimilarity(queryNorm=true):
{}, locale=ja-JP-u-ca-japanese-x-lvariant-JP, timezone=Africa/Abidjan
   [junit4]   2> NOTE: Linux 4.10.0-27-generic amd64/Oracle Corporation 1.8.0_144 (64-bit)/cpus=8,threads=1,free=267838072,total=518979584
   [junit4]   2> NOTE: All tests run in this JVM: [BasicFunctionalityTest, TestCustomStream,
CleanupOldIndexTest, GraphQueryTest, TestAnalyzeInfixSuggestions, EnumFieldTest, TestExactSharedStatsCache,
ClassificationUpdateProcessorTest, TestPartialUpdateDeduplication, HdfsBasicDistributedZk2Test,
TestFieldCacheVsDocValues, TestSQLHandler, RestartWhileUpdatingTest, LeaderElectionContextKeyTest,
TestLeaderInitiatedRecoveryThread, TestSolrConfigHandlerConcurrent, DOMUtilTest, PropertiesRequestHandlerTest,
TestCloudDeleteByQuery, JSONWriterTest, DataDrivenBlockJoinTest, TestNumericTerms32, DirectSolrConnectionTest,
TestSchemaNameResource, BlockJoinFacetDistribTest, PrimUtilsTest, TestSolrJ, LukeRequestHandlerTest,
QueryParsingTest, AtomicUpdatesTest, DocValuesMultiTest, TestFieldResource, TestStressCloudBlindAtomicUpdates,
TestManagedSchemaThreadSafety, SortSpecParsingTest, TestElisionMultitermQuery, TermVectorComponentTest,
MissingSegmentRecoveryTest, IndexSchemaRuntimeFieldTest, ZkSolrClientTest, TestXIncludeConfig,
HdfsUnloadDistributedZkTest, TestJsonFacetRefinement, MetricUtilsTest, ImplicitSnitchTest,
HdfsChaosMonkeySafeLeaderTest, TestCharFilters, ExitableDirectoryReaderTest, SolrGraphiteReporterTest,
SolrCmdDistributorTest, TestCoreContainer, TestPayloadScoreQParserPlugin, TestFieldCacheReopen,
TestReloadAndDeleteDocs, MoveReplicaTest, TestSolrFieldCacheBean, TestRawResponseWriter, TestHalfAndHalfDocValues,
TestValueSourceCache, TestStreamBody, TestSweetSpotSimilarityFactory, TestHashPartitioner,
CdcrReplicationHandlerTest, TestSimpleTrackingShardHandler, LeaderInitiatedRecoveryOnCommitTest,
TestSolrCoreSnapshots, SpatialFilterTest, TestDFISimilarityFactory, ConnectionReuseTest, DistributedIntervalFacetingTest,
TestChildDocTransformer, ZkControllerTest, TestMultiValuedNumericRangeQuery, TestGraphMLResponseWriter,
CollectionsAPIDistributedZkTest, CoreMergeIndexesAdminHandlerTest, TestTrackingShardHandlerFactory,
CloudMLTQParserTest, TestSolrCloudWithDelegationTokens, BaseCdcrDistributedZkTest, TestScoreJoinQPNoScore,
ForceLeaderTest, SpellCheckComponentTest, TestComplexPhraseLeadingWildcard, SolrMetricReporterTest,
TestFastLRUCache, DistributedFacetPivotWhiteBoxTest, TestOrdValues, SOLR749Test, TestSmileRequest,
BadComponentTest, TlogReplayBufferedWhileIndexingTest, OutOfBoxZkACLAndCredentialsProvidersTest,
ScriptEngineTest, TestPerFieldSimilarity, TestSubQueryTransformerDistrib, CSVRequestHandlerTest,
DistributedTermsComponentTest, MoreLikeThisHandlerTest, TestCursorMarkWithoutUniqueKey, ReplicaListTransformerTest,
TestBM25SimilarityFactory, CollectionStateFormat2Test, ChaosMonkeyNothingIsSafeWithPullReplicasTest,
TestReplicationHandlerBackup, SubstringBytesRefFilterTest, TestRestManager, TestCloudSearcherWarming,
DeleteInactiveReplicaTest, DistributedSuggestComponentTest, SliceStateTest, ChaosMonkeySafeLeaderTest,
TestCloudManagedSchema, ShardRoutingCustomTest, TestRTGBase, StatsReloadRaceTest, SystemInfoHandlerTest,
TestSegmentSorting, TestDocBasedVersionConstraints, TestMaxScoreQueryParser, IgnoreCommitOptimizeUpdateProcessorFactoryTest,
OpenCloseCoreStressTest, LeaderElectionIntegrationTest, BasicZkTest, FullSolrCloudDistribCmdsTest,
TestZkChroot, ZkCLITest, AutoCommitTest, DistributedSpellCheckComponentTest, TestRealTimeGet,
TestReload, TestStressVersions, HardAutoCommitTest, SimpleFacetsTest, TestSolr4Spatial, ConvertedLegacyTest,
TestFiltering, ShowFileRequestHandlerTest, SimplePostToolTest, TestCoreDiscovery, AnalysisAfterCoreReloadTest,
TestExtendedDismaxParser, CoreAdminHandlerTest, DocValuesTest, SuggesterTSTTest, SuggesterTest,
TestStressLucene, SuggesterWFSTTest, TestCSVLoader, NoCacheHeaderTest, SchemaVersionSpecificBehaviorTest,
TestUpdate, TestAtomicUpdateErrorCases, TestWordDelimiterFilterFactory, DirectUpdateHandlerOptimizeTest,
DefaultValueUpdateProcessorTest, StatelessScriptUpdateProcessorFactoryTest, SortByFunctionTest,
TestRemoteStreaming, DistanceFunctionTest, TestSolrDeletionPolicy1, SolrInfoBeanTest, CacheHeaderTest,
DisMaxRequestHandlerTest, TestQueryUtils, DirectSolrSpellCheckerTest, TestQueryTypes, TestOmitPositions,
FileBasedSpellCheckerTest, RequestHandlersTest, DocumentBuilderTest, PathHierarchyTokenizerFactoryTest,
TestIndexingPerformance, RequiredFieldsTest, LoggingHandlerTest, IndexSchemaTest, TestJmxIntegration,
ReturnFieldsTest, UpdateRequestProcessorFactoryTest, MBeansHandlerTest, HighlighterConfigTest,
TestQuerySenderListener, AlternateDirectoryTest, TestSolrIndexConfig, CopyFieldTest, ResponseLogComponentTest,
TestStressRecovery, TestSystemIdResolver, DateFieldTest, SpellingQueryConverterTest, TestLRUCache,
TestDocumentBuilder, UUIDFieldTest, FileUtilsTest, DistributedMLTComponentTest, CursorPagingTest,
SolrTestCaseJ4Test, TestTolerantSearch, TestEmbeddedSolrServerConstructors, TestJettySolrRunner,
AssignBackwardCompatibilityTest, AssignTest, ChaosMonkeySafeLeaderWithPullReplicasTest, CollectionsAPIAsyncDistributedZkTest,
ConcurrentDeleteAndCreateCollectionTest, ConfigSetsAPITest, ConnectionManagerTest, CustomCollectionTest,
DistribCursorPagingTest, DistributedQueueTest, HttpPartitionTest, PeerSyncReplicationTest,
RemoteQueryErrorTest, RollingRestartTest, SolrCLIZkUtilsTest, SolrCloudExampleTest, TestCloudRecovery,
TestConfigSetsAPIExclusivity, TestConfigSetsAPIZkFailure, TestCryptoKeys, TestDownShardTolerantSearch,
TestExclusionRuleCollectionAccess, TestHdfsCloudBackupRestore, TestPrepRecovery, TestRandomRequestDistribution,
TestRequestForwarding, TestShortCircuitedRequests, TestSolrCloudWithSecureImpersonation, TestTolerantUpdateProcessorCloud,
ZkFailoverTest, HdfsRestartWhileUpdatingTest, HdfsSyncSliceTest, HdfsWriteToMultipleCollectionsTest,
TestClusterStateMutator, RulesTest, TestConfigSetProperties, TestInfoStreamLogging, TestSimpleTextCodec,
TestSolrConfigHandler, TestHdfsBackupRestoreCore, DistributedFacetPivotSmallTest, SuggestComponentContextFilterQueryTest,
TestUnifiedSolrHighlighter, TestLegacyField, TestLegacyFieldReuse, TestLegacyNumericUtils,
TestLegacyTerms, TestNumericRangeQuery32, TestNumericTokenStream, JvmMetricsTest, MetricsConfigTest,
SolrCoreMetricManagerTest, SolrJmxReporterCloudTest, SolrSlf4jReporterTest]
   [junit4] Completed [626/732 (1!)] on J1 in 7.09s, 1 test, 1 failure <<< FAILURES!

[...truncated 43698 lines...]

Mime
View raw message