lucene-dev mailing list archives

Site index · List index
Message view « Date » · « Thread »
Top « Date » · « Thread »
From Apache Jenkins Server <jenk...@builds.apache.org>
Subject [JENKINS] Lucene-Solr-Tests-master - Build # 2063 - Still Unstable
Date Mon, 07 Aug 2017 02:28:27 GMT
Build: https://builds.apache.org/job/Lucene-Solr-Tests-master/2063/

3 tests failed.
FAILED:  org.apache.solr.cloud.LeaderElectionContextKeyTest.test

Error Message:


Stack Trace:
java.lang.AssertionError
	at __randomizedtesting.SeedInfo.seed([F5A0231F0DD71BD6:7DF41CC5A32B762E]:0)
	at org.junit.Assert.fail(Assert.java:92)
	at org.junit.Assert.assertTrue(Assert.java:43)
	at org.junit.Assert.assertTrue(Assert.java:54)
	at org.apache.solr.cloud.LeaderElectionContextKeyTest.test(LeaderElectionContextKeyTest.java:88)
	at sun.reflect.NativeMethodAccessorImpl.invoke0(Native Method)
	at sun.reflect.NativeMethodAccessorImpl.invoke(NativeMethodAccessorImpl.java:62)
	at sun.reflect.DelegatingMethodAccessorImpl.invoke(DelegatingMethodAccessorImpl.java:43)
	at java.lang.reflect.Method.invoke(Method.java:498)
	at com.carrotsearch.randomizedtesting.RandomizedRunner.invoke(RandomizedRunner.java:1713)
	at com.carrotsearch.randomizedtesting.RandomizedRunner$8.evaluate(RandomizedRunner.java:907)
	at com.carrotsearch.randomizedtesting.RandomizedRunner$9.evaluate(RandomizedRunner.java:943)
	at com.carrotsearch.randomizedtesting.RandomizedRunner$10.evaluate(RandomizedRunner.java:957)
	at com.carrotsearch.randomizedtesting.rules.SystemPropertiesRestoreRule$1.evaluate(SystemPropertiesRestoreRule.java:57)
	at org.apache.lucene.util.TestRuleSetupTeardownChained$1.evaluate(TestRuleSetupTeardownChained.java:49)
	at org.apache.lucene.util.AbstractBeforeAfterRule$1.evaluate(AbstractBeforeAfterRule.java:45)
	at org.apache.lucene.util.TestRuleThreadAndTestName$1.evaluate(TestRuleThreadAndTestName.java:48)
	at org.apache.lucene.util.TestRuleIgnoreAfterMaxFailures$1.evaluate(TestRuleIgnoreAfterMaxFailures.java:64)
	at org.apache.lucene.util.TestRuleMarkFailure$1.evaluate(TestRuleMarkFailure.java:47)
	at com.carrotsearch.randomizedtesting.rules.StatementAdapter.evaluate(StatementAdapter.java:36)
	at com.carrotsearch.randomizedtesting.ThreadLeakControl$StatementRunner.run(ThreadLeakControl.java:368)
	at com.carrotsearch.randomizedtesting.ThreadLeakControl.forkTimeoutingTask(ThreadLeakControl.java:817)
	at com.carrotsearch.randomizedtesting.ThreadLeakControl$3.evaluate(ThreadLeakControl.java:468)
	at com.carrotsearch.randomizedtesting.RandomizedRunner.runSingleTest(RandomizedRunner.java:916)
	at com.carrotsearch.randomizedtesting.RandomizedRunner$5.evaluate(RandomizedRunner.java:802)
	at com.carrotsearch.randomizedtesting.RandomizedRunner$6.evaluate(RandomizedRunner.java:852)
	at com.carrotsearch.randomizedtesting.RandomizedRunner$7.evaluate(RandomizedRunner.java:863)
	at com.carrotsearch.randomizedtesting.rules.StatementAdapter.evaluate(StatementAdapter.java:36)
	at com.carrotsearch.randomizedtesting.rules.SystemPropertiesRestoreRule$1.evaluate(SystemPropertiesRestoreRule.java:57)
	at org.apache.lucene.util.AbstractBeforeAfterRule$1.evaluate(AbstractBeforeAfterRule.java:45)
	at com.carrotsearch.randomizedtesting.rules.StatementAdapter.evaluate(StatementAdapter.java:36)
	at org.apache.lucene.util.TestRuleStoreClassName$1.evaluate(TestRuleStoreClassName.java:41)
	at com.carrotsearch.randomizedtesting.rules.NoShadowingOrOverridesOnMethodsRule$1.evaluate(NoShadowingOrOverridesOnMethodsRule.java:40)
	at com.carrotsearch.randomizedtesting.rules.NoShadowingOrOverridesOnMethodsRule$1.evaluate(NoShadowingOrOverridesOnMethodsRule.java:40)
	at com.carrotsearch.randomizedtesting.rules.StatementAdapter.evaluate(StatementAdapter.java:36)
	at com.carrotsearch.randomizedtesting.rules.StatementAdapter.evaluate(StatementAdapter.java:36)
	at com.carrotsearch.randomizedtesting.rules.StatementAdapter.evaluate(StatementAdapter.java:36)
	at org.apache.lucene.util.TestRuleAssertionsRequired$1.evaluate(TestRuleAssertionsRequired.java:53)
	at org.apache.lucene.util.TestRuleMarkFailure$1.evaluate(TestRuleMarkFailure.java:47)
	at org.apache.lucene.util.TestRuleIgnoreAfterMaxFailures$1.evaluate(TestRuleIgnoreAfterMaxFailures.java:64)
	at org.apache.lucene.util.TestRuleIgnoreTestSuites$1.evaluate(TestRuleIgnoreTestSuites.java:54)
	at com.carrotsearch.randomizedtesting.rules.StatementAdapter.evaluate(StatementAdapter.java:36)
	at com.carrotsearch.randomizedtesting.ThreadLeakControl$StatementRunner.run(ThreadLeakControl.java:368)
	at java.lang.Thread.run(Thread.java:748)


FAILED:  org.apache.solr.handler.admin.StatsReloadRaceTest.testParallelReloadAndStats

Error Message:
Key SEARCHER.searcher.indexVersion not found in registry solr.core.collection1

Stack Trace:
java.lang.AssertionError: Key SEARCHER.searcher.indexVersion not found in registry solr.core.collection1
	at __randomizedtesting.SeedInfo.seed([F5A0231F0DD71BD6:3A3E462682267389]:0)
	at org.junit.Assert.fail(Assert.java:93)
	at org.junit.Assert.assertTrue(Assert.java:43)
	at org.apache.solr.handler.admin.StatsReloadRaceTest.requestMetrics(StatsReloadRaceTest.java:143)
	at org.apache.solr.handler.admin.StatsReloadRaceTest.testParallelReloadAndStats(StatsReloadRaceTest.java:77)
	at sun.reflect.NativeMethodAccessorImpl.invoke0(Native Method)
	at sun.reflect.NativeMethodAccessorImpl.invoke(NativeMethodAccessorImpl.java:62)
	at sun.reflect.DelegatingMethodAccessorImpl.invoke(DelegatingMethodAccessorImpl.java:43)
	at java.lang.reflect.Method.invoke(Method.java:498)
	at com.carrotsearch.randomizedtesting.RandomizedRunner.invoke(RandomizedRunner.java:1713)
	at com.carrotsearch.randomizedtesting.RandomizedRunner$8.evaluate(RandomizedRunner.java:907)
	at com.carrotsearch.randomizedtesting.RandomizedRunner$9.evaluate(RandomizedRunner.java:943)
	at com.carrotsearch.randomizedtesting.RandomizedRunner$10.evaluate(RandomizedRunner.java:957)
	at com.carrotsearch.randomizedtesting.rules.SystemPropertiesRestoreRule$1.evaluate(SystemPropertiesRestoreRule.java:57)
	at org.apache.lucene.util.TestRuleSetupTeardownChained$1.evaluate(TestRuleSetupTeardownChained.java:49)
	at org.apache.lucene.util.AbstractBeforeAfterRule$1.evaluate(AbstractBeforeAfterRule.java:45)
	at org.apache.lucene.util.TestRuleThreadAndTestName$1.evaluate(TestRuleThreadAndTestName.java:48)
	at org.apache.lucene.util.TestRuleIgnoreAfterMaxFailures$1.evaluate(TestRuleIgnoreAfterMaxFailures.java:64)
	at org.apache.lucene.util.TestRuleMarkFailure$1.evaluate(TestRuleMarkFailure.java:47)
	at com.carrotsearch.randomizedtesting.rules.StatementAdapter.evaluate(StatementAdapter.java:36)
	at com.carrotsearch.randomizedtesting.ThreadLeakControl$StatementRunner.run(ThreadLeakControl.java:368)
	at com.carrotsearch.randomizedtesting.ThreadLeakControl.forkTimeoutingTask(ThreadLeakControl.java:817)
	at com.carrotsearch.randomizedtesting.ThreadLeakControl$3.evaluate(ThreadLeakControl.java:468)
	at com.carrotsearch.randomizedtesting.RandomizedRunner.runSingleTest(RandomizedRunner.java:916)
	at com.carrotsearch.randomizedtesting.RandomizedRunner$5.evaluate(RandomizedRunner.java:802)
	at com.carrotsearch.randomizedtesting.RandomizedRunner$6.evaluate(RandomizedRunner.java:852)
	at com.carrotsearch.randomizedtesting.RandomizedRunner$7.evaluate(RandomizedRunner.java:863)
	at com.carrotsearch.randomizedtesting.rules.StatementAdapter.evaluate(StatementAdapter.java:36)
	at com.carrotsearch.randomizedtesting.rules.SystemPropertiesRestoreRule$1.evaluate(SystemPropertiesRestoreRule.java:57)
	at org.apache.lucene.util.AbstractBeforeAfterRule$1.evaluate(AbstractBeforeAfterRule.java:45)
	at com.carrotsearch.randomizedtesting.rules.StatementAdapter.evaluate(StatementAdapter.java:36)
	at org.apache.lucene.util.TestRuleStoreClassName$1.evaluate(TestRuleStoreClassName.java:41)
	at com.carrotsearch.randomizedtesting.rules.NoShadowingOrOverridesOnMethodsRule$1.evaluate(NoShadowingOrOverridesOnMethodsRule.java:40)
	at com.carrotsearch.randomizedtesting.rules.NoShadowingOrOverridesOnMethodsRule$1.evaluate(NoShadowingOrOverridesOnMethodsRule.java:40)
	at com.carrotsearch.randomizedtesting.rules.StatementAdapter.evaluate(StatementAdapter.java:36)
	at com.carrotsearch.randomizedtesting.rules.StatementAdapter.evaluate(StatementAdapter.java:36)
	at com.carrotsearch.randomizedtesting.rules.StatementAdapter.evaluate(StatementAdapter.java:36)
	at org.apache.lucene.util.TestRuleAssertionsRequired$1.evaluate(TestRuleAssertionsRequired.java:53)
	at org.apache.lucene.util.TestRuleMarkFailure$1.evaluate(TestRuleMarkFailure.java:47)
	at org.apache.lucene.util.TestRuleIgnoreAfterMaxFailures$1.evaluate(TestRuleIgnoreAfterMaxFailures.java:64)
	at org.apache.lucene.util.TestRuleIgnoreTestSuites$1.evaluate(TestRuleIgnoreTestSuites.java:54)
	at com.carrotsearch.randomizedtesting.rules.StatementAdapter.evaluate(StatementAdapter.java:36)
	at com.carrotsearch.randomizedtesting.ThreadLeakControl$StatementRunner.run(ThreadLeakControl.java:368)
	at java.lang.Thread.run(Thread.java:748)


FAILED:  org.apache.solr.cloud.SolrCLIZkUtilsTest.testCp

Error Message:
Empty files should NOT be copied down as directories

Stack Trace:
java.lang.AssertionError: Empty files should NOT be copied down as directories
	at __randomizedtesting.SeedInfo.seed([F5A0231F0DD71BD6:1E4CDE51C97EA5B4]:0)
	at org.junit.Assert.fail(Assert.java:93)
	at org.junit.Assert.assertTrue(Assert.java:43)
	at org.apache.solr.cloud.SolrCLIZkUtilsTest.testCp(SolrCLIZkUtilsTest.java:449)
	at sun.reflect.NativeMethodAccessorImpl.invoke0(Native Method)
	at sun.reflect.NativeMethodAccessorImpl.invoke(NativeMethodAccessorImpl.java:62)
	at sun.reflect.DelegatingMethodAccessorImpl.invoke(DelegatingMethodAccessorImpl.java:43)
	at java.lang.reflect.Method.invoke(Method.java:498)
	at com.carrotsearch.randomizedtesting.RandomizedRunner.invoke(RandomizedRunner.java:1713)
	at com.carrotsearch.randomizedtesting.RandomizedRunner$8.evaluate(RandomizedRunner.java:907)
	at com.carrotsearch.randomizedtesting.RandomizedRunner$9.evaluate(RandomizedRunner.java:943)
	at com.carrotsearch.randomizedtesting.RandomizedRunner$10.evaluate(RandomizedRunner.java:957)
	at com.carrotsearch.randomizedtesting.rules.SystemPropertiesRestoreRule$1.evaluate(SystemPropertiesRestoreRule.java:57)
	at org.apache.lucene.util.TestRuleSetupTeardownChained$1.evaluate(TestRuleSetupTeardownChained.java:49)
	at org.apache.lucene.util.AbstractBeforeAfterRule$1.evaluate(AbstractBeforeAfterRule.java:45)
	at org.apache.lucene.util.TestRuleThreadAndTestName$1.evaluate(TestRuleThreadAndTestName.java:48)
	at org.apache.lucene.util.TestRuleIgnoreAfterMaxFailures$1.evaluate(TestRuleIgnoreAfterMaxFailures.java:64)
	at org.apache.lucene.util.TestRuleMarkFailure$1.evaluate(TestRuleMarkFailure.java:47)
	at com.carrotsearch.randomizedtesting.rules.StatementAdapter.evaluate(StatementAdapter.java:36)
	at com.carrotsearch.randomizedtesting.ThreadLeakControl$StatementRunner.run(ThreadLeakControl.java:368)
	at com.carrotsearch.randomizedtesting.ThreadLeakControl.forkTimeoutingTask(ThreadLeakControl.java:817)
	at com.carrotsearch.randomizedtesting.ThreadLeakControl$3.evaluate(ThreadLeakControl.java:468)
	at com.carrotsearch.randomizedtesting.RandomizedRunner.runSingleTest(RandomizedRunner.java:916)
	at com.carrotsearch.randomizedtesting.RandomizedRunner$5.evaluate(RandomizedRunner.java:802)
	at com.carrotsearch.randomizedtesting.RandomizedRunner$6.evaluate(RandomizedRunner.java:852)
	at com.carrotsearch.randomizedtesting.RandomizedRunner$7.evaluate(RandomizedRunner.java:863)
	at com.carrotsearch.randomizedtesting.rules.StatementAdapter.evaluate(StatementAdapter.java:36)
	at com.carrotsearch.randomizedtesting.rules.SystemPropertiesRestoreRule$1.evaluate(SystemPropertiesRestoreRule.java:57)
	at org.apache.lucene.util.AbstractBeforeAfterRule$1.evaluate(AbstractBeforeAfterRule.java:45)
	at com.carrotsearch.randomizedtesting.rules.StatementAdapter.evaluate(StatementAdapter.java:36)
	at org.apache.lucene.util.TestRuleStoreClassName$1.evaluate(TestRuleStoreClassName.java:41)
	at com.carrotsearch.randomizedtesting.rules.NoShadowingOrOverridesOnMethodsRule$1.evaluate(NoShadowingOrOverridesOnMethodsRule.java:40)
	at com.carrotsearch.randomizedtesting.rules.NoShadowingOrOverridesOnMethodsRule$1.evaluate(NoShadowingOrOverridesOnMethodsRule.java:40)
	at com.carrotsearch.randomizedtesting.rules.StatementAdapter.evaluate(StatementAdapter.java:36)
	at com.carrotsearch.randomizedtesting.rules.StatementAdapter.evaluate(StatementAdapter.java:36)
	at com.carrotsearch.randomizedtesting.rules.StatementAdapter.evaluate(StatementAdapter.java:36)
	at org.apache.lucene.util.TestRuleAssertionsRequired$1.evaluate(TestRuleAssertionsRequired.java:53)
	at org.apache.lucene.util.TestRuleMarkFailure$1.evaluate(TestRuleMarkFailure.java:47)
	at org.apache.lucene.util.TestRuleIgnoreAfterMaxFailures$1.evaluate(TestRuleIgnoreAfterMaxFailures.java:64)
	at org.apache.lucene.util.TestRuleIgnoreTestSuites$1.evaluate(TestRuleIgnoreTestSuites.java:54)
	at com.carrotsearch.randomizedtesting.rules.StatementAdapter.evaluate(StatementAdapter.java:36)
	at com.carrotsearch.randomizedtesting.ThreadLeakControl$StatementRunner.run(ThreadLeakControl.java:368)
	at java.lang.Thread.run(Thread.java:748)




Build Log:
[...truncated 11780 lines...]
   [junit4] Suite: org.apache.solr.handler.admin.StatsReloadRaceTest
   [junit4]   2> Creating dataDir: /x1/jenkins/jenkins-slave/workspace/Lucene-Solr-Tests-master/solr/build/solr-core/test/J2/temp/solr.handler.admin.StatsReloadRaceTest_F5A0231F0DD71BD6-001/init-core-data-001
   [junit4]   2> 1098341 INFO  (SUITE-StatsReloadRaceTest-seed#[F5A0231F0DD71BD6]-worker) [    ] o.a.s.SolrTestCaseJ4 Using PointFields (NUMERIC_POINTS_SYSPROP=true) w/NUMERIC_DOCVALUES_SYSPROP=false
   [junit4]   2> 1098342 INFO  (SUITE-StatsReloadRaceTest-seed#[F5A0231F0DD71BD6]-worker) [    ] o.a.s.SolrTestCaseJ4 Randomized ssl (true) and clientAuth (false) via: @org.apache.solr.util.RandomizeSSL(reason=, ssl=NaN, value=NaN, clientAuth=NaN)
   [junit4]   2> 1098343 INFO  (SUITE-StatsReloadRaceTest-seed#[F5A0231F0DD71BD6]-worker) [    ] o.a.s.SolrTestCaseJ4 SecureRandom sanity checks: test.solr.allowed.securerandom=null & java.security.egd=file:/dev/./urandom
   [junit4]   2> 1098343 INFO  (SUITE-StatsReloadRaceTest-seed#[F5A0231F0DD71BD6]-worker) [    ] o.a.s.SolrTestCaseJ4 ####initCore
   [junit4]   2> 1098344 INFO  (SUITE-StatsReloadRaceTest-seed#[F5A0231F0DD71BD6]-worker) [    ] o.a.s.c.SolrResourceLoader [null] Added 2 libs to classloader, from paths: [/x1/jenkins/jenkins-slave/workspace/Lucene-Solr-Tests-master/solr/core/src/test-files/solr/collection1/lib, /x1/jenkins/jenkins-slave/workspace/Lucene-Solr-Tests-master/solr/core/src/test-files/solr/collection1/lib/classes]
   [junit4]   2> 1098385 INFO  (SUITE-StatsReloadRaceTest-seed#[F5A0231F0DD71BD6]-worker) [    ] o.a.s.c.SolrConfig Using Lucene MatchVersion: 8.0.0
   [junit4]   2> 1098413 INFO  (SUITE-StatsReloadRaceTest-seed#[F5A0231F0DD71BD6]-worker) [    ] o.a.s.s.IndexSchema [null] Schema name=test
   [junit4]   2> 1098549 INFO  (SUITE-StatsReloadRaceTest-seed#[F5A0231F0DD71BD6]-worker) [    ] o.a.s.s.IndexSchema Loaded schema test/1.0 with uniqueid field id
   [junit4]   2> 1098592 INFO  (SUITE-StatsReloadRaceTest-seed#[F5A0231F0DD71BD6]-worker) [    ] o.a.s.m.r.SolrJmxReporter JMX monitoring for 'solr.node' (registry 'solr.node') enabled at server: com.sun.jmx.mbeanserver.JmxMBeanServer@3a6119b9
   [junit4]   2> 1098597 INFO  (SUITE-StatsReloadRaceTest-seed#[F5A0231F0DD71BD6]-worker) [    ] o.a.s.m.r.SolrJmxReporter JMX monitoring for 'solr.jvm' (registry 'solr.jvm') enabled at server: com.sun.jmx.mbeanserver.JmxMBeanServer@3a6119b9
   [junit4]   2> 1098597 INFO  (SUITE-StatsReloadRaceTest-seed#[F5A0231F0DD71BD6]-worker) [    ] o.a.s.m.r.SolrJmxReporter JMX monitoring for 'solr.jetty' (registry 'solr.jetty') enabled at server: com.sun.jmx.mbeanserver.JmxMBeanServer@3a6119b9
   [junit4]   2> 1098599 INFO  (coreLoadExecutor-3467-thread-1) [    x:collection1] o.a.s.c.SolrResourceLoader [null] Added 2 libs to classloader, from paths: [/x1/jenkins/jenkins-slave/workspace/Lucene-Solr-Tests-master/solr/core/src/test-files/solr/collection1/lib, /x1/jenkins/jenkins-slave/workspace/Lucene-Solr-Tests-master/solr/core/src/test-files/solr/collection1/lib/classes]
   [junit4]   2> 1098634 INFO  (coreLoadExecutor-3467-thread-1) [    x:collection1] o.a.s.c.SolrConfig Using Lucene MatchVersion: 8.0.0
   [junit4]   2> 1098661 INFO  (coreLoadExecutor-3467-thread-1) [    x:collection1] o.a.s.s.IndexSchema [collection1] Schema name=test
   [junit4]   2> 1098798 INFO  (coreLoadExecutor-3467-thread-1) [    x:collection1] o.a.s.s.IndexSchema Loaded schema test/1.0 with uniqueid field id
   [junit4]   2> 1098806 INFO  (coreLoadExecutor-3467-thread-1) [    x:collection1] o.a.s.c.CoreContainer Creating SolrCore 'collection1' using configuration from instancedir /x1/jenkins/jenkins-slave/workspace/Lucene-Solr-Tests-master/solr/core/src/test-files/solr/collection1, trusted=true
   [junit4]   2> 1098807 INFO  (coreLoadExecutor-3467-thread-1) [    x:collection1] o.a.s.m.r.SolrJmxReporter JMX monitoring for 'solr.core.collection1' (registry 'solr.core.collection1') enabled at server: com.sun.jmx.mbeanserver.JmxMBeanServer@3a6119b9
   [junit4]   2> 1098807 INFO  (coreLoadExecutor-3467-thread-1) [    x:collection1] o.a.s.c.SolrCore solr.RecoveryStrategy.Builder
   [junit4]   2> 1098807 INFO  (coreLoadExecutor-3467-thread-1) [    x:collection1] o.a.s.c.SolrCore [[collection1] ] Opening new SolrCore at [/x1/jenkins/jenkins-slave/workspace/Lucene-Solr-Tests-master/solr/core/src/test-files/solr/collection1], dataDir=[/x1/jenkins/jenkins-slave/workspace/Lucene-Solr-Tests-master/solr/build/solr-core/test/J2/temp/solr.handler.admin.StatsReloadRaceTest_F5A0231F0DD71BD6-001/init-core-data-001/]
   [junit4]   2> 1098809 INFO  (coreLoadExecutor-3467-thread-1) [    x:collection1] o.a.s.u.RandomMergePolicy RandomMergePolicy wrapping class org.apache.lucene.index.AlcoholicMergePolicy: [AlcoholicMergePolicy: minMergeSize=0, mergeFactor=10, maxMergeSize=1549450695, maxMergeSizeForForcedMerge=9223372036854775807, calibrateSizeByDeletes=true, maxMergeDocs=2147483647, maxCFSSegmentSizeMB=8.796093022207999E12, noCFSRatio=0.1]
   [junit4]   2> 1098872 INFO  (coreLoadExecutor-3467-thread-1) [    x:collection1] o.a.s.u.UpdateHandler Using UpdateLog implementation: org.apache.solr.update.UpdateLog
   [junit4]   2> 1098872 INFO  (coreLoadExecutor-3467-thread-1) [    x:collection1] o.a.s.u.UpdateLog Initializing UpdateLog: dataDir= defaultSyncLevel=FLUSH numRecordsToKeep=100 maxNumLogsToKeep=10 numVersionBuckets=65536
   [junit4]   2> 1098873 INFO  (coreLoadExecutor-3467-thread-1) [    x:collection1] o.a.s.u.CommitTracker Hard AutoCommit: disabled
   [junit4]   2> 1098874 INFO  (coreLoadExecutor-3467-thread-1) [    x:collection1] o.a.s.u.CommitTracker Soft AutoCommit: disabled
   [junit4]   2> 1098875 INFO  (coreLoadExecutor-3467-thread-1) [    x:collection1] o.a.s.u.RandomMergePolicy RandomMergePolicy wrapping class org.apache.lucene.index.LogDocMergePolicy: [LogDocMergePolicy: minMergeSize=1000, mergeFactor=37, maxMergeSize=9223372036854775807, maxMergeSizeForForcedMerge=9223372036854775807, calibrateSizeByDeletes=true, maxMergeDocs=2147483647, maxCFSSegmentSizeMB=8.796093022207999E12, noCFSRatio=0.0]
   [junit4]   2> 1098876 INFO  (coreLoadExecutor-3467-thread-1) [    x:collection1] o.a.s.s.SolrIndexSearcher Opening [Searcher@3952d964[collection1] main]
   [junit4]   2> 1098877 INFO  (coreLoadExecutor-3467-thread-1) [    x:collection1] o.a.s.h.c.SpellCheckComponent Initializing spell checkers
   [junit4]   2> 1098892 INFO  (coreLoadExecutor-3467-thread-1) [    x:collection1] o.a.s.s.DirectSolrSpellChecker init: {name=direct,classname=DirectSolrSpellChecker,field=lowerfilt,minQueryLength=3}
   [junit4]   2> 1098923 INFO  (coreLoadExecutor-3467-thread-1) [    x:collection1] o.a.s.h.ReplicationHandler Commits will be reserved for  10000
   [junit4]   2> 1098923 INFO  (searcherExecutor-3468-thread-1-processing-x:collection1) [    x:collection1] o.a.s.h.c.SpellCheckComponent Loading spell index for spellchecker: default
   [junit4]   2> 1098923 INFO  (coreLoadExecutor-3467-thread-1) [    x:collection1] o.a.s.u.UpdateLog Could not find max version in index or recent updates, using new clock 1575034836901429248
   [junit4]   2> 1098923 INFO  (searcherExecutor-3468-thread-1-processing-x:collection1) [    x:collection1] o.a.s.h.c.SpellCheckComponent Loading spell index for spellchecker: direct
   [junit4]   2> 1098923 INFO  (searcherExecutor-3468-thread-1-processing-x:collection1) [    x:collection1] o.a.s.h.c.SpellCheckComponent Loading spell index for spellchecker: wordbreak
   [junit4]   2> 1098923 INFO  (searcherExecutor-3468-thread-1-processing-x:collection1) [    x:collection1] o.a.s.h.c.SpellCheckComponent Loading spell index for spellchecker: multipleFields
   [junit4]   2> 1098924 INFO  (searcherExecutor-3468-thread-1-processing-x:collection1) [    x:collection1] o.a.s.h.c.SpellCheckComponent Loading spell index for spellchecker: jarowinkler
   [junit4]   2> 1098924 INFO  (searcherExecutor-3468-thread-1-processing-x:collection1) [    x:collection1] o.a.s.h.c.SpellCheckComponent Loading spell index for spellchecker: external
   [junit4]   2> 1098924 INFO  (searcherExecutor-3468-thread-1-processing-x:collection1) [    x:collection1] o.a.s.h.c.SpellCheckComponent Loading spell index for spellchecker: freq
   [junit4]   2> 1098924 INFO  (searcherExecutor-3468-thread-1-processing-x:collection1) [    x:collection1] o.a.s.h.c.SpellCheckComponent Loading spell index for spellchecker: fqcn
   [junit4]   2> 1098925 INFO  (searcherExecutor-3468-thread-1-processing-x:collection1) [    x:collection1] o.a.s.h.c.SpellCheckComponent Loading spell index for spellchecker: perDict
   [junit4]   2> 1098926 INFO  (searcherExecutor-3468-thread-1-processing-x:collection1) [    x:collection1] o.a.s.c.SolrCore [collection1] Registered new searcher Searcher@3952d964[collection1] main{ExitableDirectoryReader(UninvertingDirectoryReader())}
   [junit4]   2> 1098928 INFO  (SUITE-StatsReloadRaceTest-seed#[F5A0231F0DD71BD6]-worker) [    ] o.a.s.SolrTestCaseJ4 ####initCore end
   [junit4]   2> 1098934 INFO  (SUITE-StatsReloadRaceTest-seed#[F5A0231F0DD71BD6]-worker) [    ] o.a.s.u.p.LogUpdateProcessorFactory [collection1]  webapp=null path=null params={}{add=[0 (1575034836906672128), 1 (1575034836907720704), 2 (1575034836908769280), 3 (1575034836908769281), 4 (1575034836908769282), 5 (1575034836908769283), 6 (1575034836908769284), 7 (1575034836908769285), 8 (1575034836910866432), 9 (1575034836910866433), ... (21 adds)]} 0 5
   [junit4]   2> 1098936 INFO  (SUITE-StatsReloadRaceTest-seed#[F5A0231F0DD71BD6]-worker) [    ] o.a.s.u.DirectUpdateHandler2 start commit{_version_=1575034836915060736,optimize=false,openSearcher=true,waitSearcher=true,expungeDeletes=false,softCommit=false,prepareCommit=false}
   [junit4]   2> 1098936 INFO  (SUITE-StatsReloadRaceTest-seed#[F5A0231F0DD71BD6]-worker) [    ] o.a.s.u.SolrIndexWriter Calling setCommitData with IW:org.apache.solr.update.SolrIndexWriter@137a8a01 commitCommandVersion:1575034836915060736
   [junit4]   2> 1098942 INFO  (SUITE-StatsReloadRaceTest-seed#[F5A0231F0DD71BD6]-worker) [    ] o.a.s.s.SolrIndexSearcher Opening [Searcher@43bdcaaf[collection1] main]
   [junit4]   2> 1098944 INFO  (searcherExecutor-3468-thread-1) [    ] o.a.s.c.SolrCore [collection1] Registered new searcher Searcher@43bdcaaf[collection1] main{ExitableDirectoryReader(UninvertingDirectoryReader(Uninverting(_0(8.0.0):C21)))}
   [junit4]   2> 1098944 INFO  (SUITE-StatsReloadRaceTest-seed#[F5A0231F0DD71BD6]-worker) [    ] o.a.s.u.DirectUpdateHandler2 end_commit_flush
   [junit4]   2> 1098944 INFO  (SUITE-StatsReloadRaceTest-seed#[F5A0231F0DD71BD6]-worker) [    ] o.a.s.u.p.LogUpdateProcessorFactory [collection1]  webapp=null path=null params={}{commit=} 0 8
   [junit4]   2> 1098949 INFO  (TEST-StatsReloadRaceTest.testParallelReloadAndStats-seed#[F5A0231F0DD71BD6]) [    ] o.a.s.SolrTestCaseJ4 ###Starting testParallelReloadAndStats
   [junit4]   2> 1098950 ERROR (parallelCoreAdminExecutor-3466-thread-1-processing-1 RELOAD) [    ] o.a.s.c.CorePropertiesLocator Couldn't load core descriptor from /x1/jenkins/jenkins-slave/workspace/Lucene-Solr-Tests-master/solr/core/src/test-files/solr/collection1/core.properties:java.nio.file.NoSuchFileException: /x1/jenkins/jenkins-slave/workspace/Lucene-Solr-Tests-master/solr/core/src/test-files/solr/collection1/core.properties
   [junit4]   2> 1098950 INFO  (parallelCoreAdminExecutor-3466-thread-1-processing-1 RELOAD) [    ] o.a.s.c.SolrResourceLoader [null] Added 2 libs to classloader, from paths: [/x1/jenkins/jenkins-slave/workspace/Lucene-Solr-Tests-master/solr/core/src/test-files/solr/collection1/lib, /x1/jenkins/jenkins-slave/workspace/Lucene-Solr-Tests-master/solr/core/src/test-files/solr/collection1/lib/classes]
   [junit4]   2> 1098962 INFO  (TEST-StatsReloadRaceTest.testParallelReloadAndStats-seed#[F5A0231F0DD71BD6]) [    ] o.a.s.h.a.CoreAdminOperation Checking request status for : 1
   [junit4]   2> 1098964 INFO  (TEST-StatsReloadRaceTest.testParallelReloadAndStats-seed#[F5A0231F0DD71BD6]) [    ] o.a.s.h.a.CoreAdminOperation Checking request status for : 1
   [junit4]   2> 1098965 INFO  (TEST-StatsReloadRaceTest.testParallelReloadAndStats-seed#[F5A0231F0DD71BD6]) [    ] o.a.s.h.a.CoreAdminOperation Checking request status for : 1
   [junit4]   2> 1098966 INFO  (TEST-StatsReloadRaceTest.testParallelReloadAndStats-seed#[F5A0231F0DD71BD6]) [    ] o.a.s.h.a.CoreAdminOperation Checking request status for : 1
   [junit4]   2> 1098967 INFO  (TEST-StatsReloadRaceTest.testParallelReloadAndStats-seed#[F5A0231F0DD71BD6]) [    ] o.a.s.h.a.CoreAdminOperation Checking request status for : 1
   [junit4]   2> 1098968 INFO  (TEST-StatsReloadRaceTest.testParallelReloadAndStats-seed#[F5A0231F0DD71BD6]) [    ] o.a.s.h.a.CoreAdminOperation Checking request status for : 1
   [junit4]   2> 1098968 INFO  (TEST-StatsReloadRaceTest.testParallelReloadAndStats-seed#[F5A0231F0DD71BD6]) [    ] o.a.s.h.a.CoreAdminOperation Checking request status for : 1
   [junit4]   2> 1098969 INFO  (TEST-StatsReloadRaceTest.testParallelReloadAndStats-seed#[F5A0231F0DD71BD6]) [    ] o.a.s.h.a.CoreAdminOperation Checking request status for : 1
   [junit4]   2> 1098970 INFO  (TEST-StatsReloadRaceTest.testParallelReloadAndStats-seed#[F5A0231F0DD71BD6]) [    ] o.a.s.h.a.CoreAdminOperation Checking request status for : 1
   [junit4]   2> 1098970 INFO  (TEST-StatsReloadRaceTest.testParallelReloadAndStats-seed#[F5A0231F0DD71BD6]) [    ] o.a.s.h.a.CoreAdminOperation Checking request status for : 1
   [junit4]   2> 1098970 INFO  (TEST-StatsReloadRaceTest.testParallelReloadAndStats-seed#[F5A0231F0DD71BD6]) [    ] o.a.s.h.a.CoreAdminOperation Checking request status for : 1
   [junit4]   2> 1098970 INFO  (TEST-StatsReloadRaceTest.testParallelReloadAndStats-seed#[F5A0231F0DD71BD6]) [    ] o.a.s.h.a.CoreAdminOperation Checking request status for : 1
   [junit4]   2> 1098971 INFO  (TEST-StatsReloadRaceTest.testParallelReloadAndStats-seed#[F5A0231F0DD71BD6]) [    ] o.a.s.h.a.CoreAdminOperation Checking request status for : 1
   [junit4]   2> 1098971 INFO  (TEST-StatsReloadRaceTest.testParallelReloadAndStats-seed#[F5A0231F0DD71BD6]) [    ] o.a.s.h.a.CoreAdminOperation Checking request status for : 1
   [junit4]   2> 1098972 INFO  (TEST-StatsReloadRaceTest.testParallelReloadAndStats-seed#[F5A0231F0DD71BD6]) [    ] o.a.s.h.a.CoreAdminOperation Checking request status for : 1
   [junit4]   2> 1098972 INFO  (TEST-StatsReloadRaceTest.testParallelReloadAndStats-seed#[F5A0231F0DD71BD6]) [    ] o.a.s.h.a.CoreAdminOperation Checking request status for : 1
   [junit4]   2> 1098973 INFO  (TEST-StatsReloadRaceTest.testParallelReloadAndStats-seed#[F5A0231F0DD71BD6]) [    ] o.a.s.h.a.CoreAdminOperation Checking request status for : 1
   [junit4]   2> 1098973 INFO  (TEST-StatsReloadRaceTest.testParallelReloadAndStats-seed#[F5A0231F0DD71BD6]) [    ] o.a.s.h.a.CoreAdminOperation Checking request status for : 1
   [junit4]   2> 1098974 INFO  (TEST-StatsReloadRaceTest.testParallelReloadAndStats-seed#[F5A0231F0DD71BD6]) [    ] o.a.s.h.a.CoreAdminOperation Checking request status for : 1
   [junit4]   2> 1098974 INFO  (TEST-StatsReloadRaceTest.testParallelReloadAndStats-seed#[F5A0231F0DD71BD6]) [    ] o.a.s.h.a.CoreAdminOperation Checking request status for : 1
   [junit4]   2> 1098975 INFO  (TEST-StatsReloadRaceTest.testParallelReloadAndStats-seed#[F5A0231F0DD71BD6]) [    ] o.a.s.h.a.CoreAdminOperation Checking request status for : 1
   [junit4]   2> 1098975 INFO  (TEST-StatsReloadRaceTest.testParallelReloadAndStats-seed#[F5A0231F0DD71BD6]) [    ] o.a.s.h.a.CoreAdminOperation Checking request status for : 1
   [junit4]   2> 1098976 INFO  (TEST-StatsReloadRaceTest.testParallelReloadAndStats-seed#[F5A0231F0DD71BD6]) [    ] o.a.s.h.a.CoreAdminOperation Checking request status for : 1
   [junit4]   2> 1098976 INFO  (TEST-StatsReloadRaceTest.testParallelReloadAndStats-seed#[F5A0231F0DD71BD6]) [    ] o.a.s.h.a.CoreAdminOperation Checking request status for : 1
   [junit4]   2> 1098977 INFO  (TEST-StatsReloadRaceTest.testParallelReloadAndStats-seed#[F5A0231F0DD71BD6]) [    ] o.a.s.h.a.CoreAdminOperation Checking request status for : 1
   [junit4]   2> 1098977 INFO  (TEST-StatsReloadRaceTest.testParallelReloadAndStats-seed#[F5A0231F0DD71BD6]) [    ] o.a.s.h.a.CoreAdminOperation Checking request status for : 1
   [junit4]   2> 1098977 INFO  (TEST-StatsReloadRaceTest.testParallelReloadAndStats-seed#[F5A0231F0DD71BD6]) [    ] o.a.s.h.a.CoreAdminOperation Checking request status for : 1
   [junit4]   2> 1098978 INFO  (TEST-StatsReloadRaceTest.testParallelReloadAndStats-seed#[F5A0231F0DD71BD6]) [    ] o.a.s.h.a.CoreAdminOperation Checking request status for : 1
   [junit4]   2> 1098978 INFO  (TEST-StatsReloadRaceTest.testParallelReloadAndStats-seed#[F5A0231F0DD71BD6]) [    ] o.a.s.h.a.CoreAdminOperation Checking request status for : 1
   [junit4]   2> 1098978 INFO  (TEST-StatsReloadRaceTest.testParallelReloadAndStats-seed#[F5A0231F0DD71BD6]) [    ] o.a.s.h.a.CoreAdminOperation Checking request status for : 1
   [junit4]   2> 1098979 INFO  (TEST-StatsReloadRaceTest.testParallelReloadAndStats-seed#[F5A0231F0DD71BD6]) [    ] o.a.s.h.a.CoreAdminOperation Checking request status for : 1
   [junit4]   2> 1098979 INFO  (TEST-StatsReloadRaceTest.testParallelReloadAndStats-seed#[F5A0231F0DD71BD6]) [    ] o.a.s.h.a.CoreAdminOperation Checking request status for : 1
   [junit4]   2> 1098980 INFO  (TEST-StatsReloadRaceTest.testParallelReloadAndStats-seed#[F5A0231F0DD71BD6]) [    ] o.a.s.h.a.CoreAdminOperation Checking request status for : 1
   [junit4]   2> 1098980 INFO  (TEST-StatsReloadRaceTest.testParallelReloadAndStats-seed#[F5A0231F0DD71BD6]) [    ] o.a.s.h.a.CoreAdminOperation Checking request status for : 1
   [junit4]   2> 1098981 INFO  (TEST-StatsReloadRaceTest.testParallelReloadAndStats-seed#[F5A0231F0DD71BD6]) [    ] o.a.s.h.a.CoreAdminOperation Checking request status for : 1
   [junit4]   2> 1098982 INFO  (TEST-StatsReloadRaceTest.testParallelReloadAndStats-seed#[F5A0231F0DD71BD6]) [    ] o.a.s.h.a.CoreAdminOperation Checking request status for : 1
   [junit4]   2> 1098982 INFO  (TEST-StatsReloadRaceTest.testParallelReloadAndStats-seed#[F5A0231F0DD71BD6]) [    ] o.a.s.h.a.CoreAdminOperation Checking request status for : 1
   [junit4]   2> 1098983 INFO  (TEST-StatsReloadRaceTest.testParallelReloadAndStats-seed#[F5A0231F0DD71BD6]) [    ] o.a.s.h.a.CoreAdminOperation Checking request status for : 1
   [junit4]   2> 1098983 INFO  (TEST-StatsReloadRaceTest.testParallelReloadAndStats-seed#[F5A0231F0DD71BD6]) [    ] o.a.s.h.a.CoreAdminOperation Checking request status for : 1
   [junit4]   2> 1098984 INFO  (TEST-StatsReloadRaceTest.testParallelReloadAndStats-seed#[F5A0231F0DD71BD6]) [    ] o.a.s.h.a.CoreAdminOperation Checking request status for : 1
   [junit4]   2> 1098984 INFO  (TEST-StatsReloadRaceTest.testParallelReloadAndStats-seed#[F5A0231F0DD71BD6]) [    ] o.a.s.h.a.CoreAdminOperation Checking request status for : 1
   [junit4]   2> 1098984 INFO  (TEST-StatsReloadRaceTest.testParallelReloadAndStats-seed#[F5A0231F0DD71BD6]) [    ] o.a.s.h.a.CoreAdminOperation Checking request status for : 1
   [junit4]   2> 1098985 INFO  (TEST-StatsReloadRaceTest.testParallelReloadAndStats-seed#[F5A0231F0DD71BD6]) [    ] o.a.s.h.a.CoreAdminOperation Checking request status for : 1
   [junit4]   2> 1098985 INFO  (TEST-StatsReloadRaceTest.testParallelReloadAndStats-seed#[F5A0231F0DD71BD6]) [    ] o.a.s.h.a.CoreAdminOperation Checking request status for : 1
   [junit4]   2> 1098986 INFO  (TEST-StatsReloadRaceTest.testParallelReloadAndStats-seed#[F5A0231F0DD71BD6]) [    ] o.a.s.h.a.CoreAdminOperation Checking request status for : 1
   [junit4]   2> 1098987 INFO  (TEST-StatsReloadRaceTest.testParallelReloadAndStats-seed#[F5A0231F0DD71BD6]) [    ] o.a.s.h.a.CoreAdminOperation Checking request status for : 1
   [junit4]   2> 1098988 INFO  (TEST-StatsReloadRaceTest.testParallelReloadAndStats-seed#[F5A0231F0DD71BD6]) [    ] o.a.s.h.a.CoreAdminOperation Checking request status for : 1
   [junit4]   2> 1098988 INFO  (TEST-StatsReloadRaceTest.testParallelReloadAndStats-seed#[F5A0231F0DD71BD6]) [    ] o.a.s.h.a.CoreAdminOperation Checking request status for : 1
   [junit4]   2> 1098988 INFO  (TEST-StatsReloadRaceTest.testParallelReloadAndStats-seed#[F5A0231F0DD71BD6]) [    ] o.a.s.h.a.CoreAdminOperation Checking request status for : 1
   [junit4]   2> 1098988 INFO  (TEST-StatsReloadRaceTest.testParallelReloadAndStats-seed#[F5A0231F0DD71BD6]) [    ] o.a.s.h.a.CoreAdminOperation Checking request status for : 1
   [junit4]   2> 1098990 INFO  (TEST-StatsReloadRaceTest.testParallelReloadAndStats-seed#[F5A0231F0DD71BD6]) [    ] o.a.s.h.a.CoreAdminOperation Checking request status for : 1
   [junit4]   2> 1098990 INFO  (TEST-StatsReloadRaceTest.testParallelReloadAndStats-seed#[F5A0231F0DD71BD6]) [    ] o.a.s.h.a.CoreAdminOperation Checking request status for : 1
   [junit4]   2> 1098990 INFO  (TEST-StatsReloadRaceTest.testParallelReloadAndStats-seed#[F5A0231F0DD71BD6]) [    ] o.a.s.h.a.CoreAdminOperation Checking request status for : 1
   [junit4]   2> 1098991 INFO  (TEST-StatsReloadRaceTest.testParallelReloadAndStats-seed#[F5A0231F0DD71BD6]) [    ] o.a.s.h.a.CoreAdminOperation Checking request status for : 1
   [junit4]   2> 1098992 INFO  (TEST-StatsReloadRaceTest.testParallelReloadAndStats-seed#[F5A0231F0DD71BD6]) [    ] o.a.s.h.a.CoreAdminOperation Checking request status for : 1
   [junit4]   2> 1098992 INFO  (TEST-StatsReloadRaceTest.testParallelReloadAndStats-seed#[F5A0231F0DD71BD6]) [    ] o.a.s.h.a.CoreAdminOperation Checking request status for : 1
   [junit4]   2> 1098993 INFO  (TEST-StatsReloadRaceTest.testParallelReloadAndStats-seed#[F5A0231F0DD71BD6]) [    ] o.a.s.h.a.CoreAdminOperation Checking request status for : 1
   [junit4]   2> 1098994 INFO  (TEST-StatsReloadRaceTest.testParallelReloadAndStats-seed#[F5A0231F0DD71BD6]) [    ] o.a.s.h.a.CoreAdminOperation Checking request status for : 1
   [junit4]   2> 1098994 INFO  (TEST-StatsReloadRaceTest.testParallelReloadAndStats-seed#[F5A0231F0DD71BD6]) [    ] o.a.s.h.a.CoreAdminOperation Checking request status for : 1
   [junit4]   2> 1098994 INFO  (TEST-StatsReloadRaceTest.testParallelReloadAndStats-seed#[F5A0231F0DD71BD6]) [    ] o.a.s.h.a.CoreAdminOperation Checking request status for : 1
   [junit4]   2> 1098995 INFO  (TEST-StatsReloadRaceTest.testParallelReloadAndStats-seed#[F5A0231F0DD71BD6]) [    ] o.a.s.h.a.CoreAdminOperation Checking request status for : 1
   [junit4]   2> 1098996 INFO  (TEST-StatsReloadRaceTest.testParallelReloadAndStats-seed#[F5A0231F0DD71BD6]) [    ] o.a.s.h.a.CoreAdminOperation Checking request status for : 1
   [junit4]   2> 1098996 INFO  (TEST-StatsReloadRaceTest.testParallelReloadAndStats-seed#[F5A0231F0DD71BD6]) [    ] o.a.s.h.a.CoreAdminOperation Checking request status for : 1
   [junit4]   2> 1098997 INFO  (TEST-StatsReloadRaceTest.testParallelReloadAndStats-seed#[F5A0231F0DD71BD6]) [    ] o.a.s.h.a.CoreAdminOperation Checking request status for : 1
   [junit4]   2> 1098998 INFO  (parallelCoreAdminExecutor-3466-thread-1-processing-1 RELOAD) [    ] o.a.s.c.SolrConfig Using Lucene MatchVersion: 8.0.0
   [junit4]   2> 1098999 INFO  (TEST-StatsReloadRaceTest.testParallelReloadAndStats-seed#[F5A0231F0DD71BD6]) [    ] o.a.s.h.a.CoreAdminOperation Checking request status for : 1
   [junit4]   2> 1099000 INFO  (TEST-StatsReloadRaceTest.testParallelReloadAndStats-seed#[F5A0231F0DD71BD6]) [    ] o.a.s.h.a.CoreAdminOperation Checking request status for : 1
   [junit4]   2> 1099000 INFO  (TEST-StatsReloadRaceTest.testParallelReloadAndStats-seed#[F5A0231F0DD71BD6]) [    ] o.a.s.h.a.CoreAdminOperation Checking request status for : 1
   [junit4]   2> 1099001 INFO  (TEST-StatsReloadRaceTest.testParallelReloadAndStats-seed#[F5A0231F0DD71BD6]) [    ] o.a.s.h.a.CoreAdminOperation Checking request status for : 1
   [junit4]   2> 1099002 INFO  (TEST-StatsReloadRaceTest.testParallelReloadAndStats-seed#[F5A0231F0DD71BD6]) [    ] o.a.s.h.a.CoreAdminOperation Checking request status for : 1
   [junit4]   2> 1099003 INFO  (TEST-StatsReloadRaceTest.testParallelReloadAndStats-seed#[F5A0231F0DD71BD6]) [    ] o.a.s.h.a.CoreAdminOperation Checking request status for : 1
   [junit4]   2> 1099003 INFO  (TEST-StatsReloadRaceTest.testParallelReloadAndStats-seed#[F5A0231F0DD71BD6]) [    ] o.a.s.h.a.CoreAdminOperation Checking request status for : 1
   [junit4]   2> 1099004 INFO  (TEST-StatsReloadRaceTest.testParallelReloadAndStats-seed#[F5A0231F0DD71BD6]) [    ] o.a.s.h.a.CoreAdminOperation Checking request status for : 1
   [junit4]   2> 1099004 INFO  (TEST-StatsReloadRaceTest.testParallelReloadAndStats-seed#[F5A0231F0DD71BD6]) [    ] o.a.s.h.a.CoreAdminOperation Checking request status for : 1
   [junit4]   2> 1099005 INFO  (TEST-StatsReloadRaceTest.testParallelReloadAndStats-seed#[F5A0231F0DD71BD6]) [    ] o.a.s.h.a.CoreAdminOperation Checking request status for : 1
   [junit4]   2> 1099006 INFO  (TEST-StatsReloadRaceTest.testParallelReloadAndStats-seed#[F5A0231F0DD71BD6]) [    ] o.a.s.h.a.CoreAdminOperation Checking request status for : 1
   [junit4]   2> 1099006 INFO  (TEST-StatsReloadRaceTest.testParallelReloadAndStats-seed#[F5A0231F0DD71BD6]) [    ] o.a.s.h.a.CoreAdminOperation Checking request status for : 1
   [junit4]   2> 1099006 INFO  (TEST-StatsReloadRaceTest.testParallelReloadAndStats-seed#[F5A0231F0DD71BD6]) [    ] o.a.s.h.a.CoreAdminOperation Checking request status for : 1
   [junit4]   2> 1099007 INFO  (TEST-StatsReloadRaceTest.testParallelReloadAndStats-seed#[F5A0231F0DD71BD6]) [    ] o.a.s.h.a.CoreAdminOperation Checking request status for : 1
   [junit4]   2> 1099007 INFO  (TEST-StatsReloadRaceTest.testParallelReloadAndStats-seed#[F5A0231F0DD71BD6]) [    ] o.a.s.h.a.CoreAdminOperation Checking request status for : 1
   [junit4]   2> 1099007 INFO  (TEST-StatsReloadRaceTest.testParallelReloadAndStats-seed#[F5A0231F0DD71BD6]) [    ] o.a.s.h.a.CoreAdminOperation Checking request status for : 1
   [junit4]   2> 1099008 INFO  (TEST-StatsReloadRaceTest.testParallelReloadAndStats-seed#[F5A0231F0DD71BD6]) [    ] o.a.s.h.a.CoreAdminOperation Checking request status for : 1
   [junit4]   2> 1099008 INFO  (TEST-StatsReloadRaceTest.testParallelReloadAndStats-seed#[F5A0231F0DD71BD6]) [    ] o.a.s.h.a.CoreAdminOperation Checking request status for : 1
   [junit4]   2> 1099009 INFO  (TEST-StatsReloadRaceTest.testParallelReloadAndStats-seed#[F5A0231F0DD71BD6]) [    ] o.a.s.h.a.CoreAdminOperation Checking request status for : 1
   [junit4]   2> 1099009 INFO  (TEST-StatsReloadRaceTest.testParallelReloadAndStats-seed#[F5A0231F0DD71BD6]) [    ] o.a.s.h.a.CoreAdminOperation Checking request status for : 1
   [junit4]   2> 1099010 INFO  (TEST-StatsReloadRaceTest.testParallelReloadAndStats-seed#[F5A0231F0DD71BD6]) [    ] o.a.s.h.a.CoreAdminOperation Checking request status for : 1
   [junit4]   2> 1099011 INFO  (TEST-StatsReloadRaceTest.testParallelReloadAndStats-seed#[F5A0231F0DD71BD6]) [    ] o.a.s.h.a.CoreAdminOperation Checking request status for : 1
   [junit4]   2> 1099011 INFO  (TEST-StatsReloadRaceTest.testParallelReloadAndStats-seed#[F5A0231F0DD71BD6]) [    ] o.a.s.h.a.CoreAdminOperation Checking request status for : 1
   [junit4]   2> 1099012 INFO  (TEST-StatsReloadRaceTest.testParallelReloadAndStats-seed#[F5A0231F0DD71BD6]) [    ] o.a.s.h.a.CoreAdminOperation Checking request status for : 1
   [junit4]   2> 1099012 INFO  (TEST-StatsReloadRaceTest.testParallelReloadAndStats-seed#[F5A0231F0DD71BD6]) [    ] o.a.s.h.a.CoreAdminOperation Checking request status for : 1
   [junit4]   2> 1099012 INFO  (TEST-StatsReloadRaceTest.testParallelReloadAndStats-seed#[F5A0231F0DD71BD6]) [    ] o.a.s.h.a.CoreAdminOperation Checking request status for : 1
   [junit4]   2> 1099013 INFO  (TEST-StatsReloadRaceTest.testParallelReloadAndStats-seed#[F5A0231F0DD71BD6]) [    ] o.a.s.h.a.CoreAdminOperation Checking request status for : 1
   [junit4]   2> 1099014 INFO  (TEST-StatsReloadRaceTest.testParallelReloadAndStats-seed#[F5A0231F0DD71BD6]) [    ] o.a.s.h.a.CoreAdminOperation Checking request status for : 1
   [junit4]   2> 1099014 INFO  (TEST-StatsReloadRaceTest.testParallelReloadAndStats-seed#[F5A0231F0DD71BD6]) [    ] o.a.s.h.a.CoreAdminOperation Checking request status for : 1
   [junit4]   2> 1099015 INFO  (TEST-StatsReloadRaceTest.testParallelReloadAndStats-seed#[F5A0231F0DD71BD6]) [    ] o.a.s.h.a.CoreAdminOperation Checking request status for : 1
   [junit4]   2> 1099015 INFO  (TEST-StatsReloadRaceTest.testParallelReloadAndStats-seed#[F5A0231F0DD71BD6]) [    ] o.a.s.h.a.CoreAdminOperation Checking request status for : 1
   [junit4]   2> 1099016 INFO  (TEST-StatsReloadRaceTest.testParallelReloadAndStats-seed#[F5A0231F0DD71BD6]) [    ] o.a.s.h.a.CoreAdminOperation Checking request status for : 1
   [junit4]   2> 1099016 INFO  (TEST-StatsReloadRaceTest.testParallelReloadAndStats-seed#[F5A0231F0DD71BD6]) [    ] o.a.s.h.a.CoreAdminOperation Checking request status for : 1
   [junit4]   2> 1099017 INFO  (TEST-StatsReloadRaceTest.testParallelReloadAndStats-seed#[F5A0231F0DD71BD6]) [    ] o.a.s.h.a.CoreAdminOperation Checking request status for : 1
   [junit4]   2> 1099018 INFO  (TEST-StatsReloadRaceTest.testParallelReloadAndStats-seed#[F5A0231F0DD71BD6]) [    ] o.a.s.h.a.CoreAdminOperation Checking request status for : 1
   [junit4]   2> 1099018 INFO  (TEST-StatsReloadRaceTest.testParallelReloadAndStats-seed#[F5A0231F0DD71BD6]) [    ] o.a.s.h.a.CoreAdminOperation Checking request status for : 1
   [junit4]   2> 1099019 INFO  (TEST-StatsReloadRaceTest.testParallelReloadAndStats-seed#[F5A0231F0DD71BD6]) [    ] o.a.s.h.a.CoreAdminOperation Checking request status for : 1
   [junit4]   2> 1099019 INFO  (TEST-StatsReloadRaceTest.testParallelReloadAndStats-seed#[F5A0231F0DD71BD6]) [    ] o.a.s.h.a.CoreAdminOperation Checking request status for : 1
   [junit4]   2> 1099020 INFO  (TEST-StatsReloadRaceTest.testParallelReloadAndStats-seed#[F5A0231F0DD71BD6]) [    ] o.a.s.h.a.CoreAdminOperation Checking request status for : 1
   [junit4]   2> 1099021 INFO  (TEST-StatsReloadRaceTest.testParallelReloadAndStats-seed#[F5A0231F0DD71BD6]) [    ] o.a.s.h.a.CoreAdminOperation Checking request status for : 1
   [junit4]   2> 1099021 INFO  (TEST-StatsReloadRaceTest.testParallelReloadAndStats-seed#[F5A0231F0DD71BD6]) [    ] o.a.s.h.a.CoreAdminOperation Checking request status for : 1
   [junit4]   2> 1099021 INFO  (TEST-StatsReloadRaceTest.testParallelReloadAndStats-seed#[F5A0231F0DD71BD6]) [    ] o.a.s.h.a.CoreAdminOperation Checking request status for : 1
   [junit4]   2> 1099022 INFO  (TEST-StatsReloadRaceTest.testParallelReloadAndStats-seed#[F5A0231F0DD71BD6]) [    ] o.a.s.h.a.CoreAdminOperation Checking request status for : 1
   [junit4]   2> 1099023 INFO  (TEST-StatsReloadRaceTest.testParallelReloadAndStats-seed#[F5A0231F0DD71BD6]) [    ] o.a.s.h.a.CoreAdminOperation Checking request status for : 1
   [junit4]   2> 1099023 INFO  (TEST-StatsReloadRaceTest.testParallelReloadAndStats-seed#[F5A0231F0DD71BD6]) [    ] o.a.s.h.a.CoreAdminOperation Checking request status for : 1
   [junit4]   2> 1099023 INFO  (TEST-StatsReloadRaceTest.testParallelReloadAndStats-seed#[F5A0231F0DD71BD6]) [    ] o.a.s.h.a.CoreAdminOperation Checking request status for : 1
   [junit4]   2> 1099024 INFO  (TEST-StatsReloadRaceTest.testParallelReloadAndStats-seed#[F5A0231F0DD71BD6]) [    ] o.a.s.h.a.CoreAdminOperation Checking request status for : 1
   [junit4]   2> 1099024 INFO  (TEST-StatsReloadRaceTest.testParallelReloadAndStats-seed#[F5A0231F0DD71BD6]) [    ] o.a.s.h.a.CoreAdminOperation Checking request status for : 1
   [junit4]   2> 1099025 INFO  (TEST-StatsReloadRaceTest.testParallelReloadAndStats-seed#[F5A0231F0DD71BD6]) [    ] o.a.s.h.a.CoreAdminOperation Checking request status for : 1
   [junit4]   2> 1099025 INFO  (parallelCoreAdminExecutor-3466-thread-1-processing-1 RELOAD) [    ] o.a.s.s.IndexSchema [collection1] Schema name=test
   [junit4]   2> 1099025 INFO  (TEST-StatsReloadRaceTest.testParallelReloadAndStats-seed#[F5A0231F0DD71BD6]) [    ] o.a.s.h.a.CoreAdminOperation Checking request status for : 1
   [junit4]   2> 1099026 INFO  (TEST-StatsReloadRaceTest.testParallelReloadAndStats-seed#[F5A0231F0DD71BD6]) [    ] o.a.s.h.a.CoreAdminOperation Checking request status for : 1
   [junit4]   2> 1099026 INFO  (TEST-StatsReloadRaceTest.testParallelReloadAndStats-seed#[F5A0231F0DD71BD6]) [    ] o.a.s.h.a.CoreAdminOperation Checking request status for : 1
   [junit4]   2> 1099027 INFO  (TEST-StatsReloadRaceTest.testParallelReloadAndStats-seed#[F5A0231F0DD71BD6]) [    ] o.a.s.h.a.CoreAdminOperation Checking request status for : 1
   [junit4]   2> 1099028 INFO  (TEST-StatsReloadRaceTest.testParallelReloadAndStats-seed#[F5A0231F0DD71BD6]) [    ] o.a.s.h.a.CoreAdminOperation Checking request status for : 1
   [junit4]   2> 1099028 INFO  (TEST-StatsReloadRaceTest.testParallelReloadAndStats-seed#[F5A0231F0DD71BD6]) [    ] o.a.s.h.a.CoreAdminOperation Checking request status for : 1
   [junit4]   2> 1099028 INFO  (TEST-StatsReloadRaceTest.testParallelReloadAndStats-seed#[F5A0231F0DD71BD6]) [    ] o.a.s.h.a.CoreAdminOperation Checking request status for : 1
   [junit4]   2> 1099029 INFO  (TEST-StatsReloadRaceTest.testParallelReloadAndStats-seed#[F5A0231F0DD71BD6]) [    ] o.a.s.h.a.CoreAdminOperation Checking request status for : 1
   [junit4]   2> 1099029 INFO  (TEST-StatsReloadRaceTest.testParallelReloadAndStats-seed#[F5A0231F0DD71BD6]) [    ] o.a.s.h.a.CoreAdminOperation Checking request status for : 1
   [junit4]   2> 1099029 INFO  (TEST-StatsReloadRaceTest.testParallelReloadAndStats-seed#[F5A0231F0DD71BD6]) [    ] o.a.s.h.a.CoreAdminOperation Checking request status for : 1
   [junit4]   2> 1099041 INFO  (TEST-StatsReloadRaceTest.testParallelReloadAndStats-seed#[F5A0231F0DD71BD6]) [    ] o.a.s.h.a.CoreAdminOperation Checking request status for : 1
   [junit4]   2> 1099042 INFO  (TEST-StatsReloadRaceTest.testParallelReloadAndStats-seed#[F5A0231F0DD71BD6]) [    ] o.a.s.h.a.CoreAdminOperation Checking request status for : 1
   [junit4]   2> 1099042 INFO  (TEST-StatsReloadRaceTest.testParallelReloadAndStats-seed#[F5A0231F0DD71BD6]) [    ] o.a.s.h.a.CoreAdminOperation Checking request status for : 1
   [junit4]   2> 1099043 INFO  (TEST-StatsReloadRaceTest.testParallelReloadAndStats-seed#[F5A0231F0DD71BD6]) [    ] o.a.s.h.a.CoreAdminOperation Checking request status for : 1
   [junit4]   2> 1099044 INFO  (TEST-StatsReloadRaceTest.testParallelReloadAndStats-seed#[F5A0231F0DD71BD6]) [    ] o.a.s.h.a.CoreAdminOperation Checking request status for : 1
   [junit4]   2> 1099044 INFO  (TEST-StatsReloadRaceTest.testParallelReloadAndStats-seed#[F5A0231F0DD71BD6]) [    ] o.a.s.h.a.CoreAdminOperation Checking request status for : 1
   [junit4]   2> 1099045 INFO  (TEST-StatsReloadRaceTest.testParallelReloadAndStats-seed#[F5A0231F0DD71BD6]) [    ] o.a.s.h.a.CoreAdminOperation Checking request status for : 1
   [junit4]   2> 1099046 INFO  (TEST-StatsReloadRaceTest.testParallelReloadAndStats-seed#[F5A0231F0DD71BD6]) [    ] o.a.s.h.a.CoreAdminOperation Checking request status for : 1
   [junit4]   2> 1099046 INFO  (TEST-StatsReloadRaceTest.testParallelReloadAndStats-seed#[F5A0231F0DD71BD6]) [    ] o.a.s.h.a.CoreAdminOperation Checking request status for : 1
   [junit4]   2> 1099047 INFO  (TEST-StatsReloadRaceTest.testParallelReloadAndStats-seed#[F5A0231F0DD71BD6]) [    ] o.a.s.h.a.CoreAdminOperation Checking request status for : 1
   [junit4]   2> 1099047 INFO  (TEST-StatsReloadRaceTest.testParallelReloadAndStats-seed#[F5A0231F0DD71BD6]) [    ] o.a.s.h.a.CoreAdminOperation Checking request status for : 1
   [junit4]   2> 1099048 INFO  (TEST-StatsReloadRaceTest.testParallelReloadAndStats-seed#[F5A0231F0DD71BD6]) [    ] o.a.s.h.a.CoreAdminOperation Checking request status for : 1
   [junit4]   2> 1099049 INFO  (TEST-StatsReloadRaceTest.testParallelReloadAndStats-seed#[F5A0231F0DD71BD6]) [    ] o.a.s.h.a.CoreAdminOperation Checking request status for : 1
   [junit4]   2> 1099049 INFO  (TEST-StatsReloadRaceTest.testParallelReloadAndStats-seed#[F5A0231F0DD71BD6]) [    ] o.a.s.h.a.CoreAdminOperation Checking request status for : 1
   [junit4]   2> 1099050 INFO  (TEST-StatsReloadRaceTest.testParallelReloadAndStats-seed#[F5A0231F0DD71BD6]) [    ] o.a.s.h.a.CoreAdminOperation Checking request status for : 1
   [junit4]   2> 1099050 INFO  (TEST-StatsReloadRaceTest.testParallelReloadAndStats-seed#[F5A0231F0DD71BD6]) [    ] o.a.s.h.a.CoreAdminOperation Checking request status for : 1
   [junit4]   2> 1099050 INFO  (TEST-StatsReloadRaceTest.testParallelReloadAndStats-seed#[F5A0231F0DD71BD6]) [    ] o.a.s.h.a.CoreAdminOperation Checking request status for : 1
   [junit4]   2> 1099051 INFO  (TEST-StatsReloadRaceTest.testParallelReloadAndStats-seed#[F5A0231F0DD71BD6]) [    ] o.a.s.h.a.CoreAdminOperation Checking request status for : 1
   [junit4]   2> 1099052 INFO  (TEST-StatsReloadRaceTest.testParallelReloadAndStats-seed#[F5A0231F0DD71BD6]) [    ] o.a.s.h.a.CoreAdminOperation Checking request status for : 1
   [junit4]   2> 1099052 INFO  (TEST-StatsReloadRaceTest.testParallelReloadAndStats-seed#[F5A0231F0DD71BD6]) [    ] o.a.s.h.a.CoreAdminOperation Checking request status for : 1
   [junit4]   2> 1099052 INFO  (TEST-StatsReloadRaceTest.testParallelReloadAndStats-seed#[F5A0231F0DD71BD6]) [    ] o.a.s.h.a.CoreAdminOperation Checking request status for : 1
   [junit4]   2> 1099053 INFO  (TEST-StatsReloadRaceTest.testParallelReloadAndStats-seed#[F5A0231F0DD71BD6]) [    ] o.a.s.h.a.CoreAdminOperation Checking request status for : 1
   [junit4]   2> 1099053 INFO  (TEST-StatsReloadRaceTest.testParallelReloadAndStats-seed#[F5A0231F0DD71BD6]) [    ] o.a.s.h.a.CoreAdminOperation Checking request status for : 1
   [junit4]   2> 1099053 INFO  (TEST-StatsReloadRaceTest.testParallelReloadAndStats-seed#[F5A0231F0DD71BD6]) [    ] o.a.s.h.a.CoreAdminOperation Checking request status for : 1
   [junit4]   2> 1099053 INFO  (TEST-StatsReloadRaceTest.testParallelReloadAndStats-seed#[F5A0231F0DD71BD6]) [    ] o.a.s.h.a.CoreAdminOperation Checking request status for : 1
   [junit4]   2> 1099054 INFO  (TEST-StatsReloadRaceTest.testParallelReloadAndStats-seed#[F5A0231F0DD71BD6]) [    ] o.a.s.h.a.CoreAdminOperation Checking request status for : 1
   [junit4]   2> 1099054 INFO  (TEST-StatsReloadRaceTest.testParallelReloadAndStats-seed#[F5A0231F0DD71BD6]) [    ] o.a.s.h.a.CoreAdminOperation Checking request status for : 1
   [junit4]   2> 1099054 INFO  (TEST-StatsReloadRaceTest.testParallelReloadAndStats-seed#[F5A0231F0DD71BD6]) [    ] o.a.s.h.a.CoreAdminOperation Checking request status for : 1
   [junit4]   2> 1099054 INFO  (TEST-StatsReloadRaceTest.testParallelReloadAndStats-seed#[F5A0231F0DD71BD6]) [    ] o.a.s.h.a.CoreAdminOperation Checking request status for : 1
   [junit4]   2> 1099055 INFO  (TEST-StatsReloadRaceTest.testParallelReloadAndStats-seed#[F5A0231F0DD71BD6]) [    ] o.a.s.h.a.CoreAdminOperation Checking request status for : 1
   [junit4]   2> 1099055 INFO  (TEST-StatsReloadRaceTest.testParallelReloadAndStats-seed#[F5A0231F0DD71BD6]) [    ] o.a.s.h.a.CoreAdminOperation Checking request status for : 1
   [junit4]   2> 1099056 INFO  (TEST-StatsReloadRaceTest.testParallelReloadAndStats-seed#[F5A0231F0DD71BD6]) [    ] o.a.s.h.a.CoreAdminOperation Checking request status for : 1
   [junit4]   2> 1099056 INFO  (TEST-StatsReloadRaceTest.testParallelReloadAndStats-seed#[F5A0231F0DD71BD6]) [    ] o.a.s.h.a.CoreAdminOperation Checking request status for : 1
   [junit4]   2> 1099056 INFO  (TEST-StatsReloadRaceTest.testParallelReloadAndStats-seed#[F5A0231F0DD71BD6]) [    ] o.a.s.h.a.CoreAdminOperation Checking request status for : 1
   [junit4]   2> 1099057 INFO  (TEST-StatsReloadRaceTest.testParallelReloadAndStats-seed#[F5A0231F0DD71BD6]) [    ] o.a.s.h.a.CoreAdminOperation Checking request status for : 1
   [junit4]   2> 1099057 INFO  (TEST-StatsReloadRaceTest.testParallelReloadAndStats-seed#[F5A0231F0DD71BD6]) [    ] o.a.s.h.a.CoreAdminOperation Checking request status for : 1
   [junit4]   2> 1099057 INFO  (TEST-StatsReloadRaceTest.testParallelReloadAndStats-seed#[F5A0231F0DD71BD6]) [    ] o.a.s.h.a.CoreAdminOperation Checking request status for : 1
   [junit4]   2> 1099058 INFO  (TEST-StatsReloadRaceTest.testParallelReloadAndStats-seed#[F5A0231F0DD71BD6]) [    ] o.a.s.h.a.CoreAdminOperation Checking request status for : 1
   [junit4]   2> 1099058 INFO  (TEST-StatsReloadRaceTest.testParallelReloadAndStats-seed#[F5A0231F0DD71BD6]) [    ] o.a.s.h.a.CoreAdminOperation Checking request status for : 1
   [junit4]   2> 1099058 INFO  (TEST-StatsReloadRaceTest.testParallelReloadAndStats-seed#[F5A0231F0DD71BD6]) [    ] o.a.s.h.a.CoreAdminOperation Checking request status for : 1
   [junit4]   2> 1099059 INFO  (TEST-StatsReloadRaceTest.testParallelReloadAndStats-seed#[F5A0231F0DD71BD6]) [    ] o.a.s.h.a.CoreAdminOperation Checking request status for : 1
   [junit4]   2> 1099060 INFO  (TEST-StatsReloadRaceTest.testParallelReloadAndStats-seed#[F5A0231F0DD71BD6]) [    ] o.a.s.h.a.CoreAdminOperation Checking request status for : 1
   [junit4]   2> 1099060 INFO  (TEST-StatsReloadRaceTest.testParallelReloadAndStats-seed#[F5A0231F0DD71BD6]) [    ] o.a.s.h.a.CoreAdminOperation Checking request status for : 1
   [junit4]   2> 1099061 INFO  (TEST-StatsReloadRaceTest.testParallelReloadAndStats-seed#[F5A0231F0DD71BD6]) [    ] o.a.s.h.a.CoreAdminOperation Checking request status for : 1
   [junit4]   2> 1099061 INFO  (TEST-StatsReloadRaceTest.testParallelReloadAndStats-seed#[F5A0231F0DD71BD6]) [    ] o.a.s.h.a.CoreAdminOperation Checking request status for : 1
   [junit4]   2> 1099061 INFO  (TEST-StatsReloadRaceTest.testParallelReloadAndStats-seed#[F5A0231F0DD71BD6]) [    ] o.a.s.h.a.CoreAdminOperation Checking request status for : 1
   [junit4]   2> 1099062 INFO  (TEST-StatsReloadRaceTest.testParallelReloadAndStats-seed#[F5A0231F0DD71BD6]) [    ] o.a.s.h.a.CoreAdminOperation Checking request status for : 1
   [junit4]   2> 1099062 INFO  (TEST-StatsReloadRaceTest.testParallelReloadAndStats-seed#[F5A0231F0DD71BD6]) [    ] o.a.s.h.a.CoreAdminOperation Checking request status for : 1
   [junit4]   2> 1099062 INFO  (TEST-StatsReloadRaceTest.testParallelReloadAndStats-seed#[F5A0231F0DD71BD6]) [    ] o.a.s.h.a.CoreAdminOperation Checking request status for : 1
   [junit4]   2> 1099063 INFO  (TEST-StatsReloadRaceTest.testParallelReloadAndStats-seed#[F5A0231F0DD71BD6]) [    ] o.a.s.h.a.CoreAdminOperation Checking request status for : 1
   [junit4]   2> 1099063 INFO  (TEST-StatsReloadRaceTest.testParallelReloadAndStats-seed#[F5A0231F0DD71BD6]) [    ] o.a.s.h.a.CoreAdminOperation Checking request status for : 1
   [junit4]   2> 1099063 INFO  (TEST-StatsReloadRaceTest.testParallelReloadAndStats-seed#[F5A0231F0DD71BD6]) [    ] o.a.s.h.a.CoreAdminOperation Checking request status for : 1
   [junit4]   2> 1099064 INFO  (TEST-StatsReloadRaceTest.testParallelReloadAndStats-seed#[F5A0231F0DD71BD6]) [    ] o.a.s.h.a.CoreAdminOperation Checking request status for : 1
   [junit4]   2> 1099064 INFO  (TEST-StatsReloadRaceTest.testParallelReloadAndStats-seed#[F5A0231F0DD71BD6]) [    ] o.a.s.h.a.CoreAdminOperation Checking request status for : 1
   [junit4]   2> 1099065 INFO  (TEST-StatsReloadRaceTest.testParallelReloadAndStats-seed#[F5A0231F0DD71BD6]) [    ] o.a.s.h.a.CoreAdminOperation Checking request status for : 1
   [junit4]   2> 1099065 INFO  (TEST-StatsReloadRaceTest.testParallelReloadAndStats-seed#[F5A0231F0DD71BD6]) [    ] o.a.s.h.a.CoreAdminOperation Checking request status for : 1
   [junit4]   2> 1099065 INFO  (TEST-StatsReloadRaceTest.testParallelReloadAndStats-seed#[F5A0231F0DD71BD6]) [    ] o.a.s.h.a.CoreAdminOperation Checking request status for : 1
   [junit4]   2> 1099066 INFO  (TEST-StatsReloadRaceTest.testParallelReloadAndStats-seed#[F5A0231F0DD71BD6]) [    ] o.a.s.h.a.CoreAdminOperation Checking request status for : 1
   [junit4]   2> 1099066 INFO  (TEST-StatsReloadRaceTest.testParallelReloadAndStats-seed#[F5A0231F0DD71BD6]) [    ] o.a.s.h.a.CoreAdminOperation Checking request status for : 1
   [junit4]   2> 1099066 INFO  (TEST-StatsReloadRaceTest.testParallelReloadAndStats-seed#[F5A0231F0DD71BD6]) [    ] o.a.s.h.a.CoreAdminOperation Checking request status for : 1
   [junit4]   2> 1099067 INFO  (TEST-StatsReloadRaceTest.testParallelReloadAndStats-seed#[F5A0231F0DD71BD6]) [    ] o.a.s.h.a.CoreAdminOperation Checking request status for : 1
   [junit4]   2> 1099067 INFO  (TEST-StatsReloadRaceTest.testParallelReloadAndStats-seed#[F5A0231F0DD71BD6]) [    ] o.a.s.h.a.CoreAdminOperation Checking request status for : 1
   [junit4]   2> 1099067 INFO  (TEST-StatsReloadRaceTest.testParallelReloadAndStats-seed#[F5A0231F0DD71BD6]) [    ] o.a.s.h.a.CoreAdminOperation Checking request status for : 1
   [junit4]   2> 1099068 INFO  (TEST-StatsReloadRaceTest.testParallelReloadAndStats-seed#[F5A0231F0DD71BD6]) [    ] o.a.s.h.a.CoreAdminOperation Checking request status for : 1
   [junit4]   2> 1099068 INFO  (TEST-StatsReloadRaceTest.testParallelReloadAndStats-seed#[F5A0231F0DD71BD6]) [    ] o.a.s.h.a.CoreAdminOperation Checking request status for : 1
   [junit4]   2> 1099069 INFO  (TEST-StatsReloadRaceTest.testParallelReloadAndStats-seed#[F5A0231F0DD71BD6]) [    ] o.a.s.h.a.CoreAdminOperation Checking request status for : 1
   [junit4]   2> 1099069 INFO  (TEST-StatsReloadRaceTest.testParallelReloadAndStats-seed#[F5A0231F0DD71BD6]) [    ] o.a.s.h.a.CoreAdminOperation Checking request status for : 1
   [junit4]   2> 1099070 INFO  (TEST-StatsReloadRaceTest.testParallelReloadAndStats-seed#[F5A0231F0DD71BD6]) [    ] o.a.s.h.a.CoreAdminOperation Checking request status for : 1
   [junit4]   2> 1099070 INFO  (TEST-StatsReloadRaceTest.testParallelReloadAndStats-seed#[F5A0231F0DD71BD6]) [    ] o.a.s.h.a.CoreAdminOperation Checking request status for : 1
   [junit4]   2> 1099071 INFO  (TEST-StatsReloadRaceTest.testParallelReloadAndStats-seed#[F5A0231F0DD71BD6]) [    ] o.a.s.h.a.CoreAdminOperation Checking request status for : 1
   [junit4]   2> 1099071 INFO  (TEST-StatsReloadRaceTest.testParallelReloadAndStats-seed#[F5A0231F0DD71BD6]) [    ] o.a.s.h.a.CoreAdminOperation Checking request status for : 1
   [junit4]   2> 1099072 INFO  (TEST-StatsReloadRaceTest.testParallelReloadAndStats-seed#[F5A0231F0DD71BD6]) [    ] o.a.s.h.a.CoreAdminOperation Checking request status for : 1
   [junit4]   2> 1099072 INFO  (TEST-StatsReloadRaceTest.testParallelReloadAndStats-seed#[F5A0231F0DD71BD6]) [    ] o.a.s.h.a.CoreAdminOperation Checking request status for : 1
   [junit4]   2> 1099072 INFO  (TEST-StatsReloadRaceTest.testParallelReloadAndStats-seed#[F5A0231F0DD71BD6]) [    ] o.a.s.h.a.CoreAdminOperation Checking request status for : 1
   [junit4]   2> 1099073 INFO  (TEST-StatsReloadRaceTest.testParallelReloadAndStats-seed#[F5A0231F0DD71BD6]) [    ] o.a.s.h.a.CoreAdminOperation Checking request status for : 1
   [junit4]   2> 1099073 INFO  (TEST-StatsReloadRaceTest.testParallelReloadAndStats-seed#[F5A0231F0DD71BD6]) [    ] o.a.s.h.a.CoreAdminOperation Checking request status for : 1
   [junit4]   2> 1099073 INFO  (TEST-StatsReloadRaceTest.testParallelReloadAndStats-seed#[F5A0231F0DD71BD6]) [    ] o.a.s.h.a.CoreAdminOperation Checking request status for : 1
   [junit4]   2> 1099073 INFO  (TEST-StatsReloadRaceTest.testParallelReloadAndStats-seed#[F5A0231F0DD71BD6]) [    ] o.a.s.h.a.CoreAdminOperation Checking request status for : 1
   [junit4]   2> 1099074 INFO  (TEST-StatsReloadRaceTest.testParallelReloadAndStats-seed#[F5A0231F0DD71BD6]) [    ] o.a.s.h.a.CoreAdminOperation Checking request status for : 1
   [junit4]   2> 1099074 INFO  (TEST-StatsReloadRaceTest.testParallelReloadAndStats-seed#[F5A0231F0DD71BD6]) [    ] o.a.s.h.a.CoreAdminOperation Checking request status for : 1
   [junit4]   2> 1099075 INFO  (TEST-StatsReloadRaceTest.testParallelReloadAndStats-seed#[F5A0231F0DD71BD6]) [    ] o.a.s.h.a.CoreAdminOperation Checking request status for : 1
   [junit4]   2> 1099075 INFO  (TEST-StatsReloadRaceTest.testParallelReloadAndStats-seed#[F5A0231F0DD71BD6]) [    ] o.a.s.h.a.CoreAdminOperation Checking request status for : 1
   [junit4]   2> 1099076 INFO  (TEST-StatsReloadRaceTest.testParallelReloadAndStats-seed#[F5A0231F0DD71BD6]) [    ] o.a.s.h.a.CoreAdminOperation Checking request status for : 1
   [junit4]   2> 1099076 INFO  (TEST-StatsReloadRaceTest.testParallelReloadAndStats-seed#[F5A0231F0DD71BD6]) [    ] o.a.s.h.a.CoreAdminOperation Checking request status for : 1
   [junit4]   2> 1099077 INFO  (TEST-StatsReloadRaceTest.testParallelReloadAndStats-seed#[F5A0231F0DD71BD6]) [    ] o.a.s.h.a.CoreAdminOperation Checking request status for : 1
   [junit4]   2> 1099077 INFO  (TEST-StatsReloadRaceTest.testParallelReloadAndStats-seed#[F5A0231F0DD71BD6]) [    ] o.a.s.h.a.CoreAdminOperation Checking request status for : 1
   [junit4]   2> 1099078 INFO  (TEST-StatsReloadRaceTest.testParallelReloadAndStats-seed#[F5A0231F0DD71BD6]) [    ] o.a.s.h.a.CoreAdminOperation Checking request status for : 1
   [junit4]   2> 1099078 INFO  (TEST-StatsReloadRaceTest.testParallelReloadAndStats-seed#[F5A0231F0DD71BD6]) [    ] o.a.s.h.a.CoreAdminOperation Checking request status for : 1
   [junit4]   2> 1099078 INFO  (TEST-StatsReloadRaceTest.testParallelReloadAndStats-seed#[F5A0231F0DD71BD6]) [    ] o.a.s.h.a.CoreAdminOperation Checking request status for : 1
   [junit4]   2> 1099078 INFO  (TEST-StatsReloadRaceTest.testParallelReloadAndStats-seed#[F5A0231F0DD71BD6]) [    ] o.a.s.h.a.CoreAdminOperation Checking request status for : 1
   [junit4]   2> 1099079 INFO  (TEST-StatsReloadRaceTest.testParallelReloadAndStats-seed#[F5A0231F0DD71BD6]) [    ] o.a.s.h.a.CoreAdminOperation Checking request status for : 1
   [junit4]   2> 1099079 INFO  (TEST-StatsReloadRaceTest.testParallelReloadAndStats-seed#[F5A0231F0DD71BD6]) [    ] o.a.s.h.a.CoreAdminOperation Checking request status for : 1
   [junit4]   2> 1099079 INFO  (TEST-StatsReloadRaceTest.testParallelReloadAndStats-seed#[F5A0231F0DD71BD6]) [    ] o.a.s.h.a.CoreAdminOperation Checking request status for : 1
   [junit4]   2> 1099080 INFO  (TEST-StatsReloadRaceTest.testParallelReloadAndStats-seed#[F5A0231F0DD71BD6]) [    ] o.a.s.h.a.CoreAdminOperation Checking request status for : 1
   [junit4]   2> 1099081 INFO  (TEST-StatsReloadRaceTest.testParallelReloadAndStats-seed#[F5A0231F0DD71BD6]) [    ] o.a.s.h.a.CoreAdminOperation Checking request status for : 1
   [junit4]   2> 1099081 INFO  (TEST-StatsReloadRaceTest.testParallelReloadAndStats-seed#[F5A0231F0DD71BD6]) [    ] o.a.s.h.a.CoreAdminOperation Checking request status for : 1
   [junit4]   2> 1099081 INFO  (TEST-StatsReloadRaceTest.testParallelReloadAndStats-seed#[F5A0231F0DD71BD6]) [    ] o.a.s.h.a.CoreAdminOperation Checking request status for : 1
   [junit4]   2> 1099082 INFO  (TEST-StatsReloadRaceTest.testParallelReloadAndStats-seed#[F5A0231F0DD71BD6]) [    ] o.a.s.h.a.CoreAdminOperation Checking request status for : 1
   [junit4]   2> 1099082 INFO  (TEST-StatsReloadRaceTest.testParallelReloadAndStats-seed#[F5A0231F0DD71BD6]) [    ] o.a.s.h.a.CoreAdminOperation Checking request status for : 1
   [junit4]   2> 1099083 INFO  (TEST-StatsReloadRaceTest.testParallelReloadAndStats-seed#[F5A0231F0DD71BD6]) [    ] o.a.s.h.a.CoreAdminOperation Checking request status for : 1
   [junit4]   2> 1099083 INFO  (TEST-StatsReloadRaceTest.testParallelReloadAndStats-seed#[F5A0231F0DD71BD6]) [    ] o.a.s.h.a.CoreAdminOperation Checking request status for : 1
   [junit4]   2> 1099083 INFO  (TEST-StatsReloadRaceTest.testParallelReloadAndStats-seed#[F5A0231F0DD71BD6]) [    ] o.a.s.h.a.CoreAdminOperation Checking request status for : 1
   [junit4]   2> 1099084 INFO  (TEST-StatsReloadRaceTest.testParallelReloadAndStats-seed#[F5A0231F0DD71BD6]) [    ] o.a.s.h.a.CoreAdminOperation Checking request status for : 1
   [junit4]   2> 1099084 INFO  (TEST-StatsReloadRaceTest.testParallelReloadAndStats-seed#[F5A0231F0DD71BD6]) [    ] o.a.s.h.a.CoreAdminOperation Checking request status for : 1
   [junit4]   2> 1099084 INFO  (TEST-StatsReloadRaceTest.testParallelReloadAndStats-seed#[F5A0231F0DD71BD6]) [    ] o.a.s.h.a.CoreAdminOperation Checking request status for : 1
   [junit4]   2> 1099085 INFO  (TEST-StatsReloadRaceTest.testParallelReloadAndStats-seed#[F5A0231F0DD71BD6]) [    ] o.a.s.h.a.CoreAdminOperation Checking request status for : 1
   [junit4]   2> 1099085 INFO  (TEST-StatsReloadRaceTest.testParallelReloadAndStats-seed#[F5A0231F0DD71BD6]) [    ] o.a.s.h.a.CoreAdminOperation Checking request status for : 1
   [junit4]   2> 1099085 INFO  (TEST-StatsReloadRaceTest.testParallelReloadAndStats-seed#[F5A0231F0DD71BD6]) [    ] o.a.s.h.a.CoreAdminOperation Checking request status for : 1
   [junit4]   2> 1099086 INFO  (TEST-StatsReloadRaceTest.testParallelReloadAndStats-seed#[F5A0231F0DD71BD6]) [    ] o.a.s.h.a.CoreAdminOperation Checking request status for : 1
   [junit4]   2> 1099086 INFO  (TEST-StatsReloadRaceTest.testParallelReloadAndStats-seed#[F5A0231F0DD71BD6]) [    ] o.a.s.h.a.CoreAdminOperation Checking request status for : 1
   [junit4]   2> 1099087 INFO  (TEST-StatsReloadRaceTest.testParallelReloadAndStats-seed#[F5A0231F0DD71BD6]) [    ] o.a.s.h.a.CoreAdminOperation Checking request status for : 1
   [junit4]   2> 1099087 INFO  (TEST-StatsReloadRaceTest.testParallelReloadAndStats-seed#[F5A0231F0DD71BD6]) [    ] o.a.s.h.a.CoreAdminOperation Checking request status for : 1
   [junit4]   2> 1099087 INFO  (TEST-StatsReloadRaceTest.testParallelReloadAndStats-seed#[F5A0231F0DD71BD6]) [    ] o.a.s.h.a.CoreAdminOperation Checking request status for : 1
   [junit4]   2> 1099087 INFO  (TEST-StatsReloadRaceTest.testParallelReloadAndStats-seed#[F5A0231F0DD71BD6]) [    ] o.a.s.h.a.CoreAdminOperation Checking request status for : 1
   [junit4]   2> 1099088 INFO  (TEST-StatsReloadRaceTest.testParallelReloadAndStats-seed#[F5A0231F0DD71BD6]) [    ] o.a.s.h.a.CoreAdminOperation Checking request status for : 1
   [junit4]   2> 1099088 INFO  (TEST-StatsReloadRaceTest.testParallelReloadAndStats-seed#[F5A0231F0DD71BD6]) [    ] o.a.s.h.a.CoreAdminOperation Checking request status for : 1
   [junit4]   2> 1099088 INFO  (TEST-StatsReloadRaceTest.testParallelReloadAndStats-seed#[F5A0231F0DD71BD6]) [    ] o.a.s.h.a.CoreAdminOperation Checking request status for : 1
   [junit4]   2> 1099089 INFO  (TEST-StatsReloadRaceTest.testParallelReloadAndStats-seed#[F5A0231F0DD71BD6]) [    ] o.a.s.h.a.CoreAdminOperation Checking request status for : 1
   [junit4]   2> 1099089 INFO  (TEST-StatsReloadRaceTest.testParallelReloadAndStats-seed#[F5A0231F0DD71BD6]) [    ] o.a.s.h.a.CoreAdminOperation Checking request status for : 1
   [junit4]   2> 1099090 INFO  (TEST-StatsReloadRaceTest.testParallelReloadAndStats-seed#[F5A0231F0DD71BD6]) [    ] o.a.s.h.a.CoreAdminOperation Checking request status for : 1
   [junit4]   2> 1099091 INFO  (TEST-StatsReloadRaceTest.testParallelReloadAndStats-seed#[F5A0231F0DD71BD6]) [    ] o.a.s.h.a.CoreAdminOperation Checking request status for : 1
   [junit4]   2> 1099091 INFO  (TEST-StatsReloadRaceTest.testParallelReloadAndStats-seed#[F5A0231F0DD71BD6]) [    ] o.a.s.h.a.CoreAdminOperation Checking request status for : 1
   [junit4]   2> 1099091 INFO  (TEST-StatsReloadRaceTest.testParallelReloadAndStats-seed#[F5A0231F0DD71BD6]) [    ] o.a.s.h.a.CoreAdminOperation Checking request status for : 1
   [junit4]   2> 1099092 INFO  (TEST-StatsReloadRaceTest.testParallelReloadAndStats-seed#[F5A0231F0DD71BD6]) [    ] o.a.s.h.a.CoreAdminOperation Checking request status for : 1
   [junit4]   2> 1099092 INFO  (TEST-StatsReloadRaceTest.testParallelReloadAndStats-seed#[F5A0231F0DD71BD6]) [    ] o.a.s.h.a.CoreAdminOperation Checking request status for : 1
   [junit4]   2> 1099092 INFO  (TEST-StatsReloadRaceTest.testParallelReloadAndStats-seed#[F5A0231F0DD71BD6]) [    ] o.a.s.h.a.CoreAdminOperation Checking request status for : 1
   [junit4]   2> 1099092 INFO  (TEST-StatsReloadRaceTest.testParallelReloadAndStats-seed#[F5A0231F0DD71BD6]) [    ] o.a.s.h.a.CoreAdminOperation Checking request status for : 1
   [junit4]   2> 1099093 INFO  (TEST-StatsReloadRaceTest.testParallelReloadAndStats-seed#[F5A0231F0DD71BD6]) [    ] o.a.s.h.a.CoreAdminOperation Checking request status for : 1
   [junit4]   2> 1099093 INFO  (TEST-StatsReloadRaceTest.testParallelReloadAndStats-seed#[F5A0231F0DD71BD6]) [    ] o.a.s.h.a.CoreAdminOperation Checking request status for : 1
   [junit4]   2> 1099093 INFO  (TEST-StatsReloadRaceTest.testParallelReloadAndStats-seed#[F5A0231F0DD71BD6]) [    ] o.a.s.h.a.CoreAdminOperation Checking request status for : 1
   [junit4]   2> 1099094 INFO  (TEST-StatsReloadRaceTest.testParallelReloadAndStats-seed#[F5A0231F0DD71BD6]) [    ] o.a.s.h.a.CoreAdminOperation Checking request status for : 1
   [junit4]   2> 1099094 INFO  (TEST-StatsReloadRaceTest.testParallelReloadAndStats-seed#[F5A0231F0DD71BD6]) [    ] o.a.s.h.a.CoreAdminOperation Checking request status for : 1
   [junit4]   2> 1099094 INFO  (TEST-StatsReloadRaceTest.testParallelReloadAndStats-seed#[F5A0231F0DD71BD6]) [    ] o.a.s.h.a.CoreAdminOperation Checking request status for : 1
   [junit4]   2> 1099095 INFO  (TEST-StatsReloadRaceTest.testParallelReloadAndStats-seed#[F5A0231F0DD71BD6]) [    ] o.a.s.h.a.CoreAdminOperation Checking request status for : 1
   [junit4]   2> 1099095 INFO  (TEST-StatsReloadRaceTest.testParallelReloadAndStats-seed#[F5A0231F0DD71BD6]) [    ] o.a.s.h.a.CoreAdminOperation Checking request status for : 1
   [junit4]   2> 1099095 INFO  (TEST-StatsReloadRaceTest.testParallelReloadAndStats-seed#[F5A0231F0DD71BD6]) [    ] o.a.s.h.a.CoreAdminOperation Checking request status for : 1
   [junit4]   2> 1099095 INFO  (TEST-StatsReloadRaceTest.testParallelReloadAndStats-seed#[F5A0231F0DD71BD6]) [    ] o.a.s.h.a.CoreAdminOperation Checking request status for : 1
   [junit4]   2> 1099096 INFO  (TEST-StatsReloadRaceTest.testParallelReloadAndStats-seed#[F5A0231F0DD71BD6]) [    ] o.a.s.h.a.CoreAdminOperation Checking request status for : 1
   [junit4]   2> 1099096 INFO  (TEST-StatsReloadRaceTest.testParallelReloadAndStats-seed#[F5A0231F0DD71BD6]) [    ] o.a.s.h.a.CoreAdminOperation Checking request status for : 1
   [junit4]   2> 1099096 INFO  (TEST-StatsReloadRaceTest.testParallelReloadAndStats-seed#[F5A0231F0DD71BD6]) [    ] o.a.s.h.a.CoreAdminOperation Checking request status for : 1
   [junit4]   2> 1099097 INFO  (TEST-StatsReloadRaceTest.testParallelReloadAndStats-seed#[F5A0231F0DD71BD6]) [    ] o.a.s.h.a.CoreAdminOperation Checking request status for : 1
   [junit4]   2> 1099097 INFO  (TEST-StatsReloadRaceTest.testParallelReloadAndStats-seed#[F5A0231F0DD71BD6]) [    ] o.a.s.h.a.CoreAdminOperation Checking request status for : 1
   [junit4]   2> 1099097 INFO  (TEST-StatsReloadRaceTest.testParallelReloadAndStats-seed#[F5A0231F0DD71BD6]) [    ] o.a.s.h.a.CoreAdminOperation Checking request status for : 1
   [junit4]   2> 1099097 INFO  (TEST-StatsReloadRaceTest.testParallelReloadAndStats-seed#[F5A0231F0DD71BD6]) [    ] o.a.s.h.a.CoreAdminOperation Checking request status for : 1
   [junit4]   2> 1099098 INFO  (TEST-StatsReloadRaceTest.testParallelReloadAndStats-seed#[F5A0231F0DD71BD6]) [    ] o.a.s.h.a.CoreAdminOperation Checking request status for : 1
   [junit4]   2> 1099098 INFO  (TEST-StatsReloadRaceTest.testParallelReloadAndStats-seed#[F5A0231F0DD71BD6]) [    ] o.a.s.h.a.CoreAdminOperation Checking request status for : 1
   [junit4]   2> 1099099 INFO  (TEST-StatsReloadRaceTest.testParallelReloadAndStats-seed#[F5A0231F0DD71BD6]) [    ] o.a.s.h.a.CoreAdminOperation Checking request status for : 1
   [junit4]   2> 1099099 INFO  (TEST-StatsReloadRaceTest.testParallelReloadAndStats-seed#[F5A0231F0DD71BD6]) [    ] o.a.s.h.a.CoreAdminOperation Checking request status for : 1
   [junit4]   2> 1099099 INFO  (TEST-StatsReloadRaceTest.testParallelReloadAndStats-seed#[F5A0231F0DD71BD6]) [    ] o.a.s.h.a.CoreAdminOperation Checking request status for : 1
   [junit4]   2> 1099099 INFO  (TEST-StatsReloadRaceTest.testParallelReloadAndStats-seed#[F5A0231F0DD71BD6]) [    ] o.a.s.h.a.CoreAdminOperation Checking request status for : 1
   [junit4]   2> 1099100 INFO  (TEST-StatsReloadRaceTest.testParallelReloadAndStats-seed#[F5A0231F0DD71BD6]) [    ] o.a.s.h.a.CoreAdminOperation Checking request status for : 1
   [junit4]   2> 1099100 INFO  (TEST-StatsReloadRaceTest.testParallelReloadAndStats-seed#[F5A0231F0DD71BD6]) [    ] o.a.s.h.a.CoreAdminOperation Checking request status for : 1
   [junit4]   2> 1099101 INFO  (TEST-StatsReloadRaceTest.testParallelReloadAndStats-seed#[F5A0231F0DD71BD6]) [    ] o.a.s.h.a.CoreAdminOperation Checking request status for : 1
   [junit4]   2> 1099101 INFO  (TEST-StatsReloadRaceTest.testParallelReloadAndStats-seed#[F5A0231F0DD71BD6]) [    ] o.a.s.h.a.CoreAdminOperation Checking request status for : 1
   [junit4]   2> 1099102 INFO  (TEST-StatsReloadRaceTest.testParallelReloadAndStats-seed#[F5A0231F0DD71BD6]) [    ] o.a.s.h.a.CoreAdminOperation Checking request status for : 1
   [junit4]   2> 1099102 INFO  (TEST-StatsReloadRaceTest.testParallelReloadAndStats-seed#[F5A0231F0DD71BD6]) [    ] o.a.s.h.a.CoreAdminOperation Checking request status for : 1
   [junit4]   2> 1099102 INFO  (TEST-StatsReloadRaceTest.testParallelReloadAndStats-seed#[F5A0231F0DD71BD6]) [    ] o.a.s.h.a.CoreAdminOperation Checking request status for : 1
   [junit4]   2> 1099103 INFO  (TEST-StatsReloadRaceTest.testParallelReloadAndStats-seed#[F5A0231F0DD71BD6]) [    ] o.a.s.h.a.CoreAdminOperation Checking request status for : 1
   [junit4]   2> 1099103 INFO  (TEST-StatsReloadRaceTest.testParallelReloadAndStats-seed#[F5A0231F0DD71BD6]) [    ] o.a.s.h.a.CoreAdminOperation Checking request status for : 1
   [junit4]   2> 1099103 INFO  (TEST-StatsReloadRaceTest.testParallelReloadAndStats-seed#[F5A0231F0DD71BD6]) [    ] o.a.s.h.a.CoreAdminOperation Checking request status for : 1
   [junit4]   2> 1099103 INFO  (TEST-StatsReloadRaceTest.testParallelReloadAndStats-seed#[F5A0231F0DD71BD6]) [    ] o.a.s.h.a.CoreAdminOperation Checking request status for : 1
   [junit4]   2> 1099104 INFO  (TEST-StatsReloadRaceTest.testParallelReloadAndStats-seed#[F5A0231F0DD71BD6]) [    ] o.a.s.h.a.CoreAdminOperation Checking request status for : 1
   [junit4]   2> 1099104 INFO  (TEST-StatsReloadRaceTest.testParallelReloadAndStats-seed#[F5A0231F0DD71BD6]) [    ] o.a.s.h.a.CoreAdminOperation Checking request status for : 1
   [junit4]   2> 1099104 INFO  (TEST-StatsReloadRaceTest.testParallelReloadAndStats-seed#[F5A0231F0DD71BD6]) [    ] o.a.s.h.a.CoreAdminOperation Checking request status for : 1
   [junit4]   2> 1099104 INFO  (TEST-StatsReloadRaceTest.testParallelReloadAndStats-seed#[F5A0231F0DD71BD6]) [    ] o.a.s.h.a.CoreAdminOperation Checking request status for : 1
   [junit4]   2> 1099105 INFO  (TEST-StatsReloadRaceTest.testParallelReloadAndStats-seed#[F5A0231F0DD71BD6]) [    ] o.a.s.h.a.CoreAdminOperation Checking request status for : 1
   [junit4]   2> 1099105 INFO  (TEST-StatsReloadRaceTest.testParallelReloadAndStats-seed#[F5A0231F0DD71BD6]) [    ] o.a.s.h.a.CoreAdminOperation Checking request status for : 1
   [junit4]   2> 1099105 INFO  (TEST-StatsReloadRaceTest.testParallelReloadAndStats-seed#[F5A0231F0DD71BD6]) [    ] o.a.s.h.a.CoreAdminOperation Checking request status for : 1
   [junit4]   2> 1099106 INFO  (TEST-StatsReloadRaceTest.testParallelReloadAndStats-seed#[F5A0231F0DD71BD6]) [    ] o.a.s.h.a.CoreAdminOperation Checking request status for : 1
   [junit4]   2> 1099106 INFO  (TEST-StatsReloadRaceTest.testParallelReloadAndStats-seed#[F5A0231F0DD71BD6]) [    ] o.a.s.h.a.CoreAdminOperation Checking request status for : 1
   [junit4]   2> 1099106 INFO  (TEST-StatsReloadRaceTest.testParallelReloadAndStats-seed#[F5A0231F0DD71BD6]) [    ] o.a.s.h.a.CoreAdminOperation Checking request status for : 1
   [junit4]   2> 1099107 INFO  (TEST-StatsReloadRaceTest.testParallelReloadAndStats-seed#[F5A0231F0DD71BD6]) [    ] o.a.s.h.a.CoreAdminOperation Checking request status for : 1
   [junit4]   2> 1099107 INFO  (TEST-StatsReloadRaceTest.testParallelReloadAndStats-seed#[F5A0231F0DD71BD6]) [    ] o.a.s.h.a.CoreAdminOperation Checking request status for : 1
   [junit4]   2> 1099107 INFO  (TEST-StatsReloadRaceTest.testParallelReloadAndStats-seed#[F5A0231F0DD71BD6]) [    ] o.a.s.h.a.CoreAdminOperation Checking request status for : 1
   [junit4]   2> 1099108 INFO  (TEST-StatsReloadRaceTest.testParallelReloadAndStats-seed#[F5A0231F0DD71BD6]) [    ] o.a.s.h.a.CoreAdminOperation Checking request status for : 1
   [junit4]   2> 1099108 INFO  (TEST-StatsReloadRaceTest.testParallelReloadAndStats-seed#[F5A0231F0DD71BD6]) [    ] o.a.s.h.a.CoreAdminOperation Checking request status for : 1
   [junit4]   2> 1099108 INFO  (TEST-StatsReloadRaceTest.testParallelReloadAndStats-seed#[F5A0231F0DD71BD6]) [    ] o.a.s.h.a.CoreAdminOperation Checking request status for : 1
   [junit4]   2> 1099108 INFO  (TEST-StatsReloadRaceTest.testParallelReloadAndStats-seed#[F5A0231F0DD71BD6]) [    ] o.a.s.h.a.CoreAdminOperation Checking request status for : 1
   [junit4]   2> 1099109 INFO  (TEST-StatsReloadRaceTest.testParallelReloadAndStats-seed#[F5A0231F0DD71BD6]) [    ] o.a.s.h.a.CoreAdminOperation Checking request status for : 1
   [junit4]   2> 1099109 INFO  (TEST-StatsReloadRaceTest.testParallelReloadAndStats-seed#[F5A0231F0DD71BD6]) [    ] o.a.s.h.a.CoreAdminOperation Checking request status for : 1
   [junit4]   2> 1099109 INFO  (TEST-StatsReloadRaceTest.testParallelReloadAndStats-seed#[F5A0231F0DD71BD6]) [    ] o.a.s.h.a.CoreAdminOperation Checking request status for : 1
   [junit4]   2> 1099110 INFO  (TEST-StatsReloadRaceTest.testParallelReloadAndStats-seed#[F5A0231F0DD71BD6]) [    ] o.a.s.h.a.CoreAdminOperation Checking request status for : 1
   [junit4]   2> 1099110 INFO  (TEST-StatsReloadRaceTest.testParallelReloadAndStats-seed#[F5A0231F0DD71BD6]) [    ] o.a.s.h.a.CoreAdminOperation Checking request status for : 1
   [junit4]   2> 1099111 INFO  (TEST-StatsReloadRaceTest.testParallelReloadAndStats-seed#[F5A0231F0DD71BD6]) [    ] o.a.s.h.a.CoreAdminOperation Checking request status for : 1
   [junit4]   2> 1099111 INFO  (TEST-StatsReloadRaceTest.testParallelReloadAndStats-seed#[F5A0231F0DD71BD6]) [    ] o.a.s.h.a.CoreAdminOperation Checking request status for : 1
   [junit4]   2> 1099111 INFO  (TEST-StatsReloadRaceTest.testParallelReloadAndStats-seed#[F5A0231F0DD71BD6]) [    ] o.a.s.h.a.CoreAdminOperation Checking request status for : 1
   [junit4]   2> 1099112 INFO  (TEST-StatsReloadRaceTest.testParallelReloadAndStats-seed#[F5A0231F0DD71BD6]) [    ] o.a.s.h.a.CoreAdminOperation Checking request status for : 1
   [junit4]   2> 1099112 INFO  (TEST-StatsReloadRaceTest.testParallelReloadAndStats-seed#[F5A0231F0DD71BD6]) [    ] o.a.s.h.a.CoreAdminOperation Checking request status for : 1
   [junit4]   2> 1099112 INFO  (TEST-StatsReloadRaceTest.testParallelReloadAndStats-seed#[F5A0231F0DD71BD6]) [    ] o.a.s.h.a.CoreAdminOperation Checking request status for : 1
   [junit4]   2> 1099113 INFO  (TEST-StatsReloadRaceTest.testParallelReloadAndStats-seed#[F5A0231F0DD71BD6]) [    ] o.a.s.h.a.CoreAdminOperation Checking request status for : 1
   [junit4]   2> 1099113 INFO  (TEST-StatsReloadRaceTest.testParallelReloadAndStats-seed#[F5A0231F0DD71BD6]) [    ] o.a.s.h.a.CoreAdminOperation Checking request status for : 1
   [junit4]   2> 1099113 INFO  (TEST-StatsReloadRaceTest.testParallelReloadAndStats-seed#[F5A0231F0DD71BD6]) [    ] o.a.s.h.a.CoreAdminOperation Checking request status for : 1
   [junit4]   2> 1099113 INFO  (TEST-StatsReloadRaceTest.testParallelReloadAndStats-seed#[F5A0231F0DD71BD6]) [    ] o.a.s.h.a.CoreAdminOperation Checking request status for : 1
   [junit4]   2> 1099113 INFO  (TEST-StatsReloadRaceTest.testParallelReloadAndStats-seed#[F5A0231F0DD71BD6]) [    ] o.a.s.h.a.CoreAdminOperation Checking request status for : 1
   [junit4]   2> 1099114 INFO  (TEST-StatsReloadRaceTest.testParallelReloadAndStats-seed#[F5A0231F0DD71BD6]) [    ] o.a.s.h.a.CoreAdminOperation Checking request status for : 1
   [junit4]   2> 1099114 INFO  (TEST-StatsReloadRaceTest.testParallelReloadAndStats-seed#[F5A0231F0DD71BD6]) [    ] o.a.s.h.a.CoreAdminOperation Checking request status for : 1
   [junit4]   2> 1099115 INFO  (TEST-StatsReloadRaceTest.testParallelReloadAndStats-seed#[F5A0231F0DD71BD6]) [    ] o.a.s.h.a.CoreAdminOperation Checking request status for : 1
   [junit4]   2> 1099115 INFO  (TEST-StatsReloadRaceTest.testParallelReloadAndStats-seed#[F5A0231F0DD71BD6]) [    ] o.a.s.h.a.CoreAdminOperation Checking request status for : 1
   [junit4]   2> 1099116 INFO  (TEST-StatsReloadRaceTest.testParallelReloadAndStats-seed#[F5A0231F0DD71BD6]) [    ] o.a.s.h.a.CoreAdminOperation Checking request status for : 1
   [junit4]   2> 1099116 INFO  (TEST-StatsReloadRaceTest.testParallelReloadAndStats-seed#[F5A0231F0DD71BD6]) [    ] o.a.s.h.a.CoreAdminOperation Checking request status for : 1
   [junit4]   2> 1099117 INFO  (TEST-StatsReloadRaceTest.testParallelReloadAndStats-seed#[F5A0231F0DD71BD6]) [    ] o.a.s.h.a.CoreAdminOperation Checking request status for : 1
   [junit4]   2> 1099117 INFO  (TEST-StatsReloadRaceTest.testParallelReloadAndStats-seed#[F5A0231F0DD71BD6]) [    ] o.a.s.h.a.CoreAdminOperation Checking request status for : 1
   [junit4]   2> 1099118 INFO  (TEST-StatsReloadRaceTest.testParallelReloadAndStats-seed#[F5A0231F0DD71BD6]) [    ] o.a.s.h.a.CoreAdminOperation Checking request status for : 1
   [junit4]   2> 1099118 INFO  (TEST-StatsReloadRaceTest.testParallelReloadAndStats-seed#[F5A0231F0DD71BD6]) [    ] o.a.s.h.a.CoreAdminOperation Checking request status for : 1
   [junit4]   2> 1099119 INFO  (TEST-StatsReloadRaceTest.testParallelReloadAndStats-seed#[F5A0231F0DD71BD6]) [    ] o.a.s.h.a.CoreAdminOperation Checking request status for : 1
   [junit4]   2> 1099119 INFO  (TEST-StatsReloadRaceTest.testParallelReloadAndStats-seed#[F5A0231F0DD71BD6]) [    ] o.a.s.h.a.CoreAdminOperation Checking request status for : 1
   [junit4]   2> 1099119 INFO  (TEST-StatsReloadRaceTest.testParallelReloadAndStats-seed#[F5A0231F0DD71BD6]) [    ] o.a.s.h.a.CoreAdminOperation Checking request status for : 1
   [junit4]   2> 1099120 INFO  (TEST-StatsReloadRaceTest.testParallelReloadAndStats-seed#[F5A0231F0DD71BD6]) [    ] o.a.s.h.a.CoreAdminOperation Checking request status for : 1
   [junit4]   2> 1099120 INFO  (TEST-StatsReloadRaceTest.testParallelReloadAndStats-seed#[F5A0231F0DD71BD6]) [    ] o.a.s.h.a.CoreAdminOperation Checking request status for : 1
   [junit4]   2> 1099121 INFO  (TEST-StatsReloadRaceTest.testParallelReloadAndStats-seed#[F5A0231F0DD71BD6]) [    ] o.a.s.h.a.CoreAdminOperation Checking request status for : 1
   [junit4]   2> 1099121 INFO  (TEST-StatsReloadRaceTest.testParallelReloadAndStats-seed#[F5A0231F0DD71BD6]) [    ] o.a.s.h.a.CoreAdminOperation Checking request status for : 1
   [junit4]   2> 1099121 INFO  (TEST-StatsReloadRaceTest.testParallelReloadAndStats-seed#[F5A0231F0DD71BD6]) [    ] o.a.s.h.a.CoreAdminOperation Checking request status for : 1
   [junit4]   2> 1099121 INFO  (TEST-StatsReloadRaceTest.testParallelReloadAndStats-seed#[F5A0231F0DD71BD6]) [    ] o.a.s.h.a.CoreAdminOperation Checking request status for : 1
   [junit4]   2> 1099122 INFO  (TEST-StatsReloadRaceTest.testParallelReloadAndStats-seed#[F5A0231F0DD71BD6]) [    ] o.a.s.h.a.CoreAdminOperation Checking request status for : 1
   [junit4]   2> 1099122 INFO  (TEST-StatsReloadRaceTest.testParallelReloadAndStats-seed#[F5A0231F0DD71BD6]) [    ] o.a.s.h.a.CoreAdminOperation Checking request status for : 1
   [junit4]   2> 1099122 INFO  (TEST-StatsReloadRaceTest.testParallelReloadAndStats-seed#[F5A0231F0DD71BD6]) [    ] o.a.s.h.a.CoreAdminOperation Checking request status for : 1
   [junit4]   2> 1099123 INFO  (TEST-StatsReloadRaceTest.testParallelReloadAndStats-seed#[F5A0231F0DD71BD6]) [    ] o.a.s.h.a.CoreAdminOperation Checking request status for : 1
   [junit4]   2> 1099123 INFO  (TEST-StatsReloadRaceTest.testParallelReloadAndStats-seed#[F5A0231F0DD71BD6]) [    ] o.a.s.h.a.CoreAdminOperation Checking request status for : 1
   [junit4]   2> 1099123 INFO  (TEST-StatsReloadRaceTest.testParallelReloadAndStats-seed#[F5A0231F0DD71BD6]) [    ] o.a.s.h.a.CoreAdminOperation Checking request status for : 1
   [junit4]   2> 1099124 INFO  (TEST-StatsReloadRaceTest.testParallelReloadAndStats-seed#[F5A0231F0DD71BD6]) [    ] o.a.s.h.a.CoreAdminOperation Checking request status for : 1
   [junit4]   2> 1099124 INFO  (TEST-StatsReloadRaceTest.testParallelReloadAndStats-seed#[F5A0231F0DD71BD6]) [    ] o.a.s.h.a.CoreAdminOperation Checking request status for : 1
   [junit4]   2> 1099125 INFO  (TEST-StatsReloadRaceTest.testParallelReloadAndStats-seed#[F5A0231F0DD71BD6]) [    ] o.a.s.h.a.CoreAdminOperation Checking request status for : 1
   [junit4]   2> 1099125 INFO  (TEST-StatsReloadRaceTest.testParallelReloadAndStats-seed#[F5A0231F0DD71BD6]) [    ] o.a.s.h.a.CoreAdminOperation Checking request status for : 1
   [junit4]   2> 1099125 INFO  (TEST-StatsReloadRaceTest.testParallelReloadAndStats-seed#[F5A0231F0DD71BD6]) [    ] o.a.s.h.a.CoreAdminOperation Checking request status for : 1
   [junit4]   2> 1099126 INFO  (TEST-StatsReloadRaceTest.testParallelReloadAndStats-seed#[F5A0231F0DD71BD6]) [    ] o.a.s.h.a.CoreAdminOperation Checking request status for : 1
   [junit4]   2> 1099126 INFO  (TEST-StatsReloadRaceTest.testParallelReloadAndStats-seed#[F5A0231F0DD71BD6]) [    ] o.a.s.h.a.CoreAdminOperation Checking request status for : 1
   [junit4]   2> 1099126 INFO  (TEST-StatsReloadRaceTest.testParallelReloadAndStats-seed#[F5A0231F0DD71BD6]) [    ] o.a.s.h.a.CoreAdminOperation Checking request status for : 1
   [junit4]   2> 1099126 INFO  (TEST-StatsReloadRaceTest.testParallelReloadAndStats-seed#[F5A0231F0DD71BD6]) [    ] o.a.s.h.a.CoreAdminOperation Checking request status for : 1
   [junit4]   2> 1099127 INFO  (TEST-StatsReloadRaceTest.testParallelReloadAndStats-seed#[F5A0231F0DD71BD6]) [    ] o.a.s.h.a.CoreAdminOperation Checking request status for : 1
   [junit4]   2> 1099127 INFO  (TEST-StatsReloadRaceTest.testParallelReloadAndStats-seed#[F5A0231F0DD71BD6]) [    ] o.a.s.h.a.CoreAdminOperation Checking request status for : 1
   [junit4]   2> 1099127 INFO  (TEST-StatsReloadRaceTest.testParallelReloadAndStats-seed#[F5A0231F0DD71BD6]) [    ] o.a.s.h.a.CoreAdminOperation Checking request status for : 1
   [junit4]   2> 1099127 INFO  (TEST-StatsReloadRaceTest.testParallelReloadAndStats-seed#[F5A0231F0DD71BD6]) [    ] o.a.s.h.a.CoreAdminOperation Checking request status for : 1
   [junit4]   2> 1099128 INFO  (TEST-StatsReloadRaceTest.testParallelReloadAndStats-seed#[F5A0231F0DD71BD6]) [    ] o.a.s.h.a.CoreAdminOperation Checking request status for : 1
   [junit4]   2> 1099128 INFO  (TEST-StatsReloadRaceTest.testParallelReloadAndStats-seed#[F5A0231F0DD71BD6]) [    ] o.a.s.h.a.CoreAdminOperation Checking request status for : 1
   [junit4]   2> 1099129 INFO  (TEST-StatsReloadRaceTest.testParallelReloadAndStats-seed#[F5A0231F0DD71BD6]) [    ] o.a.s.h.a.CoreAdminOperation Checking request status for : 1
   [junit4]   2> 1099129 INFO  (TEST-StatsReloadRaceTest.testParallelReloadAndStats-seed#[F5A0231F0DD71BD6]) [    ] o.a.s.h.a.CoreAdminOperation Checking request status for : 1
   [junit4]   2> 1099130 INFO  (TEST-StatsReloadRaceTest.testParallelReloadAndStats-seed#[F5A0231F0DD71BD6]) [    ] o.a.s.h.a.CoreAdminOperation Checking request status for : 1
   [junit4]   2> 1099130 INFO  (TEST-StatsReloadRaceTest.testParallelReloadAndStats-seed#[F5A0231F0DD71BD6]) [    ] o.a.s.h.a.CoreAdminOperation Checking request status for : 1
   [junit4]   2> 1099130 INFO  (TEST-StatsReloadRaceTest.testParallelReloadAndStats-seed#[F5A0231F0DD71BD6]) [    ] o.a.s.h.a.CoreAdminOperation Checking request status for : 1
   [junit4]   2> 1099131 INFO  (TEST-StatsReloadRaceTest.testParallelReloadAndStats-seed#[F5A0231F0DD71BD6]) [    ] o.a.s.h.a.CoreAdminOperation Checking request status for : 1
   [junit4]   2> 1099131 INFO  (TEST-StatsReloadRaceTest.testParallelReloadAndStats-seed#[F5A0231F0DD71BD6]) [    ] o.a.s.h.a.CoreAdminOperation Checking request status for : 1
   [junit4]   2> 1099131 INFO  (TEST-StatsReloadRaceTest.testParallelReloadAndStats-seed#[F5A0231F0DD71BD6]) [    ] o.a.s.h.a.CoreAdminOperation Checking request status for : 1
   [junit4]   2> 1099131 INFO  (TEST-StatsReloadRaceTest.testParallelReloadAndStats-seed#[F5A0231F0DD71BD6]) [    ] o.a.s.h.a.CoreAdminOperation Checking request status for : 1
   [junit4]   2> 1099132 INFO  (TEST-StatsReloadRaceTest.testParallelReloadAndStats-seed#[F5A0231F0DD71BD6]) [    ] o.a.s.h.a.CoreAdminOperation Checking request status f

[...truncated too long message...]

1BD6]) [    ] o.a.s.c.c.ZkMaintenanceUtils Writing file /x1/jenkins/jenkins-slave/workspace/Lucene-Solr-Tests-master/solr/build/solr-core/test/J2/temp/solr.cloud.SolrCLIZkUtilsTest_F5A0231F0DD71BD6-001/cp10-001/schema.xml
   [junit4]   2> 1878883 INFO  (TEST-SolrCLIZkUtilsTest.testCp-seed#[F5A0231F0DD71BD6]) [    ] o.a.s.c.c.ZkMaintenanceUtils Writing file /x1/jenkins/jenkins-slave/workspace/Lucene-Solr-Tests-master/solr/build/solr-core/test/J2/temp/solr.cloud.SolrCLIZkUtilsTest_F5A0231F0DD71BD6-001/cp10-001/solrconfig.xml
   [junit4]   2> 1878885 INFO  (TEST-SolrCLIZkUtilsTest.testCp-seed#[F5A0231F0DD71BD6]) [    ] o.a.s.c.c.ZkMaintenanceUtils Writing file /x1/jenkins/jenkins-slave/workspace/Lucene-Solr-Tests-master/solr/build/solr-core/test/J2/temp/solr.cloud.SolrCLIZkUtilsTest_F5A0231F0DD71BD6-001/cp10-001/stopwords/zknode.data
   [junit4]   2> 1878886 INFO  (TEST-SolrCLIZkUtilsTest.testCp-seed#[F5A0231F0DD71BD6]) [    ] o.a.s.c.c.ZkMaintenanceUtils Writing file /x1/jenkins/jenkins-slave/workspace/Lucene-Solr-Tests-master/solr/build/solr-core/test/J2/temp/solr.cloud.SolrCLIZkUtilsTest_F5A0231F0DD71BD6-001/cp10-001/stopwords/stopwords-en.txt
   [junit4]   2> 1878888 INFO  (TEST-SolrCLIZkUtilsTest.testCp-seed#[F5A0231F0DD71BD6]) [    ] o.a.s.SolrTestCaseJ4 ###Ending testCp
   [junit4]   2> NOTE: reproduce with: ant test  -Dtestcase=SolrCLIZkUtilsTest -Dtests.method=testCp -Dtests.seed=F5A0231F0DD71BD6 -Dtests.multiplier=2 -Dtests.slow=true -Dtests.locale=ja-JP -Dtests.timezone=America/Eirunepe -Dtests.asserts=true -Dtests.file.encoding=ISO-8859-1
   [junit4] FAILURE 0.22s J2 | SolrCLIZkUtilsTest.testCp <<<
   [junit4]    > Throwable #1: java.lang.AssertionError: Empty files should NOT be copied down as directories
   [junit4]    > 	at __randomizedtesting.SeedInfo.seed([F5A0231F0DD71BD6:1E4CDE51C97EA5B4]:0)
   [junit4]    > 	at org.apache.solr.cloud.SolrCLIZkUtilsTest.testCp(SolrCLIZkUtilsTest.java:449)
   [junit4]    > 	at java.lang.Thread.run(Thread.java:748)
   [junit4]   2> 1878891 INFO  (jetty-closer-2281-thread-1) [    ] o.e.j.s.AbstractConnector Stopped ServerConnector@76e63cfd{HTTP/1.1,[http/1.1]}{127.0.0.1:0}
   [junit4]   2> 1878892 INFO  (jetty-closer-2281-thread-1) [    ] o.a.s.c.CoreContainer Shutting down CoreContainer instance=1634920878
   [junit4]   2> 1878892 INFO  (jetty-closer-2281-thread-1) [    ] o.a.s.m.SolrMetricManager Closing metric reporters for registry=solr.node, tag=null
   [junit4]   2> 1878894 INFO  (jetty-closer-2281-thread-1) [    ] o.a.s.m.SolrMetricManager Closing metric reporters for registry=solr.jvm, tag=null
   [junit4]   2> 1878896 INFO  (jetty-closer-2281-thread-1) [    ] o.a.s.m.SolrMetricManager Closing metric reporters for registry=solr.jetty, tag=null
   [junit4]   2> 1878897 INFO  (jetty-closer-2281-thread-1) [    ] o.a.s.m.SolrMetricManager Closing metric reporters for registry=solr.cluster, tag=null
   [junit4]   2> 1878897 INFO  (jetty-closer-2281-thread-1) [    ] o.a.s.c.TransientSolrCoreCacheDefault Allocating transient cache for 2147483647 transient cores
   [junit4]   2> 1878898 INFO  (jetty-closer-2281-thread-1) [    ] o.a.s.c.Overseer Overseer (id=98439728349184003-127.0.0.1:45338_solr-n_0000000000) closing
   [junit4]   2> 1878898 INFO  (OverseerStateUpdate-98439728349184003-127.0.0.1:45338_solr-n_0000000000) [n:127.0.0.1:45338_solr    ] o.a.s.c.Overseer Overseer Loop exiting : 127.0.0.1:45338_solr
   [junit4]   2> 1880399 WARN  (zkCallback-2287-thread-1-processing-n:127.0.0.1:45338_solr) [n:127.0.0.1:45338_solr    ] o.a.s.c.c.ZkStateReader ZooKeeper watch triggered, but Solr cannot talk to ZK: [KeeperErrorCode = Session expired for /live_nodes]
   [junit4]   2> 1880400 INFO  (jetty-closer-2281-thread-1) [    ] o.e.j.s.h.ContextHandler Stopped o.e.j.s.ServletContextHandler@16ef909e{/solr,null,UNAVAILABLE}
   [junit4]   2> 1880400 ERROR (SUITE-SolrCLIZkUtilsTest-seed#[F5A0231F0DD71BD6]-worker) [    ] o.a.z.s.ZooKeeperServer ZKShutdownHandler is not registered, so ZooKeeper server won't take any action on ERROR or SHUTDOWN server state changes
   [junit4]   2> 1880401 INFO  (SUITE-SolrCLIZkUtilsTest-seed#[F5A0231F0DD71BD6]-worker) [    ] o.a.s.c.ZkTestServer connecting to 127.0.0.1:52324 52324
   [junit4]   2> 1880577 INFO  (Thread-3983) [    ] o.a.s.c.ZkTestServer connecting to 127.0.0.1:52324 52324
   [junit4]   2> 1880578 WARN  (Thread-3983) [    ] o.a.s.c.ZkTestServer Watch limit violations: 
   [junit4]   2> Maximum concurrent create/delete watches above limit:
   [junit4]   2> 
   [junit4]   2> 	2	/solr/aliases.json
   [junit4]   2> 	2	/solr/clusterprops.json
   [junit4]   2> 
   [junit4]   2> Maximum concurrent data watches above limit:
   [junit4]   2> 
   [junit4]   2> 	2	/solr/clusterstate.json
   [junit4]   2> 
   [junit4]   2> Maximum concurrent children watches above limit:
   [junit4]   2> 
   [junit4]   2> 	2	/solr/live_nodes
   [junit4]   2> 	2	/solr/collections
   [junit4]   2> 
   [junit4]   2> NOTE: leaving temporary files on disk at: /x1/jenkins/jenkins-slave/workspace/Lucene-Solr-Tests-master/solr/build/solr-core/test/J2/temp/solr.cloud.SolrCLIZkUtilsTest_F5A0231F0DD71BD6-001
   [junit4]   2> NOTE: test params are: codec=Lucene70, sim=RandomSimilarity(queryNorm=true): {}, locale=ja-JP, timezone=America/Eirunepe
   [junit4]   2> NOTE: Linux 3.13.0-88-generic amd64/Oracle Corporation 1.8.0_144 (64-bit)/cpus=4,threads=1,free=188467840,total=524812288
   [junit4]   2> NOTE: All tests run in this JVM: [DistributedSuggestComponentTest, TestSolrCloudWithSecureImpersonation, TestSolrCoreSnapshots, HdfsBasicDistributedZk2Test, TestSolrCoreProperties, ImplicitSnitchTest, TestDistributedMissingSort, TestFilteredDocIdSet, PropertiesRequestHandlerTest, TestFastWriter, TestBackupRepositoryFactory, CustomCollectionTest, BasicDistributedZk2Test, TestSurroundQueryParser, ManagedSchemaRoundRobinCloudTest, TestPointFields, TestOverriddenPrefixQueryForCustomFieldType, TestScoreJoinQPScore, CdcrReplicationDistributedZkTest, TestTolerantUpdateProcessorRandomCloud, TestPrepRecovery, NodeMutatorTest, OverseerCollectionConfigSetProcessorTest, SuggestComponentContextFilterQueryTest, HttpSolrCallGetCoreTest, WrapperMergePolicyFactoryTest, ShowFileRequestHandlerTest, DocumentBuilderTest, TestExportWriter, TermVectorComponentDistributedTest, TestConfigsApi, TestManagedSchema, BadIndexSchemaTest, TestCloudNestedDocsSort, NumericFieldsTest, TermsComponentTest, HdfsChaosMonkeySafeLeaderTest, TestFieldTypeCollectionResource, BasicAuthStandaloneTest, SimpleFacetsTest, TestSortByMinMaxFunction, TestHdfsUpdateLog, TestLegacyFieldReuse, ConfigSetsAPITest, BlockCacheTest, TestMacroExpander, PrimitiveFieldTypeTest, DistanceUnitsTest, TestSizeLimitedDistributedMap, TestSchemaResource, TestInitQParser, HdfsSyncSliceTest, VMParamsZkACLAndCredentialsProvidersTest, MultiTermTest, TestSuggestSpellingConverter, TestLFUCache, TestManagedSynonymFilterFactory, PreAnalyzedUpdateProcessorTest, StatsComponentTest, TestGroupingSearch, SolrMetricReporterTest, PathHierarchyTokenizerFactoryTest, CdcrVersionReplicationTest, SuggesterTest, TestAnalyzedSuggestions, FullSolrCloudDistribCmdsTest, TestCloudRecovery, SimpleMLTQParserTest, SolrInfoBeanTest, BigEndianAscendingWordSerializerTest, TestCollectionAPI, SpellPossibilityIteratorTest, HdfsRecoverLeaseTest, TestReversedWildcardFilterFactory, HdfsUnloadDistributedZkTest, TestSolrConfigHandlerConcurrent, TestLeaderElectionZkExpiry, TestReplicationHandlerBackup, MigrateRouteKeyTest, FullHLLTest, TestFoldingMultitermQuery, ExitableDirectoryReaderTest, SparseHLLTest, ConfigureRecoveryStrategyTest, CoreMergeIndexesAdminHandlerTest, UnloadDistributedZkTest, DirectUpdateHandlerTest, TestLMJelinekMercerSimilarityFactory, TestReRankQParserPlugin, XsltUpdateRequestHandlerTest, ClassificationUpdateProcessorIntegrationTest, TestDelegationWithHadoopAuth, TestConfigSetsAPIExclusivity, TestDynamicFieldResource, TestPKIAuthenticationPlugin, OverseerStatusTest, SharedFSAutoReplicaFailoverTest, DateMathParserTest, CollectionsAPIAsyncDistributedZkTest, TestDeleteCollectionOnDownNodes, TestReloadAndDeleteDocs, FastVectorHighlighterTest, SolrCoreCheckLockOnStartupTest, DeleteNodeTest, HdfsDirectoryTest, TestClusterStateMutator, TestBlobHandler, AliasIntegrationTest, ClusterStateTest, CopyFieldTest, MetricsConfigTest, StatsReloadRaceTest, SuggesterFSTTest, SSLMigrationTest, TestCloudJSONFacetJoinDomain, TestNonDefinedSimilarityFactory, AtomicUpdateProcessorFactoryTest, TimeZoneUtilsTest, SortByFunctionTest, TestTrackingShardHandlerFactory, ChaosMonkeySafeLeaderTest, SyncSliceTest, OverseerTest, ShardRoutingTest, RecoveryZkTest, TestReplicationHandler, TestRandomFaceting, LeaderElectionTest, AutoCommitTest, TestFaceting, TestRecovery, DistributedSpellCheckComponentTest, HardAutoCommitTest, TestSolr4Spatial, ConvertedLegacyTest, TestSort, SimplePostToolTest, AnalysisAfterCoreReloadTest, SignatureUpdateProcessorFactoryTest, SpellCheckCollatorTest, TestStressLucene, PolyFieldTest, TestUpdate, QueryEqualityTest, DistanceFunctionTest, DebugComponentTest, TestQueryUtils, FileBasedSpellCheckerTest, TestValueSourceCache, MoreLikeThisHandlerTest, IndexSchemaRuntimeFieldTest, IndexSchemaTest, ReturnFieldsTest, UniqFieldsUpdateProcessorFactoryTest, PingRequestHandlerTest, ExternalFileFieldSortTest, NotRequiredUniqueKeyTest, TestPhraseSuggestions, TestXIncludeConfig, TestSweetSpotSimilarityFactory, TestPerFieldSimilarity, URLClassifyProcessorTest, PreAnalyzedFieldTest, DateFieldTest, TestUtils, CircularListTest, TestRTGBase, CursorPagingTest, SolrTestCaseJ4Test, TestCrossCoreJoin, TestSimpleTrackingShardHandler, TestTolerantSearch, AsyncCallRequestStatusResponseTest, CollectionTooManyReplicasTest, DeleteStatusTest, DistribJoinFromCollectionTest, DocValuesNotIndexedTest, HttpPartitionTest, PeerSyncReplicationTest, RecoveryAfterSoftCommitTest, SolrCLIZkUtilsTest]
   [junit4] Completed [537/728 (3!)] on J2 in 2.84s, 6 tests, 1 failure <<< FAILURES!

[...truncated 43891 lines...]

Mime
View raw message