lucene-dev mailing list archives

Site index · List index
Message view « Date » · « Thread »
Top « Date » · « Thread »
From Policeman Jenkins Server <jenk...@thetaphi.de>
Subject [JENKINS] Lucene-Solr-7.x-Windows (64bit/jdk1.8.0_144) - Build # 140 - Still Unstable!
Date Sat, 26 Aug 2017 16:47:19 GMT
Build: https://jenkins.thetaphi.de/job/Lucene-Solr-7.x-Windows/140/
Java: 64bit/jdk1.8.0_144 -XX:+UseCompressedOops -XX:+UseSerialGC

4 tests failed.
FAILED:  org.apache.solr.cloud.TestAuthenticationFramework.testBasics

Error Message:
Error from server at http://127.0.0.1:57692/solr/testcollection_shard1_replica_n2: Expected mime type application/octet-stream but got text/html. <html> <head> <meta http-equiv="Content-Type" content="text/html;charset=ISO-8859-1"/> <title>Error 404 </title> </head> <body> <h2>HTTP ERROR: 404</h2> <p>Problem accessing /solr/testcollection_shard1_replica_n2/update. Reason: <pre>    Can not find: /solr/testcollection_shard1_replica_n2/update</pre></p> <hr /><a href="http://eclipse.org/jetty">Powered by Jetty:// 9.3.20.v20170531</a><hr/> </body> </html> 

Stack Trace:
org.apache.solr.client.solrj.impl.CloudSolrClient$RouteException: Error from server at http://127.0.0.1:57692/solr/testcollection_shard1_replica_n2: Expected mime type application/octet-stream but got text/html. <html>
<head>
<meta http-equiv="Content-Type" content="text/html;charset=ISO-8859-1"/>
<title>Error 404 </title>
</head>
<body>
<h2>HTTP ERROR: 404</h2>
<p>Problem accessing /solr/testcollection_shard1_replica_n2/update. Reason:
<pre>    Can not find: /solr/testcollection_shard1_replica_n2/update</pre></p>
<hr /><a href="http://eclipse.org/jetty">Powered by Jetty:// 9.3.20.v20170531</a><hr/>
</body>
</html>

	at __randomizedtesting.SeedInfo.seed([E07D851C8C129139:DDA52B30B4FCCF49]:0)
	at org.apache.solr.client.solrj.impl.CloudSolrClient.directUpdate(CloudSolrClient.java:539)
	at org.apache.solr.client.solrj.impl.CloudSolrClient.sendRequest(CloudSolrClient.java:993)
	at org.apache.solr.client.solrj.impl.CloudSolrClient.requestWithRetryOnStaleState(CloudSolrClient.java:862)
	at org.apache.solr.client.solrj.impl.CloudSolrClient.request(CloudSolrClient.java:793)
	at org.apache.solr.client.solrj.SolrRequest.process(SolrRequest.java:178)
	at org.apache.solr.client.solrj.request.UpdateRequest.commit(UpdateRequest.java:233)
	at org.apache.solr.cloud.TestAuthenticationFramework.collectionCreateSearchDeleteTwice(TestAuthenticationFramework.java:126)
	at org.apache.solr.cloud.TestAuthenticationFramework.testBasics(TestAuthenticationFramework.java:74)
	at sun.reflect.NativeMethodAccessorImpl.invoke0(Native Method)
	at sun.reflect.NativeMethodAccessorImpl.invoke(NativeMethodAccessorImpl.java:62)
	at sun.reflect.DelegatingMethodAccessorImpl.invoke(DelegatingMethodAccessorImpl.java:43)
	at java.lang.reflect.Method.invoke(Method.java:498)
	at com.carrotsearch.randomizedtesting.RandomizedRunner.invoke(RandomizedRunner.java:1713)
	at com.carrotsearch.randomizedtesting.RandomizedRunner$8.evaluate(RandomizedRunner.java:907)
	at com.carrotsearch.randomizedtesting.RandomizedRunner$9.evaluate(RandomizedRunner.java:943)
	at com.carrotsearch.randomizedtesting.RandomizedRunner$10.evaluate(RandomizedRunner.java:957)
	at com.carrotsearch.randomizedtesting.rules.SystemPropertiesRestoreRule$1.evaluate(SystemPropertiesRestoreRule.java:57)
	at org.apache.lucene.util.TestRuleSetupTeardownChained$1.evaluate(TestRuleSetupTeardownChained.java:49)
	at org.apache.lucene.util.AbstractBeforeAfterRule$1.evaluate(AbstractBeforeAfterRule.java:45)
	at org.apache.lucene.util.TestRuleThreadAndTestName$1.evaluate(TestRuleThreadAndTestName.java:48)
	at org.apache.lucene.util.TestRuleIgnoreAfterMaxFailures$1.evaluate(TestRuleIgnoreAfterMaxFailures.java:64)
	at org.apache.lucene.util.TestRuleMarkFailure$1.evaluate(TestRuleMarkFailure.java:47)
	at com.carrotsearch.randomizedtesting.rules.StatementAdapter.evaluate(StatementAdapter.java:36)
	at com.carrotsearch.randomizedtesting.ThreadLeakControl$StatementRunner.run(ThreadLeakControl.java:368)
	at com.carrotsearch.randomizedtesting.ThreadLeakControl.forkTimeoutingTask(ThreadLeakControl.java:817)
	at com.carrotsearch.randomizedtesting.ThreadLeakControl$3.evaluate(ThreadLeakControl.java:468)
	at com.carrotsearch.randomizedtesting.RandomizedRunner.runSingleTest(RandomizedRunner.java:916)
	at com.carrotsearch.randomizedtesting.RandomizedRunner$5.evaluate(RandomizedRunner.java:802)
	at com.carrotsearch.randomizedtesting.RandomizedRunner$6.evaluate(RandomizedRunner.java:852)
	at com.carrotsearch.randomizedtesting.RandomizedRunner$7.evaluate(RandomizedRunner.java:863)
	at com.carrotsearch.randomizedtesting.rules.StatementAdapter.evaluate(StatementAdapter.java:36)
	at com.carrotsearch.randomizedtesting.rules.SystemPropertiesRestoreRule$1.evaluate(SystemPropertiesRestoreRule.java:57)
	at org.apache.lucene.util.AbstractBeforeAfterRule$1.evaluate(AbstractBeforeAfterRule.java:45)
	at com.carrotsearch.randomizedtesting.rules.StatementAdapter.evaluate(StatementAdapter.java:36)
	at org.apache.lucene.util.TestRuleStoreClassName$1.evaluate(TestRuleStoreClassName.java:41)
	at com.carrotsearch.randomizedtesting.rules.NoShadowingOrOverridesOnMethodsRule$1.evaluate(NoShadowingOrOverridesOnMethodsRule.java:40)
	at com.carrotsearch.randomizedtesting.rules.NoShadowingOrOverridesOnMethodsRule$1.evaluate(NoShadowingOrOverridesOnMethodsRule.java:40)
	at com.carrotsearch.randomizedtesting.rules.StatementAdapter.evaluate(StatementAdapter.java:36)
	at com.carrotsearch.randomizedtesting.rules.StatementAdapter.evaluate(StatementAdapter.java:36)
	at com.carrotsearch.randomizedtesting.rules.StatementAdapter.evaluate(StatementAdapter.java:36)
	at org.apache.lucene.util.TestRuleAssertionsRequired$1.evaluate(TestRuleAssertionsRequired.java:53)
	at org.apache.lucene.util.TestRuleMarkFailure$1.evaluate(TestRuleMarkFailure.java:47)
	at org.apache.lucene.util.TestRuleIgnoreAfterMaxFailures$1.evaluate(TestRuleIgnoreAfterMaxFailures.java:64)
	at org.apache.lucene.util.TestRuleIgnoreTestSuites$1.evaluate(TestRuleIgnoreTestSuites.java:54)
	at com.carrotsearch.randomizedtesting.rules.StatementAdapter.evaluate(StatementAdapter.java:36)
	at com.carrotsearch.randomizedtesting.ThreadLeakControl$StatementRunner.run(ThreadLeakControl.java:368)
	at java.lang.Thread.run(Thread.java:748)
Caused by: org.apache.solr.client.solrj.impl.HttpSolrClient$RemoteSolrException: Error from server at http://127.0.0.1:57692/solr/testcollection_shard1_replica_n2: Expected mime type application/octet-stream but got text/html. <html>
<head>
<meta http-equiv="Content-Type" content="text/html;charset=ISO-8859-1"/>
<title>Error 404 </title>
</head>
<body>
<h2>HTTP ERROR: 404</h2>
<p>Problem accessing /solr/testcollection_shard1_replica_n2/update. Reason:
<pre>    Can not find: /solr/testcollection_shard1_replica_n2/update</pre></p>
<hr /><a href="http://eclipse.org/jetty">Powered by Jetty:// 9.3.20.v20170531</a><hr/>
</body>
</html>

	at org.apache.solr.client.solrj.impl.HttpSolrClient.executeMethod(HttpSolrClient.java:591)
	at org.apache.solr.client.solrj.impl.HttpSolrClient.request(HttpSolrClient.java:253)
	at org.apache.solr.client.solrj.impl.HttpSolrClient.request(HttpSolrClient.java:242)
	at org.apache.solr.client.solrj.impl.LBHttpSolrClient.doRequest(LBHttpSolrClient.java:483)
	at org.apache.solr.client.solrj.impl.LBHttpSolrClient.request(LBHttpSolrClient.java:413)
	at org.apache.solr.client.solrj.impl.CloudSolrClient.lambda$directUpdate$0(CloudSolrClient.java:516)
	at java.util.concurrent.FutureTask.run(FutureTask.java:266)
	at org.apache.solr.common.util.ExecutorUtil$MDCAwareThreadPoolExecutor.lambda$execute$0(ExecutorUtil.java:188)
	at java.util.concurrent.ThreadPoolExecutor.runWorker(ThreadPoolExecutor.java:1149)
	at java.util.concurrent.ThreadPoolExecutor$Worker.run(ThreadPoolExecutor.java:624)
	... 1 more


FAILED:  org.apache.solr.client.solrj.io.stream.StreamExpressionTest.testExecutorStream

Error Message:
Error from server at http://127.0.0.1:51249/solr/workQueue_shard2_replica_n3: Expected mime type application/octet-stream but got text/html. <html> <head> <meta http-equiv="Content-Type" content="text/html;charset=ISO-8859-1"/> <title>Error 404 </title> </head> <body> <h2>HTTP ERROR: 404</h2> <p>Problem accessing /solr/workQueue_shard2_replica_n3/update. Reason: <pre>    Can not find: /solr/workQueue_shard2_replica_n3/update</pre></p> <hr /><a href="http://eclipse.org/jetty">Powered by Jetty:// 9.3.20.v20170531</a><hr/> </body> </html> 

Stack Trace:
org.apache.solr.client.solrj.impl.CloudSolrClient$RouteException: Error from server at http://127.0.0.1:51249/solr/workQueue_shard2_replica_n3: Expected mime type application/octet-stream but got text/html. <html>
<head>
<meta http-equiv="Content-Type" content="text/html;charset=ISO-8859-1"/>
<title>Error 404 </title>
</head>
<body>
<h2>HTTP ERROR: 404</h2>
<p>Problem accessing /solr/workQueue_shard2_replica_n3/update. Reason:
<pre>    Can not find: /solr/workQueue_shard2_replica_n3/update</pre></p>
<hr /><a href="http://eclipse.org/jetty">Powered by Jetty:// 9.3.20.v20170531</a><hr/>
</body>
</html>

	at __randomizedtesting.SeedInfo.seed([B9D166F8FF877AC6:9B11E703DCED50D6]:0)
	at org.apache.solr.client.solrj.impl.CloudSolrClient.directUpdate(CloudSolrClient.java:539)
	at org.apache.solr.client.solrj.impl.CloudSolrClient.sendRequest(CloudSolrClient.java:993)
	at org.apache.solr.client.solrj.impl.CloudSolrClient.requestWithRetryOnStaleState(CloudSolrClient.java:862)
	at org.apache.solr.client.solrj.impl.CloudSolrClient.request(CloudSolrClient.java:793)
	at org.apache.solr.client.solrj.SolrRequest.process(SolrRequest.java:178)
	at org.apache.solr.client.solrj.request.UpdateRequest.commit(UpdateRequest.java:233)
	at org.apache.solr.client.solrj.io.stream.StreamExpressionTest.testExecutorStream(StreamExpressionTest.java:6822)
	at sun.reflect.NativeMethodAccessorImpl.invoke0(Native Method)
	at sun.reflect.NativeMethodAccessorImpl.invoke(NativeMethodAccessorImpl.java:62)
	at sun.reflect.DelegatingMethodAccessorImpl.invoke(DelegatingMethodAccessorImpl.java:43)
	at java.lang.reflect.Method.invoke(Method.java:498)
	at com.carrotsearch.randomizedtesting.RandomizedRunner.invoke(RandomizedRunner.java:1713)
	at com.carrotsearch.randomizedtesting.RandomizedRunner$8.evaluate(RandomizedRunner.java:907)
	at com.carrotsearch.randomizedtesting.RandomizedRunner$9.evaluate(RandomizedRunner.java:943)
	at com.carrotsearch.randomizedtesting.RandomizedRunner$10.evaluate(RandomizedRunner.java:957)
	at com.carrotsearch.randomizedtesting.rules.SystemPropertiesRestoreRule$1.evaluate(SystemPropertiesRestoreRule.java:57)
	at org.apache.lucene.util.TestRuleSetupTeardownChained$1.evaluate(TestRuleSetupTeardownChained.java:49)
	at org.apache.lucene.util.AbstractBeforeAfterRule$1.evaluate(AbstractBeforeAfterRule.java:45)
	at org.apache.lucene.util.TestRuleThreadAndTestName$1.evaluate(TestRuleThreadAndTestName.java:48)
	at org.apache.lucene.util.TestRuleIgnoreAfterMaxFailures$1.evaluate(TestRuleIgnoreAfterMaxFailures.java:64)
	at org.apache.lucene.util.TestRuleMarkFailure$1.evaluate(TestRuleMarkFailure.java:47)
	at com.carrotsearch.randomizedtesting.rules.StatementAdapter.evaluate(StatementAdapter.java:36)
	at com.carrotsearch.randomizedtesting.ThreadLeakControl$StatementRunner.run(ThreadLeakControl.java:368)
	at com.carrotsearch.randomizedtesting.ThreadLeakControl.forkTimeoutingTask(ThreadLeakControl.java:817)
	at com.carrotsearch.randomizedtesting.ThreadLeakControl$3.evaluate(ThreadLeakControl.java:468)
	at com.carrotsearch.randomizedtesting.RandomizedRunner.runSingleTest(RandomizedRunner.java:916)
	at com.carrotsearch.randomizedtesting.RandomizedRunner$5.evaluate(RandomizedRunner.java:802)
	at com.carrotsearch.randomizedtesting.RandomizedRunner$6.evaluate(RandomizedRunner.java:852)
	at com.carrotsearch.randomizedtesting.RandomizedRunner$7.evaluate(RandomizedRunner.java:863)
	at com.carrotsearch.randomizedtesting.rules.StatementAdapter.evaluate(StatementAdapter.java:36)
	at com.carrotsearch.randomizedtesting.rules.SystemPropertiesRestoreRule$1.evaluate(SystemPropertiesRestoreRule.java:57)
	at org.apache.lucene.util.AbstractBeforeAfterRule$1.evaluate(AbstractBeforeAfterRule.java:45)
	at com.carrotsearch.randomizedtesting.rules.StatementAdapter.evaluate(StatementAdapter.java:36)
	at org.apache.lucene.util.TestRuleStoreClassName$1.evaluate(TestRuleStoreClassName.java:41)
	at com.carrotsearch.randomizedtesting.rules.NoShadowingOrOverridesOnMethodsRule$1.evaluate(NoShadowingOrOverridesOnMethodsRule.java:40)
	at com.carrotsearch.randomizedtesting.rules.NoShadowingOrOverridesOnMethodsRule$1.evaluate(NoShadowingOrOverridesOnMethodsRule.java:40)
	at com.carrotsearch.randomizedtesting.rules.StatementAdapter.evaluate(StatementAdapter.java:36)
	at com.carrotsearch.randomizedtesting.rules.StatementAdapter.evaluate(StatementAdapter.java:36)
	at com.carrotsearch.randomizedtesting.rules.StatementAdapter.evaluate(StatementAdapter.java:36)
	at org.apache.lucene.util.TestRuleAssertionsRequired$1.evaluate(TestRuleAssertionsRequired.java:53)
	at org.apache.lucene.util.TestRuleMarkFailure$1.evaluate(TestRuleMarkFailure.java:47)
	at org.apache.lucene.util.TestRuleIgnoreAfterMaxFailures$1.evaluate(TestRuleIgnoreAfterMaxFailures.java:64)
	at org.apache.lucene.util.TestRuleIgnoreTestSuites$1.evaluate(TestRuleIgnoreTestSuites.java:54)
	at com.carrotsearch.randomizedtesting.rules.StatementAdapter.evaluate(StatementAdapter.java:36)
	at com.carrotsearch.randomizedtesting.ThreadLeakControl$StatementRunner.run(ThreadLeakControl.java:368)
	at java.lang.Thread.run(Thread.java:748)
Caused by: org.apache.solr.client.solrj.impl.HttpSolrClient$RemoteSolrException: Error from server at http://127.0.0.1:51249/solr/workQueue_shard2_replica_n3: Expected mime type application/octet-stream but got text/html. <html>
<head>
<meta http-equiv="Content-Type" content="text/html;charset=ISO-8859-1"/>
<title>Error 404 </title>
</head>
<body>
<h2>HTTP ERROR: 404</h2>
<p>Problem accessing /solr/workQueue_shard2_replica_n3/update. Reason:
<pre>    Can not find: /solr/workQueue_shard2_replica_n3/update</pre></p>
<hr /><a href="http://eclipse.org/jetty">Powered by Jetty:// 9.3.20.v20170531</a><hr/>
</body>
</html>

	at org.apache.solr.client.solrj.impl.HttpSolrClient.executeMethod(HttpSolrClient.java:591)
	at org.apache.solr.client.solrj.impl.HttpSolrClient.request(HttpSolrClient.java:253)
	at org.apache.solr.client.solrj.impl.HttpSolrClient.request(HttpSolrClient.java:242)
	at org.apache.solr.client.solrj.impl.LBHttpSolrClient.doRequest(LBHttpSolrClient.java:483)
	at org.apache.solr.client.solrj.impl.LBHttpSolrClient.request(LBHttpSolrClient.java:413)
	at org.apache.solr.client.solrj.impl.CloudSolrClient.lambda$directUpdate$0(CloudSolrClient.java:516)
	at java.util.concurrent.FutureTask.run(FutureTask.java:266)
	at org.apache.solr.common.util.ExecutorUtil$MDCAwareThreadPoolExecutor.lambda$execute$0(ExecutorUtil.java:188)
	at java.util.concurrent.ThreadPoolExecutor.runWorker(ThreadPoolExecutor.java:1149)
	at java.util.concurrent.ThreadPoolExecutor$Worker.run(ThreadPoolExecutor.java:624)
	... 1 more


FAILED:  org.apache.solr.metrics.reporters.SolrSlf4jReporterTest.testReporter

Error Message:
No 'solr.node' logs in: {numFound=0,start=0,docs=[]}

Stack Trace:
java.lang.AssertionError: No 'solr.node' logs in: {numFound=0,start=0,docs=[]}
	at __randomizedtesting.SeedInfo.seed([E07D851C8C129139:BF99A82BE71E027C]:0)
	at org.junit.Assert.fail(Assert.java:93)
	at org.apache.solr.metrics.reporters.SolrSlf4jReporterTest.testReporter(SolrSlf4jReporterTest.java:85)
	at sun.reflect.NativeMethodAccessorImpl.invoke0(Native Method)
	at sun.reflect.NativeMethodAccessorImpl.invoke(NativeMethodAccessorImpl.java:62)
	at sun.reflect.DelegatingMethodAccessorImpl.invoke(DelegatingMethodAccessorImpl.java:43)
	at java.lang.reflect.Method.invoke(Method.java:498)
	at com.carrotsearch.randomizedtesting.RandomizedRunner.invoke(RandomizedRunner.java:1713)
	at com.carrotsearch.randomizedtesting.RandomizedRunner$8.evaluate(RandomizedRunner.java:907)
	at com.carrotsearch.randomizedtesting.RandomizedRunner$9.evaluate(RandomizedRunner.java:943)
	at com.carrotsearch.randomizedtesting.RandomizedRunner$10.evaluate(RandomizedRunner.java:957)
	at com.carrotsearch.randomizedtesting.rules.SystemPropertiesRestoreRule$1.evaluate(SystemPropertiesRestoreRule.java:57)
	at org.apache.lucene.util.TestRuleSetupTeardownChained$1.evaluate(TestRuleSetupTeardownChained.java:49)
	at org.apache.lucene.util.AbstractBeforeAfterRule$1.evaluate(AbstractBeforeAfterRule.java:45)
	at org.apache.lucene.util.TestRuleThreadAndTestName$1.evaluate(TestRuleThreadAndTestName.java:48)
	at org.apache.lucene.util.TestRuleIgnoreAfterMaxFailures$1.evaluate(TestRuleIgnoreAfterMaxFailures.java:64)
	at org.apache.lucene.util.TestRuleMarkFailure$1.evaluate(TestRuleMarkFailure.java:47)
	at com.carrotsearch.randomizedtesting.rules.StatementAdapter.evaluate(StatementAdapter.java:36)
	at com.carrotsearch.randomizedtesting.ThreadLeakControl$StatementRunner.run(ThreadLeakControl.java:368)
	at com.carrotsearch.randomizedtesting.ThreadLeakControl.forkTimeoutingTask(ThreadLeakControl.java:817)
	at com.carrotsearch.randomizedtesting.ThreadLeakControl$3.evaluate(ThreadLeakControl.java:468)
	at com.carrotsearch.randomizedtesting.RandomizedRunner.runSingleTest(RandomizedRunner.java:916)
	at com.carrotsearch.randomizedtesting.RandomizedRunner$5.evaluate(RandomizedRunner.java:802)
	at com.carrotsearch.randomizedtesting.RandomizedRunner$6.evaluate(RandomizedRunner.java:852)
	at com.carrotsearch.randomizedtesting.RandomizedRunner$7.evaluate(RandomizedRunner.java:863)
	at com.carrotsearch.randomizedtesting.rules.StatementAdapter.evaluate(StatementAdapter.java:36)
	at com.carrotsearch.randomizedtesting.rules.SystemPropertiesRestoreRule$1.evaluate(SystemPropertiesRestoreRule.java:57)
	at org.apache.lucene.util.AbstractBeforeAfterRule$1.evaluate(AbstractBeforeAfterRule.java:45)
	at com.carrotsearch.randomizedtesting.rules.StatementAdapter.evaluate(StatementAdapter.java:36)
	at org.apache.lucene.util.TestRuleStoreClassName$1.evaluate(TestRuleStoreClassName.java:41)
	at com.carrotsearch.randomizedtesting.rules.NoShadowingOrOverridesOnMethodsRule$1.evaluate(NoShadowingOrOverridesOnMethodsRule.java:40)
	at com.carrotsearch.randomizedtesting.rules.NoShadowingOrOverridesOnMethodsRule$1.evaluate(NoShadowingOrOverridesOnMethodsRule.java:40)
	at com.carrotsearch.randomizedtesting.rules.StatementAdapter.evaluate(StatementAdapter.java:36)
	at com.carrotsearch.randomizedtesting.rules.StatementAdapter.evaluate(StatementAdapter.java:36)
	at com.carrotsearch.randomizedtesting.rules.StatementAdapter.evaluate(StatementAdapter.java:36)
	at org.apache.lucene.util.TestRuleAssertionsRequired$1.evaluate(TestRuleAssertionsRequired.java:53)
	at org.apache.lucene.util.TestRuleMarkFailure$1.evaluate(TestRuleMarkFailure.java:47)
	at org.apache.lucene.util.TestRuleIgnoreAfterMaxFailures$1.evaluate(TestRuleIgnoreAfterMaxFailures.java:64)
	at org.apache.lucene.util.TestRuleIgnoreTestSuites$1.evaluate(TestRuleIgnoreTestSuites.java:54)
	at com.carrotsearch.randomizedtesting.rules.StatementAdapter.evaluate(StatementAdapter.java:36)
	at com.carrotsearch.randomizedtesting.ThreadLeakControl$StatementRunner.run(ThreadLeakControl.java:368)
	at java.lang.Thread.run(Thread.java:748)


FAILED:  org.apache.solr.update.processor.UpdateRequestProcessorFactoryTest.testUpdateDistribChainSkipping

Error Message:
Tests must be run with INFO level logging otherwise LogUpdateProcessor isn't used and can't be tested.

Stack Trace:
java.lang.AssertionError: Tests must be run with INFO level logging otherwise LogUpdateProcessor isn't used and can't be tested.
	at __randomizedtesting.SeedInfo.seed([E07D851C8C129139:91997BCAFAF9B6F5]:0)
	at org.junit.Assert.fail(Assert.java:93)
	at org.junit.Assert.assertTrue(Assert.java:43)
	at org.apache.solr.update.processor.UpdateRequestProcessorFactoryTest.testUpdateDistribChainSkipping(UpdateRequestProcessorFactoryTest.java:101)
	at sun.reflect.NativeMethodAccessorImpl.invoke0(Native Method)
	at sun.reflect.NativeMethodAccessorImpl.invoke(NativeMethodAccessorImpl.java:62)
	at sun.reflect.DelegatingMethodAccessorImpl.invoke(DelegatingMethodAccessorImpl.java:43)
	at java.lang.reflect.Method.invoke(Method.java:498)
	at com.carrotsearch.randomizedtesting.RandomizedRunner.invoke(RandomizedRunner.java:1713)
	at com.carrotsearch.randomizedtesting.RandomizedRunner$8.evaluate(RandomizedRunner.java:907)
	at com.carrotsearch.randomizedtesting.RandomizedRunner$9.evaluate(RandomizedRunner.java:943)
	at com.carrotsearch.randomizedtesting.RandomizedRunner$10.evaluate(RandomizedRunner.java:957)
	at com.carrotsearch.randomizedtesting.rules.SystemPropertiesRestoreRule$1.evaluate(SystemPropertiesRestoreRule.java:57)
	at org.apache.lucene.util.TestRuleSetupTeardownChained$1.evaluate(TestRuleSetupTeardownChained.java:49)
	at org.apache.lucene.util.AbstractBeforeAfterRule$1.evaluate(AbstractBeforeAfterRule.java:45)
	at org.apache.lucene.util.TestRuleThreadAndTestName$1.evaluate(TestRuleThreadAndTestName.java:48)
	at org.apache.lucene.util.TestRuleIgnoreAfterMaxFailures$1.evaluate(TestRuleIgnoreAfterMaxFailures.java:64)
	at org.apache.lucene.util.TestRuleMarkFailure$1.evaluate(TestRuleMarkFailure.java:47)
	at com.carrotsearch.randomizedtesting.rules.StatementAdapter.evaluate(StatementAdapter.java:36)
	at com.carrotsearch.randomizedtesting.ThreadLeakControl$StatementRunner.run(ThreadLeakControl.java:368)
	at com.carrotsearch.randomizedtesting.ThreadLeakControl.forkTimeoutingTask(ThreadLeakControl.java:817)
	at com.carrotsearch.randomizedtesting.ThreadLeakControl$3.evaluate(ThreadLeakControl.java:468)
	at com.carrotsearch.randomizedtesting.RandomizedRunner.runSingleTest(RandomizedRunner.java:916)
	at com.carrotsearch.randomizedtesting.RandomizedRunner$5.evaluate(RandomizedRunner.java:802)
	at com.carrotsearch.randomizedtesting.RandomizedRunner$6.evaluate(RandomizedRunner.java:852)
	at com.carrotsearch.randomizedtesting.RandomizedRunner$7.evaluate(RandomizedRunner.java:863)
	at com.carrotsearch.randomizedtesting.rules.StatementAdapter.evaluate(StatementAdapter.java:36)
	at com.carrotsearch.randomizedtesting.rules.SystemPropertiesRestoreRule$1.evaluate(SystemPropertiesRestoreRule.java:57)
	at org.apache.lucene.util.AbstractBeforeAfterRule$1.evaluate(AbstractBeforeAfterRule.java:45)
	at com.carrotsearch.randomizedtesting.rules.StatementAdapter.evaluate(StatementAdapter.java:36)
	at org.apache.lucene.util.TestRuleStoreClassName$1.evaluate(TestRuleStoreClassName.java:41)
	at com.carrotsearch.randomizedtesting.rules.NoShadowingOrOverridesOnMethodsRule$1.evaluate(NoShadowingOrOverridesOnMethodsRule.java:40)
	at com.carrotsearch.randomizedtesting.rules.NoShadowingOrOverridesOnMethodsRule$1.evaluate(NoShadowingOrOverridesOnMethodsRule.java:40)
	at com.carrotsearch.randomizedtesting.rules.StatementAdapter.evaluate(StatementAdapter.java:36)
	at com.carrotsearch.randomizedtesting.rules.StatementAdapter.evaluate(StatementAdapter.java:36)
	at com.carrotsearch.randomizedtesting.rules.StatementAdapter.evaluate(StatementAdapter.java:36)
	at org.apache.lucene.util.TestRuleAssertionsRequired$1.evaluate(TestRuleAssertionsRequired.java:53)
	at org.apache.lucene.util.TestRuleMarkFailure$1.evaluate(TestRuleMarkFailure.java:47)
	at org.apache.lucene.util.TestRuleIgnoreAfterMaxFailures$1.evaluate(TestRuleIgnoreAfterMaxFailures.java:64)
	at org.apache.lucene.util.TestRuleIgnoreTestSuites$1.evaluate(TestRuleIgnoreTestSuites.java:54)
	at com.carrotsearch.randomizedtesting.rules.StatementAdapter.evaluate(StatementAdapter.java:36)
	at com.carrotsearch.randomizedtesting.ThreadLeakControl$StatementRunner.run(ThreadLeakControl.java:368)
	at java.lang.Thread.run(Thread.java:748)




Build Log:
[...truncated 10861 lines...]
   [junit4] Suite: org.apache.solr.cloud.TestAuthenticationFramework
   [junit4]   2> Creating dataDir: C:\Users\jenkins\workspace\Lucene-Solr-7.x-Windows\solr\build\solr-core\test\J1\temp\solr.cloud.TestAuthenticationFramework_E07D851C8C129139-001\init-core-data-001
   [junit4]   2> 139357 WARN  (SUITE-TestAuthenticationFramework-seed#[E07D851C8C129139]-worker) [    ] o.a.s.SolrTestCaseJ4 startTrackingSearchers: numOpens=4 numCloses=4
   [junit4]   2> 139357 INFO  (SUITE-TestAuthenticationFramework-seed#[E07D851C8C129139]-worker) [    ] o.a.s.SolrTestCaseJ4 Using TrieFields (NUMERIC_POINTS_SYSPROP=false) w/NUMERIC_DOCVALUES_SYSPROP=false
   [junit4]   2> 139362 INFO  (SUITE-TestAuthenticationFramework-seed#[E07D851C8C129139]-worker) [    ] o.a.s.SolrTestCaseJ4 Randomized ssl (false) and clientAuth (true) via: @org.apache.solr.util.RandomizeSSL(reason=, value=NaN, ssl=NaN, clientAuth=NaN)
   [junit4]   2> 139362 INFO  (SUITE-TestAuthenticationFramework-seed#[E07D851C8C129139]-worker) [    ] o.a.s.SolrTestCaseJ4 SecureRandom sanity checks: test.solr.allowed.securerandom=null & java.security.egd=file:/dev/./urandom
   [junit4]   2> 139367 INFO  (TEST-TestAuthenticationFramework.testBasics-seed#[E07D851C8C129139]) [    ] o.a.s.c.MiniSolrCloudCluster Starting cluster of 2 servers in C:\Users\jenkins\workspace\Lucene-Solr-7.x-Windows\solr\build\solr-core\test\J1\temp\solr.cloud.TestAuthenticationFramework_E07D851C8C129139-001\tempDir-001
   [junit4]   2> 139367 INFO  (TEST-TestAuthenticationFramework.testBasics-seed#[E07D851C8C129139]) [    ] o.a.s.c.ZkTestServer STARTING ZK TEST SERVER
   [junit4]   2> 139367 INFO  (Thread-384) [    ] o.a.s.c.ZkTestServer client port:0.0.0.0/0.0.0.0:0
   [junit4]   2> 139367 INFO  (Thread-384) [    ] o.a.s.c.ZkTestServer Starting server
   [junit4]   2> 139381 ERROR (Thread-384) [    ] o.a.z.s.ZooKeeperServer ZKShutdownHandler is not registered, so ZooKeeper server won't take any action on ERROR or SHUTDOWN server state changes
   [junit4]   2> 139467 INFO  (TEST-TestAuthenticationFramework.testBasics-seed#[E07D851C8C129139]) [    ] o.a.s.c.ZkTestServer start zk server on port:57688
   [junit4]   2> 139481 INFO  (jetty-launcher-216-thread-1) [    ] o.e.j.s.Server jetty-9.3.20.v20170531
   [junit4]   2> 139482 INFO  (jetty-launcher-216-thread-1) [    ] o.e.j.s.h.ContextHandler Started o.e.j.s.ServletContextHandler@4f21c2e9{/solr,null,AVAILABLE}
   [junit4]   2> 139488 INFO  (jetty-launcher-216-thread-1) [    ] o.e.j.s.AbstractConnector Started ServerConnector@3127c589{HTTP/1.1,[http/1.1]}{127.0.0.1:57692}
   [junit4]   2> 139488 INFO  (jetty-launcher-216-thread-1) [    ] o.e.j.s.Server Started @148304ms
   [junit4]   2> 139488 INFO  (jetty-launcher-216-thread-1) [    ] o.a.s.c.s.e.JettySolrRunner Jetty properties: {hostContext=/solr, hostPort=57692}
   [junit4]   2> 139488 ERROR (jetty-launcher-216-thread-1) [    ] o.a.s.u.StartupLoggingUtils Missing Java Option solr.log.dir. Logging may be missing or incomplete.
   [junit4]   2> 139488 INFO  (jetty-launcher-216-thread-1) [    ] o.a.s.s.SolrDispatchFilter  ___      _       Welcome to Apache Solr? version 7.1.0
   [junit4]   2> 139488 INFO  (jetty-launcher-216-thread-1) [    ] o.a.s.s.SolrDispatchFilter / __| ___| |_ _   Starting in cloud mode on port null
   [junit4]   2> 139488 INFO  (jetty-launcher-216-thread-1) [    ] o.a.s.s.SolrDispatchFilter \__ \/ _ \ | '_|  Install dir: null, Default config dir: null
   [junit4]   2> 139488 INFO  (jetty-launcher-216-thread-1) [    ] o.a.s.s.SolrDispatchFilter |___/\___/_|_|    Start time: 2017-08-26T15:32:30.524Z
   [junit4]   2> 139492 INFO  (jetty-launcher-216-thread-2) [    ] o.e.j.s.Server jetty-9.3.20.v20170531
   [junit4]   2> 139493 INFO  (jetty-launcher-216-thread-2) [    ] o.e.j.s.h.ContextHandler Started o.e.j.s.ServletContextHandler@79e07de5{/solr,null,AVAILABLE}
   [junit4]   2> 139494 INFO  (jetty-launcher-216-thread-2) [    ] o.e.j.s.AbstractConnector Started ServerConnector@65c2831a{HTTP/1.1,[http/1.1]}{127.0.0.1:57697}
   [junit4]   2> 139494 INFO  (jetty-launcher-216-thread-2) [    ] o.e.j.s.Server Started @148310ms
   [junit4]   2> 139494 INFO  (jetty-launcher-216-thread-2) [    ] o.a.s.c.s.e.JettySolrRunner Jetty properties: {hostContext=/solr, hostPort=57697}
   [junit4]   2> 139494 ERROR (jetty-launcher-216-thread-2) [    ] o.a.s.u.StartupLoggingUtils Missing Java Option solr.log.dir. Logging may be missing or incomplete.
   [junit4]   2> 139494 INFO  (jetty-launcher-216-thread-2) [    ] o.a.s.s.SolrDispatchFilter  ___      _       Welcome to Apache Solr? version 7.1.0
   [junit4]   2> 139494 INFO  (jetty-launcher-216-thread-2) [    ] o.a.s.s.SolrDispatchFilter / __| ___| |_ _   Starting in cloud mode on port null
   [junit4]   2> 139494 INFO  (jetty-launcher-216-thread-2) [    ] o.a.s.s.SolrDispatchFilter \__ \/ _ \ | '_|  Install dir: null, Default config dir: null
   [junit4]   2> 139494 INFO  (jetty-launcher-216-thread-2) [    ] o.a.s.s.SolrDispatchFilter |___/\___/_|_|    Start time: 2017-08-26T15:32:30.530Z
   [junit4]   2> 139508 INFO  (jetty-launcher-216-thread-1) [    ] o.a.s.s.SolrDispatchFilter solr.xml found in ZooKeeper. Loading...
   [junit4]   2> 139509 INFO  (jetty-launcher-216-thread-2) [    ] o.a.s.s.SolrDispatchFilter solr.xml found in ZooKeeper. Loading...
   [junit4]   2> 139532 INFO  (jetty-launcher-216-thread-1) [    ] o.a.s.c.ZkContainer Zookeeper client=127.0.0.1:57688/solr
   [junit4]   2> 139532 INFO  (jetty-launcher-216-thread-2) [    ] o.a.s.c.ZkContainer Zookeeper client=127.0.0.1:57688/solr
   [junit4]   2> 139538 WARN  (NIOServerCxn.Factory:0.0.0.0/0.0.0.0:0) [    ] o.a.z.s.NIOServerCnxn caught end of stream exception
   [junit4]   2> EndOfStreamException: Unable to read additional data from client sessionid 0x15e1f2c4c510004, likely client has closed socket
   [junit4]   2> 	at org.apache.zookeeper.server.NIOServerCnxn.doIO(NIOServerCnxn.java:239)
   [junit4]   2> 	at org.apache.zookeeper.server.NIOServerCnxnFactory.run(NIOServerCnxnFactory.java:203)
   [junit4]   2> 	at java.lang.Thread.run(Thread.java:748)
   [junit4]   2> 139539 WARN  (NIOServerCxn.Factory:0.0.0.0/0.0.0.0:0) [    ] o.a.z.s.NIOServerCnxn caught end of stream exception
   [junit4]   2> EndOfStreamException: Unable to read additional data from client sessionid 0x15e1f2c4c510003, likely client has closed socket
   [junit4]   2> 	at org.apache.zookeeper.server.NIOServerCnxn.doIO(NIOServerCnxn.java:239)
   [junit4]   2> 	at org.apache.zookeeper.server.NIOServerCnxnFactory.run(NIOServerCnxnFactory.java:203)
   [junit4]   2> 	at java.lang.Thread.run(Thread.java:748)
   [junit4]   2> 139679 INFO  (jetty-launcher-216-thread-1) [n:127.0.0.1:57692_solr    ] o.a.s.c.Overseer Overseer (id=null) closing
   [junit4]   2> 139679 INFO  (jetty-launcher-216-thread-2) [n:127.0.0.1:57697_solr    ] o.a.s.c.Overseer Overseer (id=null) closing
   [junit4]   2> 139679 INFO  (jetty-launcher-216-thread-1) [n:127.0.0.1:57692_solr    ] o.a.s.c.OverseerElectionContext I am going to be the leader 127.0.0.1:57692_solr
   [junit4]   2> 139680 INFO  (jetty-launcher-216-thread-2) [n:127.0.0.1:57697_solr    ] o.a.s.c.ZkController Register node as live in ZooKeeper:/live_nodes/127.0.0.1:57697_solr
   [junit4]   2> 139680 INFO  (jetty-launcher-216-thread-1) [n:127.0.0.1:57692_solr    ] o.a.s.c.Overseer Overseer (id=98550516968128518-127.0.0.1:57692_solr-n_0000000000) starting
   [junit4]   2> 139681 INFO  (zkCallback-228-thread-1-processing-n:127.0.0.1:57692_solr) [n:127.0.0.1:57692_solr    ] o.a.s.c.c.ZkStateReader Updated live nodes from ZooKeeper... (0) -> (1)
   [junit4]   2> 139683 INFO  (zkCallback-227-thread-1-processing-n:127.0.0.1:57697_solr) [n:127.0.0.1:57697_solr    ] o.a.s.c.c.ZkStateReader Updated live nodes from ZooKeeper... (0) -> (1)
   [junit4]   2> 139689 INFO  (jetty-launcher-216-thread-1) [n:127.0.0.1:57692_solr    ] o.a.s.c.ZkController Register node as live in ZooKeeper:/live_nodes/127.0.0.1:57692_solr
   [junit4]   2> 139690 INFO  (zkCallback-227-thread-1-processing-n:127.0.0.1:57697_solr) [n:127.0.0.1:57697_solr    ] o.a.s.c.c.ZkStateReader Updated live nodes from ZooKeeper... (1) -> (2)
   [junit4]   2> 139690 INFO  (zkCallback-228-thread-1-processing-n:127.0.0.1:57692_solr) [n:127.0.0.1:57692_solr    ] o.a.s.c.c.ZkStateReader Updated live nodes from ZooKeeper... (1) -> (2)
   [junit4]   2> 139714 INFO  (jetty-launcher-216-thread-1) [n:127.0.0.1:57692_solr    ] o.a.s.c.CoreContainer Initializing authentication plugin: org.apache.solr.cloud.TestAuthenticationFramework$MockAuthenticationPlugin
   [junit4]   2> 139802 INFO  (jetty-launcher-216-thread-2) [n:127.0.0.1:57697_solr    ] o.a.s.c.CoreContainer Initializing authentication plugin: org.apache.solr.cloud.TestAuthenticationFramework$MockAuthenticationPlugin
   [junit4]   2> 139848 INFO  (jetty-launcher-216-thread-1) [n:127.0.0.1:57692_solr    ] o.a.s.m.r.SolrJmxReporter JMX monitoring for 'solr_57692.solr.node' (registry 'solr.node') enabled at server: com.sun.jmx.mbeanserver.JmxMBeanServer@468b0371
   [junit4]   2> 139857 INFO  (jetty-launcher-216-thread-1) [n:127.0.0.1:57692_solr    ] o.a.s.m.r.SolrJmxReporter JMX monitoring for 'solr_57692.solr.jvm' (registry 'solr.jvm') enabled at server: com.sun.jmx.mbeanserver.JmxMBeanServer@468b0371
   [junit4]   2> 139857 INFO  (jetty-launcher-216-thread-1) [n:127.0.0.1:57692_solr    ] o.a.s.m.r.SolrJmxReporter JMX monitoring for 'solr_57692.solr.jetty' (registry 'solr.jetty') enabled at server: com.sun.jmx.mbeanserver.JmxMBeanServer@468b0371
   [junit4]   2> 139859 INFO  (jetty-launcher-216-thread-1) [n:127.0.0.1:57692_solr    ] o.a.s.c.CorePropertiesLocator Found 0 core definitions underneath C:\Users\jenkins\workspace\Lucene-Solr-7.x-Windows\solr\build\solr-core\test\J1\temp\solr.cloud.TestAuthenticationFramework_E07D851C8C129139-001\tempDir-001\node1\.
   [junit4]   2> 139955 INFO  (jetty-launcher-216-thread-2) [n:127.0.0.1:57697_solr    ] o.a.s.m.r.SolrJmxReporter JMX monitoring for 'solr_57697.solr.node' (registry 'solr.node') enabled at server: com.sun.jmx.mbeanserver.JmxMBeanServer@468b0371
   [junit4]   2> 139963 INFO  (jetty-launcher-216-thread-2) [n:127.0.0.1:57697_solr    ] o.a.s.m.r.SolrJmxReporter JMX monitoring for 'solr_57697.solr.jvm' (registry 'solr.jvm') enabled at server: com.sun.jmx.mbeanserver.JmxMBeanServer@468b0371
   [junit4]   2> 139963 INFO  (jetty-launcher-216-thread-2) [n:127.0.0.1:57697_solr    ] o.a.s.m.r.SolrJmxReporter JMX monitoring for 'solr_57697.solr.jetty' (registry 'solr.jetty') enabled at server: com.sun.jmx.mbeanserver.JmxMBeanServer@468b0371
   [junit4]   2> 139965 INFO  (jetty-launcher-216-thread-2) [n:127.0.0.1:57697_solr    ] o.a.s.c.CorePropertiesLocator Found 0 core definitions underneath C:\Users\jenkins\workspace\Lucene-Solr-7.x-Windows\solr\build\solr-core\test\J1\temp\solr.cloud.TestAuthenticationFramework_E07D851C8C129139-001\tempDir-001\node2\.
   [junit4]   2> 140007 INFO  (TEST-TestAuthenticationFramework.testBasics-seed#[E07D851C8C129139]) [    ] o.a.s.c.c.ZkStateReader Updated live nodes from ZooKeeper... (0) -> (2)
   [junit4]   2> 140009 INFO  (TEST-TestAuthenticationFramework.testBasics-seed#[E07D851C8C129139]) [    ] o.a.s.c.s.i.ZkClientClusterStateProvider Cluster at 127.0.0.1:57688/solr ready
   [junit4]   2> 140014 INFO  (TEST-TestAuthenticationFramework.testBasics-seed#[E07D851C8C129139]) [    ] o.a.s.SolrTestCaseJ4 ###Starting testBasics
   [junit4]   2> 140019 INFO  (qtp469960182-1395) [n:127.0.0.1:57692_solr    ] o.a.s.h.a.CollectionsHandler Invoked Collection Action :create with params replicationFactor=2&collection.configName=solrCloudCollectionConfig&maxShardsPerNode=2&name=testcollection&nrtReplicas=2&action=CREATE&numShards=2&wt=javabin&version=2 and sendToOCPQueue=true
   [junit4]   2> 140022 INFO  (OverseerThreadFactory-640-thread-1-processing-n:127.0.0.1:57692_solr) [n:127.0.0.1:57692_solr    ] o.a.s.c.CreateCollectionCmd Create collection testcollection
   [junit4]   2> 140132 INFO  (OverseerStateUpdate-98550516968128518-127.0.0.1:57692_solr-n_0000000000) [n:127.0.0.1:57692_solr    ] o.a.s.c.o.SliceMutator createReplica() {
   [junit4]   2>   "operation":"ADDREPLICA",
   [junit4]   2>   "collection":"testcollection",
   [junit4]   2>   "shard":"shard1",
   [junit4]   2>   "core":"testcollection_shard1_replica_n1",
   [junit4]   2>   "state":"down",
   [junit4]   2>   "base_url":"http://127.0.0.1:57697/solr",
   [junit4]   2>   "type":"NRT"} 
   [junit4]   2> 140136 INFO  (OverseerStateUpdate-98550516968128518-127.0.0.1:57692_solr-n_0000000000) [n:127.0.0.1:57692_solr    ] o.a.s.c.o.SliceMutator createReplica() {
   [junit4]   2>   "operation":"ADDREPLICA",
   [junit4]   2>   "collection":"testcollection",
   [junit4]   2>   "shard":"shard1",
   [junit4]   2>   "core":"testcollection_shard1_replica_n2",
   [junit4]   2>   "state":"down",
   [junit4]   2>   "base_url":"http://127.0.0.1:57692/solr",
   [junit4]   2>   "type":"NRT"} 
   [junit4]   2> 140142 INFO  (OverseerStateUpdate-98550516968128518-127.0.0.1:57692_solr-n_0000000000) [n:127.0.0.1:57692_solr    ] o.a.s.c.o.SliceMutator createReplica() {
   [junit4]   2>   "operation":"ADDREPLICA",
   [junit4]   2>   "collection":"testcollection",
   [junit4]   2>   "shard":"shard2",
   [junit4]   2>   "core":"testcollection_shard2_replica_n4",
   [junit4]   2>   "state":"down",
   [junit4]   2>   "base_url":"http://127.0.0.1:57697/solr",
   [junit4]   2>   "type":"NRT"} 
   [junit4]   2> 140145 INFO  (OverseerStateUpdate-98550516968128518-127.0.0.1:57692_solr-n_0000000000) [n:127.0.0.1:57692_solr    ] o.a.s.c.o.SliceMutator createReplica() {
   [junit4]   2>   "operation":"ADDREPLICA",
   [junit4]   2>   "collection":"testcollection",
   [junit4]   2>   "shard":"shard2",
   [junit4]   2>   "core":"testcollection_shard2_replica_n6",
   [junit4]   2>   "state":"down",
   [junit4]   2>   "base_url":"http://127.0.0.1:57692/solr",
   [junit4]   2>   "type":"NRT"} 
   [junit4]   2> 140350 INFO  (qtp469960182-1380) [n:127.0.0.1:57692_solr    ] o.a.s.h.a.CoreAdminOperation core create command qt=/admin/cores&coreNodeName=core_node5&collection.configName=solrCloudCollectionConfig&newCollection=true&name=testcollection_shard1_replica_n2&action=CREATE&numShards=2&collection=testcollection&shard=shard1&wt=javabin&version=2&replicaType=NRT
   [junit4]   2> 140351 INFO  (qtp469960182-1380) [n:127.0.0.1:57692_solr    ] o.a.s.c.TransientSolrCoreCacheDefault Allocating transient cache for 2147483647 transient cores
   [junit4]   2> 140363 INFO  (qtp861225680-1391) [n:127.0.0.1:57697_solr    ] o.a.s.h.a.CoreAdminOperation core create command qt=/admin/cores&coreNodeName=core_node7&collection.configName=solrCloudCollectionConfig&newCollection=true&name=testcollection_shard2_replica_n4&action=CREATE&numShards=2&collection=testcollection&shard=shard2&wt=javabin&version=2&replicaType=NRT
   [junit4]   2> 140364 INFO  (qtp861225680-1391) [n:127.0.0.1:57697_solr    ] o.a.s.c.TransientSolrCoreCacheDefault Allocating transient cache for 2147483647 transient cores
   [junit4]   2> 140371 INFO  (qtp469960182-1379) [n:127.0.0.1:57692_solr    ] o.a.s.h.a.CoreAdminOperation core create command qt=/admin/cores&coreNodeName=core_node8&collection.configName=solrCloudCollectionConfig&newCollection=true&name=testcollection_shard2_replica_n6&action=CREATE&numShards=2&collection=testcollection&shard=shard2&wt=javabin&version=2&replicaType=NRT
   [junit4]   2> 140377 INFO  (qtp861225680-1388) [n:127.0.0.1:57697_solr    ] o.a.s.h.a.CoreAdminOperation core create command qt=/admin/cores&coreNodeName=core_node3&collection.configName=solrCloudCollectionConfig&newCollection=true&name=testcollection_shard1_replica_n1&action=CREATE&numShards=2&collection=testcollection&shard=shard1&wt=javabin&version=2&replicaType=NRT
   [junit4]   2> 140497 INFO  (zkCallback-228-thread-1-processing-n:127.0.0.1:57692_solr) [n:127.0.0.1:57692_solr    ] o.a.s.c.c.ZkStateReader A cluster state change: [WatchedEvent state:SyncConnected type:NodeDataChanged path:/collections/testcollection/state.json] for collection [testcollection] has occurred - updating... (live nodes size: [2])
   [junit4]   2> 140497 INFO  (zkCallback-227-thread-1-processing-n:127.0.0.1:57697_solr) [n:127.0.0.1:57697_solr    ] o.a.s.c.c.ZkStateReader A cluster state change: [WatchedEvent state:SyncConnected type:NodeDataChanged path:/collections/testcollection/state.json] for collection [testcollection] has occurred - updating... (live nodes size: [2])
   [junit4]   2> 140502 INFO  (zkCallback-228-thread-2-processing-n:127.0.0.1:57692_solr) [n:127.0.0.1:57692_solr    ] o.a.s.c.c.ZkStateReader A cluster state change: [WatchedEvent state:SyncConnected type:NodeDataChanged path:/collections/testcollection/state.json] for collection [testcollection] has occurred - updating... (live nodes size: [2])
   [junit4]   2> 140503 INFO  (zkCallback-228-thread-3-processing-n:127.0.0.1:57692_solr) [n:127.0.0.1:57692_solr    ] o.a.s.c.c.ZkStateReader A cluster state change: [WatchedEvent state:SyncConnected type:NodeDataChanged path:/collections/testcollection/state.json] for collection [testcollection] has occurred - updating... (live nodes size: [2])
   [junit4]   2> 140503 INFO  (zkCallback-227-thread-2-processing-n:127.0.0.1:57697_solr) [n:127.0.0.1:57697_solr    ] o.a.s.c.c.ZkStateReader A cluster state change: [WatchedEvent state:SyncConnected type:NodeDataChanged path:/collections/testcollection/state.json] for collection [testcollection] has occurred - updating... (live nodes size: [2])
   [junit4]   2> 141441 INFO  (qtp469960182-1380) [n:127.0.0.1:57692_solr c:testcollection s:shard1 r:core_node5 x:testcollection_shard1_replica_n2] o.a.s.c.SolrConfig Using Lucene MatchVersion: 7.1.0
   [junit4]   2> 141442 INFO  (qtp469960182-1379) [n:127.0.0.1:57692_solr c:testcollection s:shard2 r:core_node8 x:testcollection_shard2_replica_n6] o.a.s.c.SolrConfig Using Lucene MatchVersion: 7.1.0
   [junit4]   2> 141457 INFO  (qtp861225680-1391) [n:127.0.0.1:57697_solr c:testcollection s:shard2 r:core_node7 x:testcollection_shard2_replica_n4] o.a.s.c.SolrConfig Using Lucene MatchVersion: 7.1.0
   [junit4]   2> 141459 INFO  (qtp861225680-1388) [n:127.0.0.1:57697_solr c:testcollection s:shard1 r:core_node3 x:testcollection_shard1_replica_n1] o.a.s.c.SolrConfig Using Lucene MatchVersion: 7.1.0
   [junit4]   2> 141466 INFO  (qtp469960182-1380) [n:127.0.0.1:57692_solr c:testcollection s:shard1 r:core_node5 x:testcollection_shard1_replica_n2] o.a.s.s.IndexSchema [testcollection_shard1_replica_n2] Schema name=minimal
   [junit4]   2> 141466 INFO  (qtp469960182-1379) [n:127.0.0.1:57692_solr c:testcollection s:shard2 r:core_node8 x:testcollection_shard2_replica_n6] o.a.s.s.IndexSchema [testcollection_shard2_replica_n6] Schema name=minimal
   [junit4]   2> 141468 INFO  (qtp861225680-1391) [n:127.0.0.1:57697_solr c:testcollection s:shard2 r:core_node7 x:testcollection_shard2_replica_n4] o.a.s.s.IndexSchema [testcollection_shard2_replica_n4] Schema name=minimal
   [junit4]   2> 141479 INFO  (qtp861225680-1388) [n:127.0.0.1:57697_solr c:testcollection s:shard1 r:core_node3 x:testcollection_shard1_replica_n1] o.a.s.s.IndexSchema [testcollection_shard1_replica_n1] Schema name=minimal
   [junit4]   2> 141479 INFO  (qtp861225680-1391) [n:127.0.0.1:57697_solr c:testcollection s:shard2 r:core_node7 x:testcollection_shard2_replica_n4] o.a.s.s.IndexSchema Loaded schema minimal/1.1 with uniqueid field id
   [junit4]   2> 141479 INFO  (qtp861225680-1391) [n:127.0.0.1:57697_solr c:testcollection s:shard2 r:core_node7 x:testcollection_shard2_replica_n4] o.a.s.c.CoreContainer Creating SolrCore 'testcollection_shard2_replica_n4' using configuration from collection testcollection, trusted=true
   [junit4]   2> 141481 INFO  (qtp861225680-1391) [n:127.0.0.1:57697_solr c:testcollection s:shard2 r:core_node7 x:testcollection_shard2_replica_n4] o.a.s.m.r.SolrJmxReporter JMX monitoring for 'solr_57697.solr.core.testcollection.shard2.replica_n4' (registry 'solr.core.testcollection.shard2.replica_n4') enabled at server: com.sun.jmx.mbeanserver.JmxMBeanServer@468b0371
   [junit4]   2> 141481 INFO  (qtp861225680-1391) [n:127.0.0.1:57697_solr c:testcollection s:shard2 r:core_node7 x:testcollection_shard2_replica_n4] o.a.s.c.SolrCore solr.RecoveryStrategy.Builder
   [junit4]   2> 141481 INFO  (qtp861225680-1391) [n:127.0.0.1:57697_solr c:testcollection s:shard2 r:core_node7 x:testcollection_shard2_replica_n4] o.a.s.c.SolrCore [[testcollection_shard2_replica_n4] ] Opening new SolrCore at [C:\Users\jenkins\workspace\Lucene-Solr-7.x-Windows\solr\build\solr-core\test\J1\temp\solr.cloud.TestAuthenticationFramework_E07D851C8C129139-001\tempDir-001\node2\testcollection_shard2_replica_n4], dataDir=[C:\Users\jenkins\workspace\Lucene-Solr-7.x-Windows\solr\build\solr-core\test\J1\temp\solr.cloud.TestAuthenticationFramework_E07D851C8C129139-001\tempDir-001\node2\.\testcollection_shard2_replica_n4\data\]
   [junit4]   2> 141481 INFO  (qtp469960182-1379) [n:127.0.0.1:57692_solr c:testcollection s:shard2 r:core_node8 x:testcollection_shard2_replica_n6] o.a.s.s.IndexSchema Loaded schema minimal/1.1 with uniqueid field id
   [junit4]   2> 141481 INFO  (qtp469960182-1379) [n:127.0.0.1:57692_solr c:testcollection s:shard2 r:core_node8 x:testcollection_shard2_replica_n6] o.a.s.c.CoreContainer Creating SolrCore 'testcollection_shard2_replica_n6' using configuration from collection testcollection, trusted=true
   [junit4]   2> 141481 INFO  (qtp861225680-1388) [n:127.0.0.1:57697_solr c:testcollection s:shard1 r:core_node3 x:testcollection_shard1_replica_n1] o.a.s.s.IndexSchema Loaded schema minimal/1.1 with uniqueid field id
   [junit4]   2> 141481 INFO  (qtp861225680-1388) [n:127.0.0.1:57697_solr c:testcollection s:shard1 r:core_node3 x:testcollection_shard1_replica_n1] o.a.s.c.CoreContainer Creating SolrCore 'testcollection_shard1_replica_n1' using configuration from collection testcollection, trusted=true
   [junit4]   2> 141482 INFO  (qtp469960182-1379) [n:127.0.0.1:57692_solr c:testcollection s:shard2 r:core_node8 x:testcollection_shard2_replica_n6] o.a.s.m.r.SolrJmxReporter JMX monitoring for 'solr_57692.solr.core.testcollection.shard2.replica_n6' (registry 'solr.core.testcollection.shard2.replica_n6') enabled at server: com.sun.jmx.mbeanserver.JmxMBeanServer@468b0371
   [junit4]   2> 141482 INFO  (qtp469960182-1379) [n:127.0.0.1:57692_solr c:testcollection s:shard2 r:core_node8 x:testcollection_shard2_replica_n6] o.a.s.c.SolrCore solr.RecoveryStrategy.Builder
   [junit4]   2> 141482 INFO  (qtp469960182-1379) [n:127.0.0.1:57692_solr c:testcollection s:shard2 r:core_node8 x:testcollection_shard2_replica_n6] o.a.s.c.SolrCore [[testcollection_shard2_replica_n6] ] Opening new SolrCore at [C:\Users\jenkins\workspace\Lucene-Solr-7.x-Windows\solr\build\solr-core\test\J1\temp\solr.cloud.TestAuthenticationFramework_E07D851C8C129139-001\tempDir-001\node1\testcollection_shard2_replica_n6], dataDir=[C:\Users\jenkins\workspace\Lucene-Solr-7.x-Windows\solr\build\solr-core\test\J1\temp\solr.cloud.TestAuthenticationFramework_E07D851C8C129139-001\tempDir-001\node1\.\testcollection_shard2_replica_n6\data\]
   [junit4]   2> 141483 INFO  (qtp861225680-1388) [n:127.0.0.1:57697_solr c:testcollection s:shard1 r:core_node3 x:testcollection_shard1_replica_n1] o.a.s.m.r.SolrJmxReporter JMX monitoring for 'solr_57697.solr.core.testcollection.shard1.replica_n1' (registry 'solr.core.testcollection.shard1.replica_n1') enabled at server: com.sun.jmx.mbeanserver.JmxMBeanServer@468b0371
   [junit4]   2> 141483 INFO  (qtp861225680-1388) [n:127.0.0.1:57697_solr c:testcollection s:shard1 r:core_node3 x:testcollection_shard1_replica_n1] o.a.s.c.SolrCore solr.RecoveryStrategy.Builder
   [junit4]   2> 141483 INFO  (qtp861225680-1388) [n:127.0.0.1:57697_solr c:testcollection s:shard1 r:core_node3 x:testcollection_shard1_replica_n1] o.a.s.c.SolrCore [[testcollection_shard1_replica_n1] ] Opening new SolrCore at [C:\Users\jenkins\workspace\Lucene-Solr-7.x-Windows\solr\build\solr-core\test\J1\temp\solr.cloud.TestAuthenticationFramework_E07D851C8C129139-001\tempDir-001\node2\testcollection_shard1_replica_n1], dataDir=[C:\Users\jenkins\workspace\Lucene-Solr-7.x-Windows\solr\build\solr-core\test\J1\temp\solr.cloud.TestAuthenticationFramework_E07D851C8C129139-001\tempDir-001\node2\.\testcollection_shard1_replica_n1\data\]
   [junit4]   2> 141485 INFO  (qtp469960182-1380) [n:127.0.0.1:57692_solr c:testcollection s:shard1 r:core_node5 x:testcollection_shard1_replica_n2] o.a.s.s.IndexSchema Loaded schema minimal/1.1 with uniqueid field id
   [junit4]   2> 141485 INFO  (qtp469960182-1380) [n:127.0.0.1:57692_solr c:testcollection s:shard1 r:core_node5 x:testcollection_shard1_replica_n2] o.a.s.c.CoreContainer Creating SolrCore 'testcollection_shard1_replica_n2' using configuration from collection testcollection, trusted=true
   [junit4]   2> 141485 INFO  (qtp469960182-1380) [n:127.0.0.1:57692_solr c:testcollection s:shard1 r:core_node5 x:testcollection_shard1_replica_n2] o.a.s.m.r.SolrJmxReporter JMX monitoring for 'solr_57692.solr.core.testcollection.shard1.replica_n2' (registry 'solr.core.testcollection.shard1.replica_n2') enabled at server: com.sun.jmx.mbeanserver.JmxMBeanServer@468b0371
   [junit4]   2> 141486 INFO  (qtp469960182-1380) [n:127.0.0.1:57692_solr c:testcollection s:shard1 r:core_node5 x:testcollection_shard1_replica_n2] o.a.s.c.SolrCore solr.RecoveryStrategy.Builder
   [junit4]   2> 141486 INFO  (qtp469960182-1380) [n:127.0.0.1:57692_solr c:testcollection s:shard1 r:core_node5 x:testcollection_shard1_replica_n2] o.a.s.c.SolrCore [[testcollection_shard1_replica_n2] ] Opening new SolrCore at [C:\Users\jenkins\workspace\Lucene-Solr-7.x-Windows\solr\build\solr-core\test\J1\temp\solr.cloud.TestAuthenticationFramework_E07D851C8C129139-001\tempDir-001\node1\testcollection_shard1_replica_n2], dataDir=[C:\Users\jenkins\workspace\Lucene-Solr-7.x-Windows\solr\build\solr-core\test\J1\temp\solr.cloud.TestAuthenticationFramework_E07D851C8C129139-001\tempDir-001\node1\.\testcollection_shard1_replica_n2\data\]
   [junit4]   2> 141692 INFO  (qtp469960182-1380) [n:127.0.0.1:57692_solr c:testcollection s:shard1 r:core_node5 x:testcollection_shard1_replica_n2] o.a.s.u.UpdateHandler Using UpdateLog implementation: org.apache.solr.update.UpdateLog
   [junit4]   2> 141692 INFO  (qtp469960182-1380) [n:127.0.0.1:57692_solr c:testcollection s:shard1 r:core_node5 x:testcollection_shard1_replica_n2] o.a.s.u.UpdateLog Initializing UpdateLog: dataDir=null defaultSyncLevel=FLUSH numRecordsToKeep=100 maxNumLogsToKeep=10 numVersionBuckets=65536
   [junit4]   2> 141693 INFO  (qtp861225680-1388) [n:127.0.0.1:57697_solr c:testcollection s:shard1 r:core_node3 x:testcollection_shard1_replica_n1] o.a.s.u.UpdateHandler Using UpdateLog implementation: org.apache.solr.update.UpdateLog
   [junit4]   2> 141693 INFO  (qtp861225680-1388) [n:127.0.0.1:57697_solr c:testcollection s:shard1 r:core_node3 x:testcollection_shard1_replica_n1] o.a.s.u.UpdateLog Initializing UpdateLog: dataDir=null defaultSyncLevel=FLUSH numRecordsToKeep=100 maxNumLogsToKeep=10 numVersionBuckets=65536
   [junit4]   2> 141693 INFO  (qtp469960182-1380) [n:127.0.0.1:57692_solr c:testcollection s:shard1 r:core_node5 x:testcollection_shard1_replica_n2] o.a.s.u.CommitTracker Hard AutoCommit: disabled
   [junit4]   2> 141693 INFO  (qtp469960182-1380) [n:127.0.0.1:57692_solr c:testcollection s:shard1 r:core_node5 x:testcollection_shard1_replica_n2] o.a.s.u.CommitTracker Soft AutoCommit: disabled
   [junit4]   2> 141694 INFO  (qtp469960182-1379) [n:127.0.0.1:57692_solr c:testcollection s:shard2 r:core_node8 x:testcollection_shard2_replica_n6] o.a.s.u.UpdateHandler Using UpdateLog implementation: org.apache.solr.update.UpdateLog
   [junit4]   2> 141694 INFO  (qtp469960182-1379) [n:127.0.0.1:57692_solr c:testcollection s:shard2 r:core_node8 x:testcollection_shard2_replica_n6] o.a.s.u.UpdateLog Initializing UpdateLog: dataDir=null defaultSyncLevel=FLUSH numRecordsToKeep=100 maxNumLogsToKeep=10 numVersionBuckets=65536
   [junit4]   2> 141696 INFO  (qtp861225680-1388) [n:127.0.0.1:57697_solr c:testcollection s:shard1 r:core_node3 x:testcollection_shard1_replica_n1] o.a.s.u.CommitTracker Hard AutoCommit: disabled
   [junit4]   2> 141696 INFO  (qtp861225680-1388) [n:127.0.0.1:57697_solr c:testcollection s:shard1 r:core_node3 x:testcollection_shard1_replica_n1] o.a.s.u.CommitTracker Soft AutoCommit: disabled
   [junit4]   2> 141696 INFO  (qtp469960182-1379) [n:127.0.0.1:57692_solr c:testcollection s:shard2 r:core_node8 x:testcollection_shard2_replica_n6] o.a.s.u.CommitTracker Hard AutoCommit: disabled
   [junit4]   2> 141696 INFO  (qtp469960182-1379) [n:127.0.0.1:57692_solr c:testcollection s:shard2 r:core_node8 x:testcollection_shard2_replica_n6] o.a.s.u.CommitTracker Soft AutoCommit: disabled
   [junit4]   2> 141719 INFO  (qtp861225680-1391) [n:127.0.0.1:57697_solr c:testcollection s:shard2 r:core_node7 x:testcollection_shard2_replica_n4] o.a.s.u.UpdateHandler Using UpdateLog implementation: org.apache.solr.update.UpdateLog
   [junit4]   2> 141720 INFO  (qtp861225680-1391) [n:127.0.0.1:57697_solr c:testcollection s:shard2 r:core_node7 x:testcollection_shard2_replica_n4] o.a.s.u.UpdateLog Initializing UpdateLog: dataDir=null defaultSyncLevel=FLUSH numRecordsToKeep=100 maxNumLogsToKeep=10 numVersionBuckets=65536
   [junit4]   2> 141721 INFO  (qtp861225680-1391) [n:127.0.0.1:57697_solr c:testcollection s:shard2 r:core_node7 x:testcollection_shard2_replica_n4] o.a.s.u.CommitTracker Hard AutoCommit: disabled
   [junit4]   2> 141721 INFO  (qtp861225680-1391) [n:127.0.0.1:57697_solr c:testcollection s:shard2 r:core_node7 x:testcollection_shard2_replica_n4] o.a.s.u.CommitTracker Soft AutoCommit: disabled
   [junit4]   2> 141723 INFO  (qtp861225680-1388) [n:127.0.0.1:57697_solr c:testcollection s:shard1 r:core_node3 x:testcollection_shard1_replica_n1] o.a.s.s.SolrIndexSearcher Opening [Searcher@14242993[testcollection_shard1_replica_n1] main]
   [junit4]   2> 141723 INFO  (qtp469960182-1380) [n:127.0.0.1:57692_solr c:testcollection s:shard1 r:core_node5 x:testcollection_shard1_replica_n2] o.a.s.s.SolrIndexSearcher Opening [Searcher@5f383c6[testcollection_shard1_replica_n2] main]
   [junit4]   2> 141723 INFO  (qtp469960182-1379) [n:127.0.0.1:57692_solr c:testcollection s:shard2 r:core_node8 x:testcollection_shard2_replica_n6] o.a.s.s.SolrIndexSearcher Opening [Searcher@2207eb9b[testcollection_shard2_replica_n6] main]
   [junit4]   2> 141725 INFO  (qtp469960182-1380) [n:127.0.0.1:57692_solr c:testcollection s:shard1 r:core_node5 x:testcollection_shard1_replica_n2] o.a.s.r.ManagedResourceStorage Configured ZooKeeperStorageIO with znodeBase: /configs/solrCloudCollectionConfig
   [junit4]   2> 141726 INFO  (qtp469960182-1380) [n:127.0.0.1:57692_solr c:testcollection s:shard1 r:core_node5 x:testcollection_shard1_replica_n2] o.a.s.r.ManagedResourceStorage Loaded null at path _rest_managed.json using ZooKeeperStorageIO:path=/configs/solrCloudCollectionConfig
   [junit4]   2> 141726 INFO  (qtp861225680-1388) [n:127.0.0.1:57697_solr c:testcollection s:shard1 r:core_node3 x:testcollection_shard1_replica_n1] o.a.s.r.ManagedResourceStorage Configured ZooKeeperStorageIO with znodeBase: /configs/solrCloudCollectionConfig
   [junit4]   2> 141726 INFO  (qtp861225680-1388) [n:127.0.0.1:57697_solr c:testcollection s:shard1 r:core_node3 x:testcollection_shard1_replica_n1] o.a.s.r.ManagedResourceStorage Loaded null at path _rest_managed.json using ZooKeeperStorageIO:path=/configs/solrCloudCollectionConfig
   [junit4]   2> 141726 INFO  (qtp469960182-1380) [n:127.0.0.1:57692_solr c:testcollection s:shard1 r:core_node5 x:testcollection_shard1_replica_n2] o.a.s.h.ReplicationHandler Commits will be reserved for  10000
   [junit4]   2> 141727 INFO  (qtp469960182-1380) [n:127.0.0.1:57692_solr c:testcollection s:shard1 r:core_node5 x:testcollection_shard1_replica_n2] o.a.s.u.UpdateLog Could not find max version in index or recent updates, using new clock 1576808273950015488
   [junit4]   2> 141727 INFO  (qtp861225680-1388) [n:127.0.0.1:57697_solr c:testcollection s:shard1 r:core_node3 x:testcollection_shard1_replica_n1] o.a.s.h.ReplicationHandler Commits will be reserved for  10000
   [junit4]   2> 141727 INFO  (qtp861225680-1388) [n:127.0.0.1:57697_solr c:testcollection s:shard1 r:core_node3 x:testcollection_shard1_replica_n1] o.a.s.u.UpdateLog Could not find max version in index or recent updates, using new clock 1576808273950015488
   [junit4]   2> 141727 INFO  (qtp861225680-1391) [n:127.0.0.1:57697_solr c:testcollection s:shard2 r:core_node7 x:testcollection_shard2_replica_n4] o.a.s.s.SolrIndexSearcher Opening [Searcher@705a3e6e[testcollection_shard2_replica_n4] main]
   [junit4]   2> 141734 INFO  (qtp469960182-1379) [n:127.0.0.1:57692_solr c:testcollection s:shard2 r:core_node8 x:testcollection_shard2_replica_n6] o.a.s.r.ManagedResourceStorage Configured ZooKeeperStorageIO with znodeBase: /configs/solrCloudCollectionConfig
   [junit4]   2> 141735 INFO  (qtp469960182-1379) [n:127.0.0.1:57692_solr c:testcollection s:shard2 r:core_node8 x:testcollection_shard2_replica_n6] o.a.s.r.ManagedResourceStorage Loaded null at path _rest_managed.json using ZooKeeperStorageIO:path=/configs/solrCloudCollectionConfig
   [junit4]   2> 141735 INFO  (qtp861225680-1391) [n:127.0.0.1:57697_solr c:testcollection s:shard2 r:core_node7 x:testcollection_shard2_replica_n4] o.a.s.r.ManagedResourceStorage Configured ZooKeeperStorageIO with znodeBase: /configs/solrCloudCollectionConfig
   [junit4]   2> 141735 INFO  (searcherExecutor-646-thread-1-processing-n:127.0.0.1:57697_solr x:testcollection_shard1_replica_n1 s:shard1 c:testcollection r:core_node3) [n:127.0.0.1:57697_solr c:testcollection s:shard1 r:core_node3 x:testcollection_shard1_replica_n1] o.a.s.c.SolrCore [testcollection_shard1_replica_n1] Registered new searcher Searcher@14242993[testcollection_shard1_replica_n1] main{ExitableDirectoryReader(UninvertingDirectoryReader())}
   [junit4]   2> 141737 INFO  (qtp861225680-1391) [n:127.0.0.1:57697_solr c:testcollection s:shard2 r:core_node7 x:testcollection_shard2_replica_n4] o.a.s.r.ManagedResourceStorage Loaded null at path _rest_managed.json using ZooKeeperStorageIO:path=/configs/solrCloudCollectionConfig
   [junit4]   2> 141737 INFO  (qtp469960182-1379) [n:127.0.0.1:57692_solr c:testcollection s:shard2 r:core_node8 x:testcollection_shard2_replica_n6] o.a.s.h.ReplicationHandler Commits will be reserved for  10000
   [junit4]   2> 141738 INFO  (qtp469960182-1379) [n:127.0.0.1:57692_solr c:testcollection s:shard2 r:core_node8 x:testcollection_shard2_replica_n6] o.a.s.u.UpdateLog Could not find max version in index or recent updates, using new clock 1576808273961549824
   [junit4]   2> 141742 INFO  (searcherExecutor-647-thread-1-processing-n:127.0.0.1:57692_solr x:testcollection_shard1_replica_n2 s:shard1 c:testcollection r:core_node5) [n:127.0.0.1:57692_solr c:testcollection s:shard1 r:core_node5 x:testcollection_shard1_replica_n2] o.a.s.c.SolrCore [testcollection_shard1_replica_n2] Registered new searcher Searcher@5f383c6[testcollection_shard1_replica_n2] main{ExitableDirectoryReader(UninvertingDirectoryReader())}
   [junit4]   2> 141746 INFO  (qtp861225680-1391) [n:127.0.0.1:57697_solr c:testcollection s:shard2 r:core_node7 x:testcollection_shard2_replica_n4] o.a.s.h.ReplicationHandler Commits will be reserved for  10000
   [junit4]   2> 141746 INFO  (qtp861225680-1391) [n:127.0.0.1:57697_solr c:testcollection s:shard2 r:core_node7 x:testcollection_shard2_replica_n4] o.a.s.u.UpdateLog Could not find max version in index or recent updates, using new clock 1576808273969938432
   [junit4]   2> 141747 INFO  (searcherExecutor-645-thread-1-processing-n:127.0.0.1:57692_solr x:testcollection_shard2_replica_n6 s:shard2 c:testcollection r:core_node8) [n:127.0.0.1:57692_solr c:testcollection s:shard2 r:core_node8 x:testcollection_shard2_replica_n6] o.a.s.c.SolrCore [testcollection_shard2_replica_n6] Registered new searcher Searcher@2207eb9b[testcollection_shard2_replica_n6] main{ExitableDirectoryReader(UninvertingDirectoryReader())}
   [junit4]   2> 141750 INFO  (searcherExecutor-644-thread-1-processing-n:127.0.0.1:57697_solr x:testcollection_shard2_replica_n4 s:shard2 c:testcollection r:core_node7) [n:127.0.0.1:57697_solr c:testcollection s:shard2 r:core_node7 x:testcollection_shard2_replica_n4] o.a.s.c.SolrCore [testcollection_shard2_replica_n4] Registered new searcher Searcher@705a3e6e[testcollection_shard2_replica_n4] main{ExitableDirectoryReader(UninvertingDirectoryReader())}
   [junit4]   2> 141750 INFO  (qtp469960182-1380) [n:127.0.0.1:57692_solr c:testcollection s:shard1 r:core_node5 x:testcollection_shard1_replica_n2] o.a.s.c.ShardLeaderElectionContext Enough replicas found to continue.
   [junit4]   2> 141750 INFO  (qtp469960182-1380) [n:127.0.0.1:57692_solr c:testcollection s:shard1 r:core_node5 x:testcollection_shard1_replica_n2] o.a.s.c.ShardLeaderElectionContext I may be the new leader - try and sync
   [junit4]   2> 141750 INFO  (qtp469960182-1380) [n:127.0.0.1:57692_solr c:testcollection s:shard1 r:core_node5 x:testcollection_shard1_replica_n2] o.a.s.c.SyncStrategy Sync replicas to http://127.0.0.1:57692/solr/testcollection_shard1_replica_n2/
   [junit4]   2> 141751 INFO  (qtp469960182-1380) [n:127.0.0.1:57692_solr c:testcollection s:shard1 r:core_node5 x:testcollection_shard1_replica_n2] o.a.s.u.PeerSync PeerSync: core=testcollection_shard1_replica_n2 url=http://127.0.0.1:57692/solr START replicas=[http://127.0.0.1:57697/solr/testcollection_shard1_replica_n1/] nUpdates=100
   [junit4]   2> 141756 INFO  (qtp469960182-1379) [n:127.0.0.1:57692_solr c:testcollection s:shard2 r:core_node8 x:testcollection_shard2_replica_n6] o.a.s.c.ShardLeaderElectionContext Enough replicas found to continue.
   [junit4]   2> 141757 INFO  (qtp469960182-1379) [n:127.0.0.1:57692_solr c:testcollection s:shard2 r:core_node8 x:testcollection_shard2_replica_n6] o.a.s.c.ShardLeaderElectionContext I may be the new leader - try and sync
   [junit4]   2> 141757 INFO  (qtp469960182-1379) [n:127.0.0.1:57692_solr c:testcollection s:shard2 r:core_node8 x:testcollection_shard2_replica_n6] o.a.s.c.SyncStrategy Sync replicas to http://127.0.0.1:57692/solr/testcollection_shard2_replica_n6/
   [junit4]   2> 141757 INFO  (qtp469960182-1379) [n:127.0.0.1:57692_solr c:testcollection s:shard2 r:core_node8 x:testcollection_shard2_replica_n6] o.a.s.u.PeerSync PeerSync: core=testcollection_shard2_replica_n6 url=http://127.0.0.1:57692/solr START replicas=[http://127.0.0.1:57697/solr/testcollection_shard2_replica_n4/] nUpdates=100
   [junit4]   2> 141764 INFO  (qtp861225680-1385) [n:127.0.0.1:57697_solr c:testcollection s:shard1 r:core_node3 x:testcollection_shard1_replica_n1] o.a.s.c.S.Request [testcollection_shard1_replica_n1]  webapp=/solr path=/get params={distrib=false&qt=/get&fingerprint=false&getVersions=100&wt=javabin&version=2} status=0 QTime=0
   [junit4]   2> 141772 INFO  (qtp861225680-1384) [n:127.0.0.1:57697_solr c:testcollection s:shard2 r:core_node7 x:testcollection_shard2_replica_n4] o.a.s.c.S.Request [testcollection_shard2_replica_n4]  webapp=/solr path=/get params={distrib=false&qt=/get&fingerprint=false&getVersions=100&wt=javabin&version=2} status=0 QTime=0
   [junit4]   2> 141866 INFO  (zkCallback-228-thread-3-processing-n:127.0.0.1:57692_solr) [n:127.0.0.1:57692_solr    ] o.a.s.c.c.ZkStateReader A cluster state change: [WatchedEvent state:SyncConnected type:NodeDataChanged path:/collections/testcollection/state.json] for collection [testcollection] has occurred - updating... (live nodes size: [2])
   [junit4]   2> 141867 INFO  (zkCallback-228-thread-2-processing-n:127.0.0.1:57692_solr) [n:127.0.0.1:57692_solr    ] o.a.s.c.c.ZkStateReader A cluster state change: [WatchedEvent state:SyncConnected type:NodeDataChanged path:/collections/testcollection/state.json] for collection [testcollection] has occurred - updating... (live nodes size: [2])
   [junit4]   2> 141868 INFO  (zkCallback-228-thread-1-processing-n:127.0.0.1:57692_solr) [n:127.0.0.1:57692_solr    ] o.a.s.c.c.ZkStateReader A cluster state change: [WatchedEvent state:SyncConnected type:NodeDataChanged path:/collections/testcollection/state.json] for collection [testcollection] has occurred - updating... (live nodes size: [2])
   [junit4]   2> 141868 INFO  (zkCallback-227-thread-2-processing-n:127.0.0.1:57697_solr) [n:127.0.0.1:57697_solr    ] o.a.s.c.c.ZkStateReader A cluster state change: [WatchedEvent state:SyncConnected type:NodeDataChanged path:/collections/testcollection/state.json] for collection [testcollection] has occurred - updating... (live nodes size: [2])
   [junit4]   2> 141868 INFO  (zkCallback-227-thread-1-processing-n:127.0.0.1:57697_solr) [n:127.0.0.1:57697_solr    ] o.a.s.c.c.ZkStateReader A cluster state change: [WatchedEvent state:SyncConnected type:NodeDataChanged path:/collections/testcollection/state.json] for collection [testcollection] has occurred - updating... (live nodes size: [2])
   [junit4]   2> 142052 INFO  (qtp469960182-1380) [n:127.0.0.1:57692_solr c:testcollection s:shard1 r:core_node5 x:testcollection_shard1_replica_n2] o.a.s.u.PeerSync PeerSync: core=testcollection_shard1_replica_n2 url=http://127.0.0.1:57692/solr DONE.  We have no versions.  sync failed.
   [junit4]   2> 142052 INFO  (qtp469960182-1380) [n:127.0.0.1:57692_solr c:testcollection s:shard1 r:core_node5 x:testcollection_shard1_replica_n2] o.a.s.c.SyncStrategy Leader's attempt to sync with shard failed, moving to the next candidate
   [junit4]   2> 142052 INFO  (qtp469960182-1380) [n:127.0.0.1:57692_solr c:testcollection s:shard1 r:core_node5 x:testcollection_shard1_replica_n2] o.a.s.c.ShardLeaderElectionContext We failed sync, but we have no versions - we can't sync in that case - we were active before, so become leader anyway
   [junit4]   2> 142052 INFO  (qtp469960182-1380) [n:127.0.0.1:57692_solr c:testcollection s:shard1 r:core_node5 x:testcollection_shard1_replica_n2] o.a.s.c.ShardLeaderElectionContext Found all replicas participating in election, clear LIR
   [junit4]   2> 142065 INFO  (qtp469960182-1380) [n:127.0.0.1:57692_solr c:testcollection s:shard1 r:core_node5 x:testcollection_shard1_replica_n2] o.a.s.c.ShardLeaderElectionContext I am the new leader: http://127.0.0.1:57692/solr/testcollection_shard1_replica_n2/ shard1
   [junit4]   2> 142066 INFO  (qtp469960182-1379) [n:127.0.0.1:57692_solr c:testcollection s:shard2 r:core_node8 x:testcollection_shard2_replica_n6] o.a.s.u.PeerSync PeerSync: core=testcollection_shard2_replica_n6 url=http://127.0.0.1:57692/solr DONE.  We have no versions.  sync failed.
   [junit4]   2> 142066 INFO  (qtp469960182-1379) [n:127.0.0.1:57692_solr c:testcollection s:shard2 r:core_node8 x:testcollection_shard2_replica_n6] o.a.s.c.SyncStrategy Leader's attempt to sync with shard failed, moving to the next candidate
   [junit4]   2> 142066 INFO  (qtp469960182-1379) [n:127.0.0.1:57692_solr c:testcollection s:shard2 r:core_node8 x:testcollection_shard2_replica_n6] o.a.s.c.ShardLeaderElectionContext We failed sync, but we have no versions - we can't sync in that case - we were active before, so become leader anyway
   [junit4]   2> 142066 INFO  (qtp469960182-1379) [n:127.0.0.1:57692_solr c:testcollection s:shard2 r:core_node8 x:testcollection_shard2_replica_n6] o.a.s.c.ShardLeaderElectionContext Found all replicas participating in election, clear LIR
   [junit4]   2> 142075 INFO  (qtp469960182-1379) [n:127.0.0.1:57692_solr c:testcollection s:shard2 r:core_node8 x:testcollection_shard2_replica_n6] o.a.s.c.ShardLeaderElectionContext I am the new leader: http://127.0.0.1:57692/solr/testcollection_shard2_replica_n6/ shard2
   [junit4]   2> 142178 INFO  (zkCallback-228-thread-1-processing-n:127.0.0.1:57692_solr) [n:127.0.0.1:57692_solr    ] o.a.s.c.c.ZkStateReader A cluster state change: [WatchedEvent state:SyncConnected type:NodeDataChanged path:/collections/testcollection/state.json] for collection [testcollection] has occurred - updating... (live nodes size: [2])
   [junit4]   2> 142178 INFO  (zkCallback-228-thread-2-processing-n:127.0.0.1:57692_solr) [n:127.0.0.1:57692_solr    ] o.a.s.c.c.ZkStateReader A cluster state change: [WatchedEvent state:SyncConnected type:NodeDataChanged path:/collections/testcollection/state.json] for collection [testcollection] has occurred - updating... (live nodes size: [2])
   [junit4]   2> 142178 INFO  (zkCallback-228-thread-3-processing-n:127.0.0.1:57692_solr) [n:127.0.0.1:57692_solr    ] o.a.s.c.c.ZkStateReader A cluster state change: [WatchedEvent state:SyncConnected type:NodeDataChanged path:/collections/testcollection/state.json] for collection [testcollection] has occurred - updating... (live nodes size: [2])
   [junit4]   2> 142178 INFO  (zkCallback-227-thread-2-processing-n:127.0.0.1:57697_solr) [n:127.0.0.1:57697_solr    ] o.a.s.c.c.ZkStateReader A cluster state change: [WatchedEvent state:SyncConnected type:NodeDataChanged path:/collections/testcollection/state.json] for collection [testcollection] has occurred - updating... (live nodes size: [2])
   [junit4]   2> 142178 INFO  (zkCallback-227-thread-1-processing-n:127.0.0.1:57697_solr) [n:127.0.0.1:57697_solr    ] o.a.s.c.c.ZkStateReader A cluster state change: [WatchedEvent state:SyncConnected type:NodeDataChanged path:/collections/testcollection/state.json] for collection [testcollection] has occurred - updating... (live nodes size: [2])
   [junit4]   2> 142218 INFO  (qtp469960182-1380) [n:127.0.0.1:57692_solr c:testcollection s:shard1 r:core_node5 x:testcollection_shard1_replica_n2] o.a.s.c.ZkController I am the leader, no recovery necessary
   [junit4]   2> 142219 INFO  (qtp469960182-1380) [n:127.0.0.1:57692_solr c:testcollection s:shard1 r:core_node5 x:testcollection_shard1_replica_n2] o.a.s.s.HttpSolrCall [admin] webapp=null path=/admin/cores params={qt=/admin/cores&coreNodeName=core_node5&collection.configName=solrCloudCollectionConfig&newCollection=true&name=testcollection_shard1_replica_n2&action=CREATE&numShards=2&collection=testcollection&shard=shard1&wt=javabin&version=2&replicaType=NRT} status=0 QTime=1869
   [junit4]   2> 142226 INFO  (qtp469960182-1379) [n:127.0.0.1:57692_solr c:testcollection s:shard2 r:core_node8 x:testcollection_shard2_replica_n6] o.a.s.c.ZkController I am the leader, no recovery necessary
   [junit4]   2> 142228 INFO  (qtp469960182-1379) [n:127.0.0.1:57692_solr c:testcollection s:shard2 r:core_node8 x:testcollection_shard2_replica_n6] o.a.s.s.HttpSolrCall [admin] webapp=null path=/admin/cores params={qt=/admin/cores&coreNodeName=core_node8&collection.configName=solrCloudCollectionConfig&newCollection=true&name=testcollection_shard2_replica_n6&action=CREATE&numShards=2&collection=testcollection&shard=shard2&wt=javabin&version=2&replicaType=NRT} status=0 QTime=1857
   [junit4]   2> 142332 INFO  (zkCallback-227-thread-1-processing-n:127.0.0.1:57697_solr) [n:127.0.0.1:57697_solr    ] o.a.s.c.c.ZkStateReader A cluster state change: [WatchedEvent state:SyncConnected type:NodeDataChanged path:/collections/testcollection/state.json] for collection [testcollection] has occurred - updating... (live nodes size: [2])
   [junit4]   2> 142332 INFO  (zkCallback-227-thread-2-processing-n:127.0.0.1:57697_solr) [n:127.0.0.1:57697_solr    ] o.a.s.c.c.ZkStateReader A cluster state change: [WatchedEvent state:SyncConnected type:NodeDataChanged path:/collections/testcollection/state.json] for collection [testcollection] has occurred - updating... (live nodes size: [2])
   [junit4]   2> 142332 INFO  (zkCallback-228-thread-3-processing-n:127.0.0.1:57692_solr) [n:127.0.0.1:57692_solr    ] o.a.s.c.c.ZkStateReader A cluster state change: [WatchedEvent state:SyncConnected type:NodeDataChanged path:/collections/testcollection/state.json] for collection [testcollection] has occurred - updating... (live nodes size: [2])
   [junit4]   2> 142332 INFO  (zkCallback-228-thread-2-processing-n:127.0.0.1:57692_solr) [n:127.0.0.1:57692_solr    ] o.a.s.c.c.ZkStateReader A cluster state change: [WatchedEvent state:SyncConnected type:NodeDataChanged path:/collections/testcollection/state.json] for collection [testcollection] has occurred - updating... (live nodes size: [2])
   [junit4]   2> 142332 INFO  (zkCallback-228-thread-1-processing-n:127.0.0.1:57692_solr) [n:127.0.0.1:57692_solr    ] o.a.s.c.c.ZkStateReader A cluster state change: [WatchedEvent state:SyncConnected type:NodeDataChanged path:/collections/testcollection/state.json] for collection [testcollection] has occurred - updating... (live nodes size: [2])
   [junit4]   2> 142752 INFO  (qtp861225680-1388) [n:127.0.0.1:57697_solr c:testcollection s:shard1 r:core_node3 x:testcollection_shard1_replica_n1] o.a.s.s.HttpSolrCall [admin] webapp=null path=/admin/cores params={qt=/admin/cores&coreNodeName=core_node3&collection.configName=solrCloudCollectionConfig&newCollection=true&name=testcollection_shard1_replica_n1&action=CREATE&numShards=2&collection=testcollection&shard=shard1&wt=javabin&version=2&replicaType=NRT} status=0 QTime=2374
   [junit4]   2> 142758 INFO  (qtp861225680-1391) [n:127.0.0.1:57697_solr c:testcollection s:shard2 r:core_node7 x:testcollection_shard2_replica_n4] o.a.s.s.HttpSolrCall [admin] webapp=null path=/admin/cores params={qt=/admin/cores&coreNodeName=core_node7&collection.configName=solrCloudCollectionConfig&newCollection=true&name=testcollection_shard2_replica_n4&action=CREATE&numShards=2&collection=testcollection&shard=shard2&wt=javabin&version=2&replicaType=NRT} status=0 QTime=2395
   [junit4]   2> 142763 INFO  (qtp469960182-1395) [n:127.0.0.1:57692_solr    ] o.a.s.h.a.CollectionsHandler Wait for new collection to be active for at most 30 seconds. Check all shard replicas
   [junit4]   2> 142863 INFO  (zkCallback-228-thread-2-processing-n:127.0.0.1:57692_solr) [n:127.0.0.1:57692_solr    ] o.a.s.c.c.ZkStateReader A cluster state change: [WatchedEvent state:SyncConnected type:NodeDataChanged path:/collections/testcollection/state.json] for collection [testcollection] has occurred - updating... (live nodes size: [2])
   [junit4]   2> 142863 INFO  (zkCallback-228-thread-1-processing-n:127.0.0.1:57692_solr) [n:127.0.0.1:57692_solr    ] o.a.s.c.c.ZkStateReader A cluster state change: [WatchedEvent state:SyncConnected type:NodeDataChanged path:/collections/testcollection/state.json] for collection [testcollection] has occurred - updating... (live nodes size: [2])
   [junit4]   2> 142863 INFO  (zkCallback-227-thread-2-processing-n:127.0.0.1:57697_solr) [n:127.0.0.1:57697_solr    ] o.a.s.c.c.ZkStateReader A cluster state change: [WatchedEvent state:SyncConnected type:NodeDataChanged path:/collections/testcollection/state.json] for collection [testcollection] has occurred - updating... (live nodes size: [2])
   [junit4]   2> 142863 INFO  (zkCallback-227-thread-1-processing-n:127.0.0.1:57697_solr) [n:127.0.0.1:57697_solr    ] o.a.s.c.c.ZkStateReader A cluster state change: [WatchedEvent state:SyncConnected type:NodeDataChanged path:/collections/testcollection/state.json] for collection [testcollection] has occurred - updating... (live nodes size: [2])
   [junit4]   2> 142863 INFO  (zkCallback-228-thread-3-processing-n:127.0.0.1:57692_solr) [n:127.0.0.1:57692_solr    ] o.a.s.c.c.ZkStateReader A cluster state change: [WatchedEvent state:SyncConnected type:NodeDataChanged path:/collections/testcollection/state.json] for collection [testcollection] has occurred - updating... (live nodes size: [2])
   [junit4]   2> 143763 INFO  (qtp469960182-1395) [n:127.0.0.1:57692_solr    ] o.a.s.s.HttpSolrCall [admin] webapp=null path=/admin/collections params={replicationFactor=2&collection.configName=solrCloudCollectionConfig&maxShardsPerNode=2&name=testcollection&nrtReplicas=2&action=CREATE&numShards=2&wt=javabin&version=2} status=0 QTime=3743
   [junit4]   2> 143763 INFO  (TEST-TestAuthenticationFramework.testBasics-seed#[E07D851C8C129139]) [    ] o.a.s.c.AbstractDistribZkTestBase Wait for recoveries to finish - collection: testcollection failOnTimeout:true timeout (sec):330
   [junit4]   1> -
   [junit4]   1> replica:core_node3 rstate:active live:true
   [junit4]   1> replica:core_node5 rstate:active live:true
   [junit4]   1> replica:core_node7 rstate:active live:true
   [junit4]   1> replica:core_node8 rstate:active live:true
   [junit4]   1> no one is recoverying
   [junit4]   2> 143764 INFO  (TEST-TestAuthenticationFramework.testBasics-seed#[E07D851C8C129139]) [    ] o.a.s.c.AbstractDistribZkTestBase Recoveries finished - collection: testcollection
   [junit4]   2> 143777 INFO  (qtp469960182-1377) [n:127.0.0.1:57692_solr c:testcollection s:shard2 r:core_node8 x:testcollection_shard2_replica_n6] o.a.s.c.S.Request [testcollection_shard2_replica_n6]  webapp=/solr path=/select params={df=text&distrib=false&_stateVer_=testcollection:6&fl=id&fl=score&shards.purpose=4&start=0&fsv=true&shard.url=http://127.0.0.1:57692/solr/testcollection_shard2_replica_n6/|http://127.0.0.1:57697/solr/testcollection_shard2_replica_n4/&rows=10&version=2&q=*:*&NOW=1503761554803&isShard=true&wt=javabin} hits=0 status=0 QTime=3
   [junit4]   2> 143779 INFO  (qtp469960182-1376) [n:127.0.0.1:57692_solr c:testcollection s:shard1 r:core_node5 x:testcollection_shard1_replica_n2] o.a.s.c.S.Request [testcollection_shard1_replica_n2]  webapp=/solr path=/select params={df=text&distrib=false&_stateVer_=testcollection:6&fl=id&fl=score&shards.purpose=4&start=0&fsv=true&shard.url=http://127.0.0.1:57692/solr/testcollection_shard1_replica_n2/|http://127.0.0.1:57697/solr/testcollection_shard1_replica_n1/&rows=10&version=2&q=*:*&NOW=1503761554803&isShard=true&wt=javabin} hits=0 status=0 QTime=7
   [junit4]   2> 143779 INFO  (qtp469960182-1378) [n:127.0.0.1:57692_solr c:testcollection s:shard2 r:core_node8 x:testcollection_shard2_replica_n6] o.a.s.c.S.Request [testcollection_shard2_replica_n6]  webapp=/solr path=/select params={q=*:*&_stateVer_=testcollection:6&wt=javabin&version=2} hits=0 status=0 QTime=10
   [junit4]   2> 144028 INFO  (qtp861225680-1399) [n:127.0.0.1:57697_solr c:testcollection s:shard1 r:core_node3 x:testcollection_shard1_replica_n1] o.a.s.u.p.LogUpdateProcessorFactory [testcollection_shard1_replica_n1]  webapp=/solr path=/update params={update.distrib=FROMLEADER&distrib.from=http://127.0.0.1:57692/solr/testcollection_shard1_replica_n2/&wt=javabin&version=2}{add=[1 (1576808276105887744)]} 0 3
   [junit4]   2> 144028 INFO  (qtp469960182-1375) [n:127.0.0.1:57692_solr c:testcollection s:shard1 r:core_node5 x:testcollection_shard1_replica_n2] o.a.s.u.p.LogUpdateProcessorFactory [testcollection_shard1_replica_n2]  webapp=/solr path=/update params={_stateVer_=testcollection:6&wt=javabin&version=2}{add=[1 (1576808276105887744)]} 0 247
   [junit4]   2> 144063 INFO  (qtp861225680-1398) [n:127.0.0.1:57697_solr c:testcollection s:shard1 r:core_node3 x:testcollection_shard1_replica_n1] o.a.s.u.DirectUpdateHandler2 start commit{_version_=1576808276399489024,optimize=false,openSearcher=true,waitSearcher=true,expungeDeletes=false,softCommit=false,prepareCommit=false}
   [junit4]   2> 144063 INFO  (qtp861225680-1398) [n:127.0.0.1:57697_solr c:testcollection s:shard1 r:core_node3 x:testcollection_shard1_replica_n1] o.a.s.u.SolrIndexWriter Calling setCommitData with IW:org.apache.solr.update.SolrIndexWriter@6968f8fa commitCommandVersion:1576808276399489024
   [junit4]   2> 144067 INFO  (qtp469960182-1373) [n:127.0.0.1:57692_solr c:testcollection s:shard1 r:core_node5 x:testcollection_shard1_replica_n2] o.a.s.u.DirectUpdateHandler2 start commit{_version_=1576808276403683328,optimize=false,openSearcher=true,waitSearcher=true,expungeDeletes=false,softCommit=false,prepareCommit=false}
   [junit4]   2> 144067 INFO  (qtp469960182-1373) [n:127.0.0.1:57692_solr c:testcollection s:shard1 r:core_node5 x:testcollection_shard1_replica_n2] o.a.s.u.SolrIndexWriter Calling setCommitData with IW:org.apache.solr.update.SolrIndexWriter@14a110b4 commitCommandVersion:1576808276403683328
   [junit4]   2> 144068 INFO  (qtp469960182-1379) [n:127.0.0.1:57692_solr c:testcollection s:shard2 r:core_node8 x:testcollection_shard2_replica_n6] o.a.s.u.DirectUpdateHandler2 start commit{_version_=1576808276404731904,optimize=false,openSearcher=true,waitSearcher=true,expungeDeletes=false,softCommit=false,prepareCommit=false}
   [junit4]   2> 144068 INFO  (qtp469960182-1379) [n:127.0.0.1:57692_solr c:testcollection s:shard2 r:core_node8 x:testcollection_shard2_replica_n6] o.a.s.u.DirectUpdateHandler2 No uncommitted changes. Skipping IW.commit.
   [junit4]   2> 144068 INFO  (qtp469960182-1379) [n:127.0.0.1:57692_solr c:testcollection s:shard2 r:core_node8 x:testcollection_shard2_replica_n6] o.a.s.u.DirectUpdateHandler2 end_commit_flush
   [junit4]   2> 144068 INFO  (qtp861225680-1400) [n:127.0.0.1:57697_solr c:testcollection s:shard2 r:core_node7 x:testcollection_shard2_replica_n4] o.a.s.u.DirectUpdateHandler2 start commit{_version_=1576808276404731904,optimize=false,openSearcher=true,waitSearcher=true,expungeDeletes=false,softCommit=false,prepareCommit=false}
   [junit4]   2> 144068 INFO  (qtp861225680-1400) [n:127.0.0.1:57697_solr c:testcollection s:shard2 r:core_node7 x:testcollection_shard2_replica_n4] o.a.s.u.DirectUpdateHandler2 No uncommitted changes. Skipping IW.commit.
   [junit4]   2> 144072 INFO  (OverseerCollectionConfigSetProcessor-98550516968128518-127.0.0.1:57692_solr-n_0000000000) [n:127.0.0.1:57692_solr    ] o.a.s.c.OverseerTaskQueue Response ZK path: /overseer/collection-queue-work/qnr-0000000000 doesn't exist.  Requestor may have disconnected from ZooKeeper
   [junit4]   2> 144072 INFO  (qtp469960182-1379) [n:127.0.0.1:57692_solr c:testcollection s:shard2 r:core_node8 x:testcollection_shard2_replica_n6] o.a.s.u.p.LogUpdateProcessorFactory [testcollection_shard2_replica_n6]  webapp=/solr path=/update params={update.distrib=FROMLEADER&waitSearcher=true&openSearcher=true&commit=true&softCommit=false&distrib.from=http://127.0.0.1:57692/solr/testcollection_shard1_replica_n2/&commit_end_point=true&wt=javabin&version=2&expungeDeletes=false}{commit=} 0 2
   [junit4]   2> 144074 INFO  (qtp861225680-1400) [n:127.0.0.1:57697_solr c:testcollection s:shard2 r:core_node7 x:testcollection_shard2_replica_n4] o.a.s.u.DirectUpdateHandler2 end_commit_flush
   [junit4]   2> 144074 INFO  (qtp861225680-1400) [n:127.0.0.1:57697_solr c:testcollection s:shard2 r:core_node7 x:testcollection_shard2_replica_n4] o.a.s.u.p.LogUpdateProcessorFactory [testcollection_shard2_replica_n4]  webapp=/solr path=/update params={update.distrib=FROMLEADER&waitSearcher=true&openSearcher=true&commit=true&softCommit=false&distrib.from=http://127.0.0.1:57692/solr/testcollection_shard1_replica_n2/&commit_end_point=true&wt=javabin&version=2&expungeDeletes=false}{commit=} 0 4
   [junit4]   2> 144085 INFO  (qtp861225680-1398) [n:127.0.0.1:57697_solr c:testcollection s:shard1 r:core_node3 x:testcollection_shard1_replica_n1] o.a.s.s.SolrIndexSearcher Opening [Searcher@1975ef0b[testcollection_shard1_replica_n1] main]
   [junit4]   2> 144090 INFO  (qtp469960182-1373) [n:127.0.0.1:57692_solr c:testcollection s:shard1 r:core_node5 x:testcollection_shard1_replica_n2] o.a.s.s.SolrIndexSearcher Opening [Searcher@16616ee7[testcollection_shard1_replica_n2] main]
   [junit4]   2> 144091 INFO  (searcherExecutor-646-thread-1-processing-n:127.0.0.1:57697_solr x:testcollection_shard1_replica_n1 s:shard1 c:testcollection r:core_node3) [n:127.0.0.1:57697_solr c:testcollection s:shard1 r:core_node3 x:testcollection_shard1_replica_n1] o.a.s.c.SolrCore [testcollection_shard1_replica_n1] Registered new searcher Searcher@1975ef0b[testcollection_shard1_replica_n1] main{ExitableDirectoryReader(UninvertingDirectoryReader(Uninverting(_0(7.1.0):C1)))}
   [junit4]   2> 144092 INFO  (qtp861225680-1398) [n:127.0.0.1:57697_solr c:testcollection s:shard1 r:core_node3 x:testcollection_shard1_replica_n1] o.a.s.u.DirectUpdateHandler2 end_commit_flush
   [junit4]   2> 144092 INFO  (qtp861225680-1398) [n:127.0.0.1:57697_solr c:testcollection s:shard1 r:core_node3 x:testcollection_shard1_replica_n1] o.a.s.u.p.LogUpdateProcessorFactory [testcollection_shard1_replica_n1]  webapp=/solr path=/update params={update.distrib=FROMLEADER&waitSearcher=true&openSearcher=true&commit=true&softCommit=false&distrib.from=http://127.0.0.1:57692/solr/testcollection_shard1_replica_n2/&commit_end_point=true&wt=javabin&version=2&expungeDeletes=false}{commit=} 0 28
   [junit4]   2> 144120 INFO  (searcherExecutor-647-thread-1-processing-n:127.0.0.1:57692_solr x:testcollection_shard1_replica_n2 s:shard1 c:testcollection r:core_node5) [n:127.0.0.1:57692_solr c:testcollection s:shard1 r:core_node5 x:testcollection_shard1_replica_n2] o.a.s.c.SolrCore [testcollection_shard1_replica_n2] Registered new searcher Searcher@16616ee7[testcollection_shard1_replica_n2] main{ExitableDirectoryReader(UninvertingDirectoryReader(Uninverting(_0(7.1.0):C1)))}
   [junit4]   2> 144121 INFO  (qtp469960182-1373) [n:127.0.0.1:57692_solr c:testcollection s:shard1 r:core_node5 x:testcollection_shard1_replica_n2] o.a.s.u.DirectUpdateHandler2 end_commit_flush
   [junit4]   2> 144121 INFO  (qtp469960182-1373) [n:127.0.0.1:57692_solr c:testcollection s:shard1 r:core_node5 x:testcollection_shard1_replica_n2] o.a.s.u.p.LogUpdateProcessorFactory [testcollection_shard1_replica_n2]  webapp=/solr path=/update params={update.distrib=FROMLEADER&waitSearcher=true&openSearcher=true&commit=true&softCommit=false&distrib.from=http://127.0.0.1:57692/solr/testcollection_shard1_replica_n2/&commit_end_point=true&wt=javabin&version=2&expungeDeletes=false}{commit=} 0 54
   [junit4]   2> 144164 INFO  (qtp469960182-1397) [n:127.0.0.1:57692_solr c:testcollection s:shard1 r:core_node5 x:testcollection_shard1_replica_n2] o.a.s.u.p.LogUpdateProcessorFactory [testcollection_shard1_replica_n2]  webapp=/solr path=/update params={_stateVer_=testcollection:6&commit=true&wt=javabin&version=2}{commit=} 0 134
   [junit4]   2> 144170 INFO  (qtp469960182-1395) [n:127.0.0.1:57692_solr c:testcollection s:shard2 r:core_node8 x:testcollection_shard2_replica_n6] o.a.s.c.S.Request [testcollection_shard2_replica_n6]  webapp=/solr path=/select params={df=text&distrib=false&_stateVer_=testcollection:6&fl=id&fl=score&shards.purpose=4&start=0&fsv=true&shard.url=http://127.0.0.1:57692/solr/testcollection_shard2_replica_n6/|http://127.0.0.1:57697/solr/testcollection_shard2_replica_n4/&rows=10&version=2&q=*:*&NOW=1503761555201&isShard=true&wt=javabin} hits=0 status=0 QTime=0
   [junit4]   2> 144172 INFO  (qtp469960182-1376) [n:127.0.0.1:57692_solr c:testcollection s:shard1 r:core_node5 x:testcollection_shard1_replica_n2] o.a.s.c.S.Request [testcollection_shard1_replica_n2]  webapp=/solr path=/select params={df=text&distrib=false&_stateVer_=testcollection:6&fl=id&fl=score&shards.purpose=4&start=0&fsv=true&shard.url=http://127.0.0.1:57692/solr/testcollection_shard1_replica_n2/|http://127.0.0.1:57697/solr/testcollection_shard1_replica_n1/&rows=10&version=2&q=*:*&NOW=1503761555201&isShard=true&wt=javabin} hits=1 status=0 QTime=0
   [junit4]   2> 144175 INFO  (qtp469960182-1375) [n:127.0.0.1:57692_solr c:testcollection s:shard1 r:core_node5 x:testcollection_shard1_replica_n2] o.a.s.c.S.Request [testcollection_shard1_replica_n2]  webapp=/solr path=/select params={q=*:*&df=text&distrib=false&_stateVer_=testcollection:6&shards.purpose=64&NOW=1503761555201&ids=1&isShard=true&shard.url=http://127.0.0.1:57692/solr/testcollection_shard1_replica_n2/|http://127.0.0.1:57697/solr/testcollection_shard1_replica_n1/&wt=javabin&version=2} status=0 QTime=0
   [junit4]   2> 144176 INFO  (qtp861225680-1386) [n:127.0.0.1:57697_solr c:testcollection s:shard2 r:core_node7 x:testcollection_shard2_replica_n4] o.a.s.c.S.Request [testcollection_shard2_replica_n4]  webapp=/solr path=/select params={q=*:*&_stateVer_=testcollection:6&wt=javabin&version=2} hits=1 status=0 QTime=10
   [junit4]   2> 144180 INFO  (qtp469960182-1375) [n:127.0.0.1:57692_solr    ] o.a.s.h.a.CollectionsHandler Invoked Collection Action :delete with params name=testcollection&action=DELETE&wt=javabin&version=2 and sendToOCPQueue=true
   [junit4]   2> 144265 INFO  (OverseerThreadFactory-640-thread-2-processing-n:127.0.0.1:57692_solr) [n:127.0.0.1:57692_solr    ] o.a.s.c.OverseerCollectionMessageHandler Executing Collection Cmd : action=UNLOAD&deleteInstanceDir=true&deleteDataDir=true
   [junit4]   2> 144267 INFO  (qtp861225680-1385) [n:127.0.0.1:57697_solr    ] o.a.s.m.SolrMetricManager Closing metric reporters for registry=solr.core.testcollection.shard1.replica_n1, tag=null
   [junit4]   2> 144267 INFO  (qtp861225680-1385) [n:127.0.0.1:57697_solr    ] o.a.s.m.r.SolrJmxReporter Closing reporter [org.apache.solr.metrics.reporters.SolrJmxReporter@73ee4887: rootName = solr_57697, domain = solr.core.testcollection.shard1.replica_n1, service url = null, agent id = null] for registry solr.core.testcollection.shard1.replica_n1 / com.codahale.metrics.MetricRegistry@69f02839
   [junit4]   2> 144278 INFO  (qtp861225680-1385) [n:127.0.0.1:57697_solr    ] o.a.s.c.SolrCore [testcollection_shard1_replica_n1]  CLOSING SolrCore org.apache.solr.core.SolrCore@6d0fdd19
   [junit4]   2> 144278 INFO  (qtp861225680-1385) [n:127.0.0.1:57697_solr    ] o.a.s.m.SolrMetricManager Closing metric reporters for registry=solr.core.testcollection.shard1.replica_n1, tag=1829756185
   [junit4]   2> 144278 INFO  (qtp861225680-1385) [n:127.0.0.1:57697_solr    ] o.a.s.m.SolrMetricManager Closing metric reporters for registry=solr.collection.testcollection.shard1.leader, tag=1829756185
   [junit4]   2> 144284 INFO  (qtp469960182-1379) [n:127.0.0.1:57692_solr    ] o.a.s.m.SolrMetricManager Closing metric reporters for registry=solr.core.testcollection.shard1.replica_n2, tag=null
   [junit4]   2> 144284 INFO  (qtp469960182-1379) [n:127.0.0.1:57692_solr    ] o.a.s.m.r.SolrJmxReporter Closing reporter [org.apache.solr.metrics.reporters.SolrJmxReporter@47117ec5:

[...truncated too long message...]

estination s:shard2 r:core_node4 x:destination_shard2_replica_n2] o.a.s.m.SolrMetricManager Closing metric reporters for registry=solr.collection.destination.shard2.leader, tag=1418501865
   [junit4]   2> 136294 INFO  (coreCloseExecutor-159-thread-3) [n:127.0.0.1:51250_solr c:mainCorpus s:shard2 r:core_node4 x:mainCorpus_shard2_replica_n2] o.a.s.m.SolrMetricManager Closing metric reporters for registry=solr.core.mainCorpus.shard2.replica_n2, tag=2040370447
   [junit4]   2> 136294 INFO  (coreCloseExecutor-159-thread-3) [n:127.0.0.1:51250_solr c:mainCorpus s:shard2 r:core_node4 x:mainCorpus_shard2_replica_n2] o.a.s.m.r.SolrJmxReporter Closing reporter [org.apache.solr.metrics.reporters.SolrJmxReporter@268f541: rootName = solr_51250, domain = solr.core.mainCorpus.shard2.replica_n2, service url = null, agent id = null] for registry solr.core.mainCorpus.shard2.replica_n2 / com.codahale.metrics.MetricRegistry@3b64ed8d
   [junit4]   2> 136300 WARN  (NIOServerCxn.Factory:0.0.0.0/0.0.0.0:0) [    ] o.a.z.s.NIOServerCnxn caught end of stream exception
   [junit4]   2> EndOfStreamException: Unable to read additional data from client sessionid 0x15e1f5d6513004e, likely client has closed socket
   [junit4]   2> 	at org.apache.zookeeper.server.NIOServerCnxn.doIO(NIOServerCnxn.java:239)
   [junit4]   2> 	at org.apache.zookeeper.server.NIOServerCnxnFactory.run(NIOServerCnxnFactory.java:203)
   [junit4]   2> 	at java.lang.Thread.run(Thread.java:748)
   [junit4]   2> 136305 INFO  (coreCloseExecutor-159-thread-3) [n:127.0.0.1:51250_solr c:mainCorpus s:shard2 r:core_node4 x:mainCorpus_shard2_replica_n2] o.a.s.m.SolrMetricManager Closing metric reporters for registry=solr.collection.mainCorpus.shard2.leader, tag=2040370447
   [junit4]   2> 136306 WARN  (zkCallback-21-thread-2-processing-n:127.0.0.1:51252_solr) [n:127.0.0.1:51252_solr    ] o.a.s.c.c.ZkStateReader ZooKeeper watch triggered, but Solr cannot talk to ZK: [KeeperErrorCode = Session expired for /live_nodes]
   [junit4]   2> 136306 INFO  (coreCloseExecutor-159-thread-2) [n:127.0.0.1:51250_solr c:workQueue s:shard1 r:core_node3 x:workQueue_shard1_replica_n1] o.a.s.m.SolrMetricManager Closing metric reporters for registry=solr.core.workQueue.shard1.replica_n1, tag=1155787299
   [junit4]   2> 136306 INFO  (coreCloseExecutor-159-thread-2) [n:127.0.0.1:51250_solr c:workQueue s:shard1 r:core_node3 x:workQueue_shard1_replica_n1] o.a.s.m.r.SolrJmxReporter Closing reporter [org.apache.solr.metrics.reporters.SolrJmxReporter@5736a7cb: rootName = solr_51250, domain = solr.core.workQueue.shard1.replica_n1, service url = null, agent id = null] for registry solr.core.workQueue.shard1.replica_n1 / com.codahale.metrics.MetricRegistry@38f0e9f5
   [junit4]   2> 136307 INFO  (jetty-closer-2-thread-2) [    ] o.e.j.s.h.ContextHandler Stopped o.e.j.s.ServletContextHandler@20ba9708{/solr,null,UNAVAILABLE}
   [junit4]   2> 136309 INFO  (zkCallback-23-thread-2-processing-n:127.0.0.1:51250_solr) [n:127.0.0.1:51250_solr    ] o.a.s.c.c.ZkStateReader Updated live nodes from ZooKeeper... (3) -> (1)
   [junit4]   2> 136310 INFO  (zkCallback-23-thread-1-processing-n:127.0.0.1:51250_solr) [n:127.0.0.1:51250_solr    ] o.a.s.c.OverseerElectionContext I am going to be the leader 127.0.0.1:51250_solr
   [junit4]   2> 136323 INFO  (coreCloseExecutor-159-thread-2) [n:127.0.0.1:51250_solr c:workQueue s:shard1 r:core_node3 x:workQueue_shard1_replica_n1] o.a.s.m.SolrMetricManager Closing metric reporters for registry=solr.collection.workQueue.shard1.leader, tag=1155787299
   [junit4]   2> 136323 INFO  (coreCloseExecutor-159-thread-2) [n:127.0.0.1:51250_solr c:workQueue s:shard1 r:core_node3 x:workQueue_shard1_replica_n1] o.a.s.u.DirectUpdateHandler2 Committing on IndexWriter close.
   [junit4]   2> 136323 INFO  (coreCloseExecutor-159-thread-2) [n:127.0.0.1:51250_solr c:workQueue s:shard1 r:core_node3 x:workQueue_shard1_replica_n1] o.a.s.u.SolrIndexWriter Calling setCommitData with IW:org.apache.solr.update.SolrIndexWriter@32088285 commitCommandVersion:0
   [junit4]   2> 136332 WARN  (NIOServerCxn.Factory:0.0.0.0/0.0.0.0:0) [    ] o.a.z.s.NIOServerCnxn caught end of stream exception
   [junit4]   2> EndOfStreamException: Unable to read additional data from client sessionid 0x15e1f5d6513000b, likely client has closed socket
   [junit4]   2> 	at org.apache.zookeeper.server.NIOServerCnxn.doIO(NIOServerCnxn.java:239)
   [junit4]   2> 	at org.apache.zookeeper.server.NIOServerCnxnFactory.run(NIOServerCnxnFactory.java:203)
   [junit4]   2> 	at java.lang.Thread.run(Thread.java:748)
   [junit4]   2> 137819 WARN  (zkCallback-22-thread-2-processing-n:127.0.0.1:51249_solr) [n:127.0.0.1:51249_solr    ] o.a.s.c.c.ZkStateReader ZooKeeper watch triggered, but Solr cannot talk to ZK: [KeeperErrorCode = Session expired for /live_nodes]
   [junit4]   2> 137819 INFO  (jetty-closer-2-thread-3) [    ] o.e.j.s.h.ContextHandler Stopped o.e.j.s.ServletContextHandler@2160c04a{/solr,null,UNAVAILABLE}
   [junit4]   2> 137833 WARN  (zkCallback-23-thread-1-processing-n:127.0.0.1:51250_solr) [n:127.0.0.1:51250_solr    ] o.a.s.c.c.ZkStateReader ZooKeeper watch triggered, but Solr cannot talk to ZK: [KeeperErrorCode = Session expired for /live_nodes]
   [junit4]   2> 137833 INFO  (jetty-closer-2-thread-1) [    ] o.e.j.s.h.ContextHandler Stopped o.e.j.s.ServletContextHandler@6bfbb50f{/solr,null,UNAVAILABLE}
   [junit4]   2> 137835 ERROR (SUITE-StreamExpressionTest-seed#[B9D166F8FF877AC6]-worker) [    ] o.a.z.s.ZooKeeperServer ZKShutdownHandler is not registered, so ZooKeeper server won't take any action on ERROR or SHUTDOWN server state changes
   [junit4]   2> 137837 INFO  (SUITE-StreamExpressionTest-seed#[B9D166F8FF877AC6]-worker) [    ] o.a.s.c.ZkTestServer connecting to 127.0.0.1:51243 51243
   [junit4]   2> 137840 INFO  (Thread-1) [    ] o.a.s.c.ZkTestServer connecting to 127.0.0.1:51243 51243
   [junit4]   2> 137842 WARN  (Thread-1) [    ] o.a.s.c.ZkTestServer Watch limit violations: 
   [junit4]   2> Maximum concurrent create/delete watches above limit:
   [junit4]   2> 
   [junit4]   2> 	72	/solr/aliases.json
   [junit4]   2> 	72	/solr/clusterprops.json
   [junit4]   2> 	8	/solr/configs/conf
   [junit4]   2> 	4	/solr/security.json
   [junit4]   2> 
   [junit4]   2> Maximum concurrent data watches above limit:
   [junit4]   2> 
   [junit4]   2> 	72	/solr/clusterstate.json
   [junit4]   2> 	22	/solr/collections/destination/state.json
   [junit4]   2> 	22	/solr/collections/destinationCollection/state.json
   [junit4]   2> 	20	/solr/collections/parallelDestinationCollection/state.json
   [junit4]   2> 	20	/solr/collections/workQueue/state.json
   [junit4]   2> 	20	/solr/collections/mainCorpus/state.json
   [junit4]   2> 	18	/solr/collections/parallelDestinationCollection1/state.json
   [junit4]   2> 	12	/solr/collections/collection1_collection/state.json
   [junit4]   2> 
   [junit4]   2> Maximum concurrent children watches above limit:
   [junit4]   2> 
   [junit4]   2> 	72	/solr/live_nodes
   [junit4]   2> 	72	/solr/collections
   [junit4]   2> 
   [junit4]   2> NOTE: leaving temporary files on disk at: C:\Users\jenkins\workspace\Lucene-Solr-7.x-Windows\solr\build\solr-solrj\test\J0\temp\solr.client.solrj.io.stream.StreamExpressionTest_B9D166F8FF877AC6-001
   [junit4]   2> Aug 26, 2017 4:28:25 PM com.carrotsearch.randomizedtesting.ThreadLeakControl checkThreadLeaks
   [junit4]   2> WARNING: Will linger awaiting termination of 2 leaked thread(s).
   [junit4]   2> NOTE: test params are: codec=Asserting(Lucene70): {expr_s=PostingsFormat(name=Memory), join2_s=PostingsFormat(name=LuceneVarGapDocFreqInterval), multiDefault=PostingsFormat(name=LuceneVarGapDocFreqInterval), subject=PostingsFormat(name=LuceneVarGapDocFreqInterval), a1_s=PostingsFormat(name=MockRandom), a2_s=PostingsFormat(name=Memory), test_t=BlockTreeOrds(blocksize=128), level1_s=PostingsFormat(name=Memory), ident_s=PostingsFormat(name=MockRandom), body_t=BlockTreeOrds(blocksize=128), s_multi=PostingsFormat(name=Memory), col_s=PostingsFormat(name=MockRandom), level2_s=PostingsFormat(name=MockRandom), a_ss=PostingsFormat(name=LuceneVarGapDocFreqInterval), a_s=PostingsFormat(name=Memory), a_t=PostingsFormat(name=LuceneVarGapDocFreqInterval), side_s=BlockTreeOrds(blocksize=128), id=BlockTreeOrds(blocksize=128), text=PostingsFormat(name=Memory)}, docValues:{expr_s=DocValuesFormat(name=Lucene70), join2_s=DocValuesFormat(name=Asserting), multiDefault=DocValuesFormat(name=Asserting), price_f=DocValuesFormat(name=Asserting), a1_s=DocValuesFormat(name=Direct), intDefault=DocValuesFormat(name=Direct), a_f=DocValuesFormat(name=Direct), join1_i=DocValuesFormat(name=Lucene70), a2_s=DocValuesFormat(name=Lucene70), a_i=DocValuesFormat(name=Lucene70), join3_i=DocValuesFormat(name=Lucene70), test_i=DocValuesFormat(name=Asserting), field_i=DocValuesFormat(name=Asserting), level1_s=DocValuesFormat(name=Lucene70), s_multi=DocValuesFormat(name=Lucene70), col_s=DocValuesFormat(name=Direct), level2_s=DocValuesFormat(name=Direct), a_ss=DocValuesFormat(name=Asserting), a_s=DocValuesFormat(name=Lucene70), id=DocValuesFormat(name=Lucene70), timestamp=DocValuesFormat(name=Asserting), i_multi=DocValuesFormat(name=Lucene70), b_ls=DocValuesFormat(name=Direct), test_dt=DocValuesFormat(name=Lucene70), ident_s=DocValuesFormat(name=Direct), order_i=DocValuesFormat(name=Asserting), _version_=DocValuesFormat(name=Direct), side_s=DocValuesFormat(name=Lucene70), miles_i=DocValuesFormat(name=Direct)}, maxPointsInLeafNode=1595, maxMBSortInHeap=5.51672760999142, sim=RandomSimilarity(queryNorm=true): {}, locale=en-IN, timezone=America/La_Paz
   [junit4]   2> NOTE: Windows 10 10.0 amd64/Oracle Corporation 1.8.0_144 (64-bit)/cpus=3,threads=1,free=53069800,total=183349248
   [junit4]   2> NOTE: All tests run in this JVM: [StreamExpressionTest]
   [junit4] Completed [38/145 (1!)] on J0 in 148.19s, 95 tests, 1 error, 9 skipped <<< FAILURES!

[...truncated 42879 lines...]

Mime
View raw message