lucene-dev mailing list archives

Site index · List index
Message view « Date » · « Thread »
Top « Date » · « Thread »
From Apache Jenkins Server <jenk...@builds.apache.org>
Subject [JENKINS] Lucene-Solr-Tests-7.0 - Build # 106 - Still Unstable
Date Wed, 09 Aug 2017 16:48:12 GMT
Build: https://builds.apache.org/job/Lucene-Solr-Tests-7.0/106/

4 tests failed.
FAILED:  junit.framework.TestSuite.org.apache.solr.analytics.NoFacetCloudTest

Error Message:
org.apache.http.ParseException: Invalid content type: 

Stack Trace:
org.apache.solr.client.solrj.SolrServerException: org.apache.http.ParseException: Invalid
content type: 
	at __randomizedtesting.SeedInfo.seed([4188D01F7FAE0A7D]:0)
	at org.apache.solr.client.solrj.impl.LBHttpSolrClient.doRequest(LBHttpSolrClient.java:523)
	at org.apache.solr.client.solrj.impl.LBHttpSolrClient.request(LBHttpSolrClient.java:413)
	at org.apache.solr.client.solrj.impl.CloudSolrClient.sendRequest(CloudSolrClient.java:1121)
	at org.apache.solr.client.solrj.impl.CloudSolrClient.requestWithRetryOnStaleState(CloudSolrClient.java:862)
	at org.apache.solr.client.solrj.impl.CloudSolrClient.request(CloudSolrClient.java:793)
	at org.apache.solr.client.solrj.SolrRequest.process(SolrRequest.java:178)
	at org.apache.solr.client.solrj.SolrRequest.process(SolrRequest.java:195)
	at org.apache.solr.analytics.AbstractAnalyticsStatsCloudTest.setupCluster(AbstractAnalyticsStatsCloudTest.java:75)
	at org.apache.solr.analytics.NoFacetCloudTest.populate(NoFacetCloudTest.java:62)
	at sun.reflect.NativeMethodAccessorImpl.invoke0(Native Method)
	at sun.reflect.NativeMethodAccessorImpl.invoke(NativeMethodAccessorImpl.java:62)
	at sun.reflect.DelegatingMethodAccessorImpl.invoke(DelegatingMethodAccessorImpl.java:43)
	at java.lang.reflect.Method.invoke(Method.java:498)
	at com.carrotsearch.randomizedtesting.RandomizedRunner.invoke(RandomizedRunner.java:1713)
	at com.carrotsearch.randomizedtesting.RandomizedRunner$6.evaluate(RandomizedRunner.java:847)
	at com.carrotsearch.randomizedtesting.RandomizedRunner$7.evaluate(RandomizedRunner.java:863)
	at com.carrotsearch.randomizedtesting.rules.StatementAdapter.evaluate(StatementAdapter.java:36)
	at com.carrotsearch.randomizedtesting.rules.SystemPropertiesRestoreRule$1.evaluate(SystemPropertiesRestoreRule.java:57)
	at org.apache.lucene.util.AbstractBeforeAfterRule$1.evaluate(AbstractBeforeAfterRule.java:45)
	at com.carrotsearch.randomizedtesting.rules.StatementAdapter.evaluate(StatementAdapter.java:36)
	at org.apache.lucene.util.TestRuleStoreClassName$1.evaluate(TestRuleStoreClassName.java:41)
	at com.carrotsearch.randomizedtesting.rules.NoShadowingOrOverridesOnMethodsRule$1.evaluate(NoShadowingOrOverridesOnMethodsRule.java:40)
	at com.carrotsearch.randomizedtesting.rules.NoShadowingOrOverridesOnMethodsRule$1.evaluate(NoShadowingOrOverridesOnMethodsRule.java:40)
	at com.carrotsearch.randomizedtesting.rules.StatementAdapter.evaluate(StatementAdapter.java:36)
	at com.carrotsearch.randomizedtesting.rules.StatementAdapter.evaluate(StatementAdapter.java:36)
	at com.carrotsearch.randomizedtesting.rules.StatementAdapter.evaluate(StatementAdapter.java:36)
	at org.apache.lucene.util.TestRuleAssertionsRequired$1.evaluate(TestRuleAssertionsRequired.java:53)
	at org.apache.lucene.util.TestRuleMarkFailure$1.evaluate(TestRuleMarkFailure.java:47)
	at org.apache.lucene.util.TestRuleIgnoreAfterMaxFailures$1.evaluate(TestRuleIgnoreAfterMaxFailures.java:64)
	at org.apache.lucene.util.TestRuleIgnoreTestSuites$1.evaluate(TestRuleIgnoreTestSuites.java:54)
	at com.carrotsearch.randomizedtesting.rules.StatementAdapter.evaluate(StatementAdapter.java:36)
	at com.carrotsearch.randomizedtesting.ThreadLeakControl$StatementRunner.run(ThreadLeakControl.java:368)
	at java.lang.Thread.run(Thread.java:748)
Caused by: org.apache.http.ParseException: Invalid content type: 
	at org.apache.http.entity.ContentType.parse(ContentType.java:273)
	at org.apache.solr.client.solrj.impl.HttpSolrClient.executeMethod(HttpSolrClient.java:575)
	at org.apache.solr.client.solrj.impl.HttpSolrClient.request(HttpSolrClient.java:253)
	at org.apache.solr.client.solrj.impl.HttpSolrClient.request(HttpSolrClient.java:242)
	at org.apache.solr.client.solrj.impl.LBHttpSolrClient.doRequest(LBHttpSolrClient.java:483)
	... 32 more


FAILED:  junit.framework.TestSuite.org.apache.solr.security.hadoop.TestZkAclsWithHadoopAuth

Error Message:
KeeperErrorCode = AuthFailed for /solr

Stack Trace:
org.apache.zookeeper.KeeperException$AuthFailedException: KeeperErrorCode = AuthFailed for
/solr
	at __randomizedtesting.SeedInfo.seed([440A9D9DD209B6A4]:0)
	at org.apache.zookeeper.KeeperException.create(KeeperException.java:123)
	at org.apache.zookeeper.KeeperException.create(KeeperException.java:51)
	at org.apache.zookeeper.ZooKeeper.exists(ZooKeeper.java:1102)
	at org.apache.solr.common.cloud.SolrZkClient$4.execute(SolrZkClient.java:306)
	at org.apache.solr.common.cloud.SolrZkClient$4.execute(SolrZkClient.java:303)
	at org.apache.solr.common.cloud.ZkCmdExecutor.retryOperation(ZkCmdExecutor.java:60)
	at org.apache.solr.common.cloud.SolrZkClient.exists(SolrZkClient.java:303)
	at org.apache.solr.common.cloud.SolrZkClient.makePath(SolrZkClient.java:512)
	at org.apache.solr.common.cloud.SolrZkClient.makePath(SolrZkClient.java:467)
	at org.apache.solr.common.cloud.SolrZkClient.makePath(SolrZkClient.java:454)
	at org.apache.solr.common.cloud.SolrZkClient.makePath(SolrZkClient.java:441)
	at org.apache.solr.cloud.MiniSolrCloudCluster.<init>(MiniSolrCloudCluster.java:233)
	at org.apache.solr.cloud.SolrCloudTestCase$Builder.configure(SolrCloudTestCase.java:190)
	at org.apache.solr.security.hadoop.TestZkAclsWithHadoopAuth.setupClass(TestZkAclsWithHadoopAuth.java:69)
	at sun.reflect.NativeMethodAccessorImpl.invoke0(Native Method)
	at sun.reflect.NativeMethodAccessorImpl.invoke(NativeMethodAccessorImpl.java:62)
	at sun.reflect.DelegatingMethodAccessorImpl.invoke(DelegatingMethodAccessorImpl.java:43)
	at java.lang.reflect.Method.invoke(Method.java:498)
	at com.carrotsearch.randomizedtesting.RandomizedRunner.invoke(RandomizedRunner.java:1713)
	at com.carrotsearch.randomizedtesting.RandomizedRunner$6.evaluate(RandomizedRunner.java:847)
	at com.carrotsearch.randomizedtesting.RandomizedRunner$7.evaluate(RandomizedRunner.java:863)
	at com.carrotsearch.randomizedtesting.rules.StatementAdapter.evaluate(StatementAdapter.java:36)
	at com.carrotsearch.randomizedtesting.rules.SystemPropertiesRestoreRule$1.evaluate(SystemPropertiesRestoreRule.java:57)
	at org.apache.lucene.util.AbstractBeforeAfterRule$1.evaluate(AbstractBeforeAfterRule.java:45)
	at com.carrotsearch.randomizedtesting.rules.StatementAdapter.evaluate(StatementAdapter.java:36)
	at org.apache.lucene.util.TestRuleStoreClassName$1.evaluate(TestRuleStoreClassName.java:41)
	at com.carrotsearch.randomizedtesting.rules.NoShadowingOrOverridesOnMethodsRule$1.evaluate(NoShadowingOrOverridesOnMethodsRule.java:40)
	at com.carrotsearch.randomizedtesting.rules.NoShadowingOrOverridesOnMethodsRule$1.evaluate(NoShadowingOrOverridesOnMethodsRule.java:40)
	at com.carrotsearch.randomizedtesting.rules.StatementAdapter.evaluate(StatementAdapter.java:36)
	at com.carrotsearch.randomizedtesting.rules.StatementAdapter.evaluate(StatementAdapter.java:36)
	at com.carrotsearch.randomizedtesting.rules.StatementAdapter.evaluate(StatementAdapter.java:36)
	at org.apache.lucene.util.TestRuleAssertionsRequired$1.evaluate(TestRuleAssertionsRequired.java:53)
	at org.apache.lucene.util.TestRuleMarkFailure$1.evaluate(TestRuleMarkFailure.java:47)
	at org.apache.lucene.util.TestRuleIgnoreAfterMaxFailures$1.evaluate(TestRuleIgnoreAfterMaxFailures.java:64)
	at org.apache.lucene.util.TestRuleIgnoreTestSuites$1.evaluate(TestRuleIgnoreTestSuites.java:54)
	at com.carrotsearch.randomizedtesting.rules.StatementAdapter.evaluate(StatementAdapter.java:36)
	at com.carrotsearch.randomizedtesting.ThreadLeakControl$StatementRunner.run(ThreadLeakControl.java:368)
	at java.lang.Thread.run(Thread.java:748)


FAILED:  junit.framework.TestSuite.org.apache.solr.security.hadoop.TestZkAclsWithHadoopAuth

Error Message:
5 threads leaked from SUITE scope at org.apache.solr.security.hadoop.TestZkAclsWithHadoopAuth:
    1) Thread[id=7937, name=Thread-1809, state=WAITING, group=TGRP-TestZkAclsWithHadoopAuth]
        at java.lang.Object.wait(Native Method)         at java.lang.Thread.join(Thread.java:1252)
        at java.lang.Thread.join(Thread.java:1326)         at org.apache.zookeeper.server.NIOServerCnxnFactory.join(NIOServerCnxnFactory.java:297)
        at org.apache.solr.cloud.ZkTestServer$ZKServerMain.runFromConfig(ZkTestServer.java:309)
        at org.apache.solr.cloud.ZkTestServer$2.run(ZkTestServer.java:490)    2) Thread[id=7941,
name=ProcessThread(sid:0 cport:44453):, state=WAITING, group=TGRP-TestZkAclsWithHadoopAuth]
        at sun.misc.Unsafe.park(Native Method)         at java.util.concurrent.locks.LockSupport.park(LockSupport.java:175)
        at java.util.concurrent.locks.AbstractQueuedSynchronizer$ConditionObject.await(AbstractQueuedSynchronizer.java:2039)
        at java.util.concurrent.LinkedBlockingQueue.take(LinkedBlockingQueue.java:442)   
     at org.apache.zookeeper.server.PrepRequestProcessor.run(PrepRequestProcessor.java:122)
   3) Thread[id=7939, name=SessionTracker, state=TIMED_WAITING, group=TGRP-TestZkAclsWithHadoopAuth]
        at java.lang.Object.wait(Native Method)         at org.apache.zookeeper.server.SessionTrackerImpl.run(SessionTrackerImpl.java:146)
   4) Thread[id=7938, name=NIOServerCxn.Factory:0.0.0.0/0.0.0.0:0, state=RUNNABLE, group=TGRP-TestZkAclsWithHadoopAuth]
        at sun.nio.ch.EPollArrayWrapper.epollWait(Native Method)         at sun.nio.ch.EPollArrayWrapper.poll(EPollArrayWrapper.java:269)
        at sun.nio.ch.EPollSelectorImpl.doSelect(EPollSelectorImpl.java:93)         at sun.nio.ch.SelectorImpl.lockAndDoSelect(SelectorImpl.java:86)
        at sun.nio.ch.SelectorImpl.select(SelectorImpl.java:97)         at org.apache.zookeeper.server.NIOServerCnxnFactory.run(NIOServerCnxnFactory.java:173)
        at java.lang.Thread.run(Thread.java:748)    5) Thread[id=7943, name=SUITE-TestZkAclsWithHadoopAuth-seed#[440A9D9DD209B6A4]-worker-EventThread,
state=WAITING, group=TGRP-TestZkAclsWithHadoopAuth]         at sun.misc.Unsafe.park(Native
Method)         at java.util.concurrent.locks.LockSupport.park(LockSupport.java:175)     
   at java.util.concurrent.locks.AbstractQueuedSynchronizer$ConditionObject.await(AbstractQueuedSynchronizer.java:2039)
        at java.util.concurrent.LinkedBlockingQueue.take(LinkedBlockingQueue.java:442)   
     at org.apache.zookeeper.ClientCnxn$EventThread.run(ClientCnxn.java:501)

Stack Trace:
com.carrotsearch.randomizedtesting.ThreadLeakError: 5 threads leaked from SUITE scope at org.apache.solr.security.hadoop.TestZkAclsWithHadoopAuth:

   1) Thread[id=7937, name=Thread-1809, state=WAITING, group=TGRP-TestZkAclsWithHadoopAuth]
        at java.lang.Object.wait(Native Method)
        at java.lang.Thread.join(Thread.java:1252)
        at java.lang.Thread.join(Thread.java:1326)
        at org.apache.zookeeper.server.NIOServerCnxnFactory.join(NIOServerCnxnFactory.java:297)
        at org.apache.solr.cloud.ZkTestServer$ZKServerMain.runFromConfig(ZkTestServer.java:309)
        at org.apache.solr.cloud.ZkTestServer$2.run(ZkTestServer.java:490)
   2) Thread[id=7941, name=ProcessThread(sid:0 cport:44453):, state=WAITING, group=TGRP-TestZkAclsWithHadoopAuth]
        at sun.misc.Unsafe.park(Native Method)
        at java.util.concurrent.locks.LockSupport.park(LockSupport.java:175)
        at java.util.concurrent.locks.AbstractQueuedSynchronizer$ConditionObject.await(AbstractQueuedSynchronizer.java:2039)
        at java.util.concurrent.LinkedBlockingQueue.take(LinkedBlockingQueue.java:442)
        at org.apache.zookeeper.server.PrepRequestProcessor.run(PrepRequestProcessor.java:122)
   3) Thread[id=7939, name=SessionTracker, state=TIMED_WAITING, group=TGRP-TestZkAclsWithHadoopAuth]
        at java.lang.Object.wait(Native Method)
        at org.apache.zookeeper.server.SessionTrackerImpl.run(SessionTrackerImpl.java:146)
   4) Thread[id=7938, name=NIOServerCxn.Factory:0.0.0.0/0.0.0.0:0, state=RUNNABLE, group=TGRP-TestZkAclsWithHadoopAuth]
        at sun.nio.ch.EPollArrayWrapper.epollWait(Native Method)
        at sun.nio.ch.EPollArrayWrapper.poll(EPollArrayWrapper.java:269)
        at sun.nio.ch.EPollSelectorImpl.doSelect(EPollSelectorImpl.java:93)
        at sun.nio.ch.SelectorImpl.lockAndDoSelect(SelectorImpl.java:86)
        at sun.nio.ch.SelectorImpl.select(SelectorImpl.java:97)
        at org.apache.zookeeper.server.NIOServerCnxnFactory.run(NIOServerCnxnFactory.java:173)
        at java.lang.Thread.run(Thread.java:748)
   5) Thread[id=7943, name=SUITE-TestZkAclsWithHadoopAuth-seed#[440A9D9DD209B6A4]-worker-EventThread,
state=WAITING, group=TGRP-TestZkAclsWithHadoopAuth]
        at sun.misc.Unsafe.park(Native Method)
        at java.util.concurrent.locks.LockSupport.park(LockSupport.java:175)
        at java.util.concurrent.locks.AbstractQueuedSynchronizer$ConditionObject.await(AbstractQueuedSynchronizer.java:2039)
        at java.util.concurrent.LinkedBlockingQueue.take(LinkedBlockingQueue.java:442)
        at org.apache.zookeeper.ClientCnxn$EventThread.run(ClientCnxn.java:501)
	at __randomizedtesting.SeedInfo.seed([440A9D9DD209B6A4]:0)


FAILED:  junit.framework.TestSuite.org.apache.solr.security.hadoop.TestZkAclsWithHadoopAuth

Error Message:
There are still zombie threads that couldn't be terminated:    1) Thread[id=7938, name=NIOServerCxn.Factory:0.0.0.0/0.0.0.0:0,
state=RUNNABLE, group=TGRP-TestZkAclsWithHadoopAuth]         at sun.nio.ch.EPollArrayWrapper.epollWait(Native
Method)         at sun.nio.ch.EPollArrayWrapper.poll(EPollArrayWrapper.java:269)         at
sun.nio.ch.EPollSelectorImpl.doSelect(EPollSelectorImpl.java:93)         at sun.nio.ch.SelectorImpl.lockAndDoSelect(SelectorImpl.java:86)
        at sun.nio.ch.SelectorImpl.select(SelectorImpl.java:97)         at org.apache.zookeeper.server.NIOServerCnxnFactory.run(NIOServerCnxnFactory.java:173)
        at java.lang.Thread.run(Thread.java:748)

Stack Trace:
com.carrotsearch.randomizedtesting.ThreadLeakError: There are still zombie threads that couldn't
be terminated:
   1) Thread[id=7938, name=NIOServerCxn.Factory:0.0.0.0/0.0.0.0:0, state=RUNNABLE, group=TGRP-TestZkAclsWithHadoopAuth]
        at sun.nio.ch.EPollArrayWrapper.epollWait(Native Method)
        at sun.nio.ch.EPollArrayWrapper.poll(EPollArrayWrapper.java:269)
        at sun.nio.ch.EPollSelectorImpl.doSelect(EPollSelectorImpl.java:93)
        at sun.nio.ch.SelectorImpl.lockAndDoSelect(SelectorImpl.java:86)
        at sun.nio.ch.SelectorImpl.select(SelectorImpl.java:97)
        at org.apache.zookeeper.server.NIOServerCnxnFactory.run(NIOServerCnxnFactory.java:173)
        at java.lang.Thread.run(Thread.java:748)
	at __randomizedtesting.SeedInfo.seed([440A9D9DD209B6A4]:0)




Build Log:
[...truncated 11539 lines...]
   [junit4] Suite: org.apache.solr.security.hadoop.TestZkAclsWithHadoopAuth
   [junit4]   2> Creating dataDir: /x1/jenkins/jenkins-slave/workspace/Lucene-Solr-Tests-7.0/solr/build/solr-core/test/J1/temp/solr.security.hadoop.TestZkAclsWithHadoopAuth_440A9D9DD209B6A4-001/init-core-data-001
   [junit4]   2> 911114 WARN  (SUITE-TestZkAclsWithHadoopAuth-seed#[440A9D9DD209B6A4]-worker)
[    ] o.a.s.SolrTestCaseJ4 startTrackingSearchers: numOpens=2 numCloses=2
   [junit4]   2> 911114 INFO  (SUITE-TestZkAclsWithHadoopAuth-seed#[440A9D9DD209B6A4]-worker)
[    ] o.a.s.SolrTestCaseJ4 Using PointFields (NUMERIC_POINTS_SYSPROP=true) w/NUMERIC_DOCVALUES_SYSPROP=true
   [junit4]   2> 911116 INFO  (SUITE-TestZkAclsWithHadoopAuth-seed#[440A9D9DD209B6A4]-worker)
[    ] o.a.s.SolrTestCaseJ4 Randomized ssl (true) and clientAuth (true) via: @org.apache.solr.util.RandomizeSSL(reason=,
ssl=NaN, value=NaN, clientAuth=NaN)
   [junit4]   2> 911126 INFO  (SUITE-TestZkAclsWithHadoopAuth-seed#[440A9D9DD209B6A4]-worker)
[    ] o.a.s.c.MiniSolrCloudCluster Starting cluster of 1 servers in /x1/jenkins/jenkins-slave/workspace/Lucene-Solr-Tests-7.0/solr/build/solr-core/test/J1/temp/solr.security.hadoop.TestZkAclsWithHadoopAuth_440A9D9DD209B6A4-001/tempDir-001
   [junit4]   2> 911126 INFO  (SUITE-TestZkAclsWithHadoopAuth-seed#[440A9D9DD209B6A4]-worker)
[    ] o.a.s.c.ZkTestServer STARTING ZK TEST SERVER
   [junit4]   2> 911127 INFO  (Thread-1809) [    ] o.a.s.c.ZkTestServer client port:0.0.0.0/0.0.0.0:0
   [junit4]   2> 911127 INFO  (Thread-1809) [    ] o.a.s.c.ZkTestServer Starting server
   [junit4]   2> 911129 ERROR (Thread-1809) [    ] o.a.z.s.ZooKeeperServer ZKShutdownHandler
is not registered, so ZooKeeper server won't take any action on ERROR or SHUTDOWN server state
changes
   [junit4]   2> 911227 INFO  (SUITE-TestZkAclsWithHadoopAuth-seed#[440A9D9DD209B6A4]-worker)
[    ] o.a.s.c.ZkTestServer start zk server on port:44453
   [junit4]   2> 911227 INFO  (SUITE-TestZkAclsWithHadoopAuth-seed#[440A9D9DD209B6A4]-worker)
[    ] o.a.s.c.c.SolrZkClient Using ZkCredentialsProvider: org.apache.solr.security.hadoop.TestZkAclsWithHadoopAuth$DummyZkCredentialsProvider
   [junit4]   2> 911237 INFO  (SUITE-TestZkAclsWithHadoopAuth-seed#[440A9D9DD209B6A4]-worker)
[    ] o.a.s.c.c.SolrZkClient Using ZkACLProvider: org.apache.solr.security.hadoop.TestZkAclsWithHadoopAuth$DummyZkAclProvider
   [junit4]   2> 911237 WARN  (NIOServerCxn.Factory:0.0.0.0/0.0.0.0:0) [    ] o.a.z.s.ZooKeeperServer
No authentication provider for scheme: dummyauth has sasl ip digest 
   [junit4]   2> 911238 WARN  (zkCallback-1360-thread-1) [    ] o.a.s.c.c.ConnectionManager
Watcher org.apache.solr.common.cloud.ConnectionManager@26cd340e name: ZooKeeperConnection
Watcher:127.0.0.1:44453 got event WatchedEvent state:AuthFailed type:None path:null path:
null type: None
   [junit4]   2> 911238 WARN  (zkCallback-1360-thread-1) [    ] o.a.s.c.c.ConnectionManager
zkClient received AuthFailed
   [junit4]   2> 911339 INFO  (SUITE-TestZkAclsWithHadoopAuth-seed#[440A9D9DD209B6A4]-worker)
[    ] o.a.s.SolrTestCaseJ4 ------------------------------------------------------- Done waiting
for tracked resources to be released
   [junit4]   2> Aug 09, 2017 4:10:12 PM com.carrotsearch.randomizedtesting.ThreadLeakControl
checkThreadLeaks
   [junit4]   2> WARNING: Will linger awaiting termination of 5 leaked thread(s).
   [junit4]   2> Aug 09, 2017 4:10:32 PM com.carrotsearch.randomizedtesting.ThreadLeakControl
checkThreadLeaks
   [junit4]   2> SEVERE: 5 threads leaked from SUITE scope at org.apache.solr.security.hadoop.TestZkAclsWithHadoopAuth:

   [junit4]   2>    1) Thread[id=7937, name=Thread-1809, state=WAITING, group=TGRP-TestZkAclsWithHadoopAuth]
   [junit4]   2>         at java.lang.Object.wait(Native Method)
   [junit4]   2>         at java.lang.Thread.join(Thread.java:1252)
   [junit4]   2>         at java.lang.Thread.join(Thread.java:1326)
   [junit4]   2>         at org.apache.zookeeper.server.NIOServerCnxnFactory.join(NIOServerCnxnFactory.java:297)
   [junit4]   2>         at org.apache.solr.cloud.ZkTestServer$ZKServerMain.runFromConfig(ZkTestServer.java:309)
   [junit4]   2>         at org.apache.solr.cloud.ZkTestServer$2.run(ZkTestServer.java:490)
   [junit4]   2>    2) Thread[id=7941, name=ProcessThread(sid:0 cport:44453):, state=WAITING,
group=TGRP-TestZkAclsWithHadoopAuth]
   [junit4]   2>         at sun.misc.Unsafe.park(Native Method)
   [junit4]   2>         at java.util.concurrent.locks.LockSupport.park(LockSupport.java:175)
   [junit4]   2>         at java.util.concurrent.locks.AbstractQueuedSynchronizer$ConditionObject.await(AbstractQueuedSynchronizer.java:2039)
   [junit4]   2>         at java.util.concurrent.LinkedBlockingQueue.take(LinkedBlockingQueue.java:442)
   [junit4]   2>         at org.apache.zookeeper.server.PrepRequestProcessor.run(PrepRequestProcessor.java:122)
   [junit4]   2>    3) Thread[id=7939, name=SessionTracker, state=TIMED_WAITING, group=TGRP-TestZkAclsWithHadoopAuth]
   [junit4]   2>         at java.lang.Object.wait(Native Method)
   [junit4]   2>         at org.apache.zookeeper.server.SessionTrackerImpl.run(SessionTrackerImpl.java:146)
   [junit4]   2>    4) Thread[id=7938, name=NIOServerCxn.Factory:0.0.0.0/0.0.0.0:0, state=RUNNABLE,
group=TGRP-TestZkAclsWithHadoopAuth]
   [junit4]   2>         at sun.nio.ch.EPollArrayWrapper.epollWait(Native Method)
   [junit4]   2>         at sun.nio.ch.EPollArrayWrapper.poll(EPollArrayWrapper.java:269)
   [junit4]   2>         at sun.nio.ch.EPollSelectorImpl.doSelect(EPollSelectorImpl.java:93)
   [junit4]   2>         at sun.nio.ch.SelectorImpl.lockAndDoSelect(SelectorImpl.java:86)
   [junit4]   2>         at sun.nio.ch.SelectorImpl.select(SelectorImpl.java:97)
   [junit4]   2>         at org.apache.zookeeper.server.NIOServerCnxnFactory.run(NIOServerCnxnFactory.java:173)
   [junit4]   2>         at java.lang.Thread.run(Thread.java:748)
   [junit4]   2>    5) Thread[id=7943, name=SUITE-TestZkAclsWithHadoopAuth-seed#[440A9D9DD209B6A4]-worker-EventThread,
state=WAITING, group=TGRP-TestZkAclsWithHadoopAuth]
   [junit4]   2>         at sun.misc.Unsafe.park(Native Method)
   [junit4]   2>         at java.util.concurrent.locks.LockSupport.park(LockSupport.java:175)
   [junit4]   2>         at java.util.concurrent.locks.AbstractQueuedSynchronizer$ConditionObject.await(AbstractQueuedSynchronizer.java:2039)
   [junit4]   2>         at java.util.concurrent.LinkedBlockingQueue.take(LinkedBlockingQueue.java:442)
   [junit4]   2>         at org.apache.zookeeper.ClientCnxn$EventThread.run(ClientCnxn.java:501)
   [junit4]   2> Aug 09, 2017 4:10:32 PM com.carrotsearch.randomizedtesting.ThreadLeakControl
tryToInterruptAll
   [junit4]   2> INFO: Starting to interrupt leaked threads:
   [junit4]   2>    1) Thread[id=7937, name=Thread-1809, state=WAITING, group=TGRP-TestZkAclsWithHadoopAuth]
   [junit4]   2>    2) Thread[id=7941, name=ProcessThread(sid:0 cport:44453):, state=WAITING,
group=TGRP-TestZkAclsWithHadoopAuth]
   [junit4]   2>    3) Thread[id=7939, name=SessionTracker, state=TIMED_WAITING, group=TGRP-TestZkAclsWithHadoopAuth]
   [junit4]   2>    4) Thread[id=7938, name=NIOServerCxn.Factory:0.0.0.0/0.0.0.0:0, state=RUNNABLE,
group=TGRP-TestZkAclsWithHadoopAuth]
   [junit4]   2>    5) Thread[id=7943, name=SUITE-TestZkAclsWithHadoopAuth-seed#[440A9D9DD209B6A4]-worker-EventThread,
state=WAITING, group=TGRP-TestZkAclsWithHadoopAuth]
   [junit4]   2> 931520 WARN  (Thread-1809) [    ] o.a.s.c.ZkTestServer Server interrupted
   [junit4]   2> java.lang.InterruptedException
   [junit4]   2> 	at java.lang.Object.wait(Native Method)
   [junit4]   2> 	at java.lang.Thread.join(Thread.java:1252)
   [junit4]   2> 	at java.lang.Thread.join(Thread.java:1326)
   [junit4]   2> 	at org.apache.zookeeper.server.NIOServerCnxnFactory.join(NIOServerCnxnFactory.java:297)
   [junit4]   2> 	at org.apache.solr.cloud.ZkTestServer$ZKServerMain.runFromConfig(ZkTestServer.java:309)
   [junit4]   2> 	at org.apache.solr.cloud.ZkTestServer$2.run(ZkTestServer.java:490)
   [junit4]   2> 931521 ERROR (ProcessThread(sid:0 cport:44453):) [    ] o.a.z.s.ZooKeeperCriticalThread
Severe unrecoverable error, from thread : ProcessThread(sid:0 cport:44453):
   [junit4]   2> java.lang.InterruptedException
   [junit4]   2> 	at java.util.concurrent.locks.AbstractQueuedSynchronizer$ConditionObject.reportInterruptAfterWait(AbstractQueuedSynchronizer.java:2014)
   [junit4]   2> 	at java.util.concurrent.locks.AbstractQueuedSynchronizer$ConditionObject.await(AbstractQueuedSynchronizer.java:2048)
   [junit4]   2> 	at java.util.concurrent.LinkedBlockingQueue.take(LinkedBlockingQueue.java:442)
   [junit4]   2> 	at org.apache.zookeeper.server.PrepRequestProcessor.run(PrepRequestProcessor.java:122)
   [junit4]   2> 931524 ERROR (SessionTracker) [    ] o.a.z.s.ZooKeeperCriticalThread Severe
unrecoverable error, from thread : SessionTracker
   [junit4]   2> java.lang.InterruptedException
   [junit4]   2> 	at java.lang.Object.wait(Native Method)
   [junit4]   2> 	at org.apache.zookeeper.server.SessionTrackerImpl.run(SessionTrackerImpl.java:146)
   [junit4]   2> 931524 ERROR (SessionTracker) [    ] o.a.z.s.ZooKeeperServer ZKShutdownHandler
is not registered, so ZooKeeper server won't take any action on ERROR or SHUTDOWN server state
changes
   [junit4]   2> 931525 ERROR (ProcessThread(sid:0 cport:44453):) [    ] o.a.z.s.ZooKeeperServer
ZKShutdownHandler is not registered, so ZooKeeper server won't take any action on ERROR or
SHUTDOWN server state changes
   [junit4]   2> 931536 ERROR (SUITE-TestZkAclsWithHadoopAuth-seed#[440A9D9DD209B6A4]-worker-EventThread)
[    ] o.a.z.ClientCnxn Event thread exiting due to interruption
   [junit4]   2> java.lang.InterruptedException
   [junit4]   2> 	at java.util.concurrent.locks.AbstractQueuedSynchronizer$ConditionObject.reportInterruptAfterWait(AbstractQueuedSynchronizer.java:2014)
   [junit4]   2> 	at java.util.concurrent.locks.AbstractQueuedSynchronizer$ConditionObject.await(AbstractQueuedSynchronizer.java:2048)
   [junit4]   2> 	at java.util.concurrent.LinkedBlockingQueue.take(LinkedBlockingQueue.java:442)
   [junit4]   2> 	at org.apache.zookeeper.ClientCnxn$EventThread.run(ClientCnxn.java:501)
   [junit4]   2> Aug 09, 2017 4:10:35 PM com.carrotsearch.randomizedtesting.ThreadLeakControl
tryToInterruptAll
   [junit4]   2> SEVERE: There are still zombie threads that couldn't be terminated:
   [junit4]   2>    1) Thread[id=7938, name=NIOServerCxn.Factory:0.0.0.0/0.0.0.0:0, state=RUNNABLE,
group=TGRP-TestZkAclsWithHadoopAuth]
   [junit4]   2>         at sun.nio.ch.EPollArrayWrapper.epollWait(Native Method)
   [junit4]   2>         at sun.nio.ch.EPollArrayWrapper.poll(EPollArrayWrapper.java:269)
   [junit4]   2>         at sun.nio.ch.EPollSelectorImpl.doSelect(EPollSelectorImpl.java:93)
   [junit4]   2>         at sun.nio.ch.SelectorImpl.lockAndDoSelect(SelectorImpl.java:86)
   [junit4]   2>         at sun.nio.ch.SelectorImpl.select(SelectorImpl.java:97)
   [junit4]   2>         at org.apache.zookeeper.server.NIOServerCnxnFactory.run(NIOServerCnxnFactory.java:173)
   [junit4]   2>         at java.lang.Thread.run(Thread.java:748)
   [junit4]   2> NOTE: test params are: codec=Asserting(Lucene70): {}, docValues:{}, maxPointsInLeafNode=1932,
maxMBSortInHeap=7.318065296618733, sim=RandomSimilarity(queryNorm=true): {}, locale=fi-FI,
timezone=Europe/Podgorica
   [junit4]   2> NOTE: Linux 3.13.0-88-generic amd64/Oracle Corporation 1.8.0_144 (64-bit)/cpus=4,threads=3,free=135968560,total=526385152
   [junit4]   2> NOTE: All tests run in this JVM: [CacheHeaderTest, TestMiniSolrCloudClusterSSL,
TestShardHandlerFactory, TestLRUCache, TestUseDocValuesAsStored, TestStressVersions, SliceStateTest,
HdfsThreadLeakTest, TestSubQueryTransformerDistrib, AutoScalingHandlerTest, TestRestManager,
TestJsonFacets, TestOverriddenPrefixQueryForCustomFieldType, ZkSolrClientTest, AsyncCallRequestStatusResponseTest,
TestSearchPerf, TemplateUpdateProcessorTest, ZkStateReaderTest, RequestLoggingTest, TestBulkSchemaConcurrent,
TestCustomDocTransformer, CollectionReloadTest, TestAtomicUpdateErrorCases, TestRequestForwarding,
ChangedSchemaMergeTest, RestartWhileUpdatingTest, QueryParsingTest, DeleteStatusTest, AnalysisErrorHandlingTest,
ConjunctionSolrSpellCheckerTest, IndexSchemaRuntimeFieldTest, HLLUtilTest, TestSQLHandlerNonCloud,
DistribJoinFromCollectionTest, DistributedIntervalFacetingTest, TestStressCloudBlindAtomicUpdates,
TestIntervalFaceting, StatelessScriptUpdateProcessorFactoryTest, ConvertedLegacyTest, TestManagedSchema,
JavabinLoaderTest, DOMUtilTest, BadComponentTest, TestStressRecovery, TestCoreContainer, LukeRequestHandlerTest,
TestNumericRangeQuery32, TestPostingsSolrHighlighter, DistributedFacetExistsSmallTest, SharedFSAutoReplicaFailoverUtilsTest,
OpenCloseCoreStressTest, TestSystemIdResolver, SampleTest, CoreAdminHandlerTest, AnalyticsQueryTest,
TestHashPartitioner, TestDefaultStatsCache, TestBM25SimilarityFactory, OverseerTaskQueueTest,
ChaosMonkeySafeLeaderTest, UpdateRequestProcessorFactoryTest, DistributedQueryComponentCustomSortTest,
TestSolr4Spatial2, DisMaxRequestHandlerTest, TestRawResponseWriter, TestMissingGroups, CustomCollectionTest,
TestComplexPhraseQParserPlugin, TestApiFramework, NoCacheHeaderTest, SolrMetricsIntegrationTest,
TestCharFilters, TestDistributedGrouping, TestInitParams, TestInPlaceUpdatesStandalone, TestNonDefinedSimilarityFactory,
MergeStrategyTest, TestDelegationWithHadoopAuth, LeaderElectionContextKeyTest, ClassificationUpdateProcessorFactoryTest,
TestCloudSchemaless, SystemInfoHandlerTest, CloneFieldUpdateProcessorFactoryTest, TestDeleteCollectionOnDownNodes,
TestExceedMaxTermLength, SolrJmxReporterTest, TestSolrJ, CollectionsAPIDistributedZkTest,
TestTestInjection, AlternateDirectoryTest, TestCloudDeleteByQuery, TestQueryWrapperFilter,
InfoHandlerTest, TestLockTree, ZkCLITest, SolrShardReporterTest, RemoteQueryErrorTest, SecurityConfHandlerTest,
TestLegacyNumericUtils, TestElisionMultitermQuery, TestZkAclsWithHadoopAuth]
   [junit4]   2> NOTE: reproduce with: ant test  -Dtestcase=TestZkAclsWithHadoopAuth -Dtests.seed=440A9D9DD209B6A4
-Dtests.multiplier=2 -Dtests.slow=true -Dtests.locale=fi-FI -Dtests.timezone=Europe/Podgorica
-Dtests.asserts=true -Dtests.file.encoding=ISO-8859-1
   [junit4] ERROR   0.00s J1 | TestZkAclsWithHadoopAuth (suite) <<<
   [junit4]    > Throwable #1: org.apache.zookeeper.KeeperException$AuthFailedException:
KeeperErrorCode = AuthFailed for /solr
   [junit4]    > 	at __randomizedtesting.SeedInfo.seed([440A9D9DD209B6A4]:0)
   [junit4]    > 	at org.apache.zookeeper.KeeperException.create(KeeperException.java:123)
   [junit4]    > 	at org.apache.zookeeper.KeeperException.create(KeeperException.java:51)
   [junit4]    > 	at org.apache.zookeeper.ZooKeeper.exists(ZooKeeper.java:1102)
   [junit4]    > 	at org.apache.solr.common.cloud.SolrZkClient$4.execute(SolrZkClient.java:306)
   [junit4]    > 	at org.apache.solr.common.cloud.SolrZkClient$4.execute(SolrZkClient.java:303)
   [junit4]    > 	at org.apache.solr.common.cloud.ZkCmdExecutor.retryOperation(ZkCmdExecutor.java:60)
   [junit4]    > 	at org.apache.solr.common.cloud.SolrZkClient.exists(SolrZkClient.java:303)
   [junit4]    > 	at org.apache.solr.common.cloud.SolrZkClient.makePath(SolrZkClient.java:512)
   [junit4]    > 	at org.apache.solr.common.cloud.SolrZkClient.makePath(SolrZkClient.java:467)
   [junit4]    > 	at org.apache.solr.common.cloud.SolrZkClient.makePath(SolrZkClient.java:454)
   [junit4]    > 	at org.apache.solr.common.cloud.SolrZkClient.makePath(SolrZkClient.java:441)
   [junit4]    > 	at org.apache.solr.cloud.MiniSolrCloudCluster.<init>(MiniSolrCloudCluster.java:233)
   [junit4]    > 	at org.apache.solr.cloud.SolrCloudTestCase$Builder.configure(SolrCloudTestCase.java:190)
   [junit4]    > 	at org.apache.solr.security.hadoop.TestZkAclsWithHadoopAuth.setupClass(TestZkAclsWithHadoopAuth.java:69)
   [junit4]    > 	at java.lang.Thread.run(Thread.java:748)Throwable #2: com.carrotsearch.randomizedtesting.ThreadLeakError:
5 threads leaked from SUITE scope at org.apache.solr.security.hadoop.TestZkAclsWithHadoopAuth:

   [junit4]    >    1) Thread[id=7937, name=Thread-1809, state=WAITING, group=TGRP-TestZkAclsWithHadoopAuth]
   [junit4]    >         at java.lang.Object.wait(Native Method)
   [junit4]    >         at java.lang.Thread.join(Thread.java:1252)
   [junit4]    >         at java.lang.Thread.join(Thread.java:1326)
   [junit4]    >         at org.apache.zookeeper.server.NIOServerCnxnFactory.join(NIOServerCnxnFactory.java:297)
   [junit4]    >         at org.apache.solr.cloud.ZkTestServer$ZKServerMain.runFromConfig(ZkTestServer.java:309)
   [junit4]    >         at org.apache.solr.cloud.ZkTestServer$2.run(ZkTestServer.java:490)
   [junit4]    >    2) Thread[id=7941, name=ProcessThread(sid:0 cport:44453):, state=WAITING,
group=TGRP-TestZkAclsWithHadoopAuth]
   [junit4]    >         at sun.misc.Unsafe.park(Native Method)
   [junit4]    >         at java.util.concurrent.locks.LockSupport.park(LockSupport.java:175)
   [junit4]    >         at java.util.concurrent.locks.AbstractQueuedSynchronizer$ConditionObject.await(AbstractQueuedSynchronizer.java:2039)
   [junit4]    >         at java.util.concurrent.LinkedBlockingQueue.take(LinkedBlockingQueue.java:442)
   [junit4]    >         at org.apache.zookeeper.server.PrepRequestProcessor.run(PrepRequestProcessor.java:122)
   [junit4]    >    3) Thread[id=7939, name=SessionTracker, state=TIMED_WAITING, group=TGRP-TestZkAclsWithHadoopAuth]
   [junit4]    >         at java.lang.Object.wait(Native Method)
   [junit4]    >         at org.apache.zookeeper.server.SessionTrackerImpl.run(SessionTrackerImpl.java:146)
   [junit4]    >    4) Thread[id=7938, name=NIOServerCxn.Factory:0.0.0.0/0.0.0.0:0, state=RUNNABLE,
group=TGRP-TestZkAclsWithHadoopAuth]
   [junit4]    >         at sun.nio.ch.EPollArrayWrapper.epollWait(Native Method)
   [junit4]    >         at sun.nio.ch.EPollArrayWrapper.poll(EPollArrayWrapper.java:269)
   [junit4]    >         at sun.nio.ch.EPollSelectorImpl.doSelect(EPollSelectorImpl.java:93)
   [junit4]    >         at sun.nio.ch.SelectorImpl.lockAndDoSelect(SelectorImpl.java:86)
   [junit4]    >         at sun.nio.ch.SelectorImpl.select(SelectorImpl.java:97)
   [junit4]    >         at org.apache.zookeeper.server.NIOServerCnxnFactory.run(NIOServerCnxnFactory.java:173)
   [junit4]    >         at java.lang.Thread.run(Thread.java:748)
   [junit4]    >    5) Thread[id=7943, name=SUITE-TestZkAclsWithHadoopAuth-seed#[440A9D9DD209B6A4]-worker-EventThread,
state=WAITING, group=TGRP-TestZkAclsWithHadoopAuth]
   [junit4]    >         at sun.misc.Unsafe.park(Native Method)
   [junit4]    >         at java.util.concurrent.locks.LockSupport.park(LockSupport.java:175)
   [junit4]    >         at java.util.concurrent.locks.AbstractQueuedSynchronizer$ConditionObject.await(AbstractQueuedSynchronizer.java:2039)
   [junit4]    >         at java.util.concurrent.LinkedBlockingQueue.take(LinkedBlockingQueue.java:442)
   [junit4]    >         at org.apache.zookeeper.ClientCnxn$EventThread.run(ClientCnxn.java:501)
   [junit4]    > 	at __randomizedtesting.SeedInfo.seed([440A9D9DD209B6A4]:0)Throwable #3:
com.carrotsearch.randomizedtesting.ThreadLeakError: There are still zombie threads that couldn't
be terminated:
   [junit4]    >    1) Thread[id=7938, name=NIOServerCxn.Factory:0.0.0.0/0.0.0.0:0, state=RUNNABLE,
group=TGRP-TestZkAclsWithHadoopAuth]
   [junit4]    >         at sun.nio.ch.EPollArrayWrapper.epollWait(Native Method)
   [junit4]    >         at sun.nio.ch.EPollArrayWrapper.poll(EPollArrayWrapper.java:269)
   [junit4]    >         at sun.nio.ch.EPollSelectorImpl.doSelect(EPollSelectorImpl.java:93)
   [junit4]    >         at sun.nio.ch.SelectorImpl.lockAndDoSelect(SelectorImpl.java:86)
   [junit4]    >         at sun.nio.ch.SelectorImpl.select(SelectorImpl.java:97)
   [junit4]    >         at org.apache.zookeeper.server.NIOServerCnxnFactory.run(NIOServerCnxnFactory.java:173)
   [junit4]    >         at java.lang.Thread.run(Thread.java:748)
   [junit4]    > 	at __randomizedtesting.SeedInfo.seed([440A9D9DD209B6A4]:0)
   [junit4] Completed [233/728 (1!)] on J1 in 23.45s, 0 tests, 3 errors <<< FAILURES!

[...truncated 4230 lines...]
   [junit4] Suite: org.apache.solr.analytics.NoFacetCloudTest
   [junit4]   2> Creating dataDir: /x1/jenkins/jenkins-slave/workspace/Lucene-Solr-Tests-7.0/solr/build/contrib/solr-analytics/test/J2/temp/solr.analytics.NoFacetCloudTest_4188D01F7FAE0A7D-001/init-core-data-001
   [junit4]   2> Aug 09, 2017 4:33:56 PM com.carrotsearch.randomizedtesting.ThreadLeakControl
checkThreadLeaks
   [junit4]   2> WARNING: Will linger awaiting termination of 1 leaked thread(s).
   [junit4]   2> NOTE: test params are: codec=Lucene70, sim=RandomSimilarity(queryNorm=false):
{}, locale=ar-EG, timezone=Pacific/Apia
   [junit4]   2> NOTE: Linux 3.13.0-88-generic amd64/Oracle Corporation 1.8.0_144 (64-bit)/cpus=4,threads=1,free=227445520,total=294125568
   [junit4]   2> NOTE: All tests run in this JVM: [FieldFacetExtrasTest, FunctionTest,
FacetSortingTest, NoFacetCloudTest]
   [junit4]   2> NOTE: reproduce with: ant test  -Dtestcase=NoFacetCloudTest -Dtests.seed=4188D01F7FAE0A7D
-Dtests.multiplier=2 -Dtests.slow=true -Dtests.locale=ar-EG -Dtests.timezone=Pacific/Apia
-Dtests.asserts=true -Dtests.file.encoding=US-ASCII
   [junit4] ERROR   0.00s J2 | NoFacetCloudTest (suite) <<<
   [junit4]    > Throwable #1: org.apache.solr.client.solrj.SolrServerException: org.apache.http.ParseException:
Invalid content type: 
   [junit4]    > 	at __randomizedtesting.SeedInfo.seed([4188D01F7FAE0A7D]:0)
   [junit4]    > 	at org.apache.solr.client.solrj.impl.LBHttpSolrClient.doRequest(LBHttpSolrClient.java:523)
   [junit4]    > 	at org.apache.solr.client.solrj.impl.LBHttpSolrClient.request(LBHttpSolrClient.java:413)
   [junit4]    > 	at org.apache.solr.client.solrj.impl.CloudSolrClient.sendRequest(CloudSolrClient.java:1121)
   [junit4]    > 	at org.apache.solr.client.solrj.impl.CloudSolrClient.requestWithRetryOnStaleState(CloudSolrClient.java:862)
   [junit4]    > 	at org.apache.solr.client.solrj.impl.CloudSolrClient.request(CloudSolrClient.java:793)
   [junit4]    > 	at org.apache.solr.client.solrj.SolrRequest.process(SolrRequest.java:178)
   [junit4]    > 	at org.apache.solr.client.solrj.SolrRequest.process(SolrRequest.java:195)
   [junit4]    > 	at org.apache.solr.analytics.AbstractAnalyticsStatsCloudTest.setupCluster(AbstractAnalyticsStatsCloudTest.java:75)
   [junit4]    > 	at org.apache.solr.analytics.NoFacetCloudTest.populate(NoFacetCloudTest.java:62)
   [junit4]    > 	at java.lang.Thread.run(Thread.java:748)
   [junit4]    > Caused by: org.apache.http.ParseException: Invalid content type: 
   [junit4]    > 	at org.apache.http.entity.ContentType.parse(ContentType.java:273)
   [junit4]    > 	at org.apache.solr.client.solrj.impl.HttpSolrClient.executeMethod(HttpSolrClient.java:575)
   [junit4]    > 	at org.apache.solr.client.solrj.impl.HttpSolrClient.request(HttpSolrClient.java:253)
   [junit4]    > 	at org.apache.solr.client.solrj.impl.HttpSolrClient.request(HttpSolrClient.java:242)
   [junit4]    > 	at org.apache.solr.client.solrj.impl.LBHttpSolrClient.doRequest(LBHttpSolrClient.java:483)
   [junit4]    > 	... 32 more
   [junit4] Completed [12/17 (1!)] on J2 in 12.47s, 0 tests, 1 error <<< FAILURES!

[...truncated 40701 lines...]

Mime
View raw message