lucene-dev mailing list archives

Site index · List index
Message view « Date » · « Thread »
Top « Date » · « Thread »
From Policeman Jenkins Server <jenk...@thetaphi.de>
Subject [JENKINS-EA] Lucene-Solr-7.x-Windows (32bit/jdk-9-ea+178) - Build # 96 - Still Unstable!
Date Tue, 01 Aug 2017 09:43:29 GMT
Build: https://jenkins.thetaphi.de/job/Lucene-Solr-7.x-Windows/96/
Java: 32bit/jdk-9-ea+178 -client -XX:+UseG1GC --illegal-access=deny

24 tests failed.
FAILED:  org.apache.solr.cloud.ChaosMonkeyNothingIsSafeTest.test

Error Message:
Timeout occured while waiting response from server at: http://127.0.0.1:55402/collection1

Stack Trace:
org.apache.solr.client.solrj.SolrServerException: Timeout occured while waiting response from server at: http://127.0.0.1:55402/collection1
	at __randomizedtesting.SeedInfo.seed([1B55945534F06E:884F6A4EFBC89D96]:0)
	at org.apache.solr.client.solrj.impl.HttpSolrClient.executeMethod(HttpSolrClient.java:637)
	at org.apache.solr.client.solrj.impl.HttpSolrClient.request(HttpSolrClient.java:252)
	at org.apache.solr.client.solrj.impl.HttpSolrClient.request(HttpSolrClient.java:241)
	at org.apache.solr.client.solrj.impl.LBHttpSolrClient.doRequest(LBHttpSolrClient.java:483)
	at org.apache.solr.client.solrj.impl.LBHttpSolrClient.request(LBHttpSolrClient.java:413)
	at org.apache.solr.client.solrj.impl.CloudSolrClient.sendRequest(CloudSolrClient.java:1121)
	at org.apache.solr.client.solrj.impl.CloudSolrClient.requestWithRetryOnStaleState(CloudSolrClient.java:862)
	at org.apache.solr.client.solrj.impl.CloudSolrClient.request(CloudSolrClient.java:793)
	at org.apache.solr.client.solrj.SolrRequest.process(SolrRequest.java:178)
	at org.apache.solr.client.solrj.SolrClient.commit(SolrClient.java:484)
	at org.apache.solr.client.solrj.SolrClient.commit(SolrClient.java:463)
	at org.apache.solr.cloud.AbstractFullDistribZkTestBase.commit(AbstractFullDistribZkTestBase.java:1583)
	at org.apache.solr.cloud.ChaosMonkeyNothingIsSafeTest.test(ChaosMonkeyNothingIsSafeTest.java:213)
	at java.base/jdk.internal.reflect.NativeMethodAccessorImpl.invoke0(Native Method)
	at java.base/jdk.internal.reflect.NativeMethodAccessorImpl.invoke(NativeMethodAccessorImpl.java:62)
	at java.base/jdk.internal.reflect.DelegatingMethodAccessorImpl.invoke(DelegatingMethodAccessorImpl.java:43)
	at java.base/java.lang.reflect.Method.invoke(Method.java:564)
	at com.carrotsearch.randomizedtesting.RandomizedRunner.invoke(RandomizedRunner.java:1713)
	at com.carrotsearch.randomizedtesting.RandomizedRunner$8.evaluate(RandomizedRunner.java:907)
	at com.carrotsearch.randomizedtesting.RandomizedRunner$9.evaluate(RandomizedRunner.java:943)
	at com.carrotsearch.randomizedtesting.RandomizedRunner$10.evaluate(RandomizedRunner.java:957)
	at org.apache.solr.BaseDistributedSearchTestCase$ShardsRepeatRule$ShardsFixedStatement.callStatement(BaseDistributedSearchTestCase.java:985)
	at org.apache.solr.BaseDistributedSearchTestCase$ShardsRepeatRule$ShardsStatement.evaluate(BaseDistributedSearchTestCase.java:960)
	at com.carrotsearch.randomizedtesting.rules.SystemPropertiesRestoreRule$1.evaluate(SystemPropertiesRestoreRule.java:57)
	at org.apache.lucene.util.TestRuleSetupTeardownChained$1.evaluate(TestRuleSetupTeardownChained.java:49)
	at org.apache.lucene.util.AbstractBeforeAfterRule$1.evaluate(AbstractBeforeAfterRule.java:45)
	at org.apache.lucene.util.TestRuleThreadAndTestName$1.evaluate(TestRuleThreadAndTestName.java:48)
	at org.apache.lucene.util.TestRuleIgnoreAfterMaxFailures$1.evaluate(TestRuleIgnoreAfterMaxFailures.java:64)
	at org.apache.lucene.util.TestRuleMarkFailure$1.evaluate(TestRuleMarkFailure.java:47)
	at com.carrotsearch.randomizedtesting.rules.StatementAdapter.evaluate(StatementAdapter.java:36)
	at com.carrotsearch.randomizedtesting.ThreadLeakControl$StatementRunner.run(ThreadLeakControl.java:368)
	at com.carrotsearch.randomizedtesting.ThreadLeakControl.forkTimeoutingTask(ThreadLeakControl.java:817)
	at com.carrotsearch.randomizedtesting.ThreadLeakControl$3.evaluate(ThreadLeakControl.java:468)
	at com.carrotsearch.randomizedtesting.RandomizedRunner.runSingleTest(RandomizedRunner.java:916)
	at com.carrotsearch.randomizedtesting.RandomizedRunner$5.evaluate(RandomizedRunner.java:802)
	at com.carrotsearch.randomizedtesting.RandomizedRunner$6.evaluate(RandomizedRunner.java:852)
	at com.carrotsearch.randomizedtesting.RandomizedRunner$7.evaluate(RandomizedRunner.java:863)
	at com.carrotsearch.randomizedtesting.rules.StatementAdapter.evaluate(StatementAdapter.java:36)
	at com.carrotsearch.randomizedtesting.rules.SystemPropertiesRestoreRule$1.evaluate(SystemPropertiesRestoreRule.java:57)
	at org.apache.lucene.util.AbstractBeforeAfterRule$1.evaluate(AbstractBeforeAfterRule.java:45)
	at com.carrotsearch.randomizedtesting.rules.StatementAdapter.evaluate(StatementAdapter.java:36)
	at org.apache.lucene.util.TestRuleStoreClassName$1.evaluate(TestRuleStoreClassName.java:41)
	at com.carrotsearch.randomizedtesting.rules.NoShadowingOrOverridesOnMethodsRule$1.evaluate(NoShadowingOrOverridesOnMethodsRule.java:40)
	at com.carrotsearch.randomizedtesting.rules.NoShadowingOrOverridesOnMethodsRule$1.evaluate(NoShadowingOrOverridesOnMethodsRule.java:40)
	at com.carrotsearch.randomizedtesting.rules.StatementAdapter.evaluate(StatementAdapter.java:36)
	at com.carrotsearch.randomizedtesting.rules.StatementAdapter.evaluate(StatementAdapter.java:36)
	at org.apache.lucene.util.TestRuleAssertionsRequired$1.evaluate(TestRuleAssertionsRequired.java:53)
	at org.apache.lucene.util.TestRuleMarkFailure$1.evaluate(TestRuleMarkFailure.java:47)
	at org.apache.lucene.util.TestRuleIgnoreAfterMaxFailures$1.evaluate(TestRuleIgnoreAfterMaxFailures.java:64)
	at org.apache.lucene.util.TestRuleIgnoreTestSuites$1.evaluate(TestRuleIgnoreTestSuites.java:54)
	at com.carrotsearch.randomizedtesting.rules.StatementAdapter.evaluate(StatementAdapter.java:36)
	at com.carrotsearch.randomizedtesting.ThreadLeakControl$StatementRunner.run(ThreadLeakControl.java:368)
	at java.base/java.lang.Thread.run(Thread.java:844)
Caused by: java.net.SocketTimeoutException: Read timed out
	at java.base/java.net.SocketInputStream.socketRead0(Native Method)
	at java.base/java.net.SocketInputStream.socketRead(SocketInputStream.java:116)
	at java.base/java.net.SocketInputStream.read(SocketInputStream.java:171)
	at java.base/java.net.SocketInputStream.read(SocketInputStream.java:141)
	at org.apache.http.impl.io.SessionInputBufferImpl.streamRead(SessionInputBufferImpl.java:139)
	at org.apache.http.impl.io.SessionInputBufferImpl.fillBuffer(SessionInputBufferImpl.java:155)
	at org.apache.http.impl.io.SessionInputBufferImpl.readLine(SessionInputBufferImpl.java:284)
	at org.apache.http.impl.conn.DefaultHttpResponseParser.parseHead(DefaultHttpResponseParser.java:140)
	at org.apache.http.impl.conn.DefaultHttpResponseParser.parseHead(DefaultHttpResponseParser.java:57)
	at org.apache.http.impl.io.AbstractMessageParser.parse(AbstractMessageParser.java:261)
	at org.apache.http.impl.DefaultBHttpClientConnection.receiveResponseHeader(DefaultBHttpClientConnection.java:165)
	at org.apache.http.impl.conn.CPoolProxy.receiveResponseHeader(CPoolProxy.java:167)
	at org.apache.http.protocol.HttpRequestExecutor.doReceiveResponse(HttpRequestExecutor.java:272)
	at org.apache.http.protocol.HttpRequestExecutor.execute(HttpRequestExecutor.java:124)
	at org.apache.http.impl.execchain.MainClientExec.execute(MainClientExec.java:271)
	at org.apache.http.impl.execchain.ProtocolExec.execute(ProtocolExec.java:184)
	at org.apache.http.impl.execchain.RetryExec.execute(RetryExec.java:88)
	at org.apache.http.impl.execchain.RedirectExec.execute(RedirectExec.java:110)
	at org.apache.http.impl.client.InternalHttpClient.doExecute(InternalHttpClient.java:184)
	at org.apache.http.impl.client.CloseableHttpClient.execute(CloseableHttpClient.java:82)
	at org.apache.http.impl.client.CloseableHttpClient.execute(CloseableHttpClient.java:55)
	at org.apache.solr.client.solrj.impl.HttpSolrClient.executeMethod(HttpSolrClient.java:523)
	... 52 more


FAILED:  junit.framework.TestSuite.org.apache.solr.cloud.ChaosMonkeyNothingIsSafeTest

Error Message:
9 threads leaked from SUITE scope at org.apache.solr.cloud.ChaosMonkeyNothingIsSafeTest:     1) Thread[id=8689, name=zkCallback-1178-thread-6, state=TIMED_WAITING, group=TGRP-ChaosMonkeyNothingIsSafeTest]         at java.base@9/jdk.internal.misc.Unsafe.park(Native Method)         at java.base@9/java.util.concurrent.locks.LockSupport.parkNanos(LockSupport.java:234)         at java.base@9/java.util.concurrent.SynchronousQueue$TransferStack.awaitFulfill(SynchronousQueue.java:462)         at java.base@9/java.util.concurrent.SynchronousQueue$TransferStack.transfer(SynchronousQueue.java:361)         at java.base@9/java.util.concurrent.SynchronousQueue.poll(SynchronousQueue.java:937)         at java.base@9/java.util.concurrent.ThreadPoolExecutor.getTask(ThreadPoolExecutor.java:1085)         at java.base@9/java.util.concurrent.ThreadPoolExecutor.runWorker(ThreadPoolExecutor.java:1146)         at java.base@9/java.util.concurrent.ThreadPoolExecutor$Worker.run(ThreadPoolExecutor.java:635)         at java.base@9/java.lang.Thread.run(Thread.java:844)    2) Thread[id=8510, name=Connection evictor, state=TIMED_WAITING, group=TGRP-ChaosMonkeyNothingIsSafeTest]         at java.base@9/java.lang.Thread.sleep(Native Method)         at app//org.apache.http.impl.client.IdleConnectionEvictor$1.run(IdleConnectionEvictor.java:66)         at java.base@9/java.lang.Thread.run(Thread.java:844)    3) Thread[id=8670, name=zkCallback-1178-thread-2, state=TIMED_WAITING, group=TGRP-ChaosMonkeyNothingIsSafeTest]         at java.base@9/jdk.internal.misc.Unsafe.park(Native Method)         at java.base@9/java.util.concurrent.locks.LockSupport.parkNanos(LockSupport.java:234)         at java.base@9/java.util.concurrent.SynchronousQueue$TransferStack.awaitFulfill(SynchronousQueue.java:462)         at java.base@9/java.util.concurrent.SynchronousQueue$TransferStack.transfer(SynchronousQueue.java:361)         at java.base@9/java.util.concurrent.SynchronousQueue.poll(SynchronousQueue.java:937)         at java.base@9/java.util.concurrent.ThreadPoolExecutor.getTask(ThreadPoolExecutor.java:1085)         at java.base@9/java.util.concurrent.ThreadPoolExecutor.runWorker(ThreadPoolExecutor.java:1146)         at java.base@9/java.util.concurrent.ThreadPoolExecutor$Worker.run(ThreadPoolExecutor.java:635)         at java.base@9/java.lang.Thread.run(Thread.java:844)    4) Thread[id=8671, name=zkCallback-1178-thread-3, state=TIMED_WAITING, group=TGRP-ChaosMonkeyNothingIsSafeTest]         at java.base@9/jdk.internal.misc.Unsafe.park(Native Method)         at java.base@9/java.util.concurrent.locks.LockSupport.parkNanos(LockSupport.java:234)         at java.base@9/java.util.concurrent.SynchronousQueue$TransferStack.awaitFulfill(SynchronousQueue.java:462)         at java.base@9/java.util.concurrent.SynchronousQueue$TransferStack.transfer(SynchronousQueue.java:361)         at java.base@9/java.util.concurrent.SynchronousQueue.poll(SynchronousQueue.java:937)         at java.base@9/java.util.concurrent.ThreadPoolExecutor.getTask(ThreadPoolExecutor.java:1085)         at java.base@9/java.util.concurrent.ThreadPoolExecutor.runWorker(ThreadPoolExecutor.java:1146)         at java.base@9/java.util.concurrent.ThreadPoolExecutor$Worker.run(ThreadPoolExecutor.java:635)         at java.base@9/java.lang.Thread.run(Thread.java:844)    5) Thread[id=8673, name=zkCallback-1178-thread-5, state=TIMED_WAITING, group=TGRP-ChaosMonkeyNothingIsSafeTest]         at java.base@9/jdk.internal.misc.Unsafe.park(Native Method)         at java.base@9/java.util.concurrent.locks.LockSupport.parkNanos(LockSupport.java:234)         at java.base@9/java.util.concurrent.SynchronousQueue$TransferStack.awaitFulfill(SynchronousQueue.java:462)         at java.base@9/java.util.concurrent.SynchronousQueue$TransferStack.transfer(SynchronousQueue.java:361)         at java.base@9/java.util.concurrent.SynchronousQueue.poll(SynchronousQueue.java:937)         at java.base@9/java.util.concurrent.ThreadPoolExecutor.getTask(ThreadPoolExecutor.java:1085)         at java.base@9/java.util.concurrent.ThreadPoolExecutor.runWorker(ThreadPoolExecutor.java:1146)         at java.base@9/java.util.concurrent.ThreadPoolExecutor$Worker.run(ThreadPoolExecutor.java:635)         at java.base@9/java.lang.Thread.run(Thread.java:844)    6) Thread[id=8672, name=zkCallback-1178-thread-4, state=TIMED_WAITING, group=TGRP-ChaosMonkeyNothingIsSafeTest]         at java.base@9/jdk.internal.misc.Unsafe.park(Native Method)         at java.base@9/java.util.concurrent.locks.LockSupport.parkNanos(LockSupport.java:234)         at java.base@9/java.util.concurrent.SynchronousQueue$TransferStack.awaitFulfill(SynchronousQueue.java:462)         at java.base@9/java.util.concurrent.SynchronousQueue$TransferStack.transfer(SynchronousQueue.java:361)         at java.base@9/java.util.concurrent.SynchronousQueue.poll(SynchronousQueue.java:937)         at java.base@9/java.util.concurrent.ThreadPoolExecutor.getTask(ThreadPoolExecutor.java:1085)         at java.base@9/java.util.concurrent.ThreadPoolExecutor.runWorker(ThreadPoolExecutor.java:1146)         at java.base@9/java.util.concurrent.ThreadPoolExecutor$Worker.run(ThreadPoolExecutor.java:635)         at java.base@9/java.lang.Thread.run(Thread.java:844)    7) Thread[id=8511, name=TEST-ChaosMonkeyNothingIsSafeTest.test-seed#[1B55945534F06E]-SendThread(127.0.0.1:55352), state=TIMED_WAITING, group=TGRP-ChaosMonkeyNothingIsSafeTest]         at java.base@9/java.lang.Thread.sleep(Native Method)         at app//org.apache.zookeeper.ClientCnxn$SendThread.run(ClientCnxn.java:1051)    8) Thread[id=8513, name=zkCallback-1178-thread-1, state=TIMED_WAITING, group=TGRP-ChaosMonkeyNothingIsSafeTest]         at java.base@9/jdk.internal.misc.Unsafe.park(Native Method)         at java.base@9/java.util.concurrent.locks.LockSupport.parkNanos(LockSupport.java:234)         at java.base@9/java.util.concurrent.SynchronousQueue$TransferStack.awaitFulfill(SynchronousQueue.java:462)         at java.base@9/java.util.concurrent.SynchronousQueue$TransferStack.transfer(SynchronousQueue.java:361)         at java.base@9/java.util.concurrent.SynchronousQueue.poll(SynchronousQueue.java:937)         at java.base@9/java.util.concurrent.ThreadPoolExecutor.getTask(ThreadPoolExecutor.java:1085)         at java.base@9/java.util.concurrent.ThreadPoolExecutor.runWorker(ThreadPoolExecutor.java:1146)         at java.base@9/java.util.concurrent.ThreadPoolExecutor$Worker.run(ThreadPoolExecutor.java:635)         at java.base@9/java.lang.Thread.run(Thread.java:844)    9) Thread[id=8512, name=TEST-ChaosMonkeyNothingIsSafeTest.test-seed#[1B55945534F06E]-EventThread, state=WAITING, group=TGRP-ChaosMonkeyNothingIsSafeTest]         at java.base@9/jdk.internal.misc.Unsafe.park(Native Method)         at java.base@9/java.util.concurrent.locks.LockSupport.park(LockSupport.java:194)         at java.base@9/java.util.concurrent.locks.AbstractQueuedSynchronizer$ConditionObject.await(AbstractQueuedSynchronizer.java:2062)         at java.base@9/java.util.concurrent.LinkedBlockingQueue.take(LinkedBlockingQueue.java:435)         at app//org.apache.zookeeper.ClientCnxn$EventThread.run(ClientCnxn.java:501)

Stack Trace:
com.carrotsearch.randomizedtesting.ThreadLeakError: 9 threads leaked from SUITE scope at org.apache.solr.cloud.ChaosMonkeyNothingIsSafeTest: 
   1) Thread[id=8689, name=zkCallback-1178-thread-6, state=TIMED_WAITING, group=TGRP-ChaosMonkeyNothingIsSafeTest]
        at java.base@9/jdk.internal.misc.Unsafe.park(Native Method)
        at java.base@9/java.util.concurrent.locks.LockSupport.parkNanos(LockSupport.java:234)
        at java.base@9/java.util.concurrent.SynchronousQueue$TransferStack.awaitFulfill(SynchronousQueue.java:462)
        at java.base@9/java.util.concurrent.SynchronousQueue$TransferStack.transfer(SynchronousQueue.java:361)
        at java.base@9/java.util.concurrent.SynchronousQueue.poll(SynchronousQueue.java:937)
        at java.base@9/java.util.concurrent.ThreadPoolExecutor.getTask(ThreadPoolExecutor.java:1085)
        at java.base@9/java.util.concurrent.ThreadPoolExecutor.runWorker(ThreadPoolExecutor.java:1146)
        at java.base@9/java.util.concurrent.ThreadPoolExecutor$Worker.run(ThreadPoolExecutor.java:635)
        at java.base@9/java.lang.Thread.run(Thread.java:844)
   2) Thread[id=8510, name=Connection evictor, state=TIMED_WAITING, group=TGRP-ChaosMonkeyNothingIsSafeTest]
        at java.base@9/java.lang.Thread.sleep(Native Method)
        at app//org.apache.http.impl.client.IdleConnectionEvictor$1.run(IdleConnectionEvictor.java:66)
        at java.base@9/java.lang.Thread.run(Thread.java:844)
   3) Thread[id=8670, name=zkCallback-1178-thread-2, state=TIMED_WAITING, group=TGRP-ChaosMonkeyNothingIsSafeTest]
        at java.base@9/jdk.internal.misc.Unsafe.park(Native Method)
        at java.base@9/java.util.concurrent.locks.LockSupport.parkNanos(LockSupport.java:234)
        at java.base@9/java.util.concurrent.SynchronousQueue$TransferStack.awaitFulfill(SynchronousQueue.java:462)
        at java.base@9/java.util.concurrent.SynchronousQueue$TransferStack.transfer(SynchronousQueue.java:361)
        at java.base@9/java.util.concurrent.SynchronousQueue.poll(SynchronousQueue.java:937)
        at java.base@9/java.util.concurrent.ThreadPoolExecutor.getTask(ThreadPoolExecutor.java:1085)
        at java.base@9/java.util.concurrent.ThreadPoolExecutor.runWorker(ThreadPoolExecutor.java:1146)
        at java.base@9/java.util.concurrent.ThreadPoolExecutor$Worker.run(ThreadPoolExecutor.java:635)
        at java.base@9/java.lang.Thread.run(Thread.java:844)
   4) Thread[id=8671, name=zkCallback-1178-thread-3, state=TIMED_WAITING, group=TGRP-ChaosMonkeyNothingIsSafeTest]
        at java.base@9/jdk.internal.misc.Unsafe.park(Native Method)
        at java.base@9/java.util.concurrent.locks.LockSupport.parkNanos(LockSupport.java:234)
        at java.base@9/java.util.concurrent.SynchronousQueue$TransferStack.awaitFulfill(SynchronousQueue.java:462)
        at java.base@9/java.util.concurrent.SynchronousQueue$TransferStack.transfer(SynchronousQueue.java:361)
        at java.base@9/java.util.concurrent.SynchronousQueue.poll(SynchronousQueue.java:937)
        at java.base@9/java.util.concurrent.ThreadPoolExecutor.getTask(ThreadPoolExecutor.java:1085)
        at java.base@9/java.util.concurrent.ThreadPoolExecutor.runWorker(ThreadPoolExecutor.java:1146)
        at java.base@9/java.util.concurrent.ThreadPoolExecutor$Worker.run(ThreadPoolExecutor.java:635)
        at java.base@9/java.lang.Thread.run(Thread.java:844)
   5) Thread[id=8673, name=zkCallback-1178-thread-5, state=TIMED_WAITING, group=TGRP-ChaosMonkeyNothingIsSafeTest]
        at java.base@9/jdk.internal.misc.Unsafe.park(Native Method)
        at java.base@9/java.util.concurrent.locks.LockSupport.parkNanos(LockSupport.java:234)
        at java.base@9/java.util.concurrent.SynchronousQueue$TransferStack.awaitFulfill(SynchronousQueue.java:462)
        at java.base@9/java.util.concurrent.SynchronousQueue$TransferStack.transfer(SynchronousQueue.java:361)
        at java.base@9/java.util.concurrent.SynchronousQueue.poll(SynchronousQueue.java:937)
        at java.base@9/java.util.concurrent.ThreadPoolExecutor.getTask(ThreadPoolExecutor.java:1085)
        at java.base@9/java.util.concurrent.ThreadPoolExecutor.runWorker(ThreadPoolExecutor.java:1146)
        at java.base@9/java.util.concurrent.ThreadPoolExecutor$Worker.run(ThreadPoolExecutor.java:635)
        at java.base@9/java.lang.Thread.run(Thread.java:844)
   6) Thread[id=8672, name=zkCallback-1178-thread-4, state=TIMED_WAITING, group=TGRP-ChaosMonkeyNothingIsSafeTest]
        at java.base@9/jdk.internal.misc.Unsafe.park(Native Method)
        at java.base@9/java.util.concurrent.locks.LockSupport.parkNanos(LockSupport.java:234)
        at java.base@9/java.util.concurrent.SynchronousQueue$TransferStack.awaitFulfill(SynchronousQueue.java:462)
        at java.base@9/java.util.concurrent.SynchronousQueue$TransferStack.transfer(SynchronousQueue.java:361)
        at java.base@9/java.util.concurrent.SynchronousQueue.poll(SynchronousQueue.java:937)
        at java.base@9/java.util.concurrent.ThreadPoolExecutor.getTask(ThreadPoolExecutor.java:1085)
        at java.base@9/java.util.concurrent.ThreadPoolExecutor.runWorker(ThreadPoolExecutor.java:1146)
        at java.base@9/java.util.concurrent.ThreadPoolExecutor$Worker.run(ThreadPoolExecutor.java:635)
        at java.base@9/java.lang.Thread.run(Thread.java:844)
   7) Thread[id=8511, name=TEST-ChaosMonkeyNothingIsSafeTest.test-seed#[1B55945534F06E]-SendThread(127.0.0.1:55352), state=TIMED_WAITING, group=TGRP-ChaosMonkeyNothingIsSafeTest]
        at java.base@9/java.lang.Thread.sleep(Native Method)
        at app//org.apache.zookeeper.ClientCnxn$SendThread.run(ClientCnxn.java:1051)
   8) Thread[id=8513, name=zkCallback-1178-thread-1, state=TIMED_WAITING, group=TGRP-ChaosMonkeyNothingIsSafeTest]
        at java.base@9/jdk.internal.misc.Unsafe.park(Native Method)
        at java.base@9/java.util.concurrent.locks.LockSupport.parkNanos(LockSupport.java:234)
        at java.base@9/java.util.concurrent.SynchronousQueue$TransferStack.awaitFulfill(SynchronousQueue.java:462)
        at java.base@9/java.util.concurrent.SynchronousQueue$TransferStack.transfer(SynchronousQueue.java:361)
        at java.base@9/java.util.concurrent.SynchronousQueue.poll(SynchronousQueue.java:937)
        at java.base@9/java.util.concurrent.ThreadPoolExecutor.getTask(ThreadPoolExecutor.java:1085)
        at java.base@9/java.util.concurrent.ThreadPoolExecutor.runWorker(ThreadPoolExecutor.java:1146)
        at java.base@9/java.util.concurrent.ThreadPoolExecutor$Worker.run(ThreadPoolExecutor.java:635)
        at java.base@9/java.lang.Thread.run(Thread.java:844)
   9) Thread[id=8512, name=TEST-ChaosMonkeyNothingIsSafeTest.test-seed#[1B55945534F06E]-EventThread, state=WAITING, group=TGRP-ChaosMonkeyNothingIsSafeTest]
        at java.base@9/jdk.internal.misc.Unsafe.park(Native Method)
        at java.base@9/java.util.concurrent.locks.LockSupport.park(LockSupport.java:194)
        at java.base@9/java.util.concurrent.locks.AbstractQueuedSynchronizer$ConditionObject.await(AbstractQueuedSynchronizer.java:2062)
        at java.base@9/java.util.concurrent.LinkedBlockingQueue.take(LinkedBlockingQueue.java:435)
        at app//org.apache.zookeeper.ClientCnxn$EventThread.run(ClientCnxn.java:501)
	at __randomizedtesting.SeedInfo.seed([1B55945534F06E]:0)


FAILED:  junit.framework.TestSuite.org.apache.solr.cloud.ChaosMonkeyNothingIsSafeTest

Error Message:
There are still zombie threads that couldn't be terminated:    1) Thread[id=8689, name=zkCallback-1178-thread-6, state=TIMED_WAITING, group=TGRP-ChaosMonkeyNothingIsSafeTest]         at java.base@9/jdk.internal.misc.Unsafe.park(Native Method)         at java.base@9/java.util.concurrent.locks.LockSupport.parkNanos(LockSupport.java:234)         at java.base@9/java.util.concurrent.SynchronousQueue$TransferStack.awaitFulfill(SynchronousQueue.java:462)         at java.base@9/java.util.concurrent.SynchronousQueue$TransferStack.transfer(SynchronousQueue.java:361)         at java.base@9/java.util.concurrent.SynchronousQueue.poll(SynchronousQueue.java:937)         at java.base@9/java.util.concurrent.ThreadPoolExecutor.getTask(ThreadPoolExecutor.java:1085)         at java.base@9/java.util.concurrent.ThreadPoolExecutor.runWorker(ThreadPoolExecutor.java:1146)         at java.base@9/java.util.concurrent.ThreadPoolExecutor$Worker.run(ThreadPoolExecutor.java:635)         at java.base@9/java.lang.Thread.run(Thread.java:844)    2) Thread[id=8670, name=zkCallback-1178-thread-2, state=TIMED_WAITING, group=TGRP-ChaosMonkeyNothingIsSafeTest]         at java.base@9/jdk.internal.misc.Unsafe.park(Native Method)         at java.base@9/java.util.concurrent.locks.LockSupport.parkNanos(LockSupport.java:234)         at java.base@9/java.util.concurrent.SynchronousQueue$TransferStack.awaitFulfill(SynchronousQueue.java:462)         at java.base@9/java.util.concurrent.SynchronousQueue$TransferStack.transfer(SynchronousQueue.java:361)         at java.base@9/java.util.concurrent.SynchronousQueue.poll(SynchronousQueue.java:937)         at java.base@9/java.util.concurrent.ThreadPoolExecutor.getTask(ThreadPoolExecutor.java:1085)         at java.base@9/java.util.concurrent.ThreadPoolExecutor.runWorker(ThreadPoolExecutor.java:1146)         at java.base@9/java.util.concurrent.ThreadPoolExecutor$Worker.run(ThreadPoolExecutor.java:635)         at java.base@9/java.lang.Thread.run(Thread.java:844)    3) Thread[id=8671, name=zkCallback-1178-thread-3, state=TIMED_WAITING, group=TGRP-ChaosMonkeyNothingIsSafeTest]         at java.base@9/jdk.internal.misc.Unsafe.park(Native Method)         at java.base@9/java.util.concurrent.locks.LockSupport.parkNanos(LockSupport.java:234)         at java.base@9/java.util.concurrent.SynchronousQueue$TransferStack.awaitFulfill(SynchronousQueue.java:462)         at java.base@9/java.util.concurrent.SynchronousQueue$TransferStack.transfer(SynchronousQueue.java:361)         at java.base@9/java.util.concurrent.SynchronousQueue.poll(SynchronousQueue.java:937)         at java.base@9/java.util.concurrent.ThreadPoolExecutor.getTask(ThreadPoolExecutor.java:1085)         at java.base@9/java.util.concurrent.ThreadPoolExecutor.runWorker(ThreadPoolExecutor.java:1146)         at java.base@9/java.util.concurrent.ThreadPoolExecutor$Worker.run(ThreadPoolExecutor.java:635)         at java.base@9/java.lang.Thread.run(Thread.java:844)    4) Thread[id=8673, name=zkCallback-1178-thread-5, state=TIMED_WAITING, group=TGRP-ChaosMonkeyNothingIsSafeTest]         at java.base@9/jdk.internal.misc.Unsafe.park(Native Method)         at java.base@9/java.util.concurrent.locks.LockSupport.parkNanos(LockSupport.java:234)         at java.base@9/java.util.concurrent.SynchronousQueue$TransferStack.awaitFulfill(SynchronousQueue.java:462)         at java.base@9/java.util.concurrent.SynchronousQueue$TransferStack.transfer(SynchronousQueue.java:361)         at java.base@9/java.util.concurrent.SynchronousQueue.poll(SynchronousQueue.java:937)         at java.base@9/java.util.concurrent.ThreadPoolExecutor.getTask(ThreadPoolExecutor.java:1085)         at java.base@9/java.util.concurrent.ThreadPoolExecutor.runWorker(ThreadPoolExecutor.java:1146)         at java.base@9/java.util.concurrent.ThreadPoolExecutor$Worker.run(ThreadPoolExecutor.java:635)         at java.base@9/java.lang.Thread.run(Thread.java:844)    5) Thread[id=8672, name=zkCallback-1178-thread-4, state=TIMED_WAITING, group=TGRP-ChaosMonkeyNothingIsSafeTest]         at java.base@9/jdk.internal.misc.Unsafe.park(Native Method)         at java.base@9/java.util.concurrent.locks.LockSupport.parkNanos(LockSupport.java:234)         at java.base@9/java.util.concurrent.SynchronousQueue$TransferStack.awaitFulfill(SynchronousQueue.java:462)         at java.base@9/java.util.concurrent.SynchronousQueue$TransferStack.transfer(SynchronousQueue.java:361)         at java.base@9/java.util.concurrent.SynchronousQueue.poll(SynchronousQueue.java:937)         at java.base@9/java.util.concurrent.ThreadPoolExecutor.getTask(ThreadPoolExecutor.java:1085)         at java.base@9/java.util.concurrent.ThreadPoolExecutor.runWorker(ThreadPoolExecutor.java:1146)         at java.base@9/java.util.concurrent.ThreadPoolExecutor$Worker.run(ThreadPoolExecutor.java:635)         at java.base@9/java.lang.Thread.run(Thread.java:844)    6) Thread[id=8511, name=TEST-ChaosMonkeyNothingIsSafeTest.test-seed#[1B55945534F06E]-SendThread(127.0.0.1:55352), state=TIMED_WAITING, group=TGRP-ChaosMonkeyNothingIsSafeTest]         at java.base@9/java.lang.Thread.sleep(Native Method)         at app//org.apache.zookeeper.ClientCnxn$SendThread.run(ClientCnxn.java:1051)    7) Thread[id=8513, name=zkCallback-1178-thread-1, state=TIMED_WAITING, group=TGRP-ChaosMonkeyNothingIsSafeTest]         at java.base@9/jdk.internal.misc.Unsafe.park(Native Method)         at java.base@9/java.util.concurrent.locks.LockSupport.parkNanos(LockSupport.java:234)         at java.base@9/java.util.concurrent.SynchronousQueue$TransferStack.awaitFulfill(SynchronousQueue.java:462)         at java.base@9/java.util.concurrent.SynchronousQueue$TransferStack.transfer(SynchronousQueue.java:361)         at java.base@9/java.util.concurrent.SynchronousQueue.poll(SynchronousQueue.java:937)         at java.base@9/java.util.concurrent.ThreadPoolExecutor.getTask(ThreadPoolExecutor.java:1085)         at java.base@9/java.util.concurrent.ThreadPoolExecutor.runWorker(ThreadPoolExecutor.java:1146)         at java.base@9/java.util.concurrent.ThreadPoolExecutor$Worker.run(ThreadPoolExecutor.java:635)         at java.base@9/java.lang.Thread.run(Thread.java:844)

Stack Trace:
com.carrotsearch.randomizedtesting.ThreadLeakError: There are still zombie threads that couldn't be terminated:
   1) Thread[id=8689, name=zkCallback-1178-thread-6, state=TIMED_WAITING, group=TGRP-ChaosMonkeyNothingIsSafeTest]
        at java.base@9/jdk.internal.misc.Unsafe.park(Native Method)
        at java.base@9/java.util.concurrent.locks.LockSupport.parkNanos(LockSupport.java:234)
        at java.base@9/java.util.concurrent.SynchronousQueue$TransferStack.awaitFulfill(SynchronousQueue.java:462)
        at java.base@9/java.util.concurrent.SynchronousQueue$TransferStack.transfer(SynchronousQueue.java:361)
        at java.base@9/java.util.concurrent.SynchronousQueue.poll(SynchronousQueue.java:937)
        at java.base@9/java.util.concurrent.ThreadPoolExecutor.getTask(ThreadPoolExecutor.java:1085)
        at java.base@9/java.util.concurrent.ThreadPoolExecutor.runWorker(ThreadPoolExecutor.java:1146)
        at java.base@9/java.util.concurrent.ThreadPoolExecutor$Worker.run(ThreadPoolExecutor.java:635)
        at java.base@9/java.lang.Thread.run(Thread.java:844)
   2) Thread[id=8670, name=zkCallback-1178-thread-2, state=TIMED_WAITING, group=TGRP-ChaosMonkeyNothingIsSafeTest]
        at java.base@9/jdk.internal.misc.Unsafe.park(Native Method)
        at java.base@9/java.util.concurrent.locks.LockSupport.parkNanos(LockSupport.java:234)
        at java.base@9/java.util.concurrent.SynchronousQueue$TransferStack.awaitFulfill(SynchronousQueue.java:462)
        at java.base@9/java.util.concurrent.SynchronousQueue$TransferStack.transfer(SynchronousQueue.java:361)
        at java.base@9/java.util.concurrent.SynchronousQueue.poll(SynchronousQueue.java:937)
        at java.base@9/java.util.concurrent.ThreadPoolExecutor.getTask(ThreadPoolExecutor.java:1085)
        at java.base@9/java.util.concurrent.ThreadPoolExecutor.runWorker(ThreadPoolExecutor.java:1146)
        at java.base@9/java.util.concurrent.ThreadPoolExecutor$Worker.run(ThreadPoolExecutor.java:635)
        at java.base@9/java.lang.Thread.run(Thread.java:844)
   3) Thread[id=8671, name=zkCallback-1178-thread-3, state=TIMED_WAITING, group=TGRP-ChaosMonkeyNothingIsSafeTest]
        at java.base@9/jdk.internal.misc.Unsafe.park(Native Method)
        at java.base@9/java.util.concurrent.locks.LockSupport.parkNanos(LockSupport.java:234)
        at java.base@9/java.util.concurrent.SynchronousQueue$TransferStack.awaitFulfill(SynchronousQueue.java:462)
        at java.base@9/java.util.concurrent.SynchronousQueue$TransferStack.transfer(SynchronousQueue.java:361)
        at java.base@9/java.util.concurrent.SynchronousQueue.poll(SynchronousQueue.java:937)
        at java.base@9/java.util.concurrent.ThreadPoolExecutor.getTask(ThreadPoolExecutor.java:1085)
        at java.base@9/java.util.concurrent.ThreadPoolExecutor.runWorker(ThreadPoolExecutor.java:1146)
        at java.base@9/java.util.concurrent.ThreadPoolExecutor$Worker.run(ThreadPoolExecutor.java:635)
        at java.base@9/java.lang.Thread.run(Thread.java:844)
   4) Thread[id=8673, name=zkCallback-1178-thread-5, state=TIMED_WAITING, group=TGRP-ChaosMonkeyNothingIsSafeTest]
        at java.base@9/jdk.internal.misc.Unsafe.park(Native Method)
        at java.base@9/java.util.concurrent.locks.LockSupport.parkNanos(LockSupport.java:234)
        at java.base@9/java.util.concurrent.SynchronousQueue$TransferStack.awaitFulfill(SynchronousQueue.java:462)
        at java.base@9/java.util.concurrent.SynchronousQueue$TransferStack.transfer(SynchronousQueue.java:361)
        at java.base@9/java.util.concurrent.SynchronousQueue.poll(SynchronousQueue.java:937)
        at java.base@9/java.util.concurrent.ThreadPoolExecutor.getTask(ThreadPoolExecutor.java:1085)
        at java.base@9/java.util.concurrent.ThreadPoolExecutor.runWorker(ThreadPoolExecutor.java:1146)
        at java.base@9/java.util.concurrent.ThreadPoolExecutor$Worker.run(ThreadPoolExecutor.java:635)
        at java.base@9/java.lang.Thread.run(Thread.java:844)
   5) Thread[id=8672, name=zkCallback-1178-thread-4, state=TIMED_WAITING, group=TGRP-ChaosMonkeyNothingIsSafeTest]
        at java.base@9/jdk.internal.misc.Unsafe.park(Native Method)
        at java.base@9/java.util.concurrent.locks.LockSupport.parkNanos(LockSupport.java:234)
        at java.base@9/java.util.concurrent.SynchronousQueue$TransferStack.awaitFulfill(SynchronousQueue.java:462)
        at java.base@9/java.util.concurrent.SynchronousQueue$TransferStack.transfer(SynchronousQueue.java:361)
        at java.base@9/java.util.concurrent.SynchronousQueue.poll(SynchronousQueue.java:937)
        at java.base@9/java.util.concurrent.ThreadPoolExecutor.getTask(ThreadPoolExecutor.java:1085)
        at java.base@9/java.util.concurrent.ThreadPoolExecutor.runWorker(ThreadPoolExecutor.java:1146)
        at java.base@9/java.util.concurrent.ThreadPoolExecutor$Worker.run(ThreadPoolExecutor.java:635)
        at java.base@9/java.lang.Thread.run(Thread.java:844)
   6) Thread[id=8511, name=TEST-ChaosMonkeyNothingIsSafeTest.test-seed#[1B55945534F06E]-SendThread(127.0.0.1:55352), state=TIMED_WAITING, group=TGRP-ChaosMonkeyNothingIsSafeTest]
        at java.base@9/java.lang.Thread.sleep(Native Method)
        at app//org.apache.zookeeper.ClientCnxn$SendThread.run(ClientCnxn.java:1051)
   7) Thread[id=8513, name=zkCallback-1178-thread-1, state=TIMED_WAITING, group=TGRP-ChaosMonkeyNothingIsSafeTest]
        at java.base@9/jdk.internal.misc.Unsafe.park(Native Method)
        at java.base@9/java.util.concurrent.locks.LockSupport.parkNanos(LockSupport.java:234)
        at java.base@9/java.util.concurrent.SynchronousQueue$TransferStack.awaitFulfill(SynchronousQueue.java:462)
        at java.base@9/java.util.concurrent.SynchronousQueue$TransferStack.transfer(SynchronousQueue.java:361)
        at java.base@9/java.util.concurrent.SynchronousQueue.poll(SynchronousQueue.java:937)
        at java.base@9/java.util.concurrent.ThreadPoolExecutor.getTask(ThreadPoolExecutor.java:1085)
        at java.base@9/java.util.concurrent.ThreadPoolExecutor.runWorker(ThreadPoolExecutor.java:1146)
        at java.base@9/java.util.concurrent.ThreadPoolExecutor$Worker.run(ThreadPoolExecutor.java:635)
        at java.base@9/java.lang.Thread.run(Thread.java:844)
	at __randomizedtesting.SeedInfo.seed([1B55945534F06E]:0)


FAILED:  org.apache.solr.cloud.TestTlogReplica.testOnlyLeaderIndexes

Error Message:


Stack Trace:
java.lang.AssertionError
	at __randomizedtesting.SeedInfo.seed([1B55945534F06E:1C1A281920918EFD]:0)
	at org.junit.Assert.fail(Assert.java:92)
	at org.junit.Assert.assertTrue(Assert.java:43)
	at org.junit.Assert.assertFalse(Assert.java:68)
	at org.junit.Assert.assertFalse(Assert.java:79)
	at org.apache.solr.cloud.TestTlogReplica.testOnlyLeaderIndexes(TestTlogReplica.java:497)
	at java.base/jdk.internal.reflect.NativeMethodAccessorImpl.invoke0(Native Method)
	at java.base/jdk.internal.reflect.NativeMethodAccessorImpl.invoke(NativeMethodAccessorImpl.java:62)
	at java.base/jdk.internal.reflect.DelegatingMethodAccessorImpl.invoke(DelegatingMethodAccessorImpl.java:43)
	at java.base/java.lang.reflect.Method.invoke(Method.java:564)
	at com.carrotsearch.randomizedtesting.RandomizedRunner.invoke(RandomizedRunner.java:1713)
	at com.carrotsearch.randomizedtesting.RandomizedRunner$8.evaluate(RandomizedRunner.java:907)
	at com.carrotsearch.randomizedtesting.RandomizedRunner$9.evaluate(RandomizedRunner.java:943)
	at com.carrotsearch.randomizedtesting.RandomizedRunner$10.evaluate(RandomizedRunner.java:957)
	at com.carrotsearch.randomizedtesting.rules.SystemPropertiesRestoreRule$1.evaluate(SystemPropertiesRestoreRule.java:57)
	at org.apache.lucene.util.TestRuleSetupTeardownChained$1.evaluate(TestRuleSetupTeardownChained.java:49)
	at org.apache.lucene.util.AbstractBeforeAfterRule$1.evaluate(AbstractBeforeAfterRule.java:45)
	at org.apache.lucene.util.TestRuleThreadAndTestName$1.evaluate(TestRuleThreadAndTestName.java:48)
	at org.apache.lucene.util.TestRuleIgnoreAfterMaxFailures$1.evaluate(TestRuleIgnoreAfterMaxFailures.java:64)
	at org.apache.lucene.util.TestRuleMarkFailure$1.evaluate(TestRuleMarkFailure.java:47)
	at com.carrotsearch.randomizedtesting.rules.StatementAdapter.evaluate(StatementAdapter.java:36)
	at com.carrotsearch.randomizedtesting.ThreadLeakControl$StatementRunner.run(ThreadLeakControl.java:368)
	at com.carrotsearch.randomizedtesting.ThreadLeakControl.forkTimeoutingTask(ThreadLeakControl.java:817)
	at com.carrotsearch.randomizedtesting.ThreadLeakControl$3.evaluate(ThreadLeakControl.java:468)
	at com.carrotsearch.randomizedtesting.RandomizedRunner.runSingleTest(RandomizedRunner.java:916)
	at com.carrotsearch.randomizedtesting.RandomizedRunner$5.evaluate(RandomizedRunner.java:802)
	at com.carrotsearch.randomizedtesting.RandomizedRunner$6.evaluate(RandomizedRunner.java:852)
	at com.carrotsearch.randomizedtesting.RandomizedRunner$7.evaluate(RandomizedRunner.java:863)
	at com.carrotsearch.randomizedtesting.rules.StatementAdapter.evaluate(StatementAdapter.java:36)
	at com.carrotsearch.randomizedtesting.rules.SystemPropertiesRestoreRule$1.evaluate(SystemPropertiesRestoreRule.java:57)
	at org.apache.lucene.util.AbstractBeforeAfterRule$1.evaluate(AbstractBeforeAfterRule.java:45)
	at com.carrotsearch.randomizedtesting.rules.StatementAdapter.evaluate(StatementAdapter.java:36)
	at org.apache.lucene.util.TestRuleStoreClassName$1.evaluate(TestRuleStoreClassName.java:41)
	at com.carrotsearch.randomizedtesting.rules.NoShadowingOrOverridesOnMethodsRule$1.evaluate(NoShadowingOrOverridesOnMethodsRule.java:40)
	at com.carrotsearch.randomizedtesting.rules.NoShadowingOrOverridesOnMethodsRule$1.evaluate(NoShadowingOrOverridesOnMethodsRule.java:40)
	at com.carrotsearch.randomizedtesting.rules.StatementAdapter.evaluate(StatementAdapter.java:36)
	at com.carrotsearch.randomizedtesting.rules.StatementAdapter.evaluate(StatementAdapter.java:36)
	at org.apache.lucene.util.TestRuleAssertionsRequired$1.evaluate(TestRuleAssertionsRequired.java:53)
	at org.apache.lucene.util.TestRuleMarkFailure$1.evaluate(TestRuleMarkFailure.java:47)
	at org.apache.lucene.util.TestRuleIgnoreAfterMaxFailures$1.evaluate(TestRuleIgnoreAfterMaxFailures.java:64)
	at org.apache.lucene.util.TestRuleIgnoreTestSuites$1.evaluate(TestRuleIgnoreTestSuites.java:54)
	at com.carrotsearch.randomizedtesting.rules.StatementAdapter.evaluate(StatementAdapter.java:36)
	at com.carrotsearch.randomizedtesting.ThreadLeakControl$StatementRunner.run(ThreadLeakControl.java:368)
	at java.base/java.lang.Thread.run(Thread.java:844)


FAILED:  org.apache.solr.client.solrj.io.stream.StreamExpressionTest.testExecutorStream

Error Message:
Error from server at http://127.0.0.1:60627/solr/workQueue_shard2_replica_n2: Expected mime type application/octet-stream but got text/html. <html> <head> <meta http-equiv="Content-Type" content="text/html;charset=ISO-8859-1"/> <title>Error 404 </title> </head> <body> <h2>HTTP ERROR: 404</h2> <p>Problem accessing /solr/workQueue_shard2_replica_n2/update. Reason: <pre>    Can not find: /solr/workQueue_shard2_replica_n2/update</pre></p> <hr /><a href="http://eclipse.org/jetty">Powered by Jetty:// 9.3.14.v20161028</a><hr/> </body> </html> 

Stack Trace:
org.apache.solr.client.solrj.impl.CloudSolrClient$RouteException: Error from server at http://127.0.0.1:60627/solr/workQueue_shard2_replica_n2: Expected mime type application/octet-stream but got text/html. <html>
<head>
<meta http-equiv="Content-Type" content="text/html;charset=ISO-8859-1"/>
<title>Error 404 </title>
</head>
<body>
<h2>HTTP ERROR: 404</h2>
<p>Problem accessing /solr/workQueue_shard2_replica_n2/update. Reason:
<pre>    Can not find: /solr/workQueue_shard2_replica_n2/update</pre></p>
<hr /><a href="http://eclipse.org/jetty">Powered by Jetty:// 9.3.14.v20161028</a><hr/>
</body>
</html>

	at __randomizedtesting.SeedInfo.seed([8F11632C68E403FC:ADD1E2D74B8E29EC]:0)
	at org.apache.solr.client.solrj.impl.CloudSolrClient.directUpdate(CloudSolrClient.java:539)
	at org.apache.solr.client.solrj.impl.CloudSolrClient.sendRequest(CloudSolrClient.java:993)
	at org.apache.solr.client.solrj.impl.CloudSolrClient.requestWithRetryOnStaleState(CloudSolrClient.java:862)
	at org.apache.solr.client.solrj.impl.CloudSolrClient.request(CloudSolrClient.java:793)
	at org.apache.solr.client.solrj.SolrRequest.process(SolrRequest.java:178)
	at org.apache.solr.client.solrj.request.UpdateRequest.commit(UpdateRequest.java:233)
	at org.apache.solr.client.solrj.io.stream.StreamExpressionTest.testExecutorStream(StreamExpressionTest.java:6794)
	at java.base/jdk.internal.reflect.NativeMethodAccessorImpl.invoke0(Native Method)
	at java.base/jdk.internal.reflect.NativeMethodAccessorImpl.invoke(NativeMethodAccessorImpl.java:62)
	at java.base/jdk.internal.reflect.DelegatingMethodAccessorImpl.invoke(DelegatingMethodAccessorImpl.java:43)
	at java.base/java.lang.reflect.Method.invoke(Method.java:564)
	at com.carrotsearch.randomizedtesting.RandomizedRunner.invoke(RandomizedRunner.java:1713)
	at com.carrotsearch.randomizedtesting.RandomizedRunner$8.evaluate(RandomizedRunner.java:907)
	at com.carrotsearch.randomizedtesting.RandomizedRunner$9.evaluate(RandomizedRunner.java:943)
	at com.carrotsearch.randomizedtesting.RandomizedRunner$10.evaluate(RandomizedRunner.java:957)
	at com.carrotsearch.randomizedtesting.rules.SystemPropertiesRestoreRule$1.evaluate(SystemPropertiesRestoreRule.java:57)
	at org.apache.lucene.util.TestRuleSetupTeardownChained$1.evaluate(TestRuleSetupTeardownChained.java:49)
	at org.apache.lucene.util.AbstractBeforeAfterRule$1.evaluate(AbstractBeforeAfterRule.java:45)
	at org.apache.lucene.util.TestRuleThreadAndTestName$1.evaluate(TestRuleThreadAndTestName.java:48)
	at org.apache.lucene.util.TestRuleIgnoreAfterMaxFailures$1.evaluate(TestRuleIgnoreAfterMaxFailures.java:64)
	at org.apache.lucene.util.TestRuleMarkFailure$1.evaluate(TestRuleMarkFailure.java:47)
	at com.carrotsearch.randomizedtesting.rules.StatementAdapter.evaluate(StatementAdapter.java:36)
	at com.carrotsearch.randomizedtesting.ThreadLeakControl$StatementRunner.run(ThreadLeakControl.java:368)
	at com.carrotsearch.randomizedtesting.ThreadLeakControl.forkTimeoutingTask(ThreadLeakControl.java:817)
	at com.carrotsearch.randomizedtesting.ThreadLeakControl$3.evaluate(ThreadLeakControl.java:468)
	at com.carrotsearch.randomizedtesting.RandomizedRunner.runSingleTest(RandomizedRunner.java:916)
	at com.carrotsearch.randomizedtesting.RandomizedRunner$5.evaluate(RandomizedRunner.java:802)
	at com.carrotsearch.randomizedtesting.RandomizedRunner$6.evaluate(RandomizedRunner.java:852)
	at com.carrotsearch.randomizedtesting.RandomizedRunner$7.evaluate(RandomizedRunner.java:863)
	at com.carrotsearch.randomizedtesting.rules.StatementAdapter.evaluate(StatementAdapter.java:36)
	at com.carrotsearch.randomizedtesting.rules.SystemPropertiesRestoreRule$1.evaluate(SystemPropertiesRestoreRule.java:57)
	at org.apache.lucene.util.AbstractBeforeAfterRule$1.evaluate(AbstractBeforeAfterRule.java:45)
	at com.carrotsearch.randomizedtesting.rules.StatementAdapter.evaluate(StatementAdapter.java:36)
	at org.apache.lucene.util.TestRuleStoreClassName$1.evaluate(TestRuleStoreClassName.java:41)
	at com.carrotsearch.randomizedtesting.rules.NoShadowingOrOverridesOnMethodsRule$1.evaluate(NoShadowingOrOverridesOnMethodsRule.java:40)
	at com.carrotsearch.randomizedtesting.rules.NoShadowingOrOverridesOnMethodsRule$1.evaluate(NoShadowingOrOverridesOnMethodsRule.java:40)
	at com.carrotsearch.randomizedtesting.rules.StatementAdapter.evaluate(StatementAdapter.java:36)
	at com.carrotsearch.randomizedtesting.rules.StatementAdapter.evaluate(StatementAdapter.java:36)
	at org.apache.lucene.util.TestRuleAssertionsRequired$1.evaluate(TestRuleAssertionsRequired.java:53)
	at org.apache.lucene.util.TestRuleMarkFailure$1.evaluate(TestRuleMarkFailure.java:47)
	at org.apache.lucene.util.TestRuleIgnoreAfterMaxFailures$1.evaluate(TestRuleIgnoreAfterMaxFailures.java:64)
	at org.apache.lucene.util.TestRuleIgnoreTestSuites$1.evaluate(TestRuleIgnoreTestSuites.java:54)
	at com.carrotsearch.randomizedtesting.rules.StatementAdapter.evaluate(StatementAdapter.java:36)
	at com.carrotsearch.randomizedtesting.ThreadLeakControl$StatementRunner.run(ThreadLeakControl.java:368)
	at java.base/java.lang.Thread.run(Thread.java:844)
Caused by: org.apache.solr.client.solrj.impl.HttpSolrClient$RemoteSolrException: Error from server at http://127.0.0.1:60627/solr/workQueue_shard2_replica_n2: Expected mime type application/octet-stream but got text/html. <html>
<head>
<meta http-equiv="Content-Type" content="text/html;charset=ISO-8859-1"/>
<title>Error 404 </title>
</head>
<body>
<h2>HTTP ERROR: 404</h2>
<p>Problem accessing /solr/workQueue_shard2_replica_n2/update. Reason:
<pre>    Can not find: /solr/workQueue_shard2_replica_n2/update</pre></p>
<hr /><a href="http://eclipse.org/jetty">Powered by Jetty:// 9.3.14.v20161028</a><hr/>
</body>
</html>

	at org.apache.solr.client.solrj.impl.HttpSolrClient.executeMethod(HttpSolrClient.java:588)
	at org.apache.solr.client.solrj.impl.HttpSolrClient.request(HttpSolrClient.java:252)
	at org.apache.solr.client.solrj.impl.HttpSolrClient.request(HttpSolrClient.java:241)
	at org.apache.solr.client.solrj.impl.LBHttpSolrClient.doRequest(LBHttpSolrClient.java:483)
	at org.apache.solr.client.solrj.impl.LBHttpSolrClient.request(LBHttpSolrClient.java:413)
	at org.apache.solr.client.solrj.impl.CloudSolrClient.lambda$directUpdate$0(CloudSolrClient.java:516)
	at java.base/java.util.concurrent.FutureTask.run(FutureTask.java:264)
	at org.apache.solr.common.util.ExecutorUtil$MDCAwareThreadPoolExecutor.lambda$execute$0(ExecutorUtil.java:188)
	at java.base/java.util.concurrent.ThreadPoolExecutor.runWorker(ThreadPoolExecutor.java:1161)
	at java.base/java.util.concurrent.ThreadPoolExecutor$Worker.run(ThreadPoolExecutor.java:635)
	... 1 more


FAILED:  junit.framework.TestSuite.org.apache.solr.common.util.TestNamedListCodec

Error Message:
The test or suite printed 10306 bytes to stdout and stderr, even though the limit was set to 8192 bytes. Increase the limit with @Limit, ignore it completely with @SuppressSysoutChecks or run with -Dtests.verbose=true

Stack Trace:
java.lang.AssertionError: The test or suite printed 10306 bytes to stdout and stderr, even though the limit was set to 8192 bytes. Increase the limit with @Limit, ignore it completely with @SuppressSysoutChecks or run with -Dtests.verbose=true
	at __randomizedtesting.SeedInfo.seed([8F11632C68E403FC]:0)
	at org.apache.lucene.util.TestRuleLimitSysouts.afterIfSuccessful(TestRuleLimitSysouts.java:211)
	at com.carrotsearch.randomizedtesting.rules.TestRuleAdapter$1.afterIfSuccessful(TestRuleAdapter.java:36)
	at com.carrotsearch.randomizedtesting.rules.StatementAdapter.evaluate(StatementAdapter.java:37)
	at org.apache.lucene.util.TestRuleAssertionsRequired$1.evaluate(TestRuleAssertionsRequired.java:53)
	at org.apache.lucene.util.TestRuleMarkFailure$1.evaluate(TestRuleMarkFailure.java:47)
	at org.apache.lucene.util.TestRuleIgnoreAfterMaxFailures$1.evaluate(TestRuleIgnoreAfterMaxFailures.java:64)
	at org.apache.lucene.util.TestRuleIgnoreTestSuites$1.evaluate(TestRuleIgnoreTestSuites.java:54)
	at com.carrotsearch.randomizedtesting.rules.StatementAdapter.evaluate(StatementAdapter.java:36)
	at com.carrotsearch.randomizedtesting.ThreadLeakControl$StatementRunner.run(ThreadLeakControl.java:368)
	at java.base/java.lang.Thread.run(Thread.java:844)


FAILED:  org.apache.solr.TestDistributedSearch.test

Error Message:
Error from server at http://127.0.0.1:52670//collection1: Cannot use facet.mincount=0 on field a_n_tdt which is Points-based

Stack Trace:
org.apache.solr.client.solrj.impl.HttpSolrClient$RemoteSolrException: Error from server at http://127.0.0.1:52670//collection1: Cannot use facet.mincount=0 on field a_n_tdt which is Points-based
	at __randomizedtesting.SeedInfo.seed([1B55945534F06E:884F6A4EFBC89D96]:0)
	at org.apache.solr.client.solrj.impl.HttpSolrClient.executeMethod(HttpSolrClient.java:626)
	at org.apache.solr.client.solrj.impl.HttpSolrClient.request(HttpSolrClient.java:252)
	at org.apache.solr.client.solrj.impl.HttpSolrClient.request(HttpSolrClient.java:241)
	at org.apache.solr.client.solrj.SolrRequest.process(SolrRequest.java:178)
	at org.apache.solr.client.solrj.SolrClient.query(SolrClient.java:942)
	at org.apache.solr.client.solrj.SolrClient.query(SolrClient.java:957)
	at org.apache.solr.BaseDistributedSearchTestCase.query(BaseDistributedSearchTestCase.java:599)
	at org.apache.solr.BaseDistributedSearchTestCase.query(BaseDistributedSearchTestCase.java:587)
	at org.apache.solr.BaseDistributedSearchTestCase.query(BaseDistributedSearchTestCase.java:566)
	at org.apache.solr.TestDistributedSearch.test(TestDistributedSearch.java:241)
	at java.base/jdk.internal.reflect.NativeMethodAccessorImpl.invoke0(Native Method)
	at java.base/jdk.internal.reflect.NativeMethodAccessorImpl.invoke(NativeMethodAccessorImpl.java:62)
	at java.base/jdk.internal.reflect.DelegatingMethodAccessorImpl.invoke(DelegatingMethodAccessorImpl.java:43)
	at java.base/java.lang.reflect.Method.invoke(Method.java:564)
	at com.carrotsearch.randomizedtesting.RandomizedRunner.invoke(RandomizedRunner.java:1713)
	at com.carrotsearch.randomizedtesting.RandomizedRunner$8.evaluate(RandomizedRunner.java:907)
	at com.carrotsearch.randomizedtesting.RandomizedRunner$9.evaluate(RandomizedRunner.java:943)
	at com.carrotsearch.randomizedtesting.RandomizedRunner$10.evaluate(RandomizedRunner.java:957)
	at org.apache.solr.BaseDistributedSearchTestCase$ShardsRepeatRule$ShardsRepeatStatement.callStatement(BaseDistributedSearchTestCase.java:1011)
	at org.apache.solr.BaseDistributedSearchTestCase$ShardsRepeatRule$ShardsStatement.evaluate(BaseDistributedSearchTestCase.java:960)
	at com.carrotsearch.randomizedtesting.rules.SystemPropertiesRestoreRule$1.evaluate(SystemPropertiesRestoreRule.java:57)
	at org.apache.lucene.util.TestRuleSetupTeardownChained$1.evaluate(TestRuleSetupTeardownChained.java:49)
	at org.apache.lucene.util.AbstractBeforeAfterRule$1.evaluate(AbstractBeforeAfterRule.java:45)
	at org.apache.lucene.util.TestRuleThreadAndTestName$1.evaluate(TestRuleThreadAndTestName.java:48)
	at org.apache.lucene.util.TestRuleIgnoreAfterMaxFailures$1.evaluate(TestRuleIgnoreAfterMaxFailures.java:64)
	at org.apache.lucene.util.TestRuleMarkFailure$1.evaluate(TestRuleMarkFailure.java:47)
	at com.carrotsearch.randomizedtesting.rules.StatementAdapter.evaluate(StatementAdapter.java:36)
	at com.carrotsearch.randomizedtesting.ThreadLeakControl$StatementRunner.run(ThreadLeakControl.java:368)
	at com.carrotsearch.randomizedtesting.ThreadLeakControl.forkTimeoutingTask(ThreadLeakControl.java:817)
	at com.carrotsearch.randomizedtesting.ThreadLeakControl$3.evaluate(ThreadLeakControl.java:468)
	at com.carrotsearch.randomizedtesting.RandomizedRunner.runSingleTest(RandomizedRunner.java:916)
	at com.carrotsearch.randomizedtesting.RandomizedRunner$5.evaluate(RandomizedRunner.java:802)
	at com.carrotsearch.randomizedtesting.RandomizedRunner$6.evaluate(RandomizedRunner.java:852)
	at com.carrotsearch.randomizedtesting.RandomizedRunner$7.evaluate(RandomizedRunner.java:863)
	at com.carrotsearch.randomizedtesting.rules.StatementAdapter.evaluate(StatementAdapter.java:36)
	at com.carrotsearch.randomizedtesting.rules.SystemPropertiesRestoreRule$1.evaluate(SystemPropertiesRestoreRule.java:57)
	at org.apache.lucene.util.AbstractBeforeAfterRule$1.evaluate(AbstractBeforeAfterRule.java:45)
	at com.carrotsearch.randomizedtesting.rules.StatementAdapter.evaluate(StatementAdapter.java:36)
	at org.apache.lucene.util.TestRuleStoreClassName$1.evaluate(TestRuleStoreClassName.java:41)
	at com.carrotsearch.randomizedtesting.rules.NoShadowingOrOverridesOnMethodsRule$1.evaluate(NoShadowingOrOverridesOnMethodsRule.java:40)
	at com.carrotsearch.randomizedtesting.rules.NoShadowingOrOverridesOnMethodsRule$1.evaluate(NoShadowingOrOverridesOnMethodsRule.java:40)
	at com.carrotsearch.randomizedtesting.rules.StatementAdapter.evaluate(StatementAdapter.java:36)
	at com.carrotsearch.randomizedtesting.rules.StatementAdapter.evaluate(StatementAdapter.java:36)
	at org.apache.lucene.util.TestRuleAssertionsRequired$1.evaluate(TestRuleAssertionsRequired.java:53)
	at org.apache.lucene.util.TestRuleMarkFailure$1.evaluate(TestRuleMarkFailure.java:47)
	at org.apache.lucene.util.TestRuleIgnoreAfterMaxFailures$1.evaluate(TestRuleIgnoreAfterMaxFailures.java:64)
	at org.apache.lucene.util.TestRuleIgnoreTestSuites$1.evaluate(TestRuleIgnoreTestSuites.java:54)
	at com.carrotsearch.randomizedtesting.rules.StatementAdapter.evaluate(StatementAdapter.java:36)
	at com.carrotsearch.randomizedtesting.ThreadLeakControl$StatementRunner.run(ThreadLeakControl.java:368)
	at java.base/java.lang.Thread.run(Thread.java:844)


FAILED:  org.apache.solr.request.TestFaceting.testFacetSortWithMinCount

Error Message:
Exception during query

Stack Trace:
java.lang.RuntimeException: Exception during query
	at __randomizedtesting.SeedInfo.seed([1B55945534F06E:8B105A03FEF3DAA8]:0)
	at org.apache.solr.SolrTestCaseJ4.assertQ(SolrTestCaseJ4.java:886)
	at org.apache.solr.SolrTestCaseJ4.assertQ(SolrTestCaseJ4.java:846)
	at org.apache.solr.request.TestFaceting.testFacetSortWithMinCount(TestFaceting.java:312)
	at java.base/jdk.internal.reflect.NativeMethodAccessorImpl.invoke0(Native Method)
	at java.base/jdk.internal.reflect.NativeMethodAccessorImpl.invoke(NativeMethodAccessorImpl.java:62)
	at java.base/jdk.internal.reflect.DelegatingMethodAccessorImpl.invoke(DelegatingMethodAccessorImpl.java:43)
	at java.base/java.lang.reflect.Method.invoke(Method.java:564)
	at com.carrotsearch.randomizedtesting.RandomizedRunner.invoke(RandomizedRunner.java:1713)
	at com.carrotsearch.randomizedtesting.RandomizedRunner$8.evaluate(RandomizedRunner.java:907)
	at com.carrotsearch.randomizedtesting.RandomizedRunner$9.evaluate(RandomizedRunner.java:943)
	at com.carrotsearch.randomizedtesting.RandomizedRunner$10.evaluate(RandomizedRunner.java:957)
	at com.carrotsearch.randomizedtesting.rules.SystemPropertiesRestoreRule$1.evaluate(SystemPropertiesRestoreRule.java:57)
	at org.apache.lucene.util.TestRuleSetupTeardownChained$1.evaluate(TestRuleSetupTeardownChained.java:49)
	at org.apache.lucene.util.AbstractBeforeAfterRule$1.evaluate(AbstractBeforeAfterRule.java:45)
	at org.apache.lucene.util.TestRuleThreadAndTestName$1.evaluate(TestRuleThreadAndTestName.java:48)
	at org.apache.lucene.util.TestRuleIgnoreAfterMaxFailures$1.evaluate(TestRuleIgnoreAfterMaxFailures.java:64)
	at org.apache.lucene.util.TestRuleMarkFailure$1.evaluate(TestRuleMarkFailure.java:47)
	at com.carrotsearch.randomizedtesting.rules.StatementAdapter.evaluate(StatementAdapter.java:36)
	at com.carrotsearch.randomizedtesting.ThreadLeakControl$StatementRunner.run(ThreadLeakControl.java:368)
	at com.carrotsearch.randomizedtesting.ThreadLeakControl.forkTimeoutingTask(ThreadLeakControl.java:817)
	at com.carrotsearch.randomizedtesting.ThreadLeakControl$3.evaluate(ThreadLeakControl.java:468)
	at com.carrotsearch.randomizedtesting.RandomizedRunner.runSingleTest(RandomizedRunner.java:916)
	at com.carrotsearch.randomizedtesting.RandomizedRunner$5.evaluate(RandomizedRunner.java:802)
	at com.carrotsearch.randomizedtesting.RandomizedRunner$6.evaluate(RandomizedRunner.java:852)
	at com.carrotsearch.randomizedtesting.RandomizedRunner$7.evaluate(RandomizedRunner.java:863)
	at com.carrotsearch.randomizedtesting.rules.StatementAdapter.evaluate(StatementAdapter.java:36)
	at com.carrotsearch.randomizedtesting.rules.SystemPropertiesRestoreRule$1.evaluate(SystemPropertiesRestoreRule.java:57)
	at org.apache.lucene.util.AbstractBeforeAfterRule$1.evaluate(AbstractBeforeAfterRule.java:45)
	at com.carrotsearch.randomizedtesting.rules.StatementAdapter.evaluate(StatementAdapter.java:36)
	at org.apache.lucene.util.TestRuleStoreClassName$1.evaluate(TestRuleStoreClassName.java:41)
	at com.carrotsearch.randomizedtesting.rules.NoShadowingOrOverridesOnMethodsRule$1.evaluate(NoShadowingOrOverridesOnMethodsRule.java:40)
	at com.carrotsearch.randomizedtesting.rules.NoShadowingOrOverridesOnMethodsRule$1.evaluate(NoShadowingOrOverridesOnMethodsRule.java:40)
	at com.carrotsearch.randomizedtesting.rules.StatementAdapter.evaluate(StatementAdapter.java:36)
	at com.carrotsearch.randomizedtesting.rules.StatementAdapter.evaluate(StatementAdapter.java:36)
	at org.apache.lucene.util.TestRuleAssertionsRequired$1.evaluate(TestRuleAssertionsRequired.java:53)
	at org.apache.lucene.util.TestRuleMarkFailure$1.evaluate(TestRuleMarkFailure.java:47)
	at org.apache.lucene.util.TestRuleIgnoreAfterMaxFailures$1.evaluate(TestRuleIgnoreAfterMaxFailures.java:64)
	at org.apache.lucene.util.TestRuleIgnoreTestSuites$1.evaluate(TestRuleIgnoreTestSuites.java:54)
	at com.carrotsearch.randomizedtesting.rules.StatementAdapter.evaluate(StatementAdapter.java:36)
	at com.carrotsearch.randomizedtesting.ThreadLeakControl$StatementRunner.run(ThreadLeakControl.java:368)
	at java.base/java.lang.Thread.run(Thread.java:844)
Caused by: org.apache.solr.common.SolrException: Cannot use facet.mincount=0 on field f_td which is Points-based
	at org.apache.solr.request.NumericFacets.getCountsSingleValue(NumericFacets.java:184)
	at org.apache.solr.request.NumericFacets.getCounts(NumericFacets.java:170)
	at org.apache.solr.request.SimpleFacets.getTermCounts(SimpleFacets.java:499)
	at org.apache.solr.request.SimpleFacets.getTermCounts(SimpleFacets.java:405)
	at org.apache.solr.request.SimpleFacets.lambda$getFacetFieldCounts$0(SimpleFacets.java:803)
	at java.base/java.util.concurrent.FutureTask.run(FutureTask.java:264)
	at org.apache.solr.request.SimpleFacets$3.execute(SimpleFacets.java:742)
	at org.apache.solr.request.SimpleFacets.getFacetFieldCounts(SimpleFacets.java:818)
	at org.apache.solr.handler.component.FacetComponent.getFacetCounts(FacetComponent.java:329)
	at org.apache.solr.handler.component.FacetComponent.process(FacetComponent.java:273)
	at org.apache.solr.handler.component.SearchHandler.handleRequestBody(SearchHandler.java:295)
	at org.apache.solr.handler.RequestHandlerBase.handleRequest(RequestHandlerBase.java:177)
	at org.apache.solr.core.SolrCore.execute(SolrCore.java:2473)
	at org.apache.solr.util.TestHarness.query(TestHarness.java:337)
	at org.apache.solr.util.TestHarness.query(TestHarness.java:319)
	at org.apache.solr.SolrTestCaseJ4.assertQ(SolrTestCaseJ4.java:860)
	... 40 more


FAILED:  org.apache.solr.schema.TestPointFields.testFloatPointFieldFacetField

Error Message:
Exception during query

Stack Trace:
java.lang.RuntimeException: Exception during query
	at __randomizedtesting.SeedInfo.seed([1B55945534F06E:BAA2B7AB76D8582E]:0)
	at org.apache.solr.SolrTestCaseJ4.assertQ(SolrTestCaseJ4.java:886)
	at org.apache.solr.SolrTestCaseJ4.assertQ(SolrTestCaseJ4.java:846)
	at org.apache.solr.schema.TestPointFields.doTestPointFieldFacetField(TestPointFields.java:2407)
	at org.apache.solr.schema.TestPointFields.testFloatPointFieldFacetField(TestPointFields.java:1003)
	at java.base/jdk.internal.reflect.NativeMethodAccessorImpl.invoke0(Native Method)
	at java.base/jdk.internal.reflect.NativeMethodAccessorImpl.invoke(NativeMethodAccessorImpl.java:62)
	at java.base/jdk.internal.reflect.DelegatingMethodAccessorImpl.invoke(DelegatingMethodAccessorImpl.java:43)
	at java.base/java.lang.reflect.Method.invoke(Method.java:564)
	at com.carrotsearch.randomizedtesting.RandomizedRunner.invoke(RandomizedRunner.java:1713)
	at com.carrotsearch.randomizedtesting.RandomizedRunner$8.evaluate(RandomizedRunner.java:907)
	at com.carrotsearch.randomizedtesting.RandomizedRunner$9.evaluate(RandomizedRunner.java:943)
	at com.carrotsearch.randomizedtesting.RandomizedRunner$10.evaluate(RandomizedRunner.java:957)
	at com.carrotsearch.randomizedtesting.rules.SystemPropertiesRestoreRule$1.evaluate(SystemPropertiesRestoreRule.java:57)
	at org.apache.lucene.util.TestRuleSetupTeardownChained$1.evaluate(TestRuleSetupTeardownChained.java:49)
	at org.apache.lucene.util.AbstractBeforeAfterRule$1.evaluate(AbstractBeforeAfterRule.java:45)
	at org.apache.lucene.util.TestRuleThreadAndTestName$1.evaluate(TestRuleThreadAndTestName.java:48)
	at org.apache.lucene.util.TestRuleIgnoreAfterMaxFailures$1.evaluate(TestRuleIgnoreAfterMaxFailures.java:64)
	at org.apache.lucene.util.TestRuleMarkFailure$1.evaluate(TestRuleMarkFailure.java:47)
	at com.carrotsearch.randomizedtesting.rules.StatementAdapter.evaluate(StatementAdapter.java:36)
	at com.carrotsearch.randomizedtesting.ThreadLeakControl$StatementRunner.run(ThreadLeakControl.java:368)
	at com.carrotsearch.randomizedtesting.ThreadLeakControl.forkTimeoutingTask(ThreadLeakControl.java:817)
	at com.carrotsearch.randomizedtesting.ThreadLeakControl$3.evaluate(ThreadLeakControl.java:468)
	at com.carrotsearch.randomizedtesting.RandomizedRunner.runSingleTest(RandomizedRunner.java:916)
	at com.carrotsearch.randomizedtesting.RandomizedRunner$5.evaluate(RandomizedRunner.java:802)
	at com.carrotsearch.randomizedtesting.RandomizedRunner$6.evaluate(RandomizedRunner.java:852)
	at com.carrotsearch.randomizedtesting.RandomizedRunner$7.evaluate(RandomizedRunner.java:863)
	at com.carrotsearch.randomizedtesting.rules.StatementAdapter.evaluate(StatementAdapter.java:36)
	at com.carrotsearch.randomizedtesting.rules.SystemPropertiesRestoreRule$1.evaluate(SystemPropertiesRestoreRule.java:57)
	at org.apache.lucene.util.AbstractBeforeAfterRule$1.evaluate(AbstractBeforeAfterRule.java:45)
	at com.carrotsearch.randomizedtesting.rules.StatementAdapter.evaluate(StatementAdapter.java:36)
	at org.apache.lucene.util.TestRuleStoreClassName$1.evaluate(TestRuleStoreClassName.java:41)
	at com.carrotsearch.randomizedtesting.rules.NoShadowingOrOverridesOnMethodsRule$1.evaluate(NoShadowingOrOverridesOnMethodsRule.java:40)
	at com.carrotsearch.randomizedtesting.rules.NoShadowingOrOverridesOnMethodsRule$1.evaluate(NoShadowingOrOverridesOnMethodsRule.java:40)
	at com.carrotsearch.randomizedtesting.rules.StatementAdapter.evaluate(StatementAdapter.java:36)
	at com.carrotsearch.randomizedtesting.rules.StatementAdapter.evaluate(StatementAdapter.java:36)
	at org.apache.lucene.util.TestRuleAssertionsRequired$1.evaluate(TestRuleAssertionsRequired.java:53)
	at org.apache.lucene.util.TestRuleMarkFailure$1.evaluate(TestRuleMarkFailure.java:47)
	at org.apache.lucene.util.TestRuleIgnoreAfterMaxFailures$1.evaluate(TestRuleIgnoreAfterMaxFailures.java:64)
	at org.apache.lucene.util.TestRuleIgnoreTestSuites$1.evaluate(TestRuleIgnoreTestSuites.java:54)
	at com.carrotsearch.randomizedtesting.rules.StatementAdapter.evaluate(StatementAdapter.java:36)
	at com.carrotsearch.randomizedtesting.ThreadLeakControl$StatementRunner.run(ThreadLeakControl.java:368)
	at java.base/java.lang.Thread.run(Thread.java:844)
Caused by: org.apache.solr.common.SolrException: Cannot use facet.mincount=0 on field number_p_f_dv which is Points-based
	at org.apache.solr.request.NumericFacets.getCountsSingleValue(NumericFacets.java:184)
	at org.apache.solr.request.NumericFacets.getCounts(NumericFacets.java:170)
	at org.apache.solr.request.SimpleFacets.getTermCounts(SimpleFacets.java:499)
	at org.apache.solr.request.SimpleFacets.getTermCounts(SimpleFacets.java:405)
	at org.apache.solr.request.SimpleFacets.lambda$getFacetFieldCounts$0(SimpleFacets.java:803)
	at java.base/java.util.concurrent.FutureTask.run(FutureTask.java:264)
	at org.apache.solr.request.SimpleFacets$3.execute(SimpleFacets.java:742)
	at org.apache.solr.request.SimpleFacets.getFacetFieldCounts(SimpleFacets.java:818)
	at org.apache.solr.handler.component.FacetComponent.getFacetCounts(FacetComponent.java:329)
	at org.apache.solr.handler.component.FacetComponent.process(FacetComponent.java:273)
	at org.apache.solr.handler.component.SearchHandler.handleRequestBody(SearchHandler.java:295)
	at org.apache.solr.handler.RequestHandlerBase.handleRequest(RequestHandlerBase.java:177)
	at org.apache.solr.core.SolrCore.execute(SolrCore.java:2473)
	at org.apache.solr.util.TestHarness.query(TestHarness.java:337)
	at org.apache.solr.util.TestHarness.query(TestHarness.java:319)
	at org.apache.solr.SolrTestCaseJ4.assertQ(SolrTestCaseJ4.java:860)
	... 41 more


FAILED:  org.apache.solr.schema.TestPointFields.testLongPointFieldFacetField

Error Message:
Exception during query

Stack Trace:
java.lang.RuntimeException: Exception during query
	at __randomizedtesting.SeedInfo.seed([1B55945534F06E:D1C2577FC3DF2D6F]:0)
	at org.apache.solr.SolrTestCaseJ4.assertQ(SolrTestCaseJ4.java:886)
	at org.apache.solr.SolrTestCaseJ4.assertQ(SolrTestCaseJ4.java:846)
	at org.apache.solr.schema.TestPointFields.doTestPointFieldFacetField(TestPointFields.java:2407)
	at org.apache.solr.schema.TestPointFields.testLongPointFieldFacetField(TestPointFields.java:1358)
	at java.base/jdk.internal.reflect.NativeMethodAccessorImpl.invoke0(Native Method)
	at java.base/jdk.internal.reflect.NativeMethodAccessorImpl.invoke(NativeMethodAccessorImpl.java:62)
	at java.base/jdk.internal.reflect.DelegatingMethodAccessorImpl.invoke(DelegatingMethodAccessorImpl.java:43)
	at java.base/java.lang.reflect.Method.invoke(Method.java:564)
	at com.carrotsearch.randomizedtesting.RandomizedRunner.invoke(RandomizedRunner.java:1713)
	at com.carrotsearch.randomizedtesting.RandomizedRunner$8.evaluate(RandomizedRunner.java:907)
	at com.carrotsearch.randomizedtesting.RandomizedRunner$9.evaluate(RandomizedRunner.java:943)
	at com.carrotsearch.randomizedtesting.RandomizedRunner$10.evaluate(RandomizedRunner.java:957)
	at com.carrotsearch.randomizedtesting.rules.SystemPropertiesRestoreRule$1.evaluate(SystemPropertiesRestoreRule.java:57)
	at org.apache.lucene.util.TestRuleSetupTeardownChained$1.evaluate(TestRuleSetupTeardownChained.java:49)
	at org.apache.lucene.util.AbstractBeforeAfterRule$1.evaluate(AbstractBeforeAfterRule.java:45)
	at org.apache.lucene.util.TestRuleThreadAndTestName$1.evaluate(TestRuleThreadAndTestName.java:48)
	at org.apache.lucene.util.TestRuleIgnoreAfterMaxFailures$1.evaluate(TestRuleIgnoreAfterMaxFailures.java:64)
	at org.apache.lucene.util.TestRuleMarkFailure$1.evaluate(TestRuleMarkFailure.java:47)
	at com.carrotsearch.randomizedtesting.rules.StatementAdapter.evaluate(StatementAdapter.java:36)
	at com.carrotsearch.randomizedtesting.ThreadLeakControl$StatementRunner.run(ThreadLeakControl.java:368)
	at com.carrotsearch.randomizedtesting.ThreadLeakControl.forkTimeoutingTask(ThreadLeakControl.java:817)
	at com.carrotsearch.randomizedtesting.ThreadLeakControl$3.evaluate(ThreadLeakControl.java:468)
	at com.carrotsearch.randomizedtesting.RandomizedRunner.runSingleTest(RandomizedRunner.java:916)
	at com.carrotsearch.randomizedtesting.RandomizedRunner$5.evaluate(RandomizedRunner.java:802)
	at com.carrotsearch.randomizedtesting.RandomizedRunner$6.evaluate(RandomizedRunner.java:852)
	at com.carrotsearch.randomizedtesting.RandomizedRunner$7.evaluate(RandomizedRunner.java:863)
	at com.carrotsearch.randomizedtesting.rules.StatementAdapter.evaluate(StatementAdapter.java:36)
	at com.carrotsearch.randomizedtesting.rules.SystemPropertiesRestoreRule$1.evaluate(SystemPropertiesRestoreRule.java:57)
	at org.apache.lucene.util.AbstractBeforeAfterRule$1.evaluate(AbstractBeforeAfterRule.java:45)
	at com.carrotsearch.randomizedtesting.rules.StatementAdapter.evaluate(StatementAdapter.java:36)
	at org.apache.lucene.util.TestRuleStoreClassName$1.evaluate(TestRuleStoreClassName.java:41)
	at com.carrotsearch.randomizedtesting.rules.NoShadowingOrOverridesOnMethodsRule$1.evaluate(NoShadowingOrOverridesOnMethodsRule.java:40)
	at com.carrotsearch.randomizedtesting.rules.NoShadowingOrOverridesOnMethodsRule$1.evaluate(NoShadowingOrOverridesOnMethodsRule.java:40)
	at com.carrotsearch.randomizedtesting.rules.StatementAdapter.evaluate(StatementAdapter.java:36)
	at com.carrotsearch.randomizedtesting.rules.StatementAdapter.evaluate(StatementAdapter.java:36)
	at org.apache.lucene.util.TestRuleAssertionsRequired$1.evaluate(TestRuleAssertionsRequired.java:53)
	at org.apache.lucene.util.TestRuleMarkFailure$1.evaluate(TestRuleMarkFailure.java:47)
	at org.apache.lucene.util.TestRuleIgnoreAfterMaxFailures$1.evaluate(TestRuleIgnoreAfterMaxFailures.java:64)
	at org.apache.lucene.util.TestRuleIgnoreTestSuites$1.evaluate(TestRuleIgnoreTestSuites.java:54)
	at com.carrotsearch.randomizedtesting.rules.StatementAdapter.evaluate(StatementAdapter.java:36)
	at com.carrotsearch.randomizedtesting.ThreadLeakControl$StatementRunner.run(ThreadLeakControl.java:368)
	at java.base/java.lang.Thread.run(Thread.java:844)
Caused by: org.apache.solr.common.SolrException: Cannot use facet.mincount=0 on field number_p_l_dv which is Points-based
	at org.apache.solr.request.NumericFacets.getCountsSingleValue(NumericFacets.java:184)
	at org.apache.solr.request.NumericFacets.getCounts(NumericFacets.java:170)
	at org.apache.solr.request.SimpleFacets.getTermCounts(SimpleFacets.java:499)
	at org.apache.solr.request.SimpleFacets.getTermCounts(SimpleFacets.java:405)
	at org.apache.solr.request.SimpleFacets.lambda$getFacetFieldCounts$0(SimpleFacets.java:803)
	at java.base/java.util.concurrent.FutureTask.run(FutureTask.java:264)
	at org.apache.solr.request.SimpleFacets$3.execute(SimpleFacets.java:742)
	at org.apache.solr.request.SimpleFacets.getFacetFieldCounts(SimpleFacets.java:818)
	at org.apache.solr.handler.component.FacetComponent.getFacetCounts(FacetComponent.java:329)
	at org.apache.solr.handler.component.FacetComponent.process(FacetComponent.java:273)
	at org.apache.solr.handler.component.SearchHandler.handleRequestBody(SearchHandler.java:295)
	at org.apache.solr.handler.RequestHandlerBase.handleRequest(RequestHandlerBase.java:177)
	at org.apache.solr.core.SolrCore.execute(SolrCore.java:2473)
	at org.apache.solr.util.TestHarness.query(TestHarness.java:337)
	at org.apache.solr.util.TestHarness.query(TestHarness.java:319)
	at org.apache.solr.SolrTestCaseJ4.assertQ(SolrTestCaseJ4.java:860)
	... 41 more


FAILED:  org.apache.solr.schema.TestPointFields.testDoublePointFieldFacetField

Error Message:
Exception during query

Stack Trace:
java.lang.RuntimeException: Exception during query
	at __randomizedtesting.SeedInfo.seed([1B55945534F06E:82A7DB545BCFD090]:0)
	at org.apache.solr.SolrTestCaseJ4.assertQ(SolrTestCaseJ4.java:886)
	at org.apache.solr.SolrTestCaseJ4.assertQ(SolrTestCaseJ4.java:846)
	at org.apache.solr.schema.TestPointFields.doTestPointFieldFacetField(TestPointFields.java:2407)
	at org.apache.solr.schema.TestPointFields.testDoublePointFieldFacetField(TestPointFields.java:597)
	at java.base/jdk.internal.reflect.NativeMethodAccessorImpl.invoke0(Native Method)
	at java.base/jdk.internal.reflect.NativeMethodAccessorImpl.invoke(NativeMethodAccessorImpl.java:62)
	at java.base/jdk.internal.reflect.DelegatingMethodAccessorImpl.invoke(DelegatingMethodAccessorImpl.java:43)
	at java.base/java.lang.reflect.Method.invoke(Method.java:564)
	at com.carrotsearch.randomizedtesting.RandomizedRunner.invoke(RandomizedRunner.java:1713)
	at com.carrotsearch.randomizedtesting.RandomizedRunner$8.evaluate(RandomizedRunner.java:907)
	at com.carrotsearch.randomizedtesting.RandomizedRunner$9.evaluate(RandomizedRunner.java:943)
	at com.carrotsearch.randomizedtesting.RandomizedRunner$10.evaluate(RandomizedRunner.java:957)
	at com.carrotsearch.randomizedtesting.rules.SystemPropertiesRestoreRule$1.evaluate(SystemPropertiesRestoreRule.java:57)
	at org.apache.lucene.util.TestRuleSetupTeardownChained$1.evaluate(TestRuleSetupTeardownChained.java:49)
	at org.apache.lucene.util.AbstractBeforeAfterRule$1.evaluate(AbstractBeforeAfterRule.java:45)
	at org.apache.lucene.util.TestRuleThreadAndTestName$1.evaluate(TestRuleThreadAndTestName.java:48)
	at org.apache.lucene.util.TestRuleIgnoreAfterMaxFailures$1.evaluate(TestRuleIgnoreAfterMaxFailures.java:64)
	at org.apache.lucene.util.TestRuleMarkFailure$1.evaluate(TestRuleMarkFailure.java:47)
	at com.carrotsearch.randomizedtesting.rules.StatementAdapter.evaluate(StatementAdapter.java:36)
	at com.carrotsearch.randomizedtesting.ThreadLeakControl$StatementRunner.run(ThreadLeakControl.java:368)
	at com.carrotsearch.randomizedtesting.ThreadLeakControl.forkTimeoutingTask(ThreadLeakControl.java:817)
	at com.carrotsearch.randomizedtesting.ThreadLeakControl$3.evaluate(ThreadLeakControl.java:468)
	at com.carrotsearch.randomizedtesting.RandomizedRunner.runSingleTest(RandomizedRunner.java:916)
	at com.carrotsearch.randomizedtesting.RandomizedRunner$5.evaluate(RandomizedRunner.java:802)
	at com.carrotsearch.randomizedtesting.RandomizedRunner$6.evaluate(RandomizedRunner.java:852)
	at com.carrotsearch.randomizedtesting.RandomizedRunner$7.evaluate(RandomizedRunner.java:863)
	at com.carrotsearch.randomizedtesting.rules.StatementAdapter.evaluate(StatementAdapter.java:36)
	at com.carrotsearch.randomizedtesting.rules.SystemPropertiesRestoreRule$1.evaluate(SystemPropertiesRestoreRule.java:57)
	at org.apache.lucene.util.AbstractBeforeAfterRule$1.evaluate(AbstractBeforeAfterRule.java:45)
	at com.carrotsearch.randomizedtesting.rules.StatementAdapter.evaluate(StatementAdapter.java:36)
	at org.apache.lucene.util.TestRuleStoreClassName$1.evaluate(TestRuleStoreClassName.java:41)
	at com.carrotsearch.randomizedtesting.rules.NoShadowingOrOverridesOnMethodsRule$1.evaluate(NoShadowingOrOverridesOnMethodsRule.java:40)
	at com.carrotsearch.randomizedtesting.rules.NoShadowingOrOverridesOnMethodsRule$1.evaluate(NoShadowingOrOverridesOnMethodsRule.java:40)
	at com.carrotsearch.randomizedtesting.rules.StatementAdapter.evaluate(StatementAdapter.java:36)
	at com.carrotsearch.randomizedtesting.rules.StatementAdapter.evaluate(StatementAdapter.java:36)
	at org.apache.lucene.util.TestRuleAssertionsRequired$1.evaluate(TestRuleAssertionsRequired.java:53)
	at org.apache.lucene.util.TestRuleMarkFailure$1.evaluate(TestRuleMarkFailure.java:47)
	at org.apache.lucene.util.TestRuleIgnoreAfterMaxFailures$1.evaluate(TestRuleIgnoreAfterMaxFailures.java:64)
	at org.apache.lucene.util.TestRuleIgnoreTestSuites$1.evaluate(TestRuleIgnoreTestSuites.java:54)
	at com.carrotsearch.randomizedtesting.rules.StatementAdapter.evaluate(StatementAdapter.java:36)
	at com.carrotsearch.randomizedtesting.ThreadLeakControl$StatementRunner.run(ThreadLeakControl.java:368)
	at java.base/java.lang.Thread.run(Thread.java:844)
Caused by: org.apache.solr.common.SolrException: Cannot use facet.mincount=0 on field number_p_d_dv which is Points-based
	at org.apache.solr.request.NumericFacets.getCountsSingleValue(NumericFacets.java:184)
	at org.apache.solr.request.NumericFacets.getCounts(NumericFacets.java:170)
	at org.apache.solr.request.SimpleFacets.getTermCounts(SimpleFacets.java:499)
	at org.apache.solr.request.SimpleFacets.getTermCounts(SimpleFacets.java:405)
	at org.apache.solr.request.SimpleFacets.lambda$getFacetFieldCounts$0(SimpleFacets.java:803)
	at java.base/java.util.concurrent.FutureTask.run(FutureTask.java:264)
	at org.apache.solr.request.SimpleFacets$3.execute(SimpleFacets.java:742)
	at org.apache.solr.request.SimpleFacets.getFacetFieldCounts(SimpleFacets.java:818)
	at org.apache.solr.handler.component.FacetComponent.getFacetCounts(FacetComponent.java:329)
	at org.apache.solr.handler.component.FacetComponent.process(FacetComponent.java:273)
	at org.apache.solr.handler.component.SearchHandler.handleRequestBody(SearchHandler.java:295)
	at org.apache.solr.handler.RequestHandlerBase.handleRequest(RequestHandlerBase.java:177)
	at org.apache.solr.core.SolrCore.execute(SolrCore.java:2473)
	at org.apache.solr.util.TestHarness.query(TestHarness.java:337)
	at org.apache.solr.util.TestHarness.query(TestHarness.java:319)
	at org.apache.solr.SolrTestCaseJ4.assertQ(SolrTestCaseJ4.java:860)
	... 41 more


FAILED:  org.apache.solr.schema.TestPointFields.testIntPointFieldFacetField

Error Message:
Exception during query

Stack Trace:
java.lang.RuntimeException: Exception during query
	at __randomizedtesting.SeedInfo.seed([1B55945534F06E:331D5CE2019999F4]:0)
	at org.apache.solr.SolrTestCaseJ4.assertQ(SolrTestCaseJ4.java:886)
	at org.apache.solr.SolrTestCaseJ4.assertQ(SolrTestCaseJ4.java:846)
	at org.apache.solr.schema.TestPointFields.doTestPointFieldFacetField(TestPointFields.java:2407)
	at org.apache.solr.schema.TestPointFields.testIntPointFieldFacetField(TestPointFields.java:196)
	at java.base/jdk.internal.reflect.NativeMethodAccessorImpl.invoke0(Native Method)
	at java.base/jdk.internal.reflect.NativeMethodAccessorImpl.invoke(NativeMethodAccessorImpl.java:62)
	at java.base/jdk.internal.reflect.DelegatingMethodAccessorImpl.invoke(DelegatingMethodAccessorImpl.java:43)
	at java.base/java.lang.reflect.Method.invoke(Method.java:564)
	at com.carrotsearch.randomizedtesting.RandomizedRunner.invoke(RandomizedRunner.java:1713)
	at com.carrotsearch.randomizedtesting.RandomizedRunner$8.evaluate(RandomizedRunner.java:907)
	at com.carrotsearch.randomizedtesting.RandomizedRunner$9.evaluate(RandomizedRunner.java:943)
	at com.carrotsearch.randomizedtesting.RandomizedRunner$10.evaluate(RandomizedRunner.java:957)
	at com.carrotsearch.randomizedtesting.rules.SystemPropertiesRestoreRule$1.evaluate(SystemPropertiesRestoreRule.java:57)
	at org.apache.lucene.util.TestRuleSetupTeardownChained$1.evaluate(TestRuleSetupTeardownChained.java:49)
	at org.apache.lucene.util.AbstractBeforeAfterRule$1.evaluate(AbstractBeforeAfterRule.java:45)
	at org.apache.lucene.util.TestRuleThreadAndTestName$1.evaluate(TestRuleThreadAndTestName.java:48)
	at org.apache.lucene.util.TestRuleIgnoreAfterMaxFailures$1.evaluate(TestRuleIgnoreAfterMaxFailures.java:64)
	at org.apache.lucene.util.TestRuleMarkFailure$1.evaluate(TestRuleMarkFailure.java:47)
	at com.carrotsearch.randomizedtesting.rules.StatementAdapter.evaluate(StatementAdapter.java:36)
	at com.carrotsearch.randomizedtesting.ThreadLeakControl$StatementRunner.run(ThreadLeakControl.java:368)
	at com.carrotsearch.randomizedtesting.ThreadLeakControl.forkTimeoutingTask(ThreadLeakControl.java:817)
	at com.carrotsearch.randomizedtesting.ThreadLeakControl$3.evaluate(ThreadLeakControl.java:468)
	at com.carrotsearch.randomizedtesting.RandomizedRunner.runSingleTest(RandomizedRunner.java:916)
	at com.carrotsearch.randomizedtesting.RandomizedRunner$5.evaluate(RandomizedRunner.java:802)
	at com.carrotsearch.randomizedtesting.RandomizedRunner$6.evaluate(RandomizedRunner.java:852)
	at com.carrotsearch.randomizedtesting.RandomizedRunner$7.evaluate(RandomizedRunner.java:863)
	at com.carrotsearch.randomizedtesting.rules.StatementAdapter.evaluate(StatementAdapter.java:36)
	at com.carrotsearch.randomizedtesting.rules.SystemPropertiesRestoreRule$1.evaluate(SystemPropertiesRestoreRule.java:57)
	at org.apache.lucene.util.AbstractBeforeAfterRule$1.evaluate(AbstractBeforeAfterRule.java:45)
	at com.carrotsearch.randomizedtesting.rules.StatementAdapter.evaluate(StatementAdapter.java:36)
	at org.apache.lucene.util.TestRuleStoreClassName$1.evaluate(TestRuleStoreClassName.java:41)
	at com.carrotsearch.randomizedtesting.rules.NoShadowingOrOverridesOnMethodsRule$1.evaluate(NoShadowingOrOverridesOnMethodsRule.java:40)
	at com.carrotsearch.randomizedtesting.rules.NoShadowingOrOverridesOnMethodsRule$1.evaluate(NoShadowingOrOverridesOnMethodsRule.java:40)
	at com.carrotsearch.randomizedtesting.rules.StatementAdapter.evaluate(StatementAdapter.java:36)
	at com.carrotsearch.randomizedtesting.rules.StatementAdapter.evaluate(StatementAdapter.java:36)
	at org.apache.lucene.util.TestRuleAssertionsRequired$1.evaluate(TestRuleAssertionsRequired.java:53)
	at org.apache.lucene.util.TestRuleMarkFailure$1.evaluate(TestRuleMarkFailure.java:47)
	at org.apache.lucene.util.TestRuleIgnoreAfterMaxFailures$1.evaluate(TestRuleIgnoreAfterMaxFailures.java:64)
	at org.apache.lucene.util.TestRuleIgnoreTestSuites$1.evaluate(TestRuleIgnoreTestSuites.java:54)
	at com.carrotsearch.randomizedtesting.rules.StatementAdapter.evaluate(StatementAdapter.java:36)
	at com.carrotsearch.randomizedtesting.ThreadLeakControl$StatementRunner.run(ThreadLeakControl.java:368)
	at java.base/java.lang.Thread.run(Thread.java:844)
Caused by: org.apache.solr.common.SolrException: Cannot use facet.mincount=0 on field number_p_i_dv which is Points-based
	at org.apache.solr.request.NumericFacets.getCountsSingleValue(NumericFacets.java:184)
	at org.apache.solr.request.NumericFacets.getCounts(NumericFacets.java:170)
	at org.apache.solr.request.SimpleFacets.getTermCounts(SimpleFacets.java:499)
	at org.apache.solr.request.SimpleFacets.getTermCounts(SimpleFacets.java:405)
	at org.apache.solr.request.SimpleFacets.lambda$getFacetFieldCounts$0(SimpleFacets.java:803)
	at java.base/java.util.concurrent.FutureTask.run(FutureTask.java:264)
	at org.apache.solr.request.SimpleFacets$3.execute(SimpleFacets.java:742)
	at org.apache.solr.request.SimpleFacets.getFacetFieldCounts(SimpleFacets.java:818)
	at org.apache.solr.handler.component.FacetComponent.getFacetCounts(FacetComponent.java:329)
	at org.apache.solr.handler.component.FacetComponent.process(FacetComponent.java:273)
	at org.apache.solr.handler.component.SearchHandler.handleRequestBody(SearchHandler.java:295)
	at org.apache.solr.handler.RequestHandlerBase.handleRequest(RequestHandlerBase.java:177)
	at org.apache.solr.core.SolrCore.execute(SolrCore.java:2473)
	at org.apache.solr.util.TestHarness.query(TestHarness.java:337)
	at org.apache.solr.util.TestHarness.query(TestHarness.java:319)
	at org.apache.solr.SolrTestCaseJ4.assertQ(SolrTestCaseJ4.java:860)
	... 41 more


FAILED:  org.apache.solr.schema.TestPointFields.testDatePointFieldFacetField

Error Message:
Exception during query

Stack Trace:
java.lang.RuntimeException: Exception during query
	at __randomizedtesting.SeedInfo.seed([1B55945534F06E:1EA1E1354B1D0507]:0)
	at org.apache.solr.SolrTestCaseJ4.assertQ(SolrTestCaseJ4.java:886)
	at org.apache.solr.SolrTestCaseJ4.assertQ(SolrTestCaseJ4.java:846)
	at org.apache.solr.schema.TestPointFields.doTestPointFieldFacetField(TestPointFields.java:2407)
	at org.apache.solr.schema.TestPointFields.testDatePointFieldFacetField(TestPointFields.java:1700)
	at java.base/jdk.internal.reflect.NativeMethodAccessorImpl.invoke0(Native Method)
	at java.base/jdk.internal.reflect.NativeMethodAccessorImpl.invoke(NativeMethodAccessorImpl.java:62)
	at java.base/jdk.internal.reflect.DelegatingMethodAccessorImpl.invoke(DelegatingMethodAccessorImpl.java:43)
	at java.base/java.lang.reflect.Method.invoke(Method.java:564)
	at com.carrotsearch.randomizedtesting.RandomizedRunner.invoke(RandomizedRunner.java:1713)
	at com.carrotsearch.randomizedtesting.RandomizedRunner$8.evaluate(RandomizedRunner.java:907)
	at com.carrotsearch.randomizedtesting.RandomizedRunner$9.evaluate(RandomizedRunner.java:943)
	at com.carrotsearch.randomizedtesting.RandomizedRunner$10.evaluate(RandomizedRunner.java:957)
	at com.carrotsearch.randomizedtesting.rules.SystemPropertiesRestoreRule$1.evaluate(SystemPropertiesRestoreRule.java:57)
	at org.apache.lucene.util.TestRuleSetupTeardownChained$1.evaluate(TestRuleSetupTeardownChained.java:49)
	at org.apache.lucene.util.AbstractBeforeAfterRule$1.evaluate(AbstractBeforeAfterRule.java:45)
	at org.apache.lucene.util.TestRuleThreadAndTestName$1.evaluate(TestRuleThreadAndTestName.java:48)
	at org.apache.lucene.util.TestRuleIgnoreAfterMaxFailures$1.evaluate(TestRuleIgnoreAfterMaxFailures.java:64)
	at org.apache.lucene.util.TestRuleMarkFailure$1.evaluate(TestRuleMarkFailure.java:47)
	at com.carrotsearch.randomizedtesting.rules.StatementAdapter.evaluate(StatementAdapter.java:36)
	at com.carrotsearch.randomizedtesting.ThreadLeakControl$StatementRunner.run(ThreadLeakControl.java:368)
	at com.carrotsearch.randomizedtesting.ThreadLeakControl.forkTimeoutingTask(ThreadLeakControl.java:817)
	at com.carrotsearch.randomizedtesting.ThreadLeakControl$3.evaluate(ThreadLeakControl.java:468)
	at com.carrotsearch.randomizedtesting.RandomizedRunner.runSingleTest(RandomizedRunner.java:916)
	at com.carrotsearch.randomizedtesting.RandomizedRunner$5.evaluate(RandomizedRunner.java:802)
	at com.carrotsearch.randomizedtesting.RandomizedRunner$6.evaluate(RandomizedRunner.java:852)
	at com.carrotsearch.randomizedtesting.RandomizedRunner$7.evaluate(RandomizedRunner.java:863)
	at com.carrotsearch.randomizedtesting.rules.StatementAdapter.evaluate(StatementAdapter.java:36)
	at com.carrotsearch.randomizedtesting.rules.SystemPropertiesRestoreRule$1.evaluate(SystemPropertiesRestoreRule.java:57)
	at org.apache.lucene.util.AbstractBeforeAfterRule$1.evaluate(AbstractBeforeAfterRule.java:45)
	at com.carrotsearch.randomizedtesting.rules.StatementAdapter.evaluate(StatementAdapter.java:36)
	at org.apache.lucene.util.TestRuleStoreClassName$1.evaluate(TestRuleStoreClassName.java:41)
	at com.carrotsearch.randomizedtesting.rules.NoShadowingOrOverridesOnMethodsRule$1.evaluate(NoShadowingOrOverridesOnMethodsRule.java:40)
	at com.carrotsearch.randomizedtesting.rules.NoShadowingOrOverridesOnMethodsRule$1.evaluate(NoShadowingOrOverridesOnMethodsRule.java:40)
	at com.carrotsearch.randomizedtesting.rules.StatementAdapter.evaluate(StatementAdapter.java:36)
	at com.carrotsearch.randomizedtesting.rules.StatementAdapter.evaluate(StatementAdapter.java:36)
	at org.apache.lucene.util.TestRuleAssertionsRequired$1.evaluate(TestRuleAssertionsRequired.java:53)
	at org.apache.lucene.util.TestRuleMarkFailure$1.evaluate(TestRuleMarkFailure.java:47)
	at org.apache.lucene.util.TestRuleIgnoreAfterMaxFailures$1.evaluate(TestRuleIgnoreAfterMaxFailures.java:64)
	at org.apache.lucene.util.TestRuleIgnoreTestSuites$1.evaluate(TestRuleIgnoreTestSuites.java:54)
	at com.carrotsearch.randomizedtesting.rules.StatementAdapter.evaluate(StatementAdapter.java:36)
	at com.carrotsearch.randomizedtesting.ThreadLeakControl$StatementRunner.run(ThreadLeakControl.java:368)
	at java.base/java.lang.Thread.run(Thread.java:844)
Caused by: org.apache.solr.common.SolrException: Cannot use facet.mincount=0 on field number_p_dt_dv which is Points-based
	at org.apache.solr.request.NumericFacets.getCountsSingleValue(NumericFacets.java:184)
	at org.apache.solr.request.NumericFacets.getCounts(NumericFacets.java:170)
	at org.apache.solr.request.SimpleFacets.getTermCounts(SimpleFacets.java:499)
	at org.apache.solr.request.SimpleFacets.getTermCounts(SimpleFacets.java:405)
	at org.apache.solr.request.SimpleFacets.lambda$getFacetFieldCounts$0(SimpleFacets.java:803)
	at java.base/java.util.concurrent.FutureTask.run(FutureTask.java:264)
	at org.apache.solr.request.SimpleFacets$3.execute(SimpleFacets.java:742)
	at org.apache.solr.request.SimpleFacets.getFacetFieldCounts(SimpleFacets.java:818)
	at org.apache.solr.handler.component.FacetComponent.getFacetCounts(FacetComponent.java:329)
	at org.apache.solr.handler.component.FacetComponent.process(FacetComponent.java:273)
	at org.apache.solr.handler.component.SearchHandler.handleRequestBody(SearchHandler.java:295)
	at org.apache.solr.handler.RequestHandlerBase.handleRequest(RequestHandlerBase.java:177)
	at org.apache.solr.core.SolrCore.execute(SolrCore.java:2473)
	at org.apache.solr.util.TestHarness.query(TestHarness.java:337)
	at org.apache.solr.util.TestHarness.query(TestHarness.java:319)
	at org.apache.solr.SolrTestCaseJ4.assertQ(SolrTestCaseJ4.java:860)
	... 41 more


FAILED:  org.apache.solr.schema.TestPointFields.testIntPointFieldMultiValuedFacetField

Error Message:
Exception during query

Stack Trace:
java.lang.RuntimeException: Exception during query
	at __randomizedtesting.SeedInfo.seed([1B55945534F06E:BEDA034B1FCDE07C]:0)
	at org.apache.solr.SolrTestCaseJ4.assertQ(SolrTestCaseJ4.java:886)
	at org.apache.solr.SolrTestCaseJ4.assertQ(SolrTestCaseJ4.java:846)
	at org.apache.solr.schema.TestPointFields.doTestPointFieldMultiValuedFacetField(TestPointFields.java:2749)
	at org.apache.solr.schema.TestPointFields.testIntPointFieldMultiValuedFacetField(TestPointFields.java:321)
	at java.base/jdk.internal.reflect.NativeMethodAccessorImpl.invoke0(Native Method)
	at java.base/jdk.internal.reflect.NativeMethodAccessorImpl.invoke(NativeMethodAccessorImpl.java:62)
	at java.base/jdk.internal.reflect.DelegatingMethodAccessorImpl.invoke(DelegatingMethodAccessorImpl.java:43)
	at java.base/java.lang.reflect.Method.invoke(Method.java:564)
	at com.carrotsearch.randomizedtesting.RandomizedRunner.invoke(RandomizedRunner.java:1713)
	at com.carrotsearch.randomizedtesting.RandomizedRunner$8.evaluate(RandomizedRunner.java:907)
	at com.carrotsearch.randomizedtesting.RandomizedRunner$9.evaluate(RandomizedRunner.java:943)
	at com.carrotsearch.randomizedtesting.RandomizedRunner$10.evaluate(RandomizedRunner.java:957)
	at com.carrotsearch.randomizedtesting.rules.SystemPropertiesRestoreRule$1.evaluate(SystemPropertiesRestoreRule.java:57)
	at org.apache.lucene.util.TestRuleSetupTeardownChained$1.evaluate(TestRuleSetupTeardownChained.java:49)
	at org.apache.lucene.util.AbstractBeforeAfterRule$1.evaluate(AbstractBeforeAfterRule.java:45)
	at org.apache.lucene.util.TestRuleThreadAndTestName$1.evaluate(TestRuleThreadAndTestName.java:48)
	at org.apache.lucene.util.TestRuleIgnoreAfterMaxFailures$1.evaluate(TestRuleIgnoreAfterMaxFailures.java:64)
	at org.apache.lucene.util.TestRuleMarkFailure$1.evaluate(TestRuleMarkFailure.java:47)
	at com.carrotsearch.randomizedtesting.rules.StatementAdapter.evaluate(StatementAdapter.java:36)
	at com.carrotsearch.randomizedtesting.ThreadLeakControl$StatementRunner.run(ThreadLeakControl.java:368)
	at com.carrotsearch.randomizedtesting.ThreadLeakControl.forkTimeoutingTask(ThreadLeakControl.java:817)
	at com.carrotsearch.randomizedtesting.ThreadLeakControl$3.evaluate(ThreadLeakControl.java:468)
	at com.ca

[...truncated too long message...]

inCorpus.shard2.leader, tag=6599844
   [junit4]   2> 200213 INFO  (coreCloseExecutor-708-thread-3) [    ] o.a.s.m.SolrMetricManager Closing metric reporters for registry=solr.core.destination.shard2.replica_n2, tag=3049451
   [junit4]   2> 200217 INFO  (coreCloseExecutor-709-thread-1) [    ] o.a.s.m.SolrMetricManager Closing metric reporters for registry=solr.collection.mainCorpus.shard1.leader, tag=17168195
   [junit4]   2> 200218 INFO  (coreCloseExecutor-707-thread-2) [    ] o.a.s.m.SolrMetricManager Closing metric reporters for registry=solr.collection.workQueue.shard2.leader, tag=2878514
   [junit4]   2> 200221 INFO  (coreCloseExecutor-708-thread-3) [    ] o.a.s.m.SolrMetricManager Closing metric reporters for registry=solr.collection.destination.shard2.leader, tag=3049451
   [junit4]   2> 200221 INFO  (coreCloseExecutor-710-thread-1) [    ] o.a.s.m.SolrMetricManager Closing metric reporters for registry=solr.collection.collection1_collection.shard1.leader, tag=15439263
   [junit4]   2> 200221 INFO  (coreCloseExecutor-707-thread-3) [    ] o.a.s.m.SolrMetricManager Closing metric reporters for registry=solr.core.destination.shard1.replica_n1, tag=20157318
   [junit4]   2> 200227 INFO  (jetty-closer-836-thread-2) [    ] o.e.j.s.h.ContextHandler Stopped o.e.j.s.ServletContextHandler@121c20a{/solr,null,UNAVAILABLE}
   [junit4]   2> 200229 INFO  (coreCloseExecutor-707-thread-3) [    ] o.a.s.m.SolrMetricManager Closing metric reporters for registry=solr.collection.destination.shard1.leader, tag=20157318
   [junit4]   2> 200230 INFO  (zkCallback-855-thread-1) [    ] o.a.s.c.c.ZkStateReader Updated live nodes from ZooKeeper... (4) -> (3)
   [junit4]   2> 200230 INFO  (zkCallback-854-thread-2) [    ] o.a.s.c.c.ZkStateReader Updated live nodes from ZooKeeper... (4) -> (3)
   [junit4]   2> 200230 INFO  (zkCallback-857-thread-2) [    ] o.a.s.c.c.ZkStateReader Updated live nodes from ZooKeeper... (4) -> (3)
   [junit4]   2> 200232 INFO  (jetty-closer-836-thread-3) [    ] o.a.s.c.Overseer Overseer (id=98407541644918794-127.0.0.1:60622_solr-n_0000000000) closing
   [junit4]   2> 200233 INFO  (OverseerStateUpdate-98407541644918794-127.0.0.1:60622_solr-n_0000000000) [    ] o.a.s.c.Overseer Overseer Loop exiting : 127.0.0.1:60622_solr
   [junit4]   2> 200236 WARN  (zkCallback-857-thread-2) [    ] o.a.s.c.c.ZkStateReader ZooKeeper watch triggered, but Solr cannot talk to ZK: [KeeperErrorCode = Session expired for /live_nodes]
   [junit4]   2> 200237 INFO  (jetty-closer-836-thread-1) [    ] o.e.j.s.h.ContextHandler Stopped o.e.j.s.ServletContextHandler@1d990a8{/solr,null,UNAVAILABLE}
   [junit4]   2> 200237 INFO  (zkCallback-854-thread-2) [    ] o.a.s.c.c.ZkStateReader Updated live nodes from ZooKeeper... (3) -> (1)
   [junit4]   2> 200237 INFO  (zkCallback-854-thread-1) [    ] o.a.s.c.OverseerElectionContext I am going to be the leader 127.0.0.1:60630_solr
   [junit4]   2> 200242 INFO  (coreCloseExecutor-708-thread-1) [    ] o.a.s.m.SolrMetricManager Closing metric reporters for registry=solr.core.workQueue.shard1.replica_n1, tag=17442454
   [junit4]   2> 200246 INFO  (coreCloseExecutor-708-thread-1) [    ] o.a.s.m.SolrMetricManager Closing metric reporters for registry=solr.collection.workQueue.shard1.leader, tag=17442454
   [junit4]   2> 200248 WARN  (zkCallback-854-thread-1) [    ] o.a.s.c.c.ZkStateReader ZooKeeper watch triggered, but Solr cannot talk to ZK: [KeeperErrorCode = Session expired for /live_nodes]
   [junit4]   2> 200249 INFO  (jetty-closer-836-thread-4) [    ] o.e.j.s.h.ContextHandler Stopped o.e.j.s.ServletContextHandler@ccb028{/solr,null,UNAVAILABLE}
   [junit4]   2> 201736 WARN  (zkCallback-855-thread-1) [    ] o.a.s.c.c.ZkStateReader ZooKeeper watch triggered, but Solr cannot talk to ZK: [KeeperErrorCode = Session expired for /live_nodes]
   [junit4]   2> 201736 INFO  (jetty-closer-836-thread-3) [    ] o.e.j.s.h.ContextHandler Stopped o.e.j.s.ServletContextHandler@2faae0{/solr,null,UNAVAILABLE}
   [junit4]   2> 201737 ERROR (SUITE-StreamExpressionTest-seed#[8F11632C68E403FC]-worker) [    ] o.a.z.s.ZooKeeperServer ZKShutdownHandler is not registered, so ZooKeeper server won't take any action on ERROR or SHUTDOWN server state changes
   [junit4]   2> 201737 INFO  (SUITE-StreamExpressionTest-seed#[8F11632C68E403FC]-worker) [    ] o.a.s.c.ZkTestServer connecting to 127.0.0.1:60618 60618
   [junit4]   2> 201739 INFO  (Thread-422) [    ] o.a.s.c.ZkTestServer connecting to 127.0.0.1:60618 60618
   [junit4]   2> 201740 WARN  (Thread-422) [    ] o.a.s.c.ZkTestServer Watch limit violations: 
   [junit4]   2> Maximum concurrent create/delete watches above limit:
   [junit4]   2> 
   [junit4]   2> 	69	/solr/aliases.json
   [junit4]   2> 	69	/solr/clusterprops.json
   [junit4]   2> 	7	/solr/configs/conf
   [junit4]   2> 	4	/solr/security.json
   [junit4]   2> 
   [junit4]   2> Maximum concurrent data watches above limit:
   [junit4]   2> 
   [junit4]   2> 	69	/solr/clusterstate.json
   [junit4]   2> 	20	/solr/collections/destination/state.json
   [junit4]   2> 	20	/solr/collections/parallelDestinationCollection/state.json
   [junit4]   2> 	20	/solr/collections/destinationCollection/state.json
   [junit4]   2> 	20	/solr/collections/mainCorpus/state.json
   [junit4]   2> 	18	/solr/collections/workQueue/state.json
   [junit4]   2> 	18	/solr/collections/parallelDestinationCollection1/state.json
   [junit4]   2> 	10	/solr/collections/collection1_collection/state.json
   [junit4]   2> 
   [junit4]   2> Maximum concurrent children watches above limit:
   [junit4]   2> 
   [junit4]   2> 	69	/solr/live_nodes
   [junit4]   2> 	69	/solr/collections
   [junit4]   2> 
   [junit4]   2> NOTE: leaving temporary files on disk at: C:\Users\jenkins\workspace\Lucene-Solr-7.x-Windows\solr\build\solr-solrj\test\J1\temp\solr.client.solrj.io.stream.StreamExpressionTest_8F11632C68E403FC-001
   [junit4]   2> Aug 01, 2017 9:33:14 AM com.carrotsearch.randomizedtesting.ThreadLeakControl checkThreadLeaks
   [junit4]   2> WARNING: Will linger awaiting termination of 1 leaked thread(s).
   [junit4]   2> NOTE: test params are: codec=Asserting(Lucene70): {expr_s=Lucene50(blocksize=128), join2_s=PostingsFormat(name=LuceneVarGapDocFreqInterval), multiDefault=PostingsFormat(name=LuceneVarGapDocFreqInterval), subject=PostingsFormat(name=LuceneVarGapDocFreqInterval), a1_s=PostingsFormat(name=LuceneVarGapFixedInterval), a2_s=Lucene50(blocksize=128), test_t=PostingsFormat(name=LuceneFixedGap), level1_s=Lucene50(blocksize=128), body_t=PostingsFormat(name=LuceneFixedGap), ident_s=PostingsFormat(name=LuceneVarGapFixedInterval), s_multi=Lucene50(blocksize=128), level2_s=PostingsFormat(name=LuceneVarGapFixedInterval), col_s=PostingsFormat(name=LuceneVarGapFixedInterval), a_ss=PostingsFormat(name=LuceneVarGapDocFreqInterval), a_s=Lucene50(blocksize=128), a_t=PostingsFormat(name=LuceneVarGapDocFreqInterval), side_s=PostingsFormat(name=LuceneFixedGap), id=PostingsFormat(name=LuceneFixedGap), text=Lucene50(blocksize=128)}, docValues:{expr_s=DocValuesFormat(name=Lucene70), join2_s=DocValuesFormat(name=Memory), multiDefault=DocValuesFormat(name=Memory), a1_s=DocValuesFormat(name=Direct), price_f=DocValuesFormat(name=Memory), a_f=DocValuesFormat(name=Direct), intDefault=DocValuesFormat(name=Direct), a2_s=DocValuesFormat(name=Lucene70), join1_i=DocValuesFormat(name=Lucene70), a_i=DocValuesFormat(name=Lucene70), join3_i=DocValuesFormat(name=Lucene70), test_i=DocValuesFormat(name=Memory), field_i=DocValuesFormat(name=Memory), level1_s=DocValuesFormat(name=Lucene70), s_multi=DocValuesFormat(name=Lucene70), level2_s=DocValuesFormat(name=Direct), col_s=DocValuesFormat(name=Direct), a_ss=DocValuesFormat(name=Memory), a_s=DocValuesFormat(name=Lucene70), id=DocValuesFormat(name=Lucene70), timestamp=DocValuesFormat(name=Memory), i_multi=DocValuesFormat(name=Lucene70), b_ls=DocValuesFormat(name=Direct), test_dt=DocValuesFormat(name=Lucene70), ident_s=DocValuesFormat(name=Direct), order_i=DocValuesFormat(name=Memory), _version_=DocValuesFormat(name=Direct), side_s=DocValuesFormat(name=Lucene70), miles_i=DocValuesFormat(name=Direct)}, maxPointsInLeafNode=1683, maxMBSortInHeap=5.048611062654817, sim=RandomSimilarity(queryNorm=true): {}, locale=mas-KE, timezone=Etc/GMT-6
   [junit4]   2> NOTE: Windows 10 10.0 x86/Oracle Corporation 9 (32-bit)/cpus=3,threads=1,free=146832200,total=253755392
   [junit4]   2> NOTE: All tests run in this JVM: [TestDelegationTokenResponse, TestNamedListCodec, FacetFieldTest, TestJsonRecordReader, SolrQueryTest, LessThanEvaluatorTest, FloorEvaluatorTest, TestCollectionAdminRequest, ExclusiveOrEvaluatorTest, LengthEvaluatorTest, CosineEvaluatorTest, ClientUtilsTest, GraphTest, CloudSolrClientMultiConstructorTest, QueryResponseTest, TangentEvaluatorTest, JdbcTest, SolrExceptionTest, StreamingTest, CommonAdminParamsTest, ShardParamsTest, SolrExampleBinaryTest, TestToleratedUpdateError, StreamExpressionToExpessionTest, PowerEvaluatorTest, DivideEvaluatorTest, ContentStreamTest, GetByIdTest, AddEvaluatorTest, TestDelegationTokenRequest, DocumentAnalysisResponseTest, LargeVolumeBinaryJettyTest, SolrExampleStreamingTest, SolrExampleStreamingBinaryTest, SolrExampleXMLTest, SolrExampleJettyTest, LargeVolumeEmbeddedTest, LargeVolumeJettyTest, SolrParamTest, MergeIndexesEmbeddedTest, TestEmbeddedSolrServer, TestDocumentObjectBinder, ModifiableSolrParamsTest, TestFastInputStream, SolrDocumentTest, TestUpdateRequestCodec, FieldAnalysisResponseTest, NamedListTest, AnlysisResponseBaseTest, CollectionAdminRequestRequiredParamsTest, SolrSchemalessExampleTest, TestLBHttpSolrClient, TestPolicy, CloudSolrClientBuilderTest, ConcurrentUpdateSolrClientBuilderTest, HttpSolrClientBuilderTest, HttpSolrClientConPoolTest, TestCloudSolrClientConnections, SelectWithEvaluatorsTest, StreamExpressionTest]
   [junit4] Completed [135/135 (8!)] on J1 in 75.11s, 93 tests, 1 error, 9 skipped <<< FAILURES!

[...truncated 35682 lines...]

Mime
View raw message