lucene-dev mailing list archives

Site index · List index
Message view « Date » · « Thread »
Top « Date » · « Thread »
From Policeman Jenkins Server <jenk...@thetaphi.de>
Subject [JENKINS-EA] Lucene-Solr-master-Linux (64bit/jdk-9-ea+181) - Build # 20295 - Still Unstable!
Date Fri, 11 Aug 2017 01:49:18 GMT
Build: https://jenkins.thetaphi.de/job/Lucene-Solr-master-Linux/20295/
Java: 64bit/jdk-9-ea+181 -XX:-UseCompressedOops -XX:+UseParallelGC --illegal-access=deny

1 tests failed.
FAILED:  org.apache.solr.cloud.HttpPartitionTest.test

Error Message:
Doc with id=1 not found in http://127.0.0.1:45957/zu_/gw/collMinRf_1x3 due to: Path not found: /id; rsp={doc=null}

Stack Trace:
java.lang.AssertionError: Doc with id=1 not found in http://127.0.0.1:45957/zu_/gw/collMinRf_1x3 due to: Path not found: /id; rsp={doc=null}
	at __randomizedtesting.SeedInfo.seed([892434F3DB4A5409:1700B2975B639F1]:0)
	at org.junit.Assert.fail(Assert.java:93)
	at org.junit.Assert.assertTrue(Assert.java:43)
	at org.apache.solr.cloud.HttpPartitionTest.assertDocExists(HttpPartitionTest.java:603)
	at org.apache.solr.cloud.HttpPartitionTest.assertDocsExistInAllReplicas(HttpPartitionTest.java:558)
	at org.apache.solr.cloud.HttpPartitionTest.testMinRf(HttpPartitionTest.java:249)
	at org.apache.solr.cloud.HttpPartitionTest.test(HttpPartitionTest.java:127)
	at java.base/jdk.internal.reflect.NativeMethodAccessorImpl.invoke0(Native Method)
	at java.base/jdk.internal.reflect.NativeMethodAccessorImpl.invoke(NativeMethodAccessorImpl.java:62)
	at java.base/jdk.internal.reflect.DelegatingMethodAccessorImpl.invoke(DelegatingMethodAccessorImpl.java:43)
	at java.base/java.lang.reflect.Method.invoke(Method.java:564)
	at com.carrotsearch.randomizedtesting.RandomizedRunner.invoke(RandomizedRunner.java:1713)
	at com.carrotsearch.randomizedtesting.RandomizedRunner$8.evaluate(RandomizedRunner.java:907)
	at com.carrotsearch.randomizedtesting.RandomizedRunner$9.evaluate(RandomizedRunner.java:943)
	at com.carrotsearch.randomizedtesting.RandomizedRunner$10.evaluate(RandomizedRunner.java:957)
	at org.apache.solr.BaseDistributedSearchTestCase$ShardsRepeatRule$ShardsFixedStatement.callStatement(BaseDistributedSearchTestCase.java:993)
	at org.apache.solr.BaseDistributedSearchTestCase$ShardsRepeatRule$ShardsStatement.evaluate(BaseDistributedSearchTestCase.java:968)
	at com.carrotsearch.randomizedtesting.rules.SystemPropertiesRestoreRule$1.evaluate(SystemPropertiesRestoreRule.java:57)
	at org.apache.lucene.util.TestRuleSetupTeardownChained$1.evaluate(TestRuleSetupTeardownChained.java:49)
	at org.apache.lucene.util.AbstractBeforeAfterRule$1.evaluate(AbstractBeforeAfterRule.java:45)
	at org.apache.lucene.util.TestRuleThreadAndTestName$1.evaluate(TestRuleThreadAndTestName.java:48)
	at org.apache.lucene.util.TestRuleIgnoreAfterMaxFailures$1.evaluate(TestRuleIgnoreAfterMaxFailures.java:64)
	at org.apache.lucene.util.TestRuleMarkFailure$1.evaluate(TestRuleMarkFailure.java:47)
	at com.carrotsearch.randomizedtesting.rules.StatementAdapter.evaluate(StatementAdapter.java:36)
	at com.carrotsearch.randomizedtesting.ThreadLeakControl$StatementRunner.run(ThreadLeakControl.java:368)
	at com.carrotsearch.randomizedtesting.ThreadLeakControl.forkTimeoutingTask(ThreadLeakControl.java:817)
	at com.carrotsearch.randomizedtesting.ThreadLeakControl$3.evaluate(ThreadLeakControl.java:468)
	at com.carrotsearch.randomizedtesting.RandomizedRunner.runSingleTest(RandomizedRunner.java:916)
	at com.carrotsearch.randomizedtesting.RandomizedRunner$5.evaluate(RandomizedRunner.java:802)
	at com.carrotsearch.randomizedtesting.RandomizedRunner$6.evaluate(RandomizedRunner.java:852)
	at com.carrotsearch.randomizedtesting.RandomizedRunner$7.evaluate(RandomizedRunner.java:863)
	at com.carrotsearch.randomizedtesting.rules.StatementAdapter.evaluate(StatementAdapter.java:36)
	at com.carrotsearch.randomizedtesting.rules.SystemPropertiesRestoreRule$1.evaluate(SystemPropertiesRestoreRule.java:57)
	at org.apache.lucene.util.AbstractBeforeAfterRule$1.evaluate(AbstractBeforeAfterRule.java:45)
	at com.carrotsearch.randomizedtesting.rules.StatementAdapter.evaluate(StatementAdapter.java:36)
	at org.apache.lucene.util.TestRuleStoreClassName$1.evaluate(TestRuleStoreClassName.java:41)
	at com.carrotsearch.randomizedtesting.rules.NoShadowingOrOverridesOnMethodsRule$1.evaluate(NoShadowingOrOverridesOnMethodsRule.java:40)
	at com.carrotsearch.randomizedtesting.rules.NoShadowingOrOverridesOnMethodsRule$1.evaluate(NoShadowingOrOverridesOnMethodsRule.java:40)
	at com.carrotsearch.randomizedtesting.rules.StatementAdapter.evaluate(StatementAdapter.java:36)
	at com.carrotsearch.randomizedtesting.rules.StatementAdapter.evaluate(StatementAdapter.java:36)
	at org.apache.lucene.util.TestRuleAssertionsRequired$1.evaluate(TestRuleAssertionsRequired.java:53)
	at org.apache.lucene.util.TestRuleMarkFailure$1.evaluate(TestRuleMarkFailure.java:47)
	at org.apache.lucene.util.TestRuleIgnoreAfterMaxFailures$1.evaluate(TestRuleIgnoreAfterMaxFailures.java:64)
	at org.apache.lucene.util.TestRuleIgnoreTestSuites$1.evaluate(TestRuleIgnoreTestSuites.java:54)
	at com.carrotsearch.randomizedtesting.rules.StatementAdapter.evaluate(StatementAdapter.java:36)
	at com.carrotsearch.randomizedtesting.ThreadLeakControl$StatementRunner.run(ThreadLeakControl.java:368)
	at java.base/java.lang.Thread.run(Thread.java:844)




Build Log:
[...truncated 11372 lines...]
   [junit4] Suite: org.apache.solr.cloud.HttpPartitionTest
   [junit4]   2> Creating dataDir: /home/jenkins/workspace/Lucene-Solr-master-Linux/solr/build/solr-core/test/J2/temp/solr.cloud.HttpPartitionTest_892434F3DB4A5409-001/init-core-data-001
   [junit4]   2> 684985 WARN  (SUITE-HttpPartitionTest-seed#[892434F3DB4A5409]-worker) [    ] o.a.s.SolrTestCaseJ4 startTrackingSearchers: numOpens=10 numCloses=10
   [junit4]   2> 684985 INFO  (SUITE-HttpPartitionTest-seed#[892434F3DB4A5409]-worker) [    ] o.a.s.SolrTestCaseJ4 Using PointFields (NUMERIC_POINTS_SYSPROP=true) w/NUMERIC_DOCVALUES_SYSPROP=false
   [junit4]   2> 684986 INFO  (SUITE-HttpPartitionTest-seed#[892434F3DB4A5409]-worker) [    ] o.a.s.SolrTestCaseJ4 Randomized ssl (false) and clientAuth (false) via: @org.apache.solr.SolrTestCaseJ4$SuppressSSL(bugUrl="https://issues.apache.org/jira/browse/SOLR-5776")
   [junit4]   2> 684986 INFO  (SUITE-HttpPartitionTest-seed#[892434F3DB4A5409]-worker) [    ] o.a.s.SolrTestCaseJ4 SecureRandom sanity checks: test.solr.allowed.securerandom=null & java.security.egd=file:/dev/./urandom
   [junit4]   2> 684986 INFO  (SUITE-HttpPartitionTest-seed#[892434F3DB4A5409]-worker) [    ] o.a.s.BaseDistributedSearchTestCase Setting hostContext system property: /zu_/gw
   [junit4]   2> 684987 INFO  (TEST-HttpPartitionTest.test-seed#[892434F3DB4A5409]) [    ] o.a.s.c.ZkTestServer STARTING ZK TEST SERVER
   [junit4]   2> 684987 INFO  (Thread-1222) [    ] o.a.s.c.ZkTestServer client port:0.0.0.0/0.0.0.0:0
   [junit4]   2> 684987 INFO  (Thread-1222) [    ] o.a.s.c.ZkTestServer Starting server
   [junit4]   2> 684988 ERROR (Thread-1222) [    ] o.a.z.s.ZooKeeperServer ZKShutdownHandler is not registered, so ZooKeeper server won't take any action on ERROR or SHUTDOWN server state changes
   [junit4]   2> 685087 INFO  (TEST-HttpPartitionTest.test-seed#[892434F3DB4A5409]) [    ] o.a.s.c.ZkTestServer start zk server on port:41991
   [junit4]   2> 685093 INFO  (TEST-HttpPartitionTest.test-seed#[892434F3DB4A5409]) [    ] o.a.s.c.AbstractZkTestCase put /home/jenkins/workspace/Lucene-Solr-master-Linux/solr/core/src/test-files/solr/collection1/conf/solrconfig-tlog.xml to /configs/conf1/solrconfig.xml
   [junit4]   2> 685094 INFO  (TEST-HttpPartitionTest.test-seed#[892434F3DB4A5409]) [    ] o.a.s.c.AbstractZkTestCase put /home/jenkins/workspace/Lucene-Solr-master-Linux/solr/core/src/test-files/solr/collection1/conf/schema.xml to /configs/conf1/schema.xml
   [junit4]   2> 685095 INFO  (TEST-HttpPartitionTest.test-seed#[892434F3DB4A5409]) [    ] o.a.s.c.AbstractZkTestCase put /home/jenkins/workspace/Lucene-Solr-master-Linux/solr/core/src/test-files/solr/collection1/conf/solrconfig.snippet.randomindexconfig.xml to /configs/conf1/solrconfig.snippet.randomindexconfig.xml
   [junit4]   2> 685096 INFO  (TEST-HttpPartitionTest.test-seed#[892434F3DB4A5409]) [    ] o.a.s.c.AbstractZkTestCase put /home/jenkins/workspace/Lucene-Solr-master-Linux/solr/core/src/test-files/solr/collection1/conf/stopwords.txt to /configs/conf1/stopwords.txt
   [junit4]   2> 685097 INFO  (TEST-HttpPartitionTest.test-seed#[892434F3DB4A5409]) [    ] o.a.s.c.AbstractZkTestCase put /home/jenkins/workspace/Lucene-Solr-master-Linux/solr/core/src/test-files/solr/collection1/conf/protwords.txt to /configs/conf1/protwords.txt
   [junit4]   2> 685097 INFO  (TEST-HttpPartitionTest.test-seed#[892434F3DB4A5409]) [    ] o.a.s.c.AbstractZkTestCase put /home/jenkins/workspace/Lucene-Solr-master-Linux/solr/core/src/test-files/solr/collection1/conf/currency.xml to /configs/conf1/currency.xml
   [junit4]   2> 685098 INFO  (TEST-HttpPartitionTest.test-seed#[892434F3DB4A5409]) [    ] o.a.s.c.AbstractZkTestCase put /home/jenkins/workspace/Lucene-Solr-master-Linux/solr/core/src/test-files/solr/collection1/conf/enumsConfig.xml to /configs/conf1/enumsConfig.xml
   [junit4]   2> 685099 INFO  (TEST-HttpPartitionTest.test-seed#[892434F3DB4A5409]) [    ] o.a.s.c.AbstractZkTestCase put /home/jenkins/workspace/Lucene-Solr-master-Linux/solr/core/src/test-files/solr/collection1/conf/open-exchange-rates.json to /configs/conf1/open-exchange-rates.json
   [junit4]   2> 685112 INFO  (TEST-HttpPartitionTest.test-seed#[892434F3DB4A5409]) [    ] o.a.s.c.AbstractZkTestCase put /home/jenkins/workspace/Lucene-Solr-master-Linux/solr/core/src/test-files/solr/collection1/conf/mapping-ISOLatin1Accent.txt to /configs/conf1/mapping-ISOLatin1Accent.txt
   [junit4]   2> 685113 INFO  (TEST-HttpPartitionTest.test-seed#[892434F3DB4A5409]) [    ] o.a.s.c.AbstractZkTestCase put /home/jenkins/workspace/Lucene-Solr-master-Linux/solr/core/src/test-files/solr/collection1/conf/old_synonyms.txt to /configs/conf1/old_synonyms.txt
   [junit4]   2> 685113 INFO  (TEST-HttpPartitionTest.test-seed#[892434F3DB4A5409]) [    ] o.a.s.c.AbstractZkTestCase put /home/jenkins/workspace/Lucene-Solr-master-Linux/solr/core/src/test-files/solr/collection1/conf/synonyms.txt to /configs/conf1/synonyms.txt
   [junit4]   2> 685114 INFO  (TEST-HttpPartitionTest.test-seed#[892434F3DB4A5409]) [    ] o.a.s.c.AbstractFullDistribZkTestBase Will use TLOG replicas unless explicitly asked otherwise
   [junit4]   2> 685176 INFO  (TEST-HttpPartitionTest.test-seed#[892434F3DB4A5409]) [    ] o.e.j.s.Server jetty-9.3.14.v20161028
   [junit4]   2> 685177 INFO  (TEST-HttpPartitionTest.test-seed#[892434F3DB4A5409]) [    ] o.e.j.s.h.ContextHandler Started o.e.j.s.ServletContextHandler@5b4ce42b{/zu_/gw,null,AVAILABLE}
   [junit4]   2> 685178 INFO  (TEST-HttpPartitionTest.test-seed#[892434F3DB4A5409]) [    ] o.e.j.s.AbstractConnector Started ServerConnector@78a643eb{HTTP/1.1,[http/1.1]}{127.0.0.1:36501}
   [junit4]   2> 685178 INFO  (TEST-HttpPartitionTest.test-seed#[892434F3DB4A5409]) [    ] o.e.j.s.Server Started @686357ms
   [junit4]   2> 685179 INFO  (TEST-HttpPartitionTest.test-seed#[892434F3DB4A5409]) [    ] o.a.s.c.s.e.JettySolrRunner Jetty properties: {hostContext=/zu_/gw, solr.data.dir=/home/jenkins/workspace/Lucene-Solr-master-Linux/solr/build/solr-core/test/J2/temp/solr.cloud.HttpPartitionTest_892434F3DB4A5409-001/tempDir-001/control/data, hostPort=43157, coreRootDirectory=/home/jenkins/workspace/Lucene-Solr-master-Linux/solr/build/solr-core/test/J2/temp/solr.cloud.HttpPartitionTest_892434F3DB4A5409-001/control-001/cores, replicaType=NRT}
   [junit4]   2> 685179 ERROR (TEST-HttpPartitionTest.test-seed#[892434F3DB4A5409]) [    ] o.a.s.s.StartupLoggingUtils Missing Java Option solr.log.dir. Logging may be missing or incomplete.
   [junit4]   2> 685179 INFO  (TEST-HttpPartitionTest.test-seed#[892434F3DB4A5409]) [    ] o.a.s.s.SolrDispatchFilter  ___      _       Welcome to Apache Solr™ version 8.0.0
   [junit4]   2> 685179 INFO  (TEST-HttpPartitionTest.test-seed#[892434F3DB4A5409]) [    ] o.a.s.s.SolrDispatchFilter / __| ___| |_ _   Starting in cloud mode on port null
   [junit4]   2> 685179 INFO  (TEST-HttpPartitionTest.test-seed#[892434F3DB4A5409]) [    ] o.a.s.s.SolrDispatchFilter \__ \/ _ \ | '_|  Install dir: null, Default config dir: null
   [junit4]   2> 685179 INFO  (TEST-HttpPartitionTest.test-seed#[892434F3DB4A5409]) [    ] o.a.s.s.SolrDispatchFilter |___/\___/_|_|    Start time: 2017-08-11T01:03:17.811351Z
   [junit4]   2> 685180 INFO  (TEST-HttpPartitionTest.test-seed#[892434F3DB4A5409]) [    ] o.a.s.s.SolrDispatchFilter Loading solr.xml from SolrHome (not found in ZooKeeper)
   [junit4]   2> 685180 INFO  (TEST-HttpPartitionTest.test-seed#[892434F3DB4A5409]) [    ] o.a.s.c.SolrXmlConfig Loading container configuration from /home/jenkins/workspace/Lucene-Solr-master-Linux/solr/build/solr-core/test/J2/temp/solr.cloud.HttpPartitionTest_892434F3DB4A5409-001/control-001/solr.xml
   [junit4]   2> 685182 INFO  (TEST-HttpPartitionTest.test-seed#[892434F3DB4A5409]) [    ] o.a.s.c.SolrXmlConfig MBean server found: com.sun.jmx.mbeanserver.JmxMBeanServer@6bba6964, but no JMX reporters were configured - adding default JMX reporter.
   [junit4]   2> 685184 INFO  (TEST-HttpPartitionTest.test-seed#[892434F3DB4A5409]) [    ] o.a.s.c.ZkContainer Zookeeper client=127.0.0.1:41991/solr
   [junit4]   2> 685242 INFO  (TEST-HttpPartitionTest.test-seed#[892434F3DB4A5409]) [    ] o.a.s.c.Overseer Overseer (id=null) closing
   [junit4]   2> 685243 INFO  (TEST-HttpPartitionTest.test-seed#[892434F3DB4A5409]) [    ] o.a.s.c.OverseerElectionContext I am going to be the leader 127.0.0.1:43157_zu_%2Fgw
   [junit4]   2> 685243 INFO  (TEST-HttpPartitionTest.test-seed#[892434F3DB4A5409]) [    ] o.a.s.c.Overseer Overseer (id=98462164426424324-127.0.0.1:43157_zu_%2Fgw-n_0000000000) starting
   [junit4]   2> 685252 INFO  (TEST-HttpPartitionTest.test-seed#[892434F3DB4A5409]) [    ] o.a.s.c.ZkController Register node as live in ZooKeeper:/live_nodes/127.0.0.1:43157_zu_%2Fgw
   [junit4]   2> 685253 INFO  (zkCallback-2535-thread-1) [    ] o.a.s.c.c.ZkStateReader Updated live nodes from ZooKeeper... (0) -> (1)
   [junit4]   2> 685284 INFO  (TEST-HttpPartitionTest.test-seed#[892434F3DB4A5409]) [    ] o.a.s.m.r.SolrJmxReporter JMX monitoring for 'solr.node' (registry 'solr.node') enabled at server: com.sun.jmx.mbeanserver.JmxMBeanServer@6bba6964
   [junit4]   2> 685288 INFO  (TEST-HttpPartitionTest.test-seed#[892434F3DB4A5409]) [    ] o.a.s.m.r.SolrJmxReporter JMX monitoring for 'solr.jvm' (registry 'solr.jvm') enabled at server: com.sun.jmx.mbeanserver.JmxMBeanServer@6bba6964
   [junit4]   2> 685288 INFO  (TEST-HttpPartitionTest.test-seed#[892434F3DB4A5409]) [    ] o.a.s.m.r.SolrJmxReporter JMX monitoring for 'solr.jetty' (registry 'solr.jetty') enabled at server: com.sun.jmx.mbeanserver.JmxMBeanServer@6bba6964
   [junit4]   2> 685290 INFO  (TEST-HttpPartitionTest.test-seed#[892434F3DB4A5409]) [    ] o.a.s.c.CorePropertiesLocator Found 0 core definitions underneath /home/jenkins/workspace/Lucene-Solr-master-Linux/solr/build/solr-core/test/J2/temp/solr.cloud.HttpPartitionTest_892434F3DB4A5409-001/control-001/cores
   [junit4]   2> 685301 INFO  (TEST-HttpPartitionTest.test-seed#[892434F3DB4A5409]) [    ] o.a.s.c.c.ZkStateReader Updated live nodes from ZooKeeper... (0) -> (1)
   [junit4]   2> 685301 INFO  (TEST-HttpPartitionTest.test-seed#[892434F3DB4A5409]) [    ] o.a.s.c.s.i.ZkClientClusterStateProvider Cluster at 127.0.0.1:41991/solr ready
   [junit4]   2> 685301 INFO  (SocketProxy-Acceptor-43157) [    ] o.a.s.c.SocketProxy accepted Socket[addr=/127.0.0.1,port=45588,localport=43157], receiveBufferSize:531000
   [junit4]   2> 685311 INFO  (SocketProxy-Acceptor-43157) [    ] o.a.s.c.SocketProxy proxy connection Socket[addr=/127.0.0.1,port=36501,localport=36290], receiveBufferSize=530904
   [junit4]   2> 685312 INFO  (qtp1445921533-11562) [    ] o.a.s.h.a.CollectionsHandler Invoked Collection Action :create with params replicationFactor=1&collection.configName=conf1&name=control_collection&nrtReplicas=1&action=CREATE&numShards=1&createNodeSet=127.0.0.1:43157_zu_%252Fgw&wt=javabin&version=2 and sendToOCPQueue=true
   [junit4]   2> 685314 INFO  (OverseerThreadFactory-3001-thread-1) [    ] o.a.s.c.CreateCollectionCmd Create collection control_collection
   [junit4]   2> 685417 INFO  (SocketProxy-Acceptor-43157) [    ] o.a.s.c.SocketProxy accepted Socket[addr=/127.0.0.1,port=45592,localport=43157], receiveBufferSize:531000
   [junit4]   2> 685418 INFO  (SocketProxy-Acceptor-43157) [    ] o.a.s.c.SocketProxy proxy connection Socket[addr=/127.0.0.1,port=36501,localport=36294], receiveBufferSize=530904
   [junit4]   2> 685418 INFO  (qtp1445921533-11564) [    ] o.a.s.h.a.CoreAdminOperation core create command qt=/admin/cores&collection.configName=conf1&newCollection=true&name=control_collection_shard1_replica_n1&action=CREATE&numShards=1&collection=control_collection&shard=shard1&wt=javabin&version=2&replicaType=NRT
   [junit4]   2> 685418 INFO  (qtp1445921533-11564) [    ] o.a.s.c.TransientSolrCoreCacheDefault Allocating transient cache for 4 transient cores
   [junit4]   2> 685523 INFO  (zkCallback-2535-thread-1) [    ] o.a.s.c.c.ZkStateReader A cluster state change: [WatchedEvent state:SyncConnected type:NodeDataChanged path:/collections/control_collection/state.json] for collection [control_collection] has occurred - updating... (live nodes size: [1])
   [junit4]   2> 686431 INFO  (qtp1445921533-11564) [    ] o.a.s.c.SolrConfig Using Lucene MatchVersion: 8.0.0
   [junit4]   2> 686443 INFO  (qtp1445921533-11564) [    ] o.a.s.s.IndexSchema [control_collection_shard1_replica_n1] Schema name=test
   [junit4]   2> 686530 INFO  (qtp1445921533-11564) [    ] o.a.s.s.IndexSchema Loaded schema test/1.0 with uniqueid field id
   [junit4]   2> 686539 INFO  (qtp1445921533-11564) [    ] o.a.s.c.CoreContainer Creating SolrCore 'control_collection_shard1_replica_n1' using configuration from collection control_collection, trusted=true
   [junit4]   2> 686539 INFO  (qtp1445921533-11564) [    ] o.a.s.m.r.SolrJmxReporter JMX monitoring for 'solr.core.control_collection.shard1.replica_n1' (registry 'solr.core.control_collection.shard1.replica_n1') enabled at server: com.sun.jmx.mbeanserver.JmxMBeanServer@6bba6964
   [junit4]   2> 686539 INFO  (qtp1445921533-11564) [    ] o.a.s.c.SolrCore solr.RecoveryStrategy.Builder
   [junit4]   2> 686539 INFO  (qtp1445921533-11564) [    ] o.a.s.c.SolrCore [[control_collection_shard1_replica_n1] ] Opening new SolrCore at [/home/jenkins/workspace/Lucene-Solr-master-Linux/solr/build/solr-core/test/J2/temp/solr.cloud.HttpPartitionTest_892434F3DB4A5409-001/control-001/cores/control_collection_shard1_replica_n1], dataDir=[/home/jenkins/workspace/Lucene-Solr-master-Linux/solr/build/solr-core/test/J2/temp/solr.cloud.HttpPartitionTest_892434F3DB4A5409-001/control-001/cores/control_collection_shard1_replica_n1/data/]
   [junit4]   2> 686541 INFO  (qtp1445921533-11564) [    ] o.a.s.u.RandomMergePolicy RandomMergePolicy wrapping class org.apache.lucene.index.TieredMergePolicy: [TieredMergePolicy: maxMergeAtOnce=14, maxMergeAtOnceExplicit=38, maxMergedSegmentMB=47.2880859375, floorSegmentMB=0.8759765625, forceMergeDeletesPctAllowed=17.995157588268476, segmentsPerTier=21.0, maxCFSSegmentSizeMB=8.796093022207999E12, noCFSRatio=0.39833529615685725
   [junit4]   2> 686545 WARN  (qtp1445921533-11564) [    ] o.a.s.c.RequestHandlers INVALID paramSet a in requestHandler {type = requestHandler,name = /dump,class = DumpRequestHandler,attributes = {initParams=a, name=/dump, class=DumpRequestHandler},args = {defaults={a=A,b=B}}}
   [junit4]   2> 686570 INFO  (qtp1445921533-11564) [    ] o.a.s.u.UpdateHandler Using UpdateLog implementation: org.apache.solr.update.UpdateLog
   [junit4]   2> 686570 INFO  (qtp1445921533-11564) [    ] o.a.s.u.UpdateLog Initializing UpdateLog: dataDir= defaultSyncLevel=FLUSH numRecordsToKeep=100 maxNumLogsToKeep=10 numVersionBuckets=65536
   [junit4]   2> 686571 INFO  (qtp1445921533-11564) [    ] o.a.s.u.CommitTracker Hard AutoCommit: disabled
   [junit4]   2> 686571 INFO  (qtp1445921533-11564) [    ] o.a.s.u.CommitTracker Soft AutoCommit: disabled
   [junit4]   2> 686571 INFO  (qtp1445921533-11564) [    ] o.a.s.u.RandomMergePolicy RandomMergePolicy wrapping class org.apache.lucene.index.TieredMergePolicy: [TieredMergePolicy: maxMergeAtOnce=50, maxMergeAtOnceExplicit=24, maxMergedSegmentMB=65.4072265625, floorSegmentMB=1.169921875, forceMergeDeletesPctAllowed=14.716761857966459, segmentsPerTier=20.0, maxCFSSegmentSizeMB=8.796093022207999E12, noCFSRatio=0.16305439323964804
   [junit4]   2> 686571 INFO  (qtp1445921533-11564) [    ] o.a.s.s.SolrIndexSearcher Opening [Searcher@586bb3f8[control_collection_shard1_replica_n1] main]
   [junit4]   2> 686572 INFO  (qtp1445921533-11564) [    ] o.a.s.r.ManagedResourceStorage Configured ZooKeeperStorageIO with znodeBase: /configs/conf1
   [junit4]   2> 686572 INFO  (qtp1445921533-11564) [    ] o.a.s.r.ManagedResourceStorage Loaded null at path _rest_managed.json using ZooKeeperStorageIO:path=/configs/conf1
   [junit4]   2> 686572 INFO  (qtp1445921533-11564) [    ] o.a.s.h.ReplicationHandler Commits will be reserved for  10000
   [junit4]   2> 686573 INFO  (searcherExecutor-3004-thread-1) [    ] o.a.s.c.SolrCore [control_collection_shard1_replica_n1] Registered new searcher Searcher@586bb3f8[control_collection_shard1_replica_n1] main{ExitableDirectoryReader(UninvertingDirectoryReader())}
   [junit4]   2> 686573 INFO  (qtp1445921533-11564) [    ] o.a.s.u.UpdateLog Could not find max version in index or recent updates, using new clock 1575394632484782080
   [junit4]   2> 686576 INFO  (qtp1445921533-11564) [    ] o.a.s.c.ShardLeaderElectionContext Enough replicas found to continue.
   [junit4]   2> 686576 INFO  (qtp1445921533-11564) [    ] o.a.s.c.ShardLeaderElectionContext I may be the new leader - try and sync
   [junit4]   2> 686576 INFO  (qtp1445921533-11564) [    ] o.a.s.c.SyncStrategy Sync replicas to http://127.0.0.1:43157/zu_/gw/control_collection_shard1_replica_n1/
   [junit4]   2> 686576 INFO  (qtp1445921533-11564) [    ] o.a.s.c.SyncStrategy Sync Success - now sync replicas to me
   [junit4]   2> 686576 INFO  (qtp1445921533-11564) [    ] o.a.s.c.SyncStrategy http://127.0.0.1:43157/zu_/gw/control_collection_shard1_replica_n1/ has no replicas
   [junit4]   2> 686576 INFO  (qtp1445921533-11564) [    ] o.a.s.c.ShardLeaderElectionContext Found all replicas participating in election, clear LIR
   [junit4]   2> 686581 INFO  (qtp1445921533-11564) [    ] o.a.s.c.ShardLeaderElectionContext I am the new leader: http://127.0.0.1:43157/zu_/gw/control_collection_shard1_replica_n1/ shard1
   [junit4]   2> 686683 INFO  (zkCallback-2535-thread-2) [    ] o.a.s.c.c.ZkStateReader A cluster state change: [WatchedEvent state:SyncConnected type:NodeDataChanged path:/collections/control_collection/state.json] for collection [control_collection] has occurred - updating... (live nodes size: [1])
   [junit4]   2> 686732 INFO  (qtp1445921533-11564) [    ] o.a.s.c.ZkController I am the leader, no recovery necessary
   [junit4]   2> 686733 INFO  (qtp1445921533-11564) [    ] o.a.s.s.HttpSolrCall [admin] webapp=null path=/admin/cores params={qt=/admin/cores&collection.configName=conf1&newCollection=true&name=control_collection_shard1_replica_n1&action=CREATE&numShards=1&collection=control_collection&shard=shard1&wt=javabin&version=2&replicaType=NRT} status=0 QTime=1315
   [junit4]   2> 686736 INFO  (qtp1445921533-11562) [    ] o.a.s.h.a.CollectionsHandler Wait for new collection to be active for at most 30 seconds. Check all shard replicas
   [junit4]   2> 686836 INFO  (zkCallback-2535-thread-2) [    ] o.a.s.c.c.ZkStateReader A cluster state change: [WatchedEvent state:SyncConnected type:NodeDataChanged path:/collections/control_collection/state.json] for collection [control_collection] has occurred - updating... (live nodes size: [1])
   [junit4]   2> 687315 INFO  (OverseerCollectionConfigSetProcessor-98462164426424324-127.0.0.1:43157_zu_%2Fgw-n_0000000000) [    ] o.a.s.c.OverseerTaskQueue Response ZK path: /overseer/collection-queue-work/qnr-0000000000 doesn't exist.  Requestor may have disconnected from ZooKeeper
   [junit4]   2> 687736 INFO  (qtp1445921533-11562) [    ] o.a.s.s.HttpSolrCall [admin] webapp=null path=/admin/collections params={replicationFactor=1&collection.configName=conf1&name=control_collection&nrtReplicas=1&action=CREATE&numShards=1&createNodeSet=127.0.0.1:43157_zu_%252Fgw&wt=javabin&version=2} status=0 QTime=2423
   [junit4]   2> 687739 INFO  (TEST-HttpPartitionTest.test-seed#[892434F3DB4A5409]) [    ] o.a.s.c.c.ZkStateReader Updated live nodes from ZooKeeper... (0) -> (1)
   [junit4]   2> 687739 INFO  (TEST-HttpPartitionTest.test-seed#[892434F3DB4A5409]) [    ] o.a.s.c.s.i.ZkClientClusterStateProvider Cluster at 127.0.0.1:41991/solr ready
   [junit4]   2> 687739 INFO  (TEST-HttpPartitionTest.test-seed#[892434F3DB4A5409]) [    ] o.a.s.c.ChaosMonkey monkey: init - expire sessions:false cause connection loss:false
   [junit4]   2> 687740 INFO  (SocketProxy-Acceptor-43157) [    ] o.a.s.c.SocketProxy accepted Socket[addr=/127.0.0.1,port=45612,localport=43157], receiveBufferSize:531000
   [junit4]   2> 687740 INFO  (qtp1445921533-11559) [    ] o.a.s.h.a.CollectionsHandler Invoked Collection Action :create with params replicationFactor=1&collection.configName=conf1&name=collection1&nrtReplicas=1&action=CREATE&numShards=2&createNodeSet=&stateFormat=2&wt=javabin&version=2 and sendToOCPQueue=true
   [junit4]   2> 687741 INFO  (SocketProxy-Acceptor-43157) [    ] o.a.s.c.SocketProxy proxy connection Socket[addr=/127.0.0.1,port=36501,localport=36314], receiveBufferSize=530904
   [junit4]   2> 687744 INFO  (OverseerThreadFactory-3001-thread-2) [    ] o.a.s.c.CreateCollectionCmd Create collection collection1
   [junit4]   2> 687744 WARN  (OverseerThreadFactory-3001-thread-2) [    ] o.a.s.c.CreateCollectionCmd It is unusual to create a collection (collection1) without cores.
   [junit4]   2> 687947 INFO  (qtp1445921533-11559) [    ] o.a.s.h.a.CollectionsHandler Wait for new collection to be active for at most 30 seconds. Check all shard replicas
   [junit4]   2> 687947 INFO  (qtp1445921533-11559) [    ] o.a.s.s.HttpSolrCall [admin] webapp=null path=/admin/collections params={replicationFactor=1&collection.configName=conf1&name=collection1&nrtReplicas=1&action=CREATE&numShards=2&createNodeSet=&stateFormat=2&wt=javabin&version=2} status=0 QTime=207
   [junit4]   2> 688061 INFO  (TEST-HttpPartitionTest.test-seed#[892434F3DB4A5409]) [    ] o.a.s.c.AbstractFullDistribZkTestBase create jetty 1 in directory /home/jenkins/workspace/Lucene-Solr-master-Linux/solr/build/solr-core/test/J2/temp/solr.cloud.HttpPartitionTest_892434F3DB4A5409-001/shard-1-001 of type TLOG
   [junit4]   2> 688062 INFO  (TEST-HttpPartitionTest.test-seed#[892434F3DB4A5409]) [    ] o.e.j.s.Server jetty-9.3.14.v20161028
   [junit4]   2> 688063 INFO  (TEST-HttpPartitionTest.test-seed#[892434F3DB4A5409]) [    ] o.e.j.s.h.ContextHandler Started o.e.j.s.ServletContextHandler@e20b99e{/zu_/gw,null,AVAILABLE}
   [junit4]   2> 688063 INFO  (TEST-HttpPartitionTest.test-seed#[892434F3DB4A5409]) [    ] o.e.j.s.AbstractConnector Started ServerConnector@23147fb3{HTTP/1.1,[http/1.1]}{127.0.0.1:39619}
   [junit4]   2> 688063 INFO  (TEST-HttpPartitionTest.test-seed#[892434F3DB4A5409]) [    ] o.e.j.s.Server Started @689242ms
   [junit4]   2> 688063 INFO  (TEST-HttpPartitionTest.test-seed#[892434F3DB4A5409]) [    ] o.a.s.c.s.e.JettySolrRunner Jetty properties: {hostContext=/zu_/gw, solrconfig=solrconfig.xml, solr.data.dir=/home/jenkins/workspace/Lucene-Solr-master-Linux/solr/build/solr-core/test/J2/temp/solr.cloud.HttpPartitionTest_892434F3DB4A5409-001/tempDir-001/jetty1, hostPort=41969, coreRootDirectory=/home/jenkins/workspace/Lucene-Solr-master-Linux/solr/build/solr-core/test/J2/temp/solr.cloud.HttpPartitionTest_892434F3DB4A5409-001/shard-1-001/cores, replicaType=TLOG}
   [junit4]   2> 688064 ERROR (TEST-HttpPartitionTest.test-seed#[892434F3DB4A5409]) [    ] o.a.s.s.StartupLoggingUtils Missing Java Option solr.log.dir. Logging may be missing or incomplete.
   [junit4]   2> 688064 INFO  (TEST-HttpPartitionTest.test-seed#[892434F3DB4A5409]) [    ] o.a.s.s.SolrDispatchFilter  ___      _       Welcome to Apache Solr™ version 8.0.0
   [junit4]   2> 688064 INFO  (TEST-HttpPartitionTest.test-seed#[892434F3DB4A5409]) [    ] o.a.s.s.SolrDispatchFilter / __| ___| |_ _   Starting in cloud mode on port null
   [junit4]   2> 688064 INFO  (TEST-HttpPartitionTest.test-seed#[892434F3DB4A5409]) [    ] o.a.s.s.SolrDispatchFilter \__ \/ _ \ | '_|  Install dir: null, Default config dir: null
   [junit4]   2> 688064 INFO  (TEST-HttpPartitionTest.test-seed#[892434F3DB4A5409]) [    ] o.a.s.s.SolrDispatchFilter |___/\___/_|_|    Start time: 2017-08-11T01:03:20.696502Z
   [junit4]   2> 688066 INFO  (TEST-HttpPartitionTest.test-seed#[892434F3DB4A5409]) [    ] o.a.s.s.SolrDispatchFilter Loading solr.xml from SolrHome (not found in ZooKeeper)
   [junit4]   2> 688066 INFO  (TEST-HttpPartitionTest.test-seed#[892434F3DB4A5409]) [    ] o.a.s.c.SolrXmlConfig Loading container configuration from /home/jenkins/workspace/Lucene-Solr-master-Linux/solr/build/solr-core/test/J2/temp/solr.cloud.HttpPartitionTest_892434F3DB4A5409-001/shard-1-001/solr.xml
   [junit4]   2> 688086 INFO  (TEST-HttpPartitionTest.test-seed#[892434F3DB4A5409]) [    ] o.a.s.c.SolrXmlConfig MBean server found: com.sun.jmx.mbeanserver.JmxMBeanServer@6bba6964, but no JMX reporters were configured - adding default JMX reporter.
   [junit4]   2> 688089 INFO  (TEST-HttpPartitionTest.test-seed#[892434F3DB4A5409]) [    ] o.a.s.c.ZkContainer Zookeeper client=127.0.0.1:41991/solr
   [junit4]   2> 688097 INFO  (TEST-HttpPartitionTest.test-seed#[892434F3DB4A5409]) [    ] o.a.s.c.c.ZkStateReader Updated live nodes from ZooKeeper... (0) -> (1)
   [junit4]   2> 688098 INFO  (TEST-HttpPartitionTest.test-seed#[892434F3DB4A5409]) [    ] o.a.s.c.Overseer Overseer (id=null) closing
   [junit4]   2> 688099 INFO  (TEST-HttpPartitionTest.test-seed#[892434F3DB4A5409]) [    ] o.a.s.c.ZkController Register node as live in ZooKeeper:/live_nodes/127.0.0.1:41969_zu_%2Fgw
   [junit4]   2> 688100 INFO  (zkCallback-2535-thread-2) [    ] o.a.s.c.c.ZkStateReader Updated live nodes from ZooKeeper... (1) -> (2)
   [junit4]   2> 688100 INFO  (zkCallback-2542-thread-1) [    ] o.a.s.c.c.ZkStateReader Updated live nodes from ZooKeeper... (1) -> (2)
   [junit4]   2> 688100 INFO  (zkCallback-2547-thread-1) [    ] o.a.s.c.c.ZkStateReader Updated live nodes from ZooKeeper... (1) -> (2)
   [junit4]   2> 688146 INFO  (TEST-HttpPartitionTest.test-seed#[892434F3DB4A5409]) [    ] o.a.s.m.r.SolrJmxReporter JMX monitoring for 'solr.node' (registry 'solr.node') enabled at server: com.sun.jmx.mbeanserver.JmxMBeanServer@6bba6964
   [junit4]   2> 688152 INFO  (TEST-HttpPartitionTest.test-seed#[892434F3DB4A5409]) [    ] o.a.s.m.r.SolrJmxReporter JMX monitoring for 'solr.jvm' (registry 'solr.jvm') enabled at server: com.sun.jmx.mbeanserver.JmxMBeanServer@6bba6964
   [junit4]   2> 688152 INFO  (TEST-HttpPartitionTest.test-seed#[892434F3DB4A5409]) [    ] o.a.s.m.r.SolrJmxReporter JMX monitoring for 'solr.jetty' (registry 'solr.jetty') enabled at server: com.sun.jmx.mbeanserver.JmxMBeanServer@6bba6964
   [junit4]   2> 688154 INFO  (TEST-HttpPartitionTest.test-seed#[892434F3DB4A5409]) [    ] o.a.s.c.CorePropertiesLocator Found 0 core definitions underneath /home/jenkins/workspace/Lucene-Solr-master-Linux/solr/build/solr-core/test/J2/temp/solr.cloud.HttpPartitionTest_892434F3DB4A5409-001/shard-1-001/cores
   [junit4]   2> 688171 INFO  (qtp1445921533-11563) [    ] o.a.s.h.a.CollectionsHandler Invoked Collection Action :addreplica with params node=127.0.0.1:41969_zu_%252Fgw&action=ADDREPLICA&collection=collection1&shard=shard2&type=TLOG&wt=javabin&version=2 and sendToOCPQueue=true
   [junit4]   2> 688173 INFO  (OverseerCollectionConfigSetProcessor-98462164426424324-127.0.0.1:43157_zu_%2Fgw-n_0000000000) [    ] o.a.s.c.OverseerTaskQueue Response ZK path: /overseer/collection-queue-work/qnr-0000000002 doesn't exist.  Requestor may have disconnected from ZooKeeper
   [junit4]   2> 688173 INFO  (OverseerThreadFactory-3001-thread-3) [    ] o.a.s.c.AddReplicaCmd Node Identified 127.0.0.1:41969_zu_%2Fgw for creating new replica
   [junit4]   2> 688174 INFO  (SocketProxy-Acceptor-41969) [    ] o.a.s.c.SocketProxy accepted Socket[addr=/127.0.0.1,port=44502,localport=41969], receiveBufferSize:531000
   [junit4]   2> 688174 INFO  (SocketProxy-Acceptor-41969) [    ] o.a.s.c.SocketProxy proxy connection Socket[addr=/127.0.0.1,port=39619,localport=58088], receiveBufferSize=530904
   [junit4]   2> 688175 INFO  (qtp600471921-11611) [    ] o.a.s.h.a.CoreAdminOperation core create command qt=/admin/cores&collection.configName=conf1&name=collection1_shard2_replica_t41&action=CREATE&collection=collection1&shard=shard2&wt=javabin&version=2&replicaType=TLOG
   [junit4]   2> 688175 INFO  (qtp600471921-11611) [    ] o.a.s.c.TransientSolrCoreCacheDefault Allocating transient cache for 4 transient cores
   [junit4]   2> 688277 INFO  (zkCallback-2547-thread-1) [    ] o.a.s.c.c.ZkStateReader A cluster state change: [WatchedEvent state:SyncConnected type:NodeDataChanged path:/collections/collection1/state.json] for collection [collection1] has occurred - updating... (live nodes size: [2])
   [junit4]   2> 689184 INFO  (qtp600471921-11611) [    ] o.a.s.c.SolrConfig Using Lucene MatchVersion: 8.0.0
   [junit4]   2> 689193 INFO  (qtp600471921-11611) [    ] o.a.s.s.IndexSchema [collection1_shard2_replica_t41] Schema name=test
   [junit4]   2> 689636 INFO  (qtp600471921-11611) [    ] o.a.s.s.IndexSchema Loaded schema test/1.0 with uniqueid field id
   [junit4]   2> 689644 INFO  (qtp600471921-11611) [    ] o.a.s.c.CoreContainer Creating SolrCore 'collection1_shard2_replica_t41' using configuration from collection collection1, trusted=true
   [junit4]   2> 689647 INFO  (qtp600471921-11611) [    ] o.a.s.m.r.SolrJmxReporter JMX monitoring for 'solr.core.collection1.shard2.replica_t41' (registry 'solr.core.collection1.shard2.replica_t41') enabled at server: com.sun.jmx.mbeanserver.JmxMBeanServer@6bba6964
   [junit4]   2> 689647 INFO  (qtp600471921-11611) [    ] o.a.s.c.SolrCore solr.RecoveryStrategy.Builder
   [junit4]   2> 689647 INFO  (qtp600471921-11611) [    ] o.a.s.c.SolrCore [[collection1_shard2_replica_t41] ] Opening new SolrCore at [/home/jenkins/workspace/Lucene-Solr-master-Linux/solr/build/solr-core/test/J2/temp/solr.cloud.HttpPartitionTest_892434F3DB4A5409-001/shard-1-001/cores/collection1_shard2_replica_t41], dataDir=[/home/jenkins/workspace/Lucene-Solr-master-Linux/solr/build/solr-core/test/J2/temp/solr.cloud.HttpPartitionTest_892434F3DB4A5409-001/shard-1-001/cores/collection1_shard2_replica_t41/data/]
   [junit4]   2> 689649 INFO  (qtp600471921-11611) [    ] o.a.s.u.RandomMergePolicy RandomMergePolicy wrapping class org.apache.lucene.index.TieredMergePolicy: [TieredMergePolicy: maxMergeAtOnce=14, maxMergeAtOnceExplicit=38, maxMergedSegmentMB=47.2880859375, floorSegmentMB=0.8759765625, forceMergeDeletesPctAllowed=17.995157588268476, segmentsPerTier=21.0, maxCFSSegmentSizeMB=8.796093022207999E12, noCFSRatio=0.39833529615685725
   [junit4]   2> 689652 WARN  (qtp600471921-11611) [    ] o.a.s.c.RequestHandlers INVALID paramSet a in requestHandler {type = requestHandler,name = /dump,class = DumpRequestHandler,attributes = {initParams=a, name=/dump, class=DumpRequestHandler},args = {defaults={a=A,b=B}}}
   [junit4]   2> 689699 INFO  (qtp600471921-11611) [    ] o.a.s.u.UpdateHandler Using UpdateLog implementation: org.apache.solr.update.UpdateLog
   [junit4]   2> 689699 INFO  (qtp600471921-11611) [    ] o.a.s.u.UpdateLog Initializing UpdateLog: dataDir= defaultSyncLevel=FLUSH numRecordsToKeep=100 maxNumLogsToKeep=10 numVersionBuckets=65536
   [junit4]   2> 689700 INFO  (qtp600471921-11611) [    ] o.a.s.u.CommitTracker Hard AutoCommit: disabled
   [junit4]   2> 689700 INFO  (qtp600471921-11611) [    ] o.a.s.u.CommitTracker Soft AutoCommit: disabled
   [junit4]   2> 689701 INFO  (qtp600471921-11611) [    ] o.a.s.u.RandomMergePolicy RandomMergePolicy wrapping class org.apache.lucene.index.TieredMergePolicy: [TieredMergePolicy: maxMergeAtOnce=50, maxMergeAtOnceExplicit=24, maxMergedSegmentMB=65.4072265625, floorSegmentMB=1.169921875, forceMergeDeletesPctAllowed=14.716761857966459, segmentsPerTier=20.0, maxCFSSegmentSizeMB=8.796093022207999E12, noCFSRatio=0.16305439323964804
   [junit4]   2> 689702 INFO  (qtp600471921-11611) [    ] o.a.s.s.SolrIndexSearcher Opening [Searcher@53a34d94[collection1_shard2_replica_t41] main]
   [junit4]   2> 689702 INFO  (qtp600471921-11611) [    ] o.a.s.r.ManagedResourceStorage Configured ZooKeeperStorageIO with znodeBase: /configs/conf1
   [junit4]   2> 689702 INFO  (qtp600471921-11611) [    ] o.a.s.r.ManagedResourceStorage Loaded null at path _rest_managed.json using ZooKeeperStorageIO:path=/configs/conf1
   [junit4]   2> 689703 INFO  (qtp600471921-11611) [    ] o.a.s.h.ReplicationHandler Commits will be reserved for  10000
   [junit4]   2> 689703 INFO  (qtp600471921-11611) [    ] o.a.s.u.UpdateLog Could not find max version in index or recent updates, using new clock 1575394635766824960
   [junit4]   2> 689704 INFO  (searcherExecutor-3015-thread-1) [    ] o.a.s.c.SolrCore [collection1_shard2_replica_t41] Registered new searcher Searcher@53a34d94[collection1_shard2_replica_t41] main{ExitableDirectoryReader(UninvertingDirectoryReader())}
   [junit4]   2> 689706 INFO  (qtp600471921-11611) [    ] o.a.s.c.ShardLeaderElectionContext Enough replicas found to continue.
   [junit4]   2> 689707 INFO  (qtp600471921-11611) [    ] o.a.s.c.ShardLeaderElectionContext I may be the new leader - try and sync
   [junit4]   2> 689707 INFO  (qtp600471921-11611) [    ] o.a.s.c.SyncStrategy Sync replicas to http://127.0.0.1:41969/zu_/gw/collection1_shard2_replica_t41/
   [junit4]   2> 689707 INFO  (qtp600471921-11611) [    ] o.a.s.c.SyncStrategy Sync Success - now sync replicas to me
   [junit4]   2> 689707 INFO  (qtp600471921-11611) [    ] o.a.s.c.SyncStrategy http://127.0.0.1:41969/zu_/gw/collection1_shard2_replica_t41/ has no replicas
   [junit4]   2> 689707 INFO  (qtp600471921-11611) [    ] o.a.s.c.ShardLeaderElectionContext Found all replicas participating in election, clear LIR
   [junit4]   2> 689707 INFO  (qtp600471921-11611) [    ] o.a.s.c.ZkController collection1_shard2_replica_t41 stopping background replication from leader
   [junit4]   2> 689708 INFO  (qtp600471921-11611) [    ] o.a.s.c.ShardLeaderElectionContext I am the new leader: http://127.0.0.1:41969/zu_/gw/collection1_shard2_replica_t41/ shard2
   [junit4]   2> 689810 INFO  (zkCallback-2547-thread-1) [    ] o.a.s.c.c.ZkStateReader A cluster state change: [WatchedEvent state:SyncConnected type:NodeDataChanged path:/collections/collection1/state.json] for collection [collection1] has occurred - updating... (live nodes size: [2])
   [junit4]   2> 689859 INFO  (qtp600471921-11611) [    ] o.a.s.c.ZkController I am the leader, no recovery necessary
   [junit4]   2> 689860 INFO  (qtp600471921-11611) [    ] o.a.s.s.HttpSolrCall [admin] webapp=null path=/admin/cores params={qt=/admin/cores&collection.configName=conf1&name=collection1_shard2_replica_t41&action=CREATE&collection=collection1&shard=shard2&wt=javabin&version=2&replicaType=TLOG} status=0 QTime=1685
   [junit4]   2> 689862 INFO  (qtp1445921533-11563) [    ] o.a.s.s.HttpSolrCall [admin] webapp=null path=/admin/collections params={node=127.0.0.1:41969_zu_%252Fgw&action=ADDREPLICA&collection=collection1&shard=shard2&type=TLOG&wt=javabin&version=2} status=0 QTime=1690
   [junit4]   2> 689928 INFO  (TEST-HttpPartitionTest.test-seed#[892434F3DB4A5409]) [    ] o.a.s.c.AbstractFullDistribZkTestBase create jetty 2 in directory /home/jenkins/workspace/Lucene-Solr-master-Linux/solr/build/solr-core/test/J2/temp/solr.cloud.HttpPartitionTest_892434F3DB4A5409-001/shard-2-001 of type TLOG
   [junit4]   2> 689929 INFO  (TEST-HttpPartitionTest.test-seed#[892434F3DB4A5409]) [    ] o.e.j.s.Server jetty-9.3.14.v20161028
   [junit4]   2> 689929 INFO  (TEST-HttpPartitionTest.test-seed#[892434F3DB4A5409]) [    ] o.e.j.s.h.ContextHandler Started o.e.j.s.ServletContextHandler@5a000ab1{/zu_/gw,null,AVAILABLE}
   [junit4]   2> 689930 INFO  (TEST-HttpPartitionTest.test-seed#[892434F3DB4A5409]) [    ] o.e.j.s.AbstractConnector Started ServerConnector@1515f805{HTTP/1.1,[http/1.1]}{127.0.0.1:44625}
   [junit4]   2> 689930 INFO  (TEST-HttpPartitionTest.test-seed#[892434F3DB4A5409]) [    ] o.e.j.s.Server Started @691109ms
   [junit4]   2> 689930 INFO  (TEST-HttpPartitionTest.test-seed#[892434F3DB4A5409]) [    ] o.a.s.c.s.e.JettySolrRunner Jetty properties: {hostContext=/zu_/gw, solrconfig=solrconfig.xml, solr.data.dir=/home/jenkins/workspace/Lucene-Solr-master-Linux/solr/build/solr-core/test/J2/temp/solr.cloud.HttpPartitionTest_892434F3DB4A5409-001/tempDir-001/jetty2, hostPort=45957, coreRootDirectory=/home/jenkins/workspace/Lucene-Solr-master-Linux/solr/build/solr-core/test/J2/temp/solr.cloud.HttpPartitionTest_892434F3DB4A5409-001/shard-2-001/cores, replicaType=TLOG}
   [junit4]   2> 689930 ERROR (TEST-HttpPartitionTest.test-seed#[892434F3DB4A5409]) [    ] o.a.s.s.StartupLoggingUtils Missing Java Option solr.log.dir. Logging may be missing or incomplete.
   [junit4]   2> 689930 INFO  (TEST-HttpPartitionTest.test-seed#[892434F3DB4A5409]) [    ] o.a.s.s.SolrDispatchFilter  ___      _       Welcome to Apache Solr™ version 8.0.0
   [junit4]   2> 689930 INFO  (TEST-HttpPartitionTest.test-seed#[892434F3DB4A5409]) [    ] o.a.s.s.SolrDispatchFilter / __| ___| |_ _   Starting in cloud mode on port null
   [junit4]   2> 689930 INFO  (TEST-HttpPartitionTest.test-seed#[892434F3DB4A5409]) [    ] o.a.s.s.SolrDispatchFilter \__ \/ _ \ | '_|  Install dir: null, Default config dir: null
   [junit4]   2> 689930 INFO  (TEST-HttpPartitionTest.test-seed#[892434F3DB4A5409]) [    ] o.a.s.s.SolrDispatchFilter |___/\___/_|_|    Start time: 2017-08-11T01:03:22.562798Z
   [junit4]   2> 689932 INFO  (TEST-HttpPartitionTest.test-seed#[892434F3DB4A5409]) [    ] o.a.s.s.SolrDispatchFilter Loading solr.xml from SolrHome (not found in ZooKeeper)
   [junit4]   2> 689932 INFO  (TEST-HttpPartitionTest.test-seed#[892434F3DB4A5409]) [    ] o.a.s.c.SolrXmlConfig Loading container configuration from /home/jenkins/workspace/Lucene-Solr-master-Linux/solr/build/solr-core/test/J2/temp/solr.cloud.HttpPartitionTest_892434F3DB4A5409-001/shard-2-001/solr.xml
   [junit4]   2> 689942 INFO  (TEST-HttpPartitionTest.test-seed#[892434F3DB4A5409]) [    ] o.a.s.c.SolrXmlConfig MBean server found: com.sun.jmx.mbeanserver.JmxMBeanServer@6bba6964, but no JMX reporters were configured - adding default JMX reporter.
   [junit4]   2> 689944 INFO  (TEST-HttpPartitionTest.test-seed#[892434F3DB4A5409]) [    ] o.a.s.c.ZkContainer Zookeeper client=127.0.0.1:41991/solr
   [junit4]   2> 689948 INFO  (TEST-HttpPartitionTest.test-seed#[892434F3DB4A5409]) [    ] o.a.s.c.c.ZkStateReader Updated live nodes from ZooKeeper... (0) -> (2)
   [junit4]   2> 689949 INFO  (TEST-HttpPartitionTest.test-seed#[892434F3DB4A5409]) [    ] o.a.s.c.Overseer Overseer (id=null) closing
   [junit4]   2> 689950 INFO  (TEST-HttpPartitionTest.test-seed#[892434F3DB4A5409]) [    ] o.a.s.c.ZkController Register node as live in ZooKeeper:/live_nodes/127.0.0.1:45957_zu_%2Fgw
   [junit4]   2> 689950 INFO  (zkCallback-2542-thread-1) [    ] o.a.s.c.c.ZkStateReader Updated live nodes from ZooKeeper... (2) -> (3)
   [junit4]   2> 689950 INFO  (zkCallback-2547-thread-1) [    ] o.a.s.c.c.ZkStateReader Updated live nodes from ZooKeeper... (2) -> (3)
   [junit4]   2> 689950 INFO  (zkCallback-2535-thread-2) [    ] o.a.s.c.c.ZkStateReader Updated live nodes from ZooKeeper... (2) -> (3)
   [junit4]   2> 689953 INFO  (zkCallback-2553-thread-1) [    ] o.a.s.c.c.ZkStateReader Updated live nodes from ZooKeeper... (2) -> (3)
   [junit4]   2> 690007 INFO  (TEST-HttpPartitionTest.test-seed#[892434F3DB4A5409]) [    ] o.a.s.m.r.SolrJmxReporter JMX monitoring for 'solr.node' (registry 'solr.node') enabled at server: com.sun.jmx.mbeanserver.JmxMBeanServer@6bba6964
   [junit4]   2> 690013 INFO  (TEST-HttpPartitionTest.test-seed#[892434F3DB4A5409]) [    ] o.a.s.m.r.SolrJmxReporter JMX monitoring for 'solr.jvm' (registry 'solr.jvm') enabled at server: com.sun.jmx.mbeanserver.JmxMBeanServer@6bba6964
   [junit4]   2> 690013 INFO  (TEST-HttpPartitionTest.test-seed#[892434F3DB4A5409]) [    ] o.a.s.m.r.SolrJmxReporter JMX monitoring for 'solr.jetty' (registry 'solr.jetty') enabled at server: com.sun.jmx.mbeanserver.JmxMBeanServer@6bba6964
   [junit4]   2> 690014 INFO  (TEST-HttpPartitionTest.test-seed#[892434F3DB4A5409]) [    ] o.a.s.c.CorePropertiesLocator Found 0 core definitions underneath /home/jenkins/workspace/Lucene-Solr-master-Linux/solr/build/solr-core/test/J2/temp/solr.cloud.HttpPartitionTest_892434F3DB4A5409-001/shard-2-001/cores
   [junit4]   2> 690038 INFO  (qtp1445921533-11564) [    ] o.a.s.h.a.CollectionsHandler Invoked Collection Action :addreplica with params node=127.0.0.1:45957_zu_%252Fgw&action=ADDREPLICA&collection=collection1&shard=shard1&type=TLOG&wt=javabin&version=2 and sendToOCPQueue=true
   [junit4]   2> 690039 INFO  (OverseerCollectionConfigSetProcessor-98462164426424324-127.0.0.1:43157_zu_%2Fgw-n_0000000000) [    ] o.a.s.c.OverseerTaskQueue Response ZK path: /overseer/collection-queue-work/qnr-0000000004 doesn't exist.  Requestor may have disconnected from ZooKeeper
   [junit4]   2> 690039 INFO  (OverseerThreadFactory-3001-thread-4) [    ] o.a.s.c.AddReplicaCmd Node Identified 127.0.0.1:45957_zu_%2Fgw for creating new replica
   [junit4]   2> 690040 INFO  (SocketProxy-Acceptor-45957) [    ] o.a.s.c.SocketProxy accepted Socket[addr=/127.0.0.1,port=37436,localport=45957], receiveBufferSize:531000
   [junit4]   2> 690041 INFO  (SocketProxy-Acceptor-45957) [    ] o.a.s.c.SocketProxy proxy connection Socket[addr=/127.0.0.1,port=44625,localport=40458], receiveBufferSize=530904
   [junit4]   2> 690042 INFO  (qtp36373676-11643) [    ] o.a.s.h.a.CoreAdminOperation core create command qt=/admin/cores&collection.configName=conf1&name=collection1_shard1_replica_t43&action=CREATE&collection=collection1&shard=shard1&wt=javabin&version=2&replicaType=TLOG
   [junit4]   2> 690042 INFO  (qtp36373676-11643) [    ] o.a.s.c.TransientSolrCoreCacheDefault Allocating transient cache for 4 transient cores
   [junit4]   2> 690144 INFO  (zkCallback-2547-thread-1) [    ] o.a.s.c.c.ZkStateReader A cluster state change: [WatchedEvent state:SyncConnected type:NodeDataChanged path:/collections/collection1/state.json] for collection [collection1] has occurred - updating... (live nodes size: [3])
   [junit4]   2> 690144 INFO  (zkCallback-2553-thread-1) [    ] o.a.s.c.c.ZkStateReader A cluster state change: [WatchedEvent state:SyncConnected type:NodeDataChanged path:/collections/collection1/state.json] for collection [collection1] has occurred - updating... (live nodes size: [3])
   [junit4]   2> 691052 INFO  (qtp36373676-11643) [    ] o.a.s.c.SolrConfig Using Lucene MatchVersion: 8.0.0
   [junit4]   2> 691064 INFO  (qtp36373676-11643) [    ] o.a.s.s.IndexSchema [collection1_shard1_replica_t43] Schema name=test
   [junit4]   2> 691192 INFO  (qtp36373676-11643) [    ] o.a.s.s.IndexSchema Loaded schema test/1.0 with uniqueid field id
   [junit4]   2> 691200 INFO  (qtp36373676-11643) [    ] o.a.s.c.CoreContainer Creating SolrCore 'collection1_shard1_replica_t43' using configuration from collection collection1, trusted=true
   [junit4]   2> 691200 INFO  (qtp36373676-11643) [    ] o.a.s.m.r.SolrJmxReporter JMX monitoring for 'solr.core.collection1.shard1.replica_t43' (registry 'solr.core.collection1.shard1.replica_t43') enabled at server: com.sun.jmx.mbeanserver.JmxMBeanServer@6bba6964
   [junit4]   2> 691200 INFO  (qtp36373676-11643) [    ] o.a.s.c.SolrCore solr.RecoveryStrategy.Builder
   [junit4]   2> 691201 INFO  (qtp36373676-11643) [    ] o.a.s.c.SolrCore [[collection1_shard1_replica_t43] ] Opening new SolrCore at [/home/jenkins/workspace/Lucene-Solr-master-Linux/solr/build/solr-core/test/J2/temp/solr.cloud.HttpPartitionTest_892434F3DB4A5409-001/shard-2-001/cores/collection1_shard1_replica_t43], dataDir=[/home/jenkins/workspace/Lucene-Solr-master-Linux/solr/build/solr-core/test/J2/temp/solr.cloud.HttpPartitionTest_892434F3DB4A5409-001/shard-2-001/cores/collection1_shard1_replica_t43/data/]
   [junit4]   2> 691203 INFO  (qtp36373676-11643) [    ] o.a.s.u.RandomMergePolicy RandomMergePolicy wrapping class org.apache.lucene.index.TieredMergePolicy: [TieredMergePolicy: maxMergeAtOnce=14, maxMergeAtOnceExplicit=38, maxMergedSegmentMB=47.2880859375, floorSegmentMB=0.8759765625, forceMergeDeletesPctAllowed=17.995157588268476, segmentsPerTier=21.0, maxCFSSegmentSizeMB=8.796093022207999E12, noCFSRatio=0.39833529615685725
   [junit4]   2> 691205 WARN  (qtp36373676-11643) [    ] o.a.s.c.RequestHandlers INVALID paramSet a in requestHandler {type = requestHandler,name = /dump,class = DumpRequestHandler,attributes = {initParams=a, name=/dump, class=DumpRequestHandler},args = {defaults={a=A,b=B}}}
   [junit4]   2> 691241 INFO  (qtp36373676-11643) [    ] o.a.s.u.UpdateHandler Using UpdateLog implementation: org.apache.solr.update.UpdateLog
   [junit4]   2> 691241 INFO  (qtp36373676-11643) [    ] o.a.s.u.UpdateLog Initializing UpdateLog: dataDir= defaultSyncLevel=FLUSH numRecordsToKeep=100 maxNumLogsToKeep=10 numVersionBuckets=65536
   [junit4]   2> 691242 INFO  (qtp36373676-11643) [    ] o.a.s.u.CommitTracker Hard AutoCommit: disabled
   [junit4]   2> 691242 INFO  (qtp36373676-11643) [    ] o.a.s.u.CommitTracker Soft AutoCommit: disabled
   [junit4]   2> 691243 INFO  (qtp36373676-11643) [    ] o.a.s.u.RandomMergePolicy RandomMergePolicy wrapping class org.apache.lucene.index.TieredMergePolicy: [TieredMergePolicy: maxMergeAtOnce=50, maxMergeAtOnceExplicit=24, maxMergedSegmentMB=65.4072265625, floorSegmentMB=1.169921875, forceMergeDeletesPctAllowed=14.716761857966459, segmentsPerTier=20.0, maxCFSSegmentSizeMB=8.796093022207999E12, noCFSRatio=0.16305439323964804
   [junit4]   2> 691243 INFO  (qtp36373676-11643) [    ] o.a.s.s.SolrIndexSearcher Opening [Searcher@33c22912[collection1_shard1_replica_t43] main]
   [junit4]   2> 691244 INFO  (qtp36373676-11643) [    ] o.a.s.r.ManagedResourceStorage Configured ZooKeeperStorageIO with znodeBase: /configs/conf1
   [junit4]   2> 691244 INFO  (qtp36373676-11643) [    ] o.a.s.r.ManagedResourceStorage Loaded null at path _rest_managed.json using ZooKeeperStorageIO:path=/configs/conf1
   [junit4]   2> 691245 INFO  (qtp36373676-11643) [    ] o.a.s.h.ReplicationHandler Commits will be reserved for  10000
   [junit4]   2> 691246 INFO  (searcherExecutor-3026-thread-1) [    ] o.a.s.c.SolrCore [collection1_shard1_replica_t43] Registered new searcher Searcher@33c22912[collection1_shard1_replica_t43] main{ExitableDirectoryReader(UninvertingDirectoryReader())}
   [junit4]   2> 691246 INFO  (qtp36373676-11643) [    ] o.a.s.u.UpdateLog Could not find max version in index or recent updates, using new clock 1575394637384777728
   [junit4]   2> 691252 INFO  (qtp36373676-11643) [    ] o.a.s.c.ShardLeaderElectionContext Enough replicas found to continue.
   [junit4]   2> 691253 INFO  (qtp36373676-11643) [    ] o.a.s.c.ShardLeaderElectionContext I may be the new leader - try and sync
   [junit4]   2> 691253 INFO  (qtp36373676-11643) [    ] o.a.s.c.SyncStrategy Sync replicas to http://127.0.0.1:45957/zu_/gw/collection1_shard1_replica_t43/
   [junit4]   2> 691253 INFO  (qtp36373676-11643) [    ] o.a.s.c.SyncStrategy Sync Success - now sync replicas to me
   [junit4]   2> 691253 INFO  (qtp36373676-11643) [    ] o.a.s.c.SyncStrategy http://127.0.0.1:45957/zu_/gw/collection1_shard1_replica_t43/ has no replicas
   [junit4]   2> 691253 INFO  (qtp36373676-11643) [    ] o.a.s.c.ShardLeaderElectionContext Found all replicas participating in election, clear LIR
   [junit4]   2> 691253 INFO  (qtp36373676-11643) [    ] o.a.s.c.ZkController collection1_shard1_replica_t43 stopping background replication from leader
   [junit4]   2> 691255 INFO  (qtp36373676-11643) [    ] o.a.s.c.ShardLeaderElectionContext I am the new leader: http://127.0.0.1:45957/zu_/gw/collection1_shard1_replica_t43/ shard1
   [junit4]   2> 691356 INFO  (zkCallback-2547-thread-1) [    ] o.a.s.c.c.ZkStateReader A cluster state change: [WatchedEvent state:SyncConnected type:NodeDataChanged path:/collections/collection1/state.json] for collection [collection1] has occurred - updating... (live nodes size: [3])
   [junit4]   2> 691356 INFO  (zkCallback-2553-thread-1) [    ] o.a.s.c.c.ZkStateReader A cluster state change: [WatchedEvent state:SyncConnected type:NodeDataChanged path:/collections/collection1/state.json] for collection [collection1] has occurred - updating... (live nodes size: [3])
   [junit4]   2> 691362 INFO  (qtp36373676-11643) [    ] o.a.s.c.ZkController I am the leader, no recovery necessary
   [junit4]   2> 691363 INFO  (qtp36373676-11643) [    ] o.a.s.s.HttpSolrCall [admin] webapp=null path=/admin/cores params={qt=/admin/cores&collection.configName=conf1&name=collection1_shard1_replica_t43&action=CREATE&collection=collection1&shard=shard1&wt=javabin&version=2&replicaType=TLOG} status=0 QTime=1321
   [junit4]   2> 691365 INFO  (qtp1445921533-11564) [    ] o.a.s.s.HttpSolrCall [admin] webapp=null path=/admin/collections params={node=127.0.0.1:45957_zu_%252Fgw&action=ADDREPLICA&collection=collection1&shard=shard1&type=TLOG&wt=javabin&version=2} status=0 QTime=1327
   [junit4]   2> 691431 INFO  (TEST-HttpPartitionTest.test-seed#[892434F3DB4A5409]) [    ] o.a.s.c.AbstractFullDistribZkTestBase create jetty 3 in directory /home/jenkins/workspace/Lucene-Solr-master-Linux/solr/build/solr-core/test/J2/temp/solr.cloud.HttpPartitionTest_892434F3DB4A5409-001/shard-3-001 of type TLOG
   [junit4]   2> 691431 INFO  (TEST-HttpPartitionTest.test-seed#[892434F3DB4A5409]) [    ] o.e.j.s.Server jetty-9.3.14.v20161028
   [junit4]   2> 691432 INFO  (TEST-HttpPartitionTest.test-seed#[892434F3DB4A5409]) [    ] o.e.j.s.h.ContextHandler Started o.e.j.s.ServletContextHandler@2cca6a5d{/zu_/gw,null,AVAILABLE}
   [junit4]   2> 691432 INFO  (TEST-HttpPartitionTest.test-seed#[892434F3DB4A5409]) [    ] o.e.j.s.AbstractConnector Started ServerConnector@1577f773{HTTP/1.1,[http/1.1]}{127.0.0.1:42585}
   [junit4]   2> 691433 INFO  (TEST-HttpPartitionTest.test-seed#[892434F3DB4A5409]) [    ] o.e.j.s.Server Started @692611ms
   [junit4]   2> 691433 INFO  (TEST-HttpPartitionTest.test-seed#[892434F3DB4A5409]) [    ] o.a.s.c.s.e.JettySolrRunner Jetty properties: {hostContext=/zu_/gw, solrconfig=solrconfig.xml, solr.data.dir=/home/jenkins/workspace/Lucene-Solr-master-Linux/solr/build/solr-core/test/J2/temp/solr.cloud.HttpPartitionTest_892434F3DB4A5409-001/tempDir-001/jetty3, hostPort=45487, coreRootDirectory=/home/jenkins/workspace/Lucene-Solr-master-Linux/solr/build/solr-core/test/J2/temp/solr.cloud.HttpPartitionTest_892434F3DB4A5409-001/shard-3-001/cores, replicaType=TLOG}
   [junit4]   2> 691433 ERROR (TEST-HttpPartitionTest.test-seed#[892434F3DB4A5409]) [    ] o.a.s.s.StartupLoggingUtils Missing Java Option solr.log.dir. Logging may be missing or incomplete.
   [junit4]   2> 691433 INFO  (TEST-HttpPartitionTest.test-seed#[892434F3DB4A5409]) [    ] o.a.s.s.SolrDispatchFilter  ___      _       Welcome to Apache Solr™ version 8.0.0
   [junit4]   2> 691433 INFO  (TEST-HttpPartitionTest.test-seed#[892434F3DB4A5409]) [    ] o.a.s.s.SolrDispatchFilter / __| ___| |_ _   Starting in cloud mode on port null
   [junit4]   2> 691433 INFO  (TEST-HttpPartitionTest.test-seed#[892434F3DB4A5409]) [    ] o.a.s.s.SolrDispatchFilter \__ \/ _ \ | '_|  Install dir: null, Default config dir: null
   [junit4]   2> 691433 INFO  (TEST-HttpPartitionTest.test-seed#[892434F3DB4A5409]) [    ] o.a.s.s.SolrDispatchFilter |___/\___/_|_|    Start time: 2017-08-11T01:03:24.065557Z
   [junit4]   2> 691434 INFO  (TEST-HttpPartitionTest.test-seed#[892434F3DB4A5409]) [    ] o.a.s.s.SolrDispatchFilter Loading solr.xml from SolrHome (not found in ZooKeeper)
   [junit4]   2> 691434 INFO  (TEST-HttpPartitionTest.test-seed#[892434F3DB4A5409]) [    ] o.a.s.c.SolrXmlConfig Loading container configuration from /home/jenkins/workspace/Lucene-Solr-master-Linux/solr/build/solr-core/test/J2/temp/solr.cloud.HttpPartitionTest_892434F3DB4A5409-001/shard-3-001/solr.xml
   [junit4]   2> 691447 INFO  (TEST-HttpPartitionTest.test-seed#[892434F3DB4A5409]) [    ] o.a.s.c.SolrXmlConfig MBean server found: com.sun.jmx.mbeanserver.JmxMBeanServer@6bba6964, but no JMX reporters were configured - adding default JMX reporter.
   [junit4]   2> 691448 INFO  (TEST-HttpPartitionTest.test-seed#[892434F3DB4A5409]) [    ] o.a.s.c.ZkContainer Zookeeper client=127.0.0.1:41991/solr
   [junit4]   2> 691452 INFO  (TEST-HttpPartitionTest.test-seed#[892434F3DB4A5409]) [    ] o.a.s.c.c.ZkStateReader Updated live nodes from ZooKeeper... (0) -> (3)
   [junit4]   2> 691453 INFO  (TEST-HttpPartitionTest.test-seed#[892434F3DB4A5409]) [    ] o.a.s.c.Overseer Overseer (id=null) closing
   [junit4]   2> 691454 INFO  (TEST-HttpPartitionTest.test-seed#[892434F3DB4A5409]) [    ] o.a.s.c.ZkController Register node as live in ZooKeeper:/live_nodes/127.0.0.1:45487_zu_%2Fgw
   [junit4]   2> 691454 INFO  (zkCallback-2542-thread-1) [    ] o.a.s.c.c.ZkStateReader Updated live nodes from ZooKeeper... (3) -> (4)
   [junit4]   2> 691454 INFO  (zkCallback-2547-thread-1) [    ] o.a.s.c.c.ZkStateReader Updated live nodes from ZooKeeper... (3) -> (4)
   [junit4]   2> 691454 INFO  (zkCallback-2553-thread-1) [    ] o.a.s.c.c.ZkStateReader Updated live nodes from ZooKeeper... (3) -> (4)
   [junit4]   2> 691456 INFO  (zkCallback-2535-thread-2) [    ] o.a.s.c.c.ZkStateReader Updated live nodes from ZooKeeper... (3) -> (4)
   [junit4]   2> 691456 INFO  (zkCallback-2559-thread-1) [    ] o.a.s.c.c.ZkStateReader Updated live nodes from ZooKeeper... (3) -> (4)
   [junit4]   2> 691487 INFO  (TEST-HttpPartitionTest.test-seed#[892434F3DB4A5409]) [    ] o.a.s.m.r.SolrJmxReporter JMX monitoring for 'solr.node' (registry 'solr.node') enabled at server: com.sun.jmx.mbeanserver.JmxMBeanServer@6bba6964
   [junit4]   2> 691490 INFO  (TEST-HttpPartitionTest.test-seed#[892434F3DB4A5409]) [    ] o.a.s.m.r.SolrJmxReporter JMX monitoring for 'solr.jvm' (registry 'solr.jvm') enabled at server: com.sun.jmx.mbeanserver.JmxMBeanServer@6bba6964
   [junit4]   2> 691490 INFO  (TEST-HttpPartitionTest.test-seed#[892434F3DB4A5409]) [    ] o.a.s.m.r.SolrJmxReporter JMX monitoring for 'solr.jetty' (registry 'solr.jetty') enabled at server: com.sun.jmx.mbeanserver.JmxMBeanServer@6bba6964
   [junit4]   2> 691491 INFO  (TEST-HttpPartitionTest.test-seed#[892434F3DB4A5409]) [    ] o.a.s.c.CorePropertiesLocator Found 0 core definitions underneath /home/jenkins/workspace/Lucene-Solr-master-Linux/solr/build/solr-core/test/J2/temp/solr.cloud.HttpPartitionTest_892434F3DB4A5409-001/shard-3-001/cores
   [junit4]   2> 691510 INFO  (qtp1445921533-11562) [    ] o.a.s.h.a.CollectionsHandler Invoked Collection Action :addreplica with params node=127.0.0.1:45487_zu_%252Fgw&action=ADDREPLICA&collection=collection1&shard=shard2&type=TLOG&wt=javabin&version=2 and sendToOCPQueue=true
   [junit4]   2> 691511 INFO  (OverseerCollectionConfigSetProcessor-98462164426424324-127.0.0.1:43157_zu_%2Fgw-n_0000000000) [    ] o.a.s.c.OverseerTaskQueue Response ZK path: /overseer/collection-queue-work/qnr-0000000006 doesn't exist.  Requestor may have disconnected from ZooKeeper
   [junit4]   2> 691511 INFO  (OverseerThreadFactory-3001-thread-5) [    ] o.a.s.c.AddReplicaCmd Node Identified 127.0.0.1:45487_zu_%2Fgw for creating new replica
   [junit4]   2> 691512 INFO  (SocketProxy-Acceptor-45487) [    ] o.a.s.c.SocketProxy accepted Socket[addr=/127.0.0.1,port=33208,localport=45487], receiveBufferSize:531000
   [junit4]   2> 691512 INFO  (SocketProxy-Acceptor-45487) [    ] o.a.s.c.SocketProxy proxy connection Socket[addr=/127.0.0.1,port=42585,localport=53582], receiveBufferSize=530904
   [junit4]   2> 691512 INFO  (qtp1558833314-11675) [    ] o.a.s.h.a.CoreAdminOperation core create command qt=/admin/cores&collection.configName=conf1&name=collection1_shard2_replica_t45&action=CREATE&collection=collection1&shard=shard2&wt=javabin&version=2&replicaType=TLOG
   [junit4]   2> 691512 INFO  (qtp1558833314-11675) [    ] o.a.s.c.TransientSolrCoreCacheDefault Allocating transient cache for 4 transient cores
   [junit4]   2> 691615 INFO  (zkCallback-2547-thread-1) [    ] o.a.s.c.c.ZkStateReader A cluster state change: [WatchedEvent state:SyncConnected type:NodeDataChanged path:/collections/collection1/state.json] for collection [collection1] has occurred - updating... (live nodes size: [4])
   [junit4]   2> 691615 INFO  (zkCallback-2553-thread-1) [    ] o.a.s.c.c.ZkStateReader A cluster state change: [WatchedEvent state:SyncConnected type:NodeDataChanged path:/collections/collection1/state.json] for collection [collection1] has occurred - updating... (live nodes size: [4])
   [junit4]   2> 691615 INFO  (zkCallback-2559-thread-1) [    ] o.a.s.c.c.ZkStateReader A cluster state change: [WatchedEvent state:SyncConnected type:NodeDataChanged path:/collections/collection1/state.json] for collection [collection1] has occurred - updating... (live nodes size: [4])
   [junit4]   2> 692522 INFO  (qtp1558833314-11675) [    ] o.a.s.c.SolrConfig Using Lucene MatchVersion: 8.0.0
   [junit4]   2> 692532 INFO  (qtp1558833314-11675) [    ] o.a.s.s.IndexSchema [collection1_shard2_replica_t45] Schema name=test
   [junit4]   2> 692619 INFO  (qtp1558833314-11675) [    ] o.a.s.s.IndexSchema Loaded schema test/1.0 with uniqueid field id
   [junit4]   2> 692625 INFO  (qtp1558833314-11675) [    ] o.a.s.c.CoreContainer Creating SolrCore 'collection1_shard2_replica_t45' using configuration from collection collection1, trusted=true
   [junit4]   2> 692625 INFO  (qtp1558833314-11675) [    ] o.a.s.m.r.SolrJmxReporter JMX monitoring for 'solr.core.collection1.shard2.replica_t45' (registry 'solr.core.collection1.shard2.replica_t45') enabled at server: com.sun.jmx.mbeanserver.JmxMBeanServer@6bba6964
   [junit4]   2> 692625 INFO  (qtp1558833314-11675) [    ] o.a.s.c.SolrCore solr.RecoveryStrategy.Builder
   [junit4]   2> 692625 INFO  (qtp1558833314-11675) [    ] o.a.s.c.SolrCore [[collection1_shard2_replica_t45] ] Opening new SolrCore at [/home/jenkins/workspace/Lucene-Solr-master-Linux/solr/build/solr-core/test/J2/temp/solr.cloud.HttpPartitionTest_892434F3DB4A5409-001/shard-3-001/cores/collection1_shard2_replica_t45], dataDir=[/home/jenkins/workspace/Lucene-Solr-master-Linux/solr/build/solr-core/test/J2/temp/solr.cloud.HttpPartitionTest_892434F3DB4A5409-001/shard-3-001/cores/collection1_shard2_replica_t45/data/]
   [junit4]   2> 692627 INFO  (qtp1558833314-11675) [    ] o.a.s.u.RandomMergePolicy RandomMergePolicy wrapping class org.apache.lucene.index.TieredMergePolicy: [TieredMergePolicy: maxMergeAtOnce=14, maxMergeAtOnceExplicit=38, maxMergedSegmentMB=47.2880859375, floorSegmentMB=0.8759765625, forceMergeDeletesPctAllowed=17.995157588268476, segmentsPerTier=21.0, maxCFSSegmentSizeMB=8.796093022207999E12, noCFSRatio=0.39833529615685725
   [junit4]   2> 692628 WARN  (qtp1558833314-11675) [    ] o.a.s.c.RequestHandlers INVALID paramSet a in requestHandler {type = requestHandler,name = /dump,class = DumpRequestHandler,attributes = {initParams=a, name=/dump, class=DumpRequestHandler},args = {defaults={a=A,b=B}}}
   [junit4]   2> 692650 INFO  (qtp1558833314-11675) [    ] o.a.s.u.UpdateHandler Using UpdateLog implementation: org.apache.solr.update.UpdateLog
   [junit4]   2> 692651 INFO  (qtp1558833314-11675) [    ] o.a.s.u.UpdateLog Initializing UpdateLog: dataDir= defaultSyncLevel=FLUSH numRecordsToKeep=100 maxNumLogsToKeep=10 numVersionBuckets=65536
   [junit4]   2> 692651 INFO  (qtp1558833314-11675) [    ] o.a.s.u.CommitTracker Hard AutoCommit: disabled
   [junit4]   2> 692651 INFO  (qtp1558833314-11675) [    ] o.a.s.u.CommitTracker Soft AutoCommit: disabled
   [junit4]   2> 692652 INFO  (qtp1558833314-11675) [    ] o.a.s.u.RandomMergePolicy RandomMergePolicy wrapping class org.apache.lucene.index.TieredMergePolicy: [TieredMergePolicy: maxMergeAtOnce=50, maxMergeAtOnceExplicit=24, maxMergedSegmentMB=65.4072265625, floorSegmentMB=1.169921875, forceMergeDeletesPctAllowed=14.716761857966459, segmentsPerTier=20.0, maxCFSSegmentSizeMB=8.796093022207999E12, noCFSRatio=0.16305439323964804
   [junit4]   2> 692652 INFO  (qtp1558833314-11675) [    ] o.a.s.s.SolrIndexSearcher Opening [Searcher@70047bfd[collection1_shard2_replica_t45] main]
   [junit4]   2> 692652 INFO  (qtp1558833314-11675) [    ] o.a.s.r.ManagedResourceStorage Configured ZooKeeperStorageIO with znodeBase: /configs/conf1
   [junit4]   2> 692653 INFO  (qtp1558833314-11675) [    ] o.a.s.r.ManagedResourceStorage Loaded null at path _rest_managed.json using ZooKeeperStorageIO:path=/configs/conf1
   [junit4]   2> 692653 INFO  (qtp1558833314-11675) [    ] o.a.s.h.ReplicationHandler Commits will be reserved for  10000
   [junit4]   2> 692654 INFO  (searcherExecutor-3037-thread-1) [    ] o.a.s.c.SolrCore [collection1_shard2_replica_t45] Registered new searcher Searcher@70047bfd[collection1_shard2_replica_t45] main{ExitableDirectoryReader(UninvertingDirectoryReader())}
   [junit4]   2> 692654 INFO  (qtp1558833314-11675) [    ] o.a.s.u.UpdateLog Could not find max version in index or recent updates, using new clock 1575394638861172736
   [junit4]   2> 692656 INFO  (qtp1558833314-11675) [    ] o.a.s.c.ZkController Core needs to recover:collection1_shard2_replica_t45
   [junit4]   2> 692656 INFO  (updateExecutor-2556-thread-1) [    ] o.a.s.u.DefaultSolrCoreState Running recovery
   [junit4]   2> 692656 INFO  (qtp1558833314-11675) [    ] o.a.s.s.HttpSolrCall [admin] webapp=null path=/admin/cores params={qt=/admin/cores&collection.configName=conf1&name=collection1_shard2_replica_t45&action=CREATE&collection=collection1&shard=shard2&wt=javabin&version=2&replicaType=TLOG} status=0 QTime=1143
   [junit4]   2> 692656 INFO  (recoveryExecutor-2557-thread-1) [    ] o.a.s.c.RecoveryStrategy Starting recovery process. recoveringAfterStartup=true
   [junit4]   2> 692656 INFO  (recoveryExecutor-2557-thread-1) [    ] o.a.s.c.RecoveryStrategy ###### startupVersions=[[]]
   [junit4]   2> 692656 INFO  (recoveryExecutor-2557-thread-1) [    ] o.a.s.c.ZkController collection1_shard2_replica_t45 stopping background replication from leader
   [junit4]   2> 692656 INFO  (recoveryExecutor-2557-thread-1) [    ] o.a.s.c.RecoveryStrategy Begin buffering updates. core=[collection1_shard2_replica_t45]
   [junit4]   2> 692656 INFO  (recoveryExecutor-2557-thread-1) [    ] o.a.s.u.UpdateLog Starting to buffer updates. FSUpdateLog{state=ACTIVE, tlog=null}
   [junit4]   2> 692656 INFO  (recoveryExecutor-2557-thread-1) [    ] o.a.s.c.RecoveryStrategy Publishing state of core [collection1_shard2_replica_t45] as recovering, leader is [http://127.0.0.1:41969/zu_/gw/collection1_shard2_replica_t41/] and I am [http://127.0.0.1:45487/zu_/gw/collection1_shard2_replica_t45/]
   [junit4]   2> 692657 INFO  (qtp1445921533-11562) [    ] o.a.s.s.HttpSolrCall [admin] webapp=null path=/admin/collections params={node=127.0.0.1:45487_zu_%252Fgw&action=ADDREPLICA&collection=collection1&shard=shard2&type=TLOG&wt=javabin&version=2} status=0 QTime=1147
   [junit4]   2> 692658 INFO  (recoveryExecutor-2557-thread-1) [    ] o.a.s.c.RecoveryStrategy Sending prep recovery command to [http://127.0.0.1:41969/zu_/gw]; [WaitForState: action=PREPRECOVERY&core=collection1_shard2_replica_t41&nodeName=127.0.0.1:45487_zu_%252Fgw&coreNodeName=core_node46&state=recovering&checkLive=true&onlyIfLeader=true&onlyIfLeaderActive=true]
   [junit4]   2> 692658 INFO  (SocketProxy-Acceptor-41969) [    ] o.a.s.c.SocketProxy accepted Socket[addr=/127.0.0.1,port=44560,localport=41969], receiveBufferSize:531000
   [junit4]   2> 692658 INFO  (SocketProxy-Acceptor-41969) [    ] o.a.s.c.SocketProxy proxy connection Socket[addr=/127.0.0.1,port=39619,localport=58146], receiveBufferSize=530904
   [junit4]   2> 692659 INFO  (TEST-HttpPartitionTest.test-seed#[892434F3DB4A5409]) [    ] o.a.s.SolrTestCaseJ4 ###Starting test
   [junit4]   2> 692660 INFO  (TEST-HttpPartitionTest.test-seed#[892434F3DB4A5409]) [    ] o.a.s.c.AbstractFullDistribZkTestBase Wait for recoveries to finish - wait 30000 for each attempt
   [junit4]   2> 692660 INFO  (TEST-HttpPartitionTest.test-seed#[892434F3DB4A5409]) [    ] o.a.s.c.AbstractDistribZkTestBase Wait for recoveries to finish - collection: collection1 failOnTimeout:true timeout (sec):30000
   [junit4]   2> 692660 INFO  (qtp600471921-11613) [    ] o.a.s.h.a.PrepRecoveryOp Going to wait for coreNodeName: core_node46, state: recovering, checkLive: true, onlyIfLeader: true, onlyIfLeaderActive: true, maxTime: 183 s
   [junit4]   2> 692660 INFO  (qtp600471921-11613) [    ] o.a.s.h.a.PrepRecoveryOp In WaitForState(recovering): collection=collection1, shard=shard2, thisCore=collection1_shard2_replica_t41, leaderDoesNotNeedRecovery=false, isLeader? true, live=true, checkLive=true, currentState=down, localState=active, nodeName=127.0.0.1:45487_zu_%2Fgw, coreNodeName=core_node46, onlyIfActiveCheckResult=false, nodeProps: core_node46:{"core":"collection1_shard2_replica_t45","base_url":"http://127.0.0.1:45487/zu_/gw","node_name":"127.0.0.1:45487_zu_%2Fgw","state":"down","type":"TLOG"}
   [junit4]   2> 692759 INFO  (zkCallback-2559-thread-1) [    ] o.a.s.c.c.ZkStateReader A cluster state change: [WatchedEvent state:SyncConnected type:NodeDataChanged path:/collections/collection1/state.json] for collection [collection1] has occurred - updating... (live nodes size: [4])
   [junit4]   2> 692759 INFO  (zkCallback-2547-thread-1) [    ] o.a.s.c.c.ZkStateReader A cluster state change: [WatchedEvent state:SyncConnected type:NodeDataChanged path:/collections/collection1/state.json] for collection [collection1] has occurred - updating... (live nodes size: [4])
   [junit4]   2> 692759 INFO  (zkCallback-2553-thread-1) [    ] o.a.s.c.c.ZkStateReader A cluster state change: [WatchedEvent state:SyncConnected type:NodeDataChanged path:/collections/collection1/state.json] for collection [collection1] has occurred - updating... (live nodes size: [4])
   [junit4]   2> 693512 INFO  (OverseerCollectionConfigSetProcessor-98462164426424324-127.0.0.1:43157_zu_%2Fgw-n_0000000000) [    ] o.a.s.c.OverseerTaskQueue Response ZK path: /overseer/collection-queue-work/qnr-0000000008 doesn't exist.  Requestor may have disconnected from ZooKeeper
   [junit4]   2> 693660 INFO  (qtp600471921-11613) [    ] o.a.s.h.a.PrepRecoveryOp In WaitForState(recovering): collection=collection1, shard=shard2, thisCore=collection1_shard2_replica_t41, leaderDoesNotNeedRecovery=false, isLeader? true, live=true, checkLive=true, currentState=recovering, localState=active, nodeName=127.0.0.1:45487_zu_%2Fgw, coreNodeName=core_node46, onlyIfActiveCheckResult=false, nodeProps: core_node46:{"core":"collection1_shard2_replica_t45","base_url":"http://127.0.0.1:45487/zu_/gw","node_name":"127.0.0.1:45487_zu_%2Fgw","state":"recovering","type":"TLOG"}
   [junit4]   2> 693660 INFO  (qtp600471921-11613) [    ] o.a.s.h.a.PrepRecoveryOp Waited coreNodeName: core_node46, state: recovering, checkLive: true, onlyIfLeader: true for: 1 seconds.
   [junit4]   2> 693660 INFO  (qtp600471921-11613) [    ] o.a.s.s.HttpSolrCall [admin] webapp=null path=/admin/cores params={nodeName=127.0.0.1:45487_zu_%252Fgw&onlyIfLeaderActive=true&core=collection1_shard2_replica_t41&coreNodeName=core_node46&action=PREPRECOVERY&checkLive=true&state=recovering&onlyIfLeader=true&wt=javabin&version=2} status=0 QTime=1000
   [junit4]   2> 694161 INFO  (recoveryExecutor-2557-thread-1) [    ] o.a.s.c.RecoveryStrategy Starting Replication Recovery.
   [junit4]   2> 694161 INFO  (recoveryExecutor-2557-thread-1) [    ] o.a.s.c.RecoveryStrategy Attempting to replicate from [http://127.0.0.1:41969/zu_/gw/collection1_shard2_replica_t41/].
   [junit4]   2> 694162 INFO  (SocketProxy-Acceptor-41969) [    ] o.a.s.c.SocketProxy accepted Socket[addr=/127.0.0.1,port=44574,localport=41969], receiveBufferSize:531000
   [junit4]   2> 694162 INFO  (SocketProxy-Acceptor-41969) [    ] o.a.s.c.SocketProxy proxy connection Socket[addr=/127.0.0.1,port=39619,localport=58160], receiveBufferSize=530904
   [junit4]   2> 694163 INFO  (qtp600471921-11613) [    ] o.a.s.u.DirectUpdateHandler2 start commit{_version_=1575394640443473920,optimize=false,openSearcher=false,waitSearcher=true,expungeDeletes=false,softCommit=false,prepareCommit=false}
   [junit4]   2> 694163 INFO  (qtp600471921-11613) [    ] o.a.s.u.DirectUpdateHandler2 No uncommitted changes. Skipping IW.commit.
   [junit4]   2> 694163 INFO  (qtp600471921-11613) [    ] o.a.s.u.DirectUpdateHandler2 end_commit_flush
   [junit4]   2> 694163 INFO  (qtp600471921-11613) [    ] o.a.s.u.p.LogUpdateProcessorFactory [collection1_shard2_replica_t41]  webapp=/zu_/gw path=/update params={waitSearcher=true&openSearcher=false&commit=true&softCommit=false&commit_end_point=true&wt=javabin&version=2}{commit=} 0 0
   [junit4]   2> 694164 INFO  (SocketProxy-Acceptor-41969) [    ] o.a.s.c.SocketProxy accepted Socket[addr=/127.0.0.1,port=44578,localport=41969], receiveBufferSize:531000
   [junit4]   2> 694164 INFO  (SocketProxy-Acceptor-41969) [    ] o.a.s.c.SocketProxy proxy connection Socket[addr=/127.0.0.1,port=39619,localport=58164], receiveBufferSize=530904
   [junit4]   2> 694165 INFO  (qtp600471921-11609) [    ] o.a.s.c.S.Request [collection1_shard2_replica_t41]  webapp=/zu_/gw path=/replication params={qt=/replication&wt=javabin&version=2&command=indexversion} status=0 QTime=0
   [junit4]   2> 694165 INFO  (recoveryExecutor-2557-thread-1) [    ] o.a.s.h.IndexFetcher Master's generation: 1
   [junit4]   2> 694165 INFO  (recoveryExecutor-2557-thread-1) [    ] o.a.s.h.IndexFetcher Master's version: 0
   [junit4]   2> 694165 INFO  (recoveryExecutor-2557-thread-1) [    ] o.a.s.h.IndexFetcher Slave's generation: 1
   [junit4]   2> 694165 INFO  (recoveryExecutor-2557-thread-1) [    ] o.a.s.h.IndexFetcher Slave's version: 0
   [junit4]   2> 694165 INFO  (recoveryExecutor-2557-thread-1) [    ] o.a.s.c.RecoveryStrategy Replication Recovery was successful.
   [junit4]   2> 694165 INFO  (recoveryExecutor-2557-thread-1) [    ] o.a.s.c.RecoveryStrategy Registering as Active after recovery.
   [junit4]   2> 694165 INFO  (recoveryExecutor-2557-thread-1) [    ] o.a.s.c.ZkController collection1_shard2_replica_t45 starting background replication from leader
   [junit4]   2> 694165 INFO  (recoveryExecutor-2557-thread-1) [    ] o.a.s.c.ReplicateFromLeader Will start replication from leader with poll interval: 00:00:03
   [junit4]   2> 694166 INFO  (recoveryExecutor-2557-thread-1) [    ] o.a.s.h.ReplicationHandler Poll scheduled at an interval of 3000ms
   [junit4]   2> 694166 INFO  (recoveryExecutor-2557-thread-1) [    ] o.a.s.c.RecoveryStrategy Updating version bucket highest from index after successful recovery.
   [junit4]   2> 694166 INFO  (recoveryExecutor-2557-thread-1) [    ] o.a.s.u.UpdateLog Could not find max version in index or recent updates, using new clock 1575394640446619648
   [junit4]   2> 694168 INFO  (recoveryExecutor-2557-thread-1) [    ] o.a.s.c.RecoveryStrategy Finished recovery process, successful=[true]
   [junit4]   2> 694268 INFO  (zkCallback-2547-thread-1) [    ] o.a.s.c.c.ZkStateReader A cluster state change: [WatchedEvent state:SyncConnected type:NodeDataChanged path:/collections/collection1/state.json] for collection [collection1] has occurred - updating... (live nodes size: [4])
   [junit4]   2> 694268 INFO  (zkCallback-2559-thread-1) [    ] o.a.s.c.c.ZkStateReader A cluster state change: [WatchedEvent state:SyncConnected type:NodeDataChanged path:/collections/collection1/state.json] for collection [collection1] has occurred - updating... (live nodes size: [4])
   [junit4]   2> 694268 INFO  (zkCallback-2553-thread-1) [    ] o.a.s.c.c.ZkStateReader A cluster state change: [WatchedEvent state:SyncConnected type:NodeDataChanged path:/collections/collection1/state.json] for collection [collection1] has occurred - updating... (live nodes size: [4])
   [junit4]   2> 694339 INFO  (indexFetcher-3043-thread-1) [    ] o.a.s.h.IndexFetcher Updated masterUrl to http://127.0.0.1:41969/zu_/gw/collection1_shard2_replica_t41/
   [junit4]   2> 694340 INFO  (qtp600471921-11608) [    ] o.a.s.c.S.Request [collection1_shard2_replica_t41]  webapp=/zu_/gw path=/replication params={qt=/replication&wt=javabin&version=2&command=indexversion} status=0 QTime=0
   [junit4]   2> 694340 INFO  (indexFetcher-3043-thread-1) [    ] o.a.s.h.IndexFetcher Master's generation: 1
   [junit4]   2> 694340 INFO  (indexFetcher-3043-thread-1) [    ] o.a.s.h.IndexFetcher Master's version: 0
   [junit4]   2> 694340 INFO  (indexFetcher-3043-thread-1) [    ] o.a.s.h.IndexFetcher Slave's generation: 1
   [junit4]   2> 694340 INFO  (indexFetcher-3043-thread-1) [    ] o.a.s.h.IndexFetcher Slave's version: 0
   [junit4]   2> 694660 INFO  (TEST-HttpPartitionTest.test-seed#[892434F3DB4A5409]) [    ] o.a.s.c.AbstractDistribZkTestBase Recoveries finished - collection: collection1
   [junit4]   2> 694662 INFO  (qtp1445921533-11563) [    ] o.a.s.u.DirectUpdateHandler2 start commit{_version_=1575394640966713344,optimize=false,openSearcher=true,waitSearcher=true,expungeDeletes=false,softCommit=false,prepareCommit=false}
   [junit4]   2> 694662 INFO  (qtp1445921533-11563) [    ] o.a.s.u.DirectUpdateHandler2 No uncommitted changes. Skipping IW.commit.
   [junit4]   2> 694662 INFO  (qtp1445921533-11563) [    ] o.a.s.u.DirectUpdateHandler2 end_commit_flush
   [junit4]   2> 694662 INFO  (qtp1445921533-11563) [    ] o.a.s.u.p.LogUpdateProcessorFactory [control_collection_shard1_replica_n1]  webapp=/zu_/gw path=/update params={waitSearcher=true&commit=true&softCommit=false&wt=javabin&version=2}{commit=} 0 0
   [junit4]   2> 694663 INFO  (SocketProxy-Acceptor-45957) [    ] o.a.s.c.SocketProxy accepted Socket[addr=/127.0.0.1,port=37500,localport=45957], receiveBufferSize:531000
   [junit4]   2> 694664 INFO  (SocketProxy-Acceptor-45957) [    ] o.a.s.c.SocketProxy proxy connection Socket[addr=/127.0.0.1,port=44625,localport=40522], receiveBufferSize=530904
   [junit4]   2> 694673 INFO  (SocketProxy-Acceptor-45957) [    ] o.a.s.c.SocketProxy accepted Socket[addr=/127.0.0.1,port=37504,localport=45957], receiveBufferSize:531000
   [junit4]   2> 694680 INFO  (SocketProxy-Acceptor-45957) [    ] o.a.s.c.SocketProxy proxy connection Socket[addr=/127.0.0.1,port=44625,localport=40526], receiveBufferSize=530904
   [junit4]   2> 694682 INFO  (SocketProxy-Acceptor-41969) [    ] o.a.s.c.SocketProxy accepted Socket[addr=/127.0.0.1,port=44598,localport=41969], receiveBufferSize:531000
   [junit4]   2> 694683 INFO  (SocketProxy-Acceptor-41969) [    ] o.a.s.c.SocketProxy proxy connection Socket[addr=/127.0.0.1,port=39619,localport=58184], receiveBufferSize=530904
   [junit4]   2> 694683 INFO  (qtp36373676-11640) [    ] o.a.s.u.DirectUpdateHandler2 start commit{_version_=1575394640988733440,optimize=false,openSearcher=true,waitSearcher=true,expungeDeletes=false,softCommit=false,prepareCommit=false}
   [junit4]   2> 694683 INFO  (qtp36373676-11640) [    ] o.a.s.u.DirectUpdateHandler2 No uncommitted changes. Skipping IW.commit.
   [junit4]   2> 694683 INFO  (qtp36373676-11640) [    ] o.a.s.u.DirectUpdateHandler2 end_commit_flush
   [junit4]   2> 694683 INFO  (SocketProxy-Acceptor-45487) [    ] o.a.s.c.SocketProxy accepted Socket[addr=/127.0.0.1,port=33262,localport=45487], receiveBufferSize:531000
   [junit4]   2> 694684 INFO  (qtp36373676-11640) [    ] o.a.s.u.p.LogUpdateProcessorFactory [collection1_shard1_replica_t43]  webapp=/zu_/gw path=/update params={update.distrib=FROMLEADER&waitSearcher=true&openSearcher=true&commit=true&softCommit=false&distrib.from=http://127.0.0.1:45957/zu_/gw/collection1_shard1_replica_t43/&commit_end_point=true&wt=javabin&version=2&expungeDeletes=false}{commit=} 0 1
   [junit4]   2> 694684 INFO  (SocketProxy-Acceptor-45487) [    ] o.a.s.c.SocketProxy proxy connection Socket[addr=/127.0.0.1,port=42585,localport=53636], receiveBufferSize=530904
   [junit4]   2> 694684 INFO  (qtp600471921-11607) [    ] o.a.s.u.DirectUpdateHandler2 start commit{_version_=1575394640989782016,optimize=false,openSearcher=true,waitSearcher=true,expungeDeletes=false,softCommit=false,prepareCommit=false}
   [junit4]   2> 694684 INFO  (qtp1558833314-11677) [    ] o.a.s.u.TestInjection Start waiting for replica in sync with leader
   [junit4]   2> 694684 INFO  (qtp600471921-11607) [    ] o.a.s.u.DirectUpdateHandler2 No uncommitted changes. Skipping IW.commit.
   [junit4]   2> 694684 INFO  (qtp600471921-11607) [    ] o.a.s.u.DirectUpdateHandler2 end_commit_flush
   [junit4]   2> 694685 INFO  (qtp600471921-11607) [    ] o.a.s.u.p.LogUpdateProcessorFactory [collection1_shard2_replica_t41]  webapp=/zu_/gw path=/update params={update.distrib=FROMLEADER&waitSearcher=true&openSearcher=true&commit=true&softCommit=false&distrib.from=http://127.0.0.1:45957/zu_/gw/collection1_shard1_replica_t43/&commit_end_point=true&wt=javabin&version=2&expungeDeletes=false}{commit=} 0 0
   [junit4]   2> 694689 INFO  (SocketProxy-Acceptor-41969) [    ] o.a.s.c.SocketProxy accepted Socket[addr=/127.0.0.1,port=44606,localport=41969], receiveBufferSize:531000
   [junit4]   2> 694693 INFO  (qtp600471921-11608) [    ] o.a.s.c.S.Request [collection1_shard2_replica_t41]  webapp=/zu_/gw path=/replication params={qt=/replication&wt=javabin&version=2&command=details} status=0 QTime=0
   [junit4]   2> 694693 INFO  (SocketProxy-Acceptor-41969) [    ] o.a.s.c.SocketProxy proxy connection Socket[addr=/127.0.0.1,port=39619,localport=58192], receiveBufferSize=530904
   [junit4]   2> 694693 INFO  (qtp1558833314-11677) [    ] o.a.s.u.p.LogUpdateProcessorFactory [collection1_shard2_replica_t45]  webapp=/zu_/gw path=/update params={update.distrib=FROMLEADER&waitSearcher=true&openSearcher=true&commit=true&softCommit=false&distrib.from=http://127.0.0.1:45957/zu_/gw/collection1_shard1_replica_t43/&commit_end_point=true&wt=javabin&version=2&expungeDeletes=false}{commit=} 0 9
   [junit4]   2> 694694 INFO  (qtp36373676-11639) [    ] o.a.s.u.p.LogUpdateProcessorFactory [collection1_shard1_replica_t43]  webapp=/zu_/gw path=/update params={_stateVer_=collection1:7&waitSearcher=true&commit=true&softCommit=false&wt=javabin&version=2}{commit=} 0 25
   [junit4]   2> 694696 INFO  (SocketProxy-Acceptor-41969) [    ] o.a.s.c.SocketProxy accepted Socket[addr=/127.0.0.1,port=44610,localport=41969], receiveBufferSize:531000
   [junit4]   2> 694698 INFO  (SocketProxy-Acceptor-41969) [    ] o.a.s.c.SocketProxy proxy connection Socket[addr=/127.0.0.1,port=39619,localport=58196], receiveBufferSize=530904
   [junit4]   2> 694698 INFO  (qtp600471921-11609) [    ] o.a.s.c.S.Request [collection1_shard2_replica_t41]  webapp=/zu_/gw path=/select params={q=*:*&distrib=false&tests=checkShardConsistency&rows=0&wt=javabin&version=2} hits=0 status=0 QTime=0
   [junit4]   2> 694699 INFO  (SocketProxy-Acceptor-45487) [    ] o.a.s.c.SocketProxy accepted Socket[addr=/127.0.0.1,port=33274,localport=45487], receiveBufferSize:531000
   [junit4]   2> 694702 INFO  (qtp1558833314-11672) [    ] o.a.s.c.S.Request [collection1_shard2_replica_t45]  webapp=/zu_/gw path=/select params={q=*:*&distrib=false&tests=checkShardConsistency&rows=0&wt=javabin&version=2} hits=0 status=0 QTime=0
   [junit4]   2> 694702 INFO  (SocketProxy-Acceptor-45487) [    ] o.a.s.c.SocketProxy proxy connection Socket[addr=/127.0.0.1,port=42585,localport=53648], receiveBufferSize=530904
   [junit4]   2> 694703 INFO  (SocketProxy-Acceptor-45957) [    ] o.a.s.c.SocketProxy accepted Socket[addr=/127.0.0.1,port=37528,localport=45957], receiveBufferSize:531000
   [junit4]   2> 694704 INFO  (SocketProxy-Acceptor-45957) [    ] o.a.s.c.SocketProxy proxy connection Socket[addr=/127.0.0.1,port=44625,localport=40550], receiveBufferSize=530904
   [junit4]   2> 694705 INFO  (qtp36373676-11638) [    ] o.a.s.c.S.Request [collection1_shard1_replica_t43]  webapp=/zu_/gw path=/select params={q=*:*&distrib=false&tests=checkShardConsistency&rows=0&wt=javabin&version=2} hits=0 status=0 QTime=0
   [junit4]   2> 696716 INFO  (SocketProxy-Acceptor-41969) [    ] o.a.s.c.SocketProxy accepted Socket[addr=/127.0.0.1,port=44634,localport=41969], receiveBufferSize:531000
   [junit4]   2> 696717 INFO  (qtp600471921-11611) [    ] o.a.s.h.a.CollectionsHandler Invoked Collection Action :create with params pullReplicas=0&maxShardsPerNode=1&collection.configName=conf1&nrtReplicas=0&name=c8n_crud_1x2&action=CREATE&numShards=1&tlogReplicas=2&wt=javabin&version=2 and sendToOCPQueue=true
   [junit4]   2> 696719 INFO  (OverseerThreadFactory-3001-thread-5) [    ] o.a.s.c.CreateCollectionCmd Create collection c8n_crud_1x2
   [junit4]   2> 696720 INFO  (SocketProxy-Acceptor-41969) [    ] o.a.s.c.SocketProxy proxy connection Socket[addr=/127.0.0.1,port=39619,localport=58220], receiveBufferSize=530904
   [junit4]   2> 696826 INFO  (qtp1445921533-11557) [    ] o.a.s.h.a.CoreAdminOperation core create command qt=/admin/cores&collection.configName=conf1&newCollection=true&name=c8n_crud_1x2_shard1_replica_t1&action=CREATE&numShards=1&collection=c8n_crud_1x2&shard=shard1&wt=javabin&version=2&replicaType=TLOG
   [junit4]   2> 696827 INFO  (qtp600471921-11612) [    ] o.a.s.h.a.CoreAdminOperation core create command qt=/admin/cores&collection.configName=conf1&newCollection=true&name=c8n_crud_1x2_shard1_replica_t2&action=CREATE&numShards=1&collection=c8n_crud_1x2&shard=shard1&wt=javabin&version=2&replicaType=TLOG
   [junit4]   2> 696930 INFO  (zkCallback-2547-thread-1) [    ] o.a.s.c.c.ZkStateReader A cluster state change: [WatchedEvent state:SyncConnected type:NodeDataChanged path:/collections/c8n_crud_1x2/state.json] for collection [c8n_crud_1x2] has occurred - updating... (live nodes size: [4])
   [junit4]   2> 696930 INFO  (zkCallback-2535-thread-2) [    ] o.a.s.c.c.ZkStateReader A cluster state change: [WatchedEvent state:SyncConnected type:NodeDataChanged path:/collections/c8n_crud_1x2/state.json] for collection [c8n_crud_1x2] has occurred - updating... (live nodes size: [4])
   [junit4]   2> 697341 INFO  (qtp600471921-11613) [    ] o.a.s.c.S.Request [collection1_shard2_replica_t41]  webapp=/zu_/gw path=/replication params={qt=/replication&wt=javabin&version=2&command=indexversion} status=0 QTime=0
   [junit4]   2> 697341 INFO  (indexFetcher-3043-thread-1) [    ] o.a.s.h.IndexFetcher Master's generation: 1
   [junit4]   2> 697341 INFO  (indexFetcher-3043-thread-1) [    ] o.a.s.h.IndexFetcher Master's version: 0
   [junit4]   2> 697341 INFO  (indexFetcher-3043-thread-1) [    ] o.a.s.h.IndexFetcher Slave's generation: 1
   [junit4]   2> 697341 INFO  (indexFetcher-3043-thread-1) [    ] o.a.s.h.IndexFetcher Slave's version: 0
   [junit4]   2> 697834 INFO  (qtp600471921-11612) [    ] o.a.s.c.SolrConfig Using Lucene MatchVersion: 8.0.0
   [junit4]   2> 697839 INFO  (qtp1445921533-11557) [    ] o.a.s.c.SolrConfig Using Lucene MatchVersion: 8.0.0
   [junit4]   2> 697853 INFO  (qtp600471921-11612) [    ] o.a.s.s.IndexSchema [c8n_crud_1x2_shard1_replica_t2] Schema name=test
   [junit4]   2> 697854 INFO  (qtp1445921533-11557) [    ] o.a.s.s.IndexSchema [c8n_crud_1x2_shard1_replica_t1] Schema name=test
   [junit4]   2> 697940 INFO  (qtp1445921533-11557) [    ] o.a.s.s.IndexSchema Loaded schema test/1.0 with uniqueid field id
   [junit4]   2> 697953 INFO  (qtp1445921533-11557) [    ] o.a.s.c.CoreContainer Creating SolrCore 'c8n_crud_1x2_shard1_replica_t1' using configuration from collection c8n_crud_1x2, trusted=true
   [junit4]   2> 697953 INFO  (qtp1445921533-11557) [    ] o.a.s.m.r.SolrJmxReporter JMX monitoring for 'solr.core.c8n_crud_1x2.shard1.replica_t1' (registry 'solr.core.c8n_crud_1x2.shard1.replica_t1') enabled at server: com.sun.jmx.mbeanserver.JmxMBeanServer@6bba6964
   [junit4]   2> 697954 INFO  (qtp1445921533-11557) [    ] o.a.s.c.SolrCore solr.RecoveryStrategy.Builder
   [junit4]   2> 697954 INFO  (qtp1445921533-11557) [    ] o.a.s.c.SolrCore [[c8n_crud_1x2_shard1_replica_t1] ] Opening new SolrCore at [/home/jenkins/workspace/Lucene-Solr-master-Linux/solr/build/solr-core/test/J2/temp/solr.cloud.HttpPartitionTest_892434F3DB4A5409-001/control-001/cores/c8n_crud_1x2_shard1_replica_t1], dataDir=[/home/jenkins/workspace/Lucene-Solr-master-Linux/solr/build/solr-core/test/J2/temp/solr.cloud.HttpPartitionTest_892434F3DB4A5409-001/control-001/cores/c8n_crud_1x2_shard1_replica_t1/data/]
   [junit4]   2> 697955 INFO  (qtp600471921-11612) [    ] o.a.s.s.IndexSchema Loaded schema test/1.0 with uniqueid field id
   [junit4]   2> 697955 INFO  (qtp1445921533-11557) [    ] o.a.s.u.RandomMergePolicy RandomMergePolicy wrapping class org.apache.lucene.index.TieredMergePolicy: [TieredMergePolicy: maxMergeAtOnce=14, maxMergeAtOnceExplicit=38, maxMergedSegmentMB=47.2880859375, floorSegmentMB=0.8759765625, forceMergeDeletesPctAllowed=17.995157588268476, segmentsPerTier=21.0, maxCFSSegmentSizeMB=8.796093022207999E12, noCFSRatio=0.39833529615685725
   [junit4]   2> 697957 WARN  (qtp1445921533-11557) [    ] o.a.s.c.RequestHandlers INVALID paramSet a in requestHandler {type = requestHandler,name = /dump,class = DumpRequestHandler,attributes = {initParams=a, name=/dump, class=DumpRequestHandler},args = {defaults={a=A,b=B}}}
   [junit4]   2> 697962 INFO  (qtp600471921-11612) [    ] o.a.s.c.CoreContainer Creating SolrCore 'c8n_crud_1x2_shard1_replica_t2' using configuration from collection c8n_crud_1x2, trusted=true
   [junit4]   2> 697962 INFO  (qtp600471921-11612) [    ] o.a.s.m.r.SolrJmxReporter JMX monitoring for 'solr.core.c8n_crud_1

[...truncated too long message...]

  2> 	at org.apache.solr.handler.IndexFetcher.fetchLatestIndex(IndexFetcher.java:332)
   [junit4]   2> 	at org.apache.solr.handler.ReplicationHandler.doFetch(ReplicationHandler.java:419)
   [junit4]   2> 	at org.apache.solr.handler.ReplicationHandler.lambda$setupPolling$12(ReplicationHandler.java:1183)
   [junit4]   2> 	at java.base/java.util.concurrent.Executors$RunnableAdapter.call(Executors.java:514)
   [junit4]   2> 	at java.base/java.util.concurrent.FutureTask.runAndReset(FutureTask.java:305)
   [junit4]   2> 	at java.base/java.util.concurrent.ScheduledThreadPoolExecutor$ScheduledFutureTask.run(ScheduledThreadPoolExecutor.java:300)
   [junit4]   2> 	at java.base/java.util.concurrent.ThreadPoolExecutor.runWorker(ThreadPoolExecutor.java:1167)
   [junit4]   2> 	at java.base/java.util.concurrent.ThreadPoolExecutor$Worker.run(ThreadPoolExecutor.java:641)
   [junit4]   2> 	at java.base/java.lang.Thread.run(Thread.java:844)
   [junit4]   2> 
   [junit4]   2> 714407 WARN  (indexFetcher-3043-thread-1) [    ] o.a.s.h.IndexFetcher Could not log failed replication details
   [junit4]   2> org.apache.lucene.store.AlreadyClosedException: Already closed
   [junit4]   2> 	at org.apache.solr.core.CachingDirectoryFactory.get(CachingDirectoryFactory.java:337)
   [junit4]   2> 	at org.apache.solr.handler.ReplicationHandler.loadReplicationProperties(ReplicationHandler.java:1131)
   [junit4]   2> 	at org.apache.solr.handler.IndexFetcher.logReplicationTimeAndConfFiles(IndexFetcher.java:769)
   [junit4]   2> 	at org.apache.solr.handler.IndexFetcher.cleanup(IndexFetcher.java:677)
   [junit4]   2> 	at org.apache.solr.handler.IndexFetcher.fetchLatestIndex(IndexFetcher.java:659)
   [junit4]   2> 	at org.apache.solr.handler.IndexFetcher.fetchLatestIndex(IndexFetcher.java:332)
   [junit4]   2> 	at org.apache.solr.handler.ReplicationHandler.doFetch(ReplicationHandler.java:419)
   [junit4]   2> 	at org.apache.solr.handler.ReplicationHandler.lambda$setupPolling$12(ReplicationHandler.java:1183)
   [junit4]   2> 	at java.base/java.util.concurrent.Executors$RunnableAdapter.call(Executors.java:514)
   [junit4]   2> 	at java.base/java.util.concurrent.FutureTask.runAndReset(FutureTask.java:305)
   [junit4]   2> 	at java.base/java.util.concurrent.ScheduledThreadPoolExecutor$ScheduledFutureTask.run(ScheduledThreadPoolExecutor.java:300)
   [junit4]   2> 	at java.base/java.util.concurrent.ThreadPoolExecutor.runWorker(ThreadPoolExecutor.java:1167)
   [junit4]   2> 	at java.base/java.util.concurrent.ThreadPoolExecutor$Worker.run(ThreadPoolExecutor.java:641)
   [junit4]   2> 	at java.base/java.lang.Thread.run(Thread.java:844)
   [junit4]   2> 715894 WARN  (zkCallback-2559-thread-1) [    ] o.a.s.c.c.ZkStateReader ZooKeeper watch triggered, but Solr cannot talk to ZK: [KeeperErrorCode = Session expired for /live_nodes]
   [junit4]   2> 715894 INFO  (TEST-HttpPartitionTest.test-seed#[892434F3DB4A5409]) [    ] o.e.j.s.AbstractConnector Stopped ServerConnector@1577f773{HTTP/1.1,[http/1.1]}{127.0.0.1:0}
   [junit4]   2> 715894 INFO  (TEST-HttpPartitionTest.test-seed#[892434F3DB4A5409]) [    ] o.e.j.s.h.ContextHandler Stopped o.e.j.s.ServletContextHandler@2cca6a5d{/zu_/gw,null,UNAVAILABLE}
   [junit4]   2> 715895 ERROR (TEST-HttpPartitionTest.test-seed#[892434F3DB4A5409]) [    ] o.a.z.s.ZooKeeperServer ZKShutdownHandler is not registered, so ZooKeeper server won't take any action on ERROR or SHUTDOWN server state changes
   [junit4]   2> 715895 INFO  (TEST-HttpPartitionTest.test-seed#[892434F3DB4A5409]) [    ] o.a.s.c.ZkTestServer connecting to 127.0.0.1:41991 41991
   [junit4]   2> 719752 INFO  (Thread-1222) [    ] o.a.s.c.ZkTestServer connecting to 127.0.0.1:41991 41991
   [junit4]   2> 719752 WARN  (Thread-1222) [    ] o.a.s.c.ZkTestServer Watch limit violations: 
   [junit4]   2> Maximum concurrent create/delete watches above limit:
   [junit4]   2> 
   [junit4]   2> 	6	/solr/aliases.json
   [junit4]   2> 	4	/solr/security.json
   [junit4]   2> 	4	/solr/configs/conf1
   [junit4]   2> 
   [junit4]   2> Maximum concurrent data watches above limit:
   [junit4]   2> 
   [junit4]   2> 	6	/solr/clusterprops.json
   [junit4]   2> 	6	/solr/clusterstate.json
   [junit4]   2> 	3	/solr/collections/collection1/state.json
   [junit4]   2> 	3	/solr/collections/collMinRf_1x3/state.json
   [junit4]   2> 	2	/solr/collections/c8n_crud_1x2/state.json
   [junit4]   2> 
   [junit4]   2> Maximum concurrent children watches above limit:
   [junit4]   2> 
   [junit4]   2> 	6	/solr/live_nodes
   [junit4]   2> 	6	/solr/collections
   [junit4]   2> 	4	/solr/overseer/collection-queue-work
   [junit4]   2> 	3	/solr/overseer/queue
   [junit4]   2> 	2	/solr/overseer/queue-work
   [junit4]   2> 
   [junit4]   2> 719753 WARN  (TEST-HttpPartitionTest.test-seed#[892434F3DB4A5409]) [    ] o.a.s.c.SocketProxy Closing 3 connections to: http://127.0.0.1:43157/zu_/gw, target: http://127.0.0.1:36501/zu_/gw
   [junit4]   2> 719753 WARN  (TEST-HttpPartitionTest.test-seed#[892434F3DB4A5409]) [    ] o.a.s.c.SocketProxy Closing 14 connections to: http://127.0.0.1:41969/zu_/gw, target: http://127.0.0.1:39619/zu_/gw
   [junit4]   2> 719753 WARN  (TEST-HttpPartitionTest.test-seed#[892434F3DB4A5409]) [    ] o.a.s.c.SocketProxy Closing 8 connections to: http://127.0.0.1:45957/zu_/gw, target: http://127.0.0.1:44625/zu_/gw
   [junit4]   2> 719753 WARN  (TEST-HttpPartitionTest.test-seed#[892434F3DB4A5409]) [    ] o.a.s.c.SocketProxy Closing 2 connections to: http://127.0.0.1:45487/zu_/gw, target: http://127.0.0.1:42585/zu_/gw
   [junit4]   2> NOTE: reproduce with: ant test  -Dtestcase=HttpPartitionTest -Dtests.method=test -Dtests.seed=892434F3DB4A5409 -Dtests.multiplier=3 -Dtests.slow=true -Dtests.locale=fr-CH -Dtests.timezone=America/Guyana -Dtests.asserts=true -Dtests.file.encoding=UTF-8
   [junit4] FAILURE 34.8s J2 | HttpPartitionTest.test <<<
   [junit4]    > Throwable #1: java.lang.AssertionError: Doc with id=1 not found in http://127.0.0.1:45957/zu_/gw/collMinRf_1x3 due to: Path not found: /id; rsp={doc=null}
   [junit4]    > 	at __randomizedtesting.SeedInfo.seed([892434F3DB4A5409:1700B2975B639F1]:0)
   [junit4]    > 	at org.apache.solr.cloud.HttpPartitionTest.assertDocExists(HttpPartitionTest.java:603)
   [junit4]    > 	at org.apache.solr.cloud.HttpPartitionTest.assertDocsExistInAllReplicas(HttpPartitionTest.java:558)
   [junit4]    > 	at org.apache.solr.cloud.HttpPartitionTest.testMinRf(HttpPartitionTest.java:249)
   [junit4]    > 	at org.apache.solr.cloud.HttpPartitionTest.test(HttpPartitionTest.java:127)
   [junit4]    > 	at java.base/jdk.internal.reflect.NativeMethodAccessorImpl.invoke0(Native Method)
   [junit4]    > 	at java.base/jdk.internal.reflect.NativeMethodAccessorImpl.invoke(NativeMethodAccessorImpl.java:62)
   [junit4]    > 	at java.base/jdk.internal.reflect.DelegatingMethodAccessorImpl.invoke(DelegatingMethodAccessorImpl.java:43)
   [junit4]    > 	at java.base/java.lang.reflect.Method.invoke(Method.java:564)
   [junit4]    > 	at org.apache.solr.BaseDistributedSearchTestCase$ShardsRepeatRule$ShardsFixedStatement.callStatement(BaseDistributedSearchTestCase.java:993)
   [junit4]    > 	at org.apache.solr.BaseDistributedSearchTestCase$ShardsRepeatRule$ShardsStatement.evaluate(BaseDistributedSearchTestCase.java:968)
   [junit4]    > 	at java.base/java.lang.Thread.run(Thread.java:844)
   [junit4]   2> NOTE: leaving temporary files on disk at: /home/jenkins/workspace/Lucene-Solr-master-Linux/solr/build/solr-core/test/J2/temp/solr.cloud.HttpPartitionTest_892434F3DB4A5409-001
   [junit4]   2> NOTE: test params are: codec=Lucene70, sim=RandomSimilarity(queryNorm=false): {}, locale=fr-CH, timezone=America/Guyana
   [junit4]   2> NOTE: Linux 4.10.0-27-generic amd64/Oracle Corporation 9 (64-bit)/cpus=8,threads=1,free=234389072,total=528482304
   [junit4]   2> NOTE: All tests run in this JVM: [OverseerStatusTest, TestMultiValuedNumericRangeQuery, TestHighFrequencyDictionaryFactory, TestPseudoReturnFields, BasicDistributedZk2Test, TestExactStatsCache, TestLFUCache, SolrMetricReporterTest, TestSuggestSpellingConverter, TestFastWriter, ResponseLogComponentTest, DistributedExpandComponentTest, SSLMigrationTest, TestCloudNestedDocsSort, TestCollectionAPI, XsltUpdateRequestHandlerTest, TestSolrCloudWithSecureImpersonation, TestStressLiveNodes, TestLeaderElectionZkExpiry, SuggesterFSTTest, LeaderFailureAfterFreshStartTest, TestJavabinTupleStreamParser, ReturnFieldsTest, TestIndexSearcher, UnloadDistributedZkTest, TestSSLRandomization, TestInfoStreamLogging, SolrInfoBeanTest, TestPointFields, TestUseDocValuesAsStored, SmileWriterTest, AsyncCallRequestStatusResponseTest, BufferStoreTest, SimpleMLTQParserTest, DeleteStatusTest, TestUtils, TestSerializedLuceneMatchVersion, TestFilteredDocIdSet, TestSizeLimitedDistributedMap, DocumentBuilderTest, StatsComponentTest, SharedFSAutoReplicaFailoverTest, TestSchemaResource, CoreMergeIndexesAdminHandlerTest, HLLUtilTest, RecoveryAfterSoftCommitTest, DocValuesNotIndexedTest, TestInitQParser, TestSolr4Spatial2, SortByFunctionTest, TermVectorComponentDistributedTest, TestOverriddenPrefixQueryForCustomFieldType, TestManagedSynonymFilterFactory, PathHierarchyTokenizerFactoryTest, PeerSyncWithIndexFingerprintCachingTest, TestTrackingShardHandlerFactory, ClusterStateTest, AnalyticsQueryTest, RecoveryZkTest, TestTolerantSearch, VMParamsZkACLAndCredentialsProvidersTest, TestDefaultStatsCache, TestExportWriter, NumericFieldsTest, ManagedSchemaRoundRobinCloudTest, MetricsConfigTest, TestRecovery, TestBlendedInfixSuggestions, DistributedSuggestComponentTest, TestReversedWildcardFilterFactory, TestAuthenticationFramework, BlobRepositoryCloudTest, ExitableDirectoryReaderTest, TestScoreJoinQPScore, TestDocTermOrds, SignatureUpdateProcessorFactoryTest, CopyFieldTest, NodeMutatorTest, ConfigSetsAPITest, AutoCommitTest, TestComplexPhraseQParserPlugin, HttpPartitionTest]
   [junit4] Completed [210/729 (1!)] on J2 in 34.79s, 1 test, 1 failure <<< FAILURES!

[...truncated 38292 lines...]

Mime
View raw message