lucene-dev mailing list archives

Site index · List index
Message view « Date » · « Thread »
Top « Date » · « Thread »
From Policeman Jenkins Server <jenk...@thetaphi.de>
Subject [JENKINS-EA] Lucene-Solr-7.0-Windows (32bit/jdk-9-ea+178) - Build # 72 - Still Unstable!
Date Mon, 07 Aug 2017 00:26:04 GMT
Build: https://jenkins.thetaphi.de/job/Lucene-Solr-7.0-Windows/72/
Java: 32bit/jdk-9-ea+178 -client -XX:+UseConcMarkSweepGC --illegal-access=deny

2 tests failed.
FAILED:  junit.framework.TestSuite.org.apache.solr.EchoParamsTest

Error Message:
Could not remove the following files (in the order of attempts):    C:\Users\jenkins\workspace\Lucene-Solr-7.0-Windows\solr\build\solr-core\test\J0\temp\solr.EchoParamsTest_159E79CD90C5F18E-001\init-core-data-001: java.nio.file.AccessDeniedException: C:\Users\jenkins\workspace\Lucene-Solr-7.0-Windows\solr\build\solr-core\test\J0\temp\solr.EchoParamsTest_159E79CD90C5F18E-001\init-core-data-001    C:\Users\jenkins\workspace\Lucene-Solr-7.0-Windows\solr\build\solr-core\test\J0\temp\solr.EchoParamsTest_159E79CD90C5F18E-001: java.nio.file.DirectoryNotEmptyException: C:\Users\jenkins\workspace\Lucene-Solr-7.0-Windows\solr\build\solr-core\test\J0\temp\solr.EchoParamsTest_159E79CD90C5F18E-001 

Stack Trace:
java.io.IOException: Could not remove the following files (in the order of attempts):
   C:\Users\jenkins\workspace\Lucene-Solr-7.0-Windows\solr\build\solr-core\test\J0\temp\solr.EchoParamsTest_159E79CD90C5F18E-001\init-core-data-001: java.nio.file.AccessDeniedException: C:\Users\jenkins\workspace\Lucene-Solr-7.0-Windows\solr\build\solr-core\test\J0\temp\solr.EchoParamsTest_159E79CD90C5F18E-001\init-core-data-001
   C:\Users\jenkins\workspace\Lucene-Solr-7.0-Windows\solr\build\solr-core\test\J0\temp\solr.EchoParamsTest_159E79CD90C5F18E-001: java.nio.file.DirectoryNotEmptyException: C:\Users\jenkins\workspace\Lucene-Solr-7.0-Windows\solr\build\solr-core\test\J0\temp\solr.EchoParamsTest_159E79CD90C5F18E-001

	at __randomizedtesting.SeedInfo.seed([159E79CD90C5F18E]:0)
	at org.apache.lucene.util.IOUtils.rm(IOUtils.java:329)
	at org.apache.lucene.util.TestRuleTemporaryFilesCleanup.afterAlways(TestRuleTemporaryFilesCleanup.java:216)
	at com.carrotsearch.randomizedtesting.rules.TestRuleAdapter$1.afterAlways(TestRuleAdapter.java:31)
	at com.carrotsearch.randomizedtesting.rules.StatementAdapter.evaluate(StatementAdapter.java:43)
	at com.carrotsearch.randomizedtesting.rules.StatementAdapter.evaluate(StatementAdapter.java:36)
	at org.apache.lucene.util.TestRuleAssertionsRequired$1.evaluate(TestRuleAssertionsRequired.java:53)
	at org.apache.lucene.util.TestRuleMarkFailure$1.evaluate(TestRuleMarkFailure.java:47)
	at org.apache.lucene.util.TestRuleIgnoreAfterMaxFailures$1.evaluate(TestRuleIgnoreAfterMaxFailures.java:64)
	at org.apache.lucene.util.TestRuleIgnoreTestSuites$1.evaluate(TestRuleIgnoreTestSuites.java:54)
	at com.carrotsearch.randomizedtesting.rules.StatementAdapter.evaluate(StatementAdapter.java:36)
	at com.carrotsearch.randomizedtesting.ThreadLeakControl$StatementRunner.run(ThreadLeakControl.java:368)
	at java.base/java.lang.Thread.run(Thread.java:844)


FAILED:  junit.framework.TestSuite.org.apache.solr.servlet.DirectSolrConnectionTest

Error Message:
Could not remove the following files (in the order of attempts):    C:\Users\jenkins\workspace\Lucene-Solr-7.0-Windows\solr\build\solr-core\test\J0\temp\solr.servlet.DirectSolrConnectionTest_159E79CD90C5F18E-001\init-core-data-001: java.nio.file.AccessDeniedException: C:\Users\jenkins\workspace\Lucene-Solr-7.0-Windows\solr\build\solr-core\test\J0\temp\solr.servlet.DirectSolrConnectionTest_159E79CD90C5F18E-001\init-core-data-001    C:\Users\jenkins\workspace\Lucene-Solr-7.0-Windows\solr\build\solr-core\test\J0\temp\solr.servlet.DirectSolrConnectionTest_159E79CD90C5F18E-001: java.nio.file.DirectoryNotEmptyException: C:\Users\jenkins\workspace\Lucene-Solr-7.0-Windows\solr\build\solr-core\test\J0\temp\solr.servlet.DirectSolrConnectionTest_159E79CD90C5F18E-001 

Stack Trace:
java.io.IOException: Could not remove the following files (in the order of attempts):
   C:\Users\jenkins\workspace\Lucene-Solr-7.0-Windows\solr\build\solr-core\test\J0\temp\solr.servlet.DirectSolrConnectionTest_159E79CD90C5F18E-001\init-core-data-001: java.nio.file.AccessDeniedException: C:\Users\jenkins\workspace\Lucene-Solr-7.0-Windows\solr\build\solr-core\test\J0\temp\solr.servlet.DirectSolrConnectionTest_159E79CD90C5F18E-001\init-core-data-001
   C:\Users\jenkins\workspace\Lucene-Solr-7.0-Windows\solr\build\solr-core\test\J0\temp\solr.servlet.DirectSolrConnectionTest_159E79CD90C5F18E-001: java.nio.file.DirectoryNotEmptyException: C:\Users\jenkins\workspace\Lucene-Solr-7.0-Windows\solr\build\solr-core\test\J0\temp\solr.servlet.DirectSolrConnectionTest_159E79CD90C5F18E-001

	at __randomizedtesting.SeedInfo.seed([159E79CD90C5F18E]:0)
	at org.apache.lucene.util.IOUtils.rm(IOUtils.java:329)
	at org.apache.lucene.util.TestRuleTemporaryFilesCleanup.afterAlways(TestRuleTemporaryFilesCleanup.java:216)
	at com.carrotsearch.randomizedtesting.rules.TestRuleAdapter$1.afterAlways(TestRuleAdapter.java:31)
	at com.carrotsearch.randomizedtesting.rules.StatementAdapter.evaluate(StatementAdapter.java:43)
	at com.carrotsearch.randomizedtesting.rules.StatementAdapter.evaluate(StatementAdapter.java:36)
	at org.apache.lucene.util.TestRuleAssertionsRequired$1.evaluate(TestRuleAssertionsRequired.java:53)
	at org.apache.lucene.util.TestRuleMarkFailure$1.evaluate(TestRuleMarkFailure.java:47)
	at org.apache.lucene.util.TestRuleIgnoreAfterMaxFailures$1.evaluate(TestRuleIgnoreAfterMaxFailures.java:64)
	at org.apache.lucene.util.TestRuleIgnoreTestSuites$1.evaluate(TestRuleIgnoreTestSuites.java:54)
	at com.carrotsearch.randomizedtesting.rules.StatementAdapter.evaluate(StatementAdapter.java:36)
	at com.carrotsearch.randomizedtesting.ThreadLeakControl$StatementRunner.run(ThreadLeakControl.java:368)
	at java.base/java.lang.Thread.run(Thread.java:844)




Build Log:
[...truncated 1722 lines...]
   [junit4] JVM J0: stderr was not empty, see: C:\Users\jenkins\workspace\Lucene-Solr-7.0-Windows\lucene\build\core\test\temp\junit4-J0-20170806_230701_53211683102151774158770.syserr
   [junit4] >>> JVM J0 emitted unexpected output (verbatim) ----
   [junit4] Java HotSpot(TM) Server VM warning: Option UseConcMarkSweepGC was deprecated in version 9.0 and will likely be removed in a future release.
   [junit4] <<< JVM J0: EOF ----

[...truncated 3 lines...]
   [junit4] JVM J1: stderr was not empty, see: C:\Users\jenkins\workspace\Lucene-Solr-7.0-Windows\lucene\build\core\test\temp\junit4-J1-20170806_230701_53213236428518995525523.syserr
   [junit4] >>> JVM J1 emitted unexpected output (verbatim) ----
   [junit4] Java HotSpot(TM) Server VM warning: Option UseConcMarkSweepGC was deprecated in version 9.0 and will likely be removed in a future release.
   [junit4] <<< JVM J1: EOF ----

[...truncated 301 lines...]
   [junit4] JVM J1: stderr was not empty, see: C:\Users\jenkins\workspace\Lucene-Solr-7.0-Windows\lucene\build\test-framework\test\temp\junit4-J1-20170806_231337_25814599452144137694277.syserr
   [junit4] >>> JVM J1 emitted unexpected output (verbatim) ----
   [junit4] Java HotSpot(TM) Server VM warning: Option UseConcMarkSweepGC was deprecated in version 9.0 and will likely be removed in a future release.
   [junit4] <<< JVM J1: EOF ----

[...truncated 3 lines...]
   [junit4] JVM J0: stderr was not empty, see: C:\Users\jenkins\workspace\Lucene-Solr-7.0-Windows\lucene\build\test-framework\test\temp\junit4-J0-20170806_231337_2586959802833660000476.syserr
   [junit4] >>> JVM J0 emitted unexpected output (verbatim) ----
   [junit4] Java HotSpot(TM) Server VM warning: Option UseConcMarkSweepGC was deprecated in version 9.0 and will likely be removed in a future release.
   [junit4] <<< JVM J0: EOF ----

[...truncated 1052 lines...]
   [junit4] JVM J0: stderr was not empty, see: C:\Users\jenkins\workspace\Lucene-Solr-7.0-Windows\lucene\build\analysis\common\test\temp\junit4-J0-20170806_231416_37412980197133414829839.syserr
   [junit4] >>> JVM J0 emitted unexpected output (verbatim) ----
   [junit4] Java HotSpot(TM) Server VM warning: Option UseConcMarkSweepGC was deprecated in version 9.0 and will likely be removed in a future release.
   [junit4] <<< JVM J0: EOF ----

[...truncated 3 lines...]
   [junit4] JVM J1: stderr was not empty, see: C:\Users\jenkins\workspace\Lucene-Solr-7.0-Windows\lucene\build\analysis\common\test\temp\junit4-J1-20170806_231416_3748134555048400065544.syserr
   [junit4] >>> JVM J1 emitted unexpected output (verbatim) ----
   [junit4] Java HotSpot(TM) Server VM warning: Option UseConcMarkSweepGC was deprecated in version 9.0 and will likely be removed in a future release.
   [junit4] <<< JVM J1: EOF ----

[...truncated 220 lines...]
   [junit4] JVM J1: stderr was not empty, see: C:\Users\jenkins\workspace\Lucene-Solr-7.0-Windows\lucene\build\analysis\icu\test\temp\junit4-J1-20170806_231605_8141921680933959894460.syserr
   [junit4] >>> JVM J1 emitted unexpected output (verbatim) ----
   [junit4] Java HotSpot(TM) Server VM warning: Option UseConcMarkSweepGC was deprecated in version 9.0 and will likely be removed in a future release.
   [junit4] <<< JVM J1: EOF ----

   [junit4] JVM J0: stderr was not empty, see: C:\Users\jenkins\workspace\Lucene-Solr-7.0-Windows\lucene\build\analysis\icu\test\temp\junit4-J0-20170806_231605_81312836105757807051630.syserr
   [junit4] >>> JVM J0 emitted unexpected output (verbatim) ----
   [junit4] Java HotSpot(TM) Server VM warning: Option UseConcMarkSweepGC was deprecated in version 9.0 and will likely be removed in a future release.
   [junit4] <<< JVM J0: EOF ----

[...truncated 238 lines...]
   [junit4] JVM J0: stderr was not empty, see: C:\Users\jenkins\workspace\Lucene-Solr-7.0-Windows\lucene\build\analysis\kuromoji\test\temp\junit4-J0-20170806_231612_374843401189011595995.syserr
   [junit4] >>> JVM J0 emitted unexpected output (verbatim) ----
   [junit4] Java HotSpot(TM) Server VM warning: Option UseConcMarkSweepGC was deprecated in version 9.0 and will likely be removed in a future release.
   [junit4] <<< JVM J0: EOF ----

[...truncated 3 lines...]
   [junit4] JVM J1: stderr was not empty, see: C:\Users\jenkins\workspace\Lucene-Solr-7.0-Windows\lucene\build\analysis\kuromoji\test\temp\junit4-J1-20170806_231612_3748725364682143674084.syserr
   [junit4] >>> JVM J1 emitted unexpected output (verbatim) ----
   [junit4] Java HotSpot(TM) Server VM warning: Option UseConcMarkSweepGC was deprecated in version 9.0 and will likely be removed in a future release.
   [junit4] <<< JVM J1: EOF ----

[...truncated 147 lines...]
   [junit4] JVM J1: stderr was not empty, see: C:\Users\jenkins\workspace\Lucene-Solr-7.0-Windows\lucene\build\analysis\morfologik\test\temp\junit4-J1-20170806_231627_26115035719946006851000.syserr
   [junit4] >>> JVM J1 emitted unexpected output (verbatim) ----
   [junit4] Java HotSpot(TM) Server VM warning: Option UseConcMarkSweepGC was deprecated in version 9.0 and will likely be removed in a future release.
   [junit4] <<< JVM J1: EOF ----

[...truncated 3 lines...]
   [junit4] JVM J0: stderr was not empty, see: C:\Users\jenkins\workspace\Lucene-Solr-7.0-Windows\lucene\build\analysis\morfologik\test\temp\junit4-J0-20170806_231627_26110178825007690553989.syserr
   [junit4] >>> JVM J0 emitted unexpected output (verbatim) ----
   [junit4] Java HotSpot(TM) Server VM warning: Option UseConcMarkSweepGC was deprecated in version 9.0 and will likely be removed in a future release.
   [junit4] <<< JVM J0: EOF ----

[...truncated 159 lines...]
   [junit4] JVM J0: stderr was not empty, see: C:\Users\jenkins\workspace\Lucene-Solr-7.0-Windows\lucene\build\analysis\phonetic\test\temp\junit4-J0-20170806_231630_42612037911950757804956.syserr
   [junit4] >>> JVM J0 emitted unexpected output (verbatim) ----
   [junit4] Java HotSpot(TM) Server VM warning: Option UseConcMarkSweepGC was deprecated in version 9.0 and will likely be removed in a future release.
   [junit4] <<< JVM J0: EOF ----

[...truncated 3 lines...]
   [junit4] JVM J1: stderr was not empty, see: C:\Users\jenkins\workspace\Lucene-Solr-7.0-Windows\lucene\build\analysis\phonetic\test\temp\junit4-J1-20170806_231630_426857330506894245027.syserr
   [junit4] >>> JVM J1 emitted unexpected output (verbatim) ----
   [junit4] Java HotSpot(TM) Server VM warning: Option UseConcMarkSweepGC was deprecated in version 9.0 and will likely be removed in a future release.
   [junit4] <<< JVM J1: EOF ----

[...truncated 144 lines...]
   [junit4] JVM J1: stderr was not empty, see: C:\Users\jenkins\workspace\Lucene-Solr-7.0-Windows\lucene\build\analysis\smartcn\test\temp\junit4-J1-20170806_231635_0472243073973849014304.syserr
   [junit4] >>> JVM J1 emitted unexpected output (verbatim) ----
   [junit4] Java HotSpot(TM) Server VM warning: Option UseConcMarkSweepGC was deprecated in version 9.0 and will likely be removed in a future release.
   [junit4] <<< JVM J1: EOF ----

[...truncated 3 lines...]
   [junit4] JVM J0: stderr was not empty, see: C:\Users\jenkins\workspace\Lucene-Solr-7.0-Windows\lucene\build\analysis\smartcn\test\temp\junit4-J0-20170806_231635_047324290679343233671.syserr
   [junit4] >>> JVM J0 emitted unexpected output (verbatim) ----
   [junit4] Java HotSpot(TM) Server VM warning: Option UseConcMarkSweepGC was deprecated in version 9.0 and will likely be removed in a future release.
   [junit4] <<< JVM J0: EOF ----

[...truncated 152 lines...]
   [junit4] JVM J1: stderr was not empty, see: C:\Users\jenkins\workspace\Lucene-Solr-7.0-Windows\lucene\build\analysis\stempel\test\temp\junit4-J1-20170806_231640_62114307670827606402985.syserr
   [junit4] >>> JVM J1 emitted unexpected output (verbatim) ----
   [junit4] Java HotSpot(TM) Server VM warning: Option UseConcMarkSweepGC was deprecated in version 9.0 and will likely be removed in a future release.
   [junit4] <<< JVM J1: EOF ----

   [junit4] JVM J0: stderr was not empty, see: C:\Users\jenkins\workspace\Lucene-Solr-7.0-Windows\lucene\build\analysis\stempel\test\temp\junit4-J0-20170806_231640_6214346946166518436187.syserr
   [junit4] >>> JVM J0 emitted unexpected output (verbatim) ----
   [junit4] Java HotSpot(TM) Server VM warning: Option UseConcMarkSweepGC was deprecated in version 9.0 and will likely be removed in a future release.
   [junit4] <<< JVM J0: EOF ----

[...truncated 160 lines...]
   [junit4] JVM J0: stderr was not empty, see: C:\Users\jenkins\workspace\Lucene-Solr-7.0-Windows\lucene\build\analysis\uima\test\temp\junit4-J0-20170806_231643_554301805669285717782.syserr
   [junit4] >>> JVM J0 emitted unexpected output (verbatim) ----
   [junit4] Java HotSpot(TM) Server VM warning: Option UseConcMarkSweepGC was deprecated in version 9.0 and will likely be removed in a future release.
   [junit4] <<< JVM J0: EOF ----

[...truncated 201 lines...]
   [junit4] JVM J1: stderr was not empty, see: C:\Users\jenkins\workspace\Lucene-Solr-7.0-Windows\lucene\build\backward-codecs\test\temp\junit4-J1-20170806_231654_10514935739249887701214.syserr
   [junit4] >>> JVM J1 emitted unexpected output (verbatim) ----
   [junit4] Java HotSpot(TM) Server VM warning: Option UseConcMarkSweepGC was deprecated in version 9.0 and will likely be removed in a future release.
   [junit4] <<< JVM J1: EOF ----

[...truncated 12 lines...]
   [junit4] JVM J0: stderr was not empty, see: C:\Users\jenkins\workspace\Lucene-Solr-7.0-Windows\lucene\build\backward-codecs\test\temp\junit4-J0-20170806_231654_10513002612654051657711.syserr
   [junit4] >>> JVM J0 emitted unexpected output (verbatim) ----
   [junit4] Java HotSpot(TM) Server VM warning: Option UseConcMarkSweepGC was deprecated in version 9.0 and will likely be removed in a future release.
   [junit4] <<< JVM J0: EOF ----

[...truncated 1222 lines...]
   [junit4] JVM J0: stderr was not empty, see: C:\Users\jenkins\workspace\Lucene-Solr-7.0-Windows\lucene\build\benchmark\test\temp\junit4-J0-20170806_231739_32712818344652374176824.syserr
   [junit4] >>> JVM J0 emitted unexpected output (verbatim) ----
   [junit4] Java HotSpot(TM) Server VM warning: Option UseConcMarkSweepGC was deprecated in version 9.0 and will likely be removed in a future release.
   [junit4] <<< JVM J0: EOF ----

   [junit4] JVM J1: stderr was not empty, see: C:\Users\jenkins\workspace\Lucene-Solr-7.0-Windows\lucene\build\benchmark\test\temp\junit4-J1-20170806_231739_32714827898967983835342.syserr
   [junit4] >>> JVM J1 emitted unexpected output (verbatim) ----
   [junit4] Java HotSpot(TM) Server VM warning: Option UseConcMarkSweepGC was deprecated in version 9.0 and will likely be removed in a future release.
   [junit4] <<< JVM J1: EOF ----

[...truncated 222 lines...]
   [junit4] JVM J1: stderr was not empty, see: C:\Users\jenkins\workspace\Lucene-Solr-7.0-Windows\lucene\build\classification\test\temp\junit4-J1-20170806_231747_14814306699863197584212.syserr
   [junit4] >>> JVM J1 emitted unexpected output (verbatim) ----
   [junit4] Java HotSpot(TM) Server VM warning: Option UseConcMarkSweepGC was deprecated in version 9.0 and will likely be removed in a future release.
   [junit4] <<< JVM J1: EOF ----

[...truncated 3 lines...]
   [junit4] JVM J0: stderr was not empty, see: C:\Users\jenkins\workspace\Lucene-Solr-7.0-Windows\lucene\build\classification\test\temp\junit4-J0-20170806_231747_14815351417110398502474.syserr
   [junit4] >>> JVM J0 emitted unexpected output (verbatim) ----
   [junit4] Java HotSpot(TM) Server VM warning: Option UseConcMarkSweepGC was deprecated in version 9.0 and will likely be removed in a future release.
   [junit4] <<< JVM J0: EOF ----

[...truncated 248 lines...]
   [junit4] JVM J1: stderr was not empty, see: C:\Users\jenkins\workspace\Lucene-Solr-7.0-Windows\lucene\build\codecs\test\temp\junit4-J1-20170806_231756_9096327685689260864169.syserr
   [junit4] >>> JVM J1 emitted unexpected output (verbatim) ----
   [junit4] Java HotSpot(TM) Server VM warning: Option UseConcMarkSweepGC was deprecated in version 9.0 and will likely be removed in a future release.
   [junit4] <<< JVM J1: EOF ----

[...truncated 7 lines...]
   [junit4] JVM J0: stderr was not empty, see: C:\Users\jenkins\workspace\Lucene-Solr-7.0-Windows\lucene\build\codecs\test\temp\junit4-J0-20170806_231756_90916271044913308059631.syserr
   [junit4] >>> JVM J0 emitted unexpected output (verbatim) ----
   [junit4] Java HotSpot(TM) Server VM warning: Option UseConcMarkSweepGC was deprecated in version 9.0 and will likely be removed in a future release.
   [junit4] <<< JVM J0: EOF ----

[...truncated 229 lines...]
   [junit4] JVM J1: stderr was not empty, see: C:\Users\jenkins\workspace\Lucene-Solr-7.0-Windows\lucene\build\demo\test\temp\junit4-J1-20170806_231854_4576506161236747431535.syserr
   [junit4] >>> JVM J1 emitted unexpected output (verbatim) ----
   [junit4] Java HotSpot(TM) Server VM warning: Option UseConcMarkSweepGC was deprecated in version 9.0 and will likely be removed in a future release.
   [junit4] <<< JVM J1: EOF ----

   [junit4] JVM J0: stderr was not empty, see: C:\Users\jenkins\workspace\Lucene-Solr-7.0-Windows\lucene\build\demo\test\temp\junit4-J0-20170806_231854_4572520243620371981853.syserr
   [junit4] >>> JVM J0 emitted unexpected output (verbatim) ----
   [junit4] Java HotSpot(TM) Server VM warning: Option UseConcMarkSweepGC was deprecated in version 9.0 and will likely be removed in a future release.
   [junit4] <<< JVM J0: EOF ----

[...truncated 160 lines...]
   [junit4] JVM J0: stderr was not empty, see: C:\Users\jenkins\workspace\Lucene-Solr-7.0-Windows\lucene\build\expressions\test\temp\junit4-J0-20170806_231857_4449002181951499233111.syserr
   [junit4] >>> JVM J0 emitted unexpected output (verbatim) ----
   [junit4] Java HotSpot(TM) Server VM warning: Option UseConcMarkSweepGC was deprecated in version 9.0 and will likely be removed in a future release.
   [junit4] <<< JVM J0: EOF ----

[...truncated 6 lines...]
   [junit4] JVM J1: stderr was not empty, see: C:\Users\jenkins\workspace\Lucene-Solr-7.0-Windows\lucene\build\expressions\test\temp\junit4-J1-20170806_231857_44414818994866814659907.syserr
   [junit4] >>> JVM J1 emitted unexpected output (verbatim) ----
   [junit4] Java HotSpot(TM) Server VM warning: Option UseConcMarkSweepGC was deprecated in version 9.0 and will likely be removed in a future release.
   [junit4] <<< JVM J1: EOF ----

[...truncated 210 lines...]
   [junit4] JVM J0: stderr was not empty, see: C:\Users\jenkins\workspace\Lucene-Solr-7.0-Windows\lucene\build\facet\test\temp\junit4-J0-20170806_231902_23412055577845379470916.syserr
   [junit4] >>> JVM J0 emitted unexpected output (verbatim) ----
   [junit4] Java HotSpot(TM) Server VM warning: Option UseConcMarkSweepGC was deprecated in version 9.0 and will likely be removed in a future release.
   [junit4] <<< JVM J0: EOF ----

[...truncated 3 lines...]
   [junit4] JVM J1: stderr was not empty, see: C:\Users\jenkins\workspace\Lucene-Solr-7.0-Windows\lucene\build\facet\test\temp\junit4-J1-20170806_231902_23418051586035564416660.syserr
   [junit4] >>> JVM J1 emitted unexpected output (verbatim) ----
   [junit4] Java HotSpot(TM) Server VM warning: Option UseConcMarkSweepGC was deprecated in version 9.0 and will likely be removed in a future release.
   [junit4] <<< JVM J1: EOF ----

[...truncated 172 lines...]
   [junit4] JVM J1: stderr was not empty, see: C:\Users\jenkins\workspace\Lucene-Solr-7.0-Windows\lucene\build\grouping\test\temp\junit4-J1-20170806_231916_494555440402648690345.syserr
   [junit4] >>> JVM J1 emitted unexpected output (verbatim) ----
   [junit4] Java HotSpot(TM) Server VM warning: Option UseConcMarkSweepGC was deprecated in version 9.0 and will likely be removed in a future release.
   [junit4] <<< JVM J1: EOF ----

[...truncated 3 lines...]
   [junit4] JVM J0: stderr was not empty, see: C:\Users\jenkins\workspace\Lucene-Solr-7.0-Windows\lucene\build\grouping\test\temp\junit4-J0-20170806_231916_4947742996306751267897.syserr
   [junit4] >>> JVM J0 emitted unexpected output (verbatim) ----
   [junit4] Java HotSpot(TM) Server VM warning: Option UseConcMarkSweepGC was deprecated in version 9.0 and will likely be removed in a future release.
   [junit4] <<< JVM J0: EOF ----

[...truncated 236 lines...]
   [junit4] JVM J0: stderr was not empty, see: C:\Users\jenkins\workspace\Lucene-Solr-7.0-Windows\lucene\build\highlighter\test\temp\junit4-J0-20170806_231922_99813705625444677198978.syserr
   [junit4] >>> JVM J0 emitted unexpected output (verbatim) ----
   [junit4] Java HotSpot(TM) Server VM warning: Option UseConcMarkSweepGC was deprecated in version 9.0 and will likely be removed in a future release.
   [junit4] <<< JVM J0: EOF ----

[...truncated 3 lines...]
   [junit4] JVM J1: stderr was not empty, see: C:\Users\jenkins\workspace\Lucene-Solr-7.0-Windows\lucene\build\highlighter\test\temp\junit4-J1-20170806_231922_99814559058815248199323.syserr
   [junit4] >>> JVM J1 emitted unexpected output (verbatim) ----
   [junit4] Java HotSpot(TM) Server VM warning: Option UseConcMarkSweepGC was deprecated in version 9.0 and will likely be removed in a future release.
   [junit4] <<< JVM J1: EOF ----

[...truncated 156 lines...]
   [junit4] JVM J1: stderr was not empty, see: C:\Users\jenkins\workspace\Lucene-Solr-7.0-Windows\lucene\build\join\test\temp\junit4-J1-20170806_231935_5484211328427067340356.syserr
   [junit4] >>> JVM J1 emitted unexpected output (verbatim) ----
   [junit4] Java HotSpot(TM) Server VM warning: Option UseConcMarkSweepGC was deprecated in version 9.0 and will likely be removed in a future release.
   [junit4] <<< JVM J1: EOF ----

[...truncated 3 lines...]
   [junit4] JVM J0: stderr was not empty, see: C:\Users\jenkins\workspace\Lucene-Solr-7.0-Windows\lucene\build\join\test\temp\junit4-J0-20170806_231935_54810525710260469102484.syserr
   [junit4] >>> JVM J0 emitted unexpected output (verbatim) ----
   [junit4] Java HotSpot(TM) Server VM warning: Option UseConcMarkSweepGC was deprecated in version 9.0 and will likely be removed in a future release.
   [junit4] <<< JVM J0: EOF ----

[...truncated 140 lines...]
   [junit4] JVM J0: stderr was not empty, see: C:\Users\jenkins\workspace\Lucene-Solr-7.0-Windows\lucene\build\memory\test\temp\junit4-J0-20170806_231944_7389716790986699717578.syserr
   [junit4] >>> JVM J0 emitted unexpected output (verbatim) ----
   [junit4] Java HotSpot(TM) Server VM warning: Option UseConcMarkSweepGC was deprecated in version 9.0 and will likely be removed in a future release.
   [junit4] <<< JVM J0: EOF ----

[...truncated 3 lines...]
   [junit4] JVM J1: stderr was not empty, see: C:\Users\jenkins\workspace\Lucene-Solr-7.0-Windows\lucene\build\memory\test\temp\junit4-J1-20170806_231944_73816336418953321815030.syserr
   [junit4] >>> JVM J1 emitted unexpected output (verbatim) ----
   [junit4] Java HotSpot(TM) Server VM warning: Option UseConcMarkSweepGC was deprecated in version 9.0 and will likely be removed in a future release.
   [junit4] <<< JVM J1: EOF ----

[...truncated 168 lines...]
   [junit4] JVM J0: stderr was not empty, see: C:\Users\jenkins\workspace\Lucene-Solr-7.0-Windows\lucene\build\misc\test\temp\junit4-J0-20170806_231950_62514303693698513065033.syserr
   [junit4] >>> JVM J0 emitted unexpected output (verbatim) ----
   [junit4] Java HotSpot(TM) Server VM warning: Option UseConcMarkSweepGC was deprecated in version 9.0 and will likely be removed in a future release.
   [junit4] <<< JVM J0: EOF ----

[...truncated 12 lines...]
   [junit4] JVM J1: stderr was not empty, see: C:\Users\jenkins\workspace\Lucene-Solr-7.0-Windows\lucene\build\misc\test\temp\junit4-J1-20170806_231950_62610500616427289062979.syserr
   [junit4] >>> JVM J1 emitted unexpected output (verbatim) ----
   [junit4] Java HotSpot(TM) Server VM warning: Option UseConcMarkSweepGC was deprecated in version 9.0 and will likely be removed in a future release.
   [junit4] <<< JVM J1: EOF ----

[...truncated 308 lines...]
   [junit4] JVM J1: stderr was not empty, see: C:\Users\jenkins\workspace\Lucene-Solr-7.0-Windows\lucene\build\queries\test\temp\junit4-J1-20170806_232002_9578900539181411080682.syserr
   [junit4] >>> JVM J1 emitted unexpected output (verbatim) ----
   [junit4] Java HotSpot(TM) Server VM warning: Option UseConcMarkSweepGC was deprecated in version 9.0 and will likely be removed in a future release.
   [junit4] <<< JVM J1: EOF ----

   [junit4] JVM J0: stderr was not empty, see: C:\Users\jenkins\workspace\Lucene-Solr-7.0-Windows\lucene\build\queries\test\temp\junit4-J0-20170806_232002_957988671315940107695.syserr
   [junit4] >>> JVM J0 emitted unexpected output (verbatim) ----
   [junit4] Java HotSpot(TM) Server VM warning: Option UseConcMarkSweepGC was deprecated in version 9.0 and will likely be removed in a future release.
   [junit4] <<< JVM J0: EOF ----

[...truncated 217 lines...]
   [junit4] JVM J0: stderr was not empty, see: C:\Users\jenkins\workspace\Lucene-Solr-7.0-Windows\lucene\build\queryparser\test\temp\junit4-J0-20170806_232009_0164948161376429335023.syserr
   [junit4] >>> JVM J0 emitted unexpected output (verbatim) ----
   [junit4] Java HotSpot(TM) Server VM warning: Option UseConcMarkSweepGC was deprecated in version 9.0 and will likely be removed in a future release.
   [junit4] <<< JVM J0: EOF ----

[...truncated 3 lines...]
   [junit4] JVM J1: stderr was not empty, see: C:\Users\jenkins\workspace\Lucene-Solr-7.0-Windows\lucene\build\queryparser\test\temp\junit4-J1-20170806_232009_0167304711478852256196.syserr
   [junit4] >>> JVM J1 emitted unexpected output (verbatim) ----
   [junit4] Java HotSpot(TM) Server VM warning: Option UseConcMarkSweepGC was deprecated in version 9.0 and will likely be removed in a future release.
   [junit4] <<< JVM J1: EOF ----

[...truncated 200 lines...]
   [junit4] JVM J0: stderr was not empty, see: C:\Users\jenkins\workspace\Lucene-Solr-7.0-Windows\lucene\build\replicator\test\temp\junit4-J0-20170806_232017_571692621575441230388.syserr
   [junit4] >>> JVM J0 emitted unexpected output (verbatim) ----
   [junit4] Java HotSpot(TM) Server VM warning: Option UseConcMarkSweepGC was deprecated in version 9.0 and will likely be removed in a future release.
   [junit4] <<< JVM J0: EOF ----

[...truncated 3 lines...]
   [junit4] JVM J1: stderr was not empty, see: C:\Users\jenkins\workspace\Lucene-Solr-7.0-Windows\lucene\build\replicator\test\temp\junit4-J1-20170806_232017_5711573254004171800606.syserr
   [junit4] >>> JVM J1 emitted unexpected output (verbatim) ----
   [junit4] Java HotSpot(TM) Server VM warning: Option UseConcMarkSweepGC was deprecated in version 9.0 and will likely be removed in a future release.
   [junit4] <<< JVM J1: EOF ----

[...truncated 184 lines...]
   [junit4] JVM J0: stderr was not empty, see: C:\Users\jenkins\workspace\Lucene-Solr-7.0-Windows\lucene\build\sandbox\test\temp\junit4-J0-20170806_232028_1149594129531638837348.syserr
   [junit4] >>> JVM J0 emitted unexpected output (verbatim) ----
   [junit4] Java HotSpot(TM) Server VM warning: Option UseConcMarkSweepGC was deprecated in version 9.0 and will likely be removed in a future release.
   [junit4] <<< JVM J0: EOF ----

[...truncated 21 lines...]
   [junit4] JVM J1: stderr was not empty, see: C:\Users\jenkins\workspace\Lucene-Solr-7.0-Windows\lucene\build\sandbox\test\temp\junit4-J1-20170806_232028_1148108959756881543671.syserr
   [junit4] >>> JVM J1 emitted unexpected output (verbatim) ----
   [junit4] Java HotSpot(TM) Server VM warning: Option UseConcMarkSweepGC was deprecated in version 9.0 and will likely be removed in a future release.
   [junit4] <<< JVM J1: EOF ----

[...truncated 208 lines...]
   [junit4] JVM J1: stderr was not empty, see: C:\Users\jenkins\workspace\Lucene-Solr-7.0-Windows\lucene\build\spatial-extras\test\temp\junit4-J1-20170806_232048_2381704486517496861791.syserr
   [junit4] >>> JVM J1 emitted unexpected output (verbatim) ----
   [junit4] Java HotSpot(TM) Server VM warning: Option UseConcMarkSweepGC was deprecated in version 9.0 and will likely be removed in a future release.
   [junit4] <<< JVM J1: EOF ----

[...truncated 3 lines...]
   [junit4] JVM J0: stderr was not empty, see: C:\Users\jenkins\workspace\Lucene-Solr-7.0-Windows\lucene\build\spatial-extras\test\temp\junit4-J0-20170806_232048_23812597765740335620243.syserr
   [junit4] >>> JVM J0 emitted unexpected output (verbatim) ----
   [junit4] Java HotSpot(TM) Server VM warning: Option UseConcMarkSweepGC was deprecated in version 9.0 and will likely be removed in a future release.
   [junit4] <<< JVM J0: EOF ----

[...truncated 163 lines...]
   [junit4] JVM J1: stderr was not empty, see: C:\Users\jenkins\workspace\Lucene-Solr-7.0-Windows\lucene\build\spatial3d\test\temp\junit4-J1-20170806_232057_1883016395608308898040.syserr
   [junit4] >>> JVM J1 emitted unexpected output (verbatim) ----
   [junit4] Java HotSpot(TM) Server VM warning: Option UseConcMarkSweepGC was deprecated in version 9.0 and will likely be removed in a future release.
   [junit4] <<< JVM J1: EOF ----

[...truncated 5 lines...]
   [junit4] JVM J0: stderr was not empty, see: C:\Users\jenkins\workspace\Lucene-Solr-7.0-Windows\lucene\build\spatial3d\test\temp\junit4-J0-20170806_232057_1881977176439300834996.syserr
   [junit4] >>> JVM J0 emitted unexpected output (verbatim) ----
   [junit4] Java HotSpot(TM) Server VM warning: Option UseConcMarkSweepGC was deprecated in version 9.0 and will likely be removed in a future release.
   [junit4] <<< JVM J0: EOF ----

[...truncated 139 lines...]
   [junit4] JVM J0: stderr was not empty, see: C:\Users\jenkins\workspace\Lucene-Solr-7.0-Windows\lucene\build\spatial\test\temp\junit4-J0-20170806_232119_30510226995373534250790.syserr
   [junit4] >>> JVM J0 emitted unexpected output (verbatim) ----
   [junit4] Java HotSpot(TM) Server VM warning: Option UseConcMarkSweepGC was deprecated in version 9.0 and will likely be removed in a future release.
   [junit4] <<< JVM J0: EOF ----

[...truncated 298 lines...]
   [junit4] JVM J1: stderr was not empty, see: C:\Users\jenkins\workspace\Lucene-Solr-7.0-Windows\lucene\build\suggest\test\temp\junit4-J1-20170806_232123_0783387924527300710199.syserr
   [junit4] >>> JVM J1 emitted unexpected output (verbatim) ----
   [junit4] Java HotSpot(TM) Server VM warning: Option UseConcMarkSweepGC was deprecated in version 9.0 and will likely be removed in a future release.
   [junit4] <<< JVM J1: EOF ----

[...truncated 3 lines...]
   [junit4] JVM J0: stderr was not empty, see: C:\Users\jenkins\workspace\Lucene-Solr-7.0-Windows\lucene\build\suggest\test\temp\junit4-J0-20170806_232123_0774165772785842288567.syserr
   [junit4] >>> JVM J0 emitted unexpected output (verbatim) ----
   [junit4] Java HotSpot(TM) Server VM warning: Option UseConcMarkSweepGC was deprecated in version 9.0 and will likely be removed in a future release.
   [junit4] <<< JVM J0: EOF ----

[...truncated 2936 lines...]
   [junit4] Suite: org.apache.solr.servlet.DirectSolrConnectionTest
   [junit4]   2> Creating dataDir: C:\Users\jenkins\workspace\Lucene-Solr-7.0-Windows\solr\build\solr-core\test\J0\temp\solr.servlet.DirectSolrConnectionTest_159E79CD90C5F18E-001\init-core-data-001
   [junit4]   2> 2035915 WARN  (SUITE-DirectSolrConnectionTest-seed#[159E79CD90C5F18E]-worker) [    ] o.a.s.SolrTestCaseJ4 startTrackingSearchers: numOpens=1 numCloses=1
   [junit4]   2> 2035915 INFO  (SUITE-DirectSolrConnectionTest-seed#[159E79CD90C5F18E]-worker) [    ] o.a.s.SolrTestCaseJ4 Using PointFields (NUMERIC_POINTS_SYSPROP=true) w/NUMERIC_DOCVALUES_SYSPROP=false
   [junit4]   2> 2035920 INFO  (SUITE-DirectSolrConnectionTest-seed#[159E79CD90C5F18E]-worker) [    ] o.a.s.SolrTestCaseJ4 Randomized ssl (false) and clientAuth (false) via: @org.apache.solr.util.RandomizeSSL(reason="", value=0.0/0.0, ssl=0.0/0.0, clientAuth=0.0/0.0)
   [junit4]   2> 2035920 INFO  (SUITE-DirectSolrConnectionTest-seed#[159E79CD90C5F18E]-worker) [    ] o.a.s.SolrTestCaseJ4 ####initCore
   [junit4]   2> 2035922 INFO  (SUITE-DirectSolrConnectionTest-seed#[159E79CD90C5F18E]-worker) [    ] o.a.s.c.SolrResourceLoader [null] Added 2 libs to classloader, from paths: [/C:/Users/jenkins/workspace/Lucene-Solr-7.0-Windows/solr/core/src/test-files/solr/collection1/lib, /C:/Users/jenkins/workspace/Lucene-Solr-7.0-Windows/solr/core/src/test-files/solr/collection1/lib/classes]
   [junit4]   2> 2035949 INFO  (SUITE-DirectSolrConnectionTest-seed#[159E79CD90C5F18E]-worker) [    ] o.a.s.c.SolrConfig Using Lucene MatchVersion: 7.0.0
   [junit4]   2> 2035961 INFO  (SUITE-DirectSolrConnectionTest-seed#[159E79CD90C5F18E]-worker) [    ] o.a.s.s.IndexSchema [null] Schema name=test
   [junit4]   2> 2035963 INFO  (SUITE-DirectSolrConnectionTest-seed#[159E79CD90C5F18E]-worker) [    ] o.a.s.s.IndexSchema Loaded schema test/1.0 with uniqueid field id
   [junit4]   2> 2036002 INFO  (SUITE-DirectSolrConnectionTest-seed#[159E79CD90C5F18E]-worker) [    ] o.a.s.m.r.SolrJmxReporter JMX monitoring for 'solr.node' (registry 'solr.node') enabled at server: com.sun.jmx.mbeanserver.JmxMBeanServer@647383
   [junit4]   2> 2036005 INFO  (SUITE-DirectSolrConnectionTest-seed#[159E79CD90C5F18E]-worker) [    ] o.a.s.m.r.SolrJmxReporter JMX monitoring for 'solr.jvm' (registry 'solr.jvm') enabled at server: com.sun.jmx.mbeanserver.JmxMBeanServer@647383
   [junit4]   2> 2036005 INFO  (SUITE-DirectSolrConnectionTest-seed#[159E79CD90C5F18E]-worker) [    ] o.a.s.m.r.SolrJmxReporter JMX monitoring for 'solr.jetty' (registry 'solr.jetty') enabled at server: com.sun.jmx.mbeanserver.JmxMBeanServer@647383
   [junit4]   2> 2036008 INFO  (coreLoadExecutor-7625-thread-1) [    ] o.a.s.c.SolrResourceLoader [null] Added 2 libs to classloader, from paths: [/C:/Users/jenkins/workspace/Lucene-Solr-7.0-Windows/solr/core/src/test-files/solr/collection1/lib, /C:/Users/jenkins/workspace/Lucene-Solr-7.0-Windows/solr/core/src/test-files/solr/collection1/lib/classes]
   [junit4]   2> 2036078 INFO  (coreLoadExecutor-7625-thread-1) [    ] o.a.s.c.SolrConfig Using Lucene MatchVersion: 7.0.0
   [junit4]   2> 2036097 INFO  (coreLoadExecutor-7625-thread-1) [    ] o.a.s.s.IndexSchema [collection1] Schema name=test
   [junit4]   2> 2036105 INFO  (coreLoadExecutor-7625-thread-1) [    ] o.a.s.s.IndexSchema Loaded schema test/1.0 with uniqueid field id
   [junit4]   2> 2036105 INFO  (coreLoadExecutor-7625-thread-1) [    ] o.a.s.c.CoreContainer Creating SolrCore 'collection1' using configuration from instancedir C:\Users\jenkins\workspace\Lucene-Solr-7.0-Windows\solr\core\src\test-files\solr\collection1, trusted=true
   [junit4]   2> 2036106 INFO  (coreLoadExecutor-7625-thread-1) [    ] o.a.s.m.r.SolrJmxReporter JMX monitoring for 'solr.core.collection1' (registry 'solr.core.collection1') enabled at server: com.sun.jmx.mbeanserver.JmxMBeanServer@647383
   [junit4]   2> 2036106 INFO  (coreLoadExecutor-7625-thread-1) [    ] o.a.s.c.SolrCore solr.RecoveryStrategy.Builder
   [junit4]   2> 2036106 INFO  (coreLoadExecutor-7625-thread-1) [    ] o.a.s.c.SolrCore [[collection1] ] Opening new SolrCore at [C:\Users\jenkins\workspace\Lucene-Solr-7.0-Windows\solr\core\src\test-files\solr\collection1], dataDir=[C:\Users\jenkins\workspace\Lucene-Solr-7.0-Windows\solr\build\solr-core\test\J0\temp\solr.servlet.DirectSolrConnectionTest_159E79CD90C5F18E-001\init-core-data-001\]
   [junit4]   2> 2036111 INFO  (coreLoadExecutor-7625-thread-1) [    ] o.a.s.u.RandomMergePolicy RandomMergePolicy wrapping class org.apache.lucene.index.TieredMergePolicy: [TieredMergePolicy: maxMergeAtOnce=39, maxMergeAtOnceExplicit=30, maxMergedSegmentMB=53.330078125, floorSegmentMB=0.30078125, forceMergeDeletesPctAllowed=21.66329285155381, segmentsPerTier=33.0, maxCFSSegmentSizeMB=8.796093022207999E12, noCFSRatio=0.1322298972476922
   [junit4]   2> 2036114 INFO  (coreLoadExecutor-7625-thread-1) [    ] o.a.s.r.XSLTResponseWriter xsltCacheLifetimeSeconds=60
   [junit4]   2> 2036212 INFO  (coreLoadExecutor-7625-thread-1) [    ] o.a.s.u.CommitTracker Hard AutoCommit: disabled
   [junit4]   2> 2036212 INFO  (coreLoadExecutor-7625-thread-1) [    ] o.a.s.u.CommitTracker Soft AutoCommit: disabled
   [junit4]   2> 2036213 INFO  (coreLoadExecutor-7625-thread-1) [    ] o.a.s.u.RandomMergePolicy RandomMergePolicy wrapping class org.apache.lucene.index.LogDocMergePolicy: [LogDocMergePolicy: minMergeSize=1000, mergeFactor=44, maxMergeSize=9223372036854775807, maxMergeSizeForForcedMerge=9223372036854775807, calibrateSizeByDeletes=true, maxMergeDocs=2147483647, maxCFSSegmentSizeMB=8.796093022207999E12, noCFSRatio=0.5921425569452468]
   [junit4]   2> 2036214 INFO  (coreLoadExecutor-7625-thread-1) [    ] o.a.s.s.SolrIndexSearcher Opening [Searcher@13db12a[collection1] main]
   [junit4]   2> 2036214 WARN  (coreLoadExecutor-7625-thread-1) [    ] o.a.s.r.ManagedResourceStorage Cannot write to config directory C:\Users\jenkins\workspace\Lucene-Solr-7.0-Windows\solr\core\src\test-files\solr\collection1\conf; switching to use InMemory storage instead.
   [junit4]   2> 2036215 INFO  (coreLoadExecutor-7625-thread-1) [    ] o.a.s.h.ReplicationHandler Commits will be reserved for  10000
   [junit4]   2> 2036216 INFO  (searcherExecutor-7626-thread-1) [    ] o.a.s.c.SolrCore [collection1] Registered new searcher Searcher@13db12a[collection1] main{ExitableDirectoryReader(UninvertingDirectoryReader())}
   [junit4]   2> 2036218 INFO  (SUITE-DirectSolrConnectionTest-seed#[159E79CD90C5F18E]-worker) [    ] o.a.s.SolrTestCaseJ4 ####initCore end
   [junit4]   2> 2036220 INFO  (TEST-DirectSolrConnectionTest.testInsertThenSelect-seed#[159E79CD90C5F18E]) [    ] o.a.s.SolrTestCaseJ4 ###Starting testInsertThenSelect
   [junit4]   2> 2036220 INFO  (TEST-DirectSolrConnectionTest.testInsertThenSelect-seed#[159E79CD90C5F18E]) [    ] o.a.s.u.p.LogUpdateProcessorFactory [collection1]  webapp=null path=null params={stream.body=<delete><id>42</id></delete>}{delete=[42]} 0 0
   [junit4]   2> 2036220 INFO  (TEST-DirectSolrConnectionTest.testInsertThenSelect-seed#[159E79CD90C5F18E]) [    ] o.a.s.u.p.LogUpdateProcessorFactory [collection1]  webapp=null path=null params={stream.body=<add><doc><field+name%3D"id">42</field><field+name%3D"subject">Kittens!!!+€</field></doc></add>}{add=[42]} 0 0
   [junit4]   2> 2036220 INFO  (TEST-DirectSolrConnectionTest.testInsertThenSelect-seed#[159E79CD90C5F18E]) [    ] o.a.s.u.DirectUpdateHandler2 start commit{,optimize=false,openSearcher=true,waitSearcher=true,expungeDeletes=false,softCommit=false,prepareCommit=false}
   [junit4]   2> 2036220 INFO  (TEST-DirectSolrConnectionTest.testInsertThenSelect-seed#[159E79CD90C5F18E]) [    ] o.a.s.u.SolrIndexWriter Calling setCommitData with IW:org.apache.solr.update.SolrIndexWriter@1b8b0d9 commitCommandVersion:0
   [junit4]   2> 2036227 INFO  (TEST-DirectSolrConnectionTest.testInsertThenSelect-seed#[159E79CD90C5F18E]) [    ] o.a.s.s.SolrIndexSearcher Opening [Searcher@1663cce[collection1] main]
   [junit4]   2> 2036227 INFO  (TEST-DirectSolrConnectionTest.testInsertThenSelect-seed#[159E79CD90C5F18E]) [    ] o.a.s.u.DirectUpdateHandler2 end_commit_flush
   [junit4]   2> 2036231 INFO  (searcherExecutor-7626-thread-1) [    ] o.a.s.c.SolrCore [collection1] Registered new searcher Searcher@1663cce[collection1] main{ExitableDirectoryReader(UninvertingDirectoryReader(Uninverting(_0(7.0.0):c1)))}
   [junit4]   2> 2036232 INFO  (TEST-DirectSolrConnectionTest.testInsertThenSelect-seed#[159E79CD90C5F18E]) [    ] o.a.s.u.p.LogUpdateProcessorFactory [collection1]  webapp=null path=null params={stream.body=<commit/>}{commit=} 0 10
   [junit4]   2> 2036232 INFO  (TEST-DirectSolrConnectionTest.testInsertThenSelect-seed#[159E79CD90C5F18E]) [    ] o.a.s.c.S.Request [collection1]  webapp=null path=null params={q=id:42&wt=xml} hits=1 status=0 QTime=0
   [junit4]   2> 2036232 INFO  (TEST-DirectSolrConnectionTest.testInsertThenSelect-seed#[159E79CD90C5F18E]) [    ] o.a.s.u.p.LogUpdateProcessorFactory [collection1]  webapp=null path=null params={}{delete=[42]} 0 0
   [junit4]   2> 2036232 INFO  (TEST-DirectSolrConnectionTest.testInsertThenSelect-seed#[159E79CD90C5F18E]) [    ] o.a.s.u.p.LogUpdateProcessorFactory [collection1]  webapp=null path=null params={}{add=[42]} 0 0
   [junit4]   2> 2036232 INFO  (TEST-DirectSolrConnectionTest.testInsertThenSelect-seed#[159E79CD90C5F18E]) [    ] o.a.s.u.DirectUpdateHandler2 start commit{,optimize=false,openSearcher=true,waitSearcher=true,expungeDeletes=false,softCommit=false,prepareCommit=false}
   [junit4]   2> 2036233 INFO  (TEST-DirectSolrConnectionTest.testInsertThenSelect-seed#[159E79CD90C5F18E]) [    ] o.a.s.u.SolrIndexWriter Calling setCommitData with IW:org.apache.solr.update.SolrIndexWriter@1b8b0d9 commitCommandVersion:0
   [junit4]   2> 2036241 INFO  (TEST-DirectSolrConnectionTest.testInsertThenSelect-seed#[159E79CD90C5F18E]) [    ] o.a.s.s.SolrIndexSearcher Opening [Searcher@15d418f[collection1] main]
   [junit4]   2> 2036241 INFO  (TEST-DirectSolrConnectionTest.testInsertThenSelect-seed#[159E79CD90C5F18E]) [    ] o.a.s.u.DirectUpdateHandler2 end_commit_flush
   [junit4]   2> 2036243 INFO  (searcherExecutor-7626-thread-1) [    ] o.a.s.c.SolrCore [collection1] Registered new searcher Searcher@15d418f[collection1] main{ExitableDirectoryReader(UninvertingDirectoryReader(Uninverting(_1(7.0.0):c1)))}
   [junit4]   2> 2036244 INFO  (TEST-DirectSolrConnectionTest.testInsertThenSelect-seed#[159E79CD90C5F18E]) [    ] o.a.s.u.p.LogUpdateProcessorFactory [collection1]  webapp=null path=null params={}{commit=} 0 10
   [junit4]   2> 2036244 INFO  (TEST-DirectSolrConnectionTest.testInsertThenSelect-seed#[159E79CD90C5F18E]) [    ] o.a.s.c.S.Request [collection1]  webapp=null path=null params={q=id:42&wt=xml} hits=1 status=0 QTime=0
   [junit4]   2> 2036244 INFO  (TEST-DirectSolrConnectionTest.testInsertThenSelect-seed#[159E79CD90C5F18E]) [    ] o.a.s.SolrTestCaseJ4 ###Ending testInsertThenSelect
   [junit4]   2> 2036247 INFO  (TEST-DirectSolrConnectionTest.testSimpleRequest-seed#[159E79CD90C5F18E]) [    ] o.a.s.SolrTestCaseJ4 ###Starting testSimpleRequest
   [junit4]   2> 2036248 INFO  (TEST-DirectSolrConnectionTest.testSimpleRequest-seed#[159E79CD90C5F18E]) [    ] o.a.s.c.S.Request [collection1]  webapp=null path=null params={q=*:*&echoParams=explicit&wt=xml&version=2.2} hits=1 status=0 QTime=0
   [junit4]   2> 2036248 INFO  (TEST-DirectSolrConnectionTest.testSimpleRequest-seed#[159E79CD90C5F18E]) [    ] o.a.s.SolrTestCaseJ4 ###Ending testSimpleRequest
   [junit4]   2> 2036249 INFO  (SUITE-DirectSolrConnectionTest-seed#[159E79CD90C5F18E]-worker) [    ] o.a.s.SolrTestCaseJ4 ###deleteCore
   [junit4]   2> 2036249 INFO  (SUITE-DirectSolrConnectionTest-seed#[159E79CD90C5F18E]-worker) [    ] o.a.s.c.CoreContainer Shutting down CoreContainer instance=30998391
   [junit4]   2> 2036249 INFO  (SUITE-DirectSolrConnectionTest-seed#[159E79CD90C5F18E]-worker) [    ] o.a.s.m.SolrMetricManager Closing metric reporters for registry=solr.node, tag=null
   [junit4]   2> 2036250 INFO  (SUITE-DirectSolrConnectionTest-seed#[159E79CD90C5F18E]-worker) [    ] o.a.s.m.SolrMetricManager Closing metric reporters for registry=solr.jvm, tag=null
   [junit4]   2> 2036251 INFO  (SUITE-DirectSolrConnectionTest-seed#[159E79CD90C5F18E]-worker) [    ] o.a.s.m.SolrMetricManager Closing metric reporters for registry=solr.jetty, tag=null
   [junit4]   2> 2036254 INFO  (SUITE-DirectSolrConnectionTest-seed#[159E79CD90C5F18E]-worker) [    ] o.a.s.c.TransientSolrCoreCacheDefault Allocating transient cache for 2147483647 transient cores
   [junit4]   2> 2036256 INFO  (coreCloseExecutor-7630-thread-1) [    ] o.a.s.c.SolrCore [collection1]  CLOSING SolrCore org.apache.solr.core.SolrCore@4db8c7
   [junit4]   2> 2036259 INFO  (coreCloseExecutor-7630-thread-1) [    ] o.a.s.m.SolrMetricManager Closing metric reporters for registry=solr.core.collection1, tag=5093575
   [junit4]   2> 2036262 INFO  (SUITE-DirectSolrConnectionTest-seed#[159E79CD90C5F18E]-worker) [    ] o.a.s.SolrTestCaseJ4 ------------------------------------------------------- Done waiting for tracked resources to be released
   [junit4]   2> Aug 06, 2017 11:56:29 PM com.carrotsearch.randomizedtesting.ThreadLeakControl checkThreadLeaks
   [junit4]   2> WARNING: Will linger awaiting termination of 1 leaked thread(s).
   [junit4]   2> NOTE: test params are: codec=Asserting(Lucene70): {subject=PostingsFormat(name=LuceneVarGapDocFreqInterval), id=Lucene50(blocksize=128)}, docValues:{}, maxPointsInLeafNode=1792, maxMBSortInHeap=5.120862114678846, sim=RandomSimilarity(queryNorm=true): {}, locale=ar-BH, timezone=Africa/Tripoli
   [junit4]   2> NOTE: Windows 10 10.0 x86/Oracle Corporation 9 (32-bit)/cpus=3,threads=1,free=111956936,total=246108160
   [junit4]   2> NOTE: All tests run in this JVM: [SuggesterWFSTTest, TestTolerantUpdateProcessorCloud, TestChildDocTransformer, TestRTimerTree, TestMaxScoreQueryParser, TestSolrConfigHandlerCloud, TestLeaderElectionZkExpiry, CollectionTooManyReplicasTest, CoreSorterTest, DistributedFacetPivotSmallTest, TestNumericTerms64, TestLRUStatsCache, TestDeleteCollectionOnDownNodes, TestFuzzyAnalyzedSuggestions, CoreAdminRequestStatusTest, FieldAnalysisRequestHandlerTest, ZkControllerTest, CursorMarkTest, HLLSerializationTest, TestJsonFacetRefinement, TestStressReorder, TestStressVersions, TestOverriddenPrefixQueryForCustomFieldType, TestSubQueryTransformerCrossCore, IndexSchemaTest, MultiThreadedOCPTest, HdfsWriteToMultipleCollectionsTest, PrimitiveFieldTypeTest, SSLMigrationTest, JSONWriterTest, BigEndianAscendingWordSerializerTest, DistanceFunctionTest, TestPHPSerializedResponseWriter, TimeZoneUtilsTest, TestFreeTextSuggestions, MultiTermTest, TestReRankQParserPlugin, TestHttpShardHandlerFactory, TestSweetSpotSimilarityFactory, PropertiesRequestHandlerTest, CollectionReloadTest, TestRandomCollapseQParserPlugin, TestNumericRangeQuery64, InfixSuggestersTest, TestReplicaProperties, TestApiFramework, OutputWriterTest, TestBulkSchemaConcurrent, HdfsChaosMonkeySafeLeaderTest, TestDFISimilarityFactory, TestPseudoReturnFields, CdcrBootstrapTest, UUIDUpdateProcessorFallbackTest, BasicAuthStandaloneTest, TestPhraseSuggestions, TestDynamicFieldCollectionResource, TestCorePropertiesReload, RequestHandlersTest, OverseerTaskQueueTest, TestSimpleQParserPlugin, AliasIntegrationTest, TestFoldingMultitermQuery, TestExtendedDismaxParser, ManagedSchemaRoundRobinCloudTest, DeleteInactiveReplicaTest, TestFieldCache, TestUpdate, DeleteNodeTest, TestManagedSynonymGraphFilterFactory, TestReversedWildcardFilterFactory, TestHdfsUpdateLog, TestTrackingShardHandlerFactory, TestSchemaManager, TestStressLiveNodes, TestLazyCores, TestConfigSetsAPI, ShardRoutingTest, AsyncCallRequestStatusResponseTest, TestReqParamsAPI, TestPrepRecovery, TestCSVResponseWriter, TestLocalFSCloudBackupRestore, DistributedVersionInfoTest, ScriptEngineTest, PeerSyncTest, ShardSplitTest, ChaosMonkeyNothingIsSafeTest, TestClusterStateMutator, TestRandomRequestDistribution, TestSchemaSimilarityResource, TestDownShardTolerantSearch, TlogReplayBufferedWhileIndexingTest, OverseerRolesTest, WrapperMergePolicyFactoryTest, TestFieldTypeCollectionResource, SuggesterTest, BlockJoinFacetSimpleTest, TestMultiValuedNumericRangeQuery, DisMaxRequestHandlerTest, ClassificationUpdateProcessorTest, TestCodecSupport, DeleteShardTest, TestTestInjection, TestJsonRequest, TestSortByMinMaxFunction, TestSizeLimitedDistributedMap, DateFieldTest, CSVRequestHandlerTest, CurrencyFieldTypeTest, TestSolr4Spatial2, TestComplexPhraseQParserPlugin, TestDistributedStatsComponentCardinality, TestPullReplicaErrorHandling, BlockJoinFacetDistribTest, TestMiniSolrCloudCluster, ResponseLogComponentTest, BasicDistributedZkTest, TestSQLHandler, VersionInfoTest, TestScoreJoinQPNoScore, TestRawTransformer, CdcrVersionReplicationTest, RegexBoostProcessorTest, ReplaceNodeTest, SparseHLLTest, TestConfigSetsAPIZkFailure, TestLegacyFieldCache, ResourceLoaderTest, TestOmitPositions, VMParamsZkACLAndCredentialsProvidersTest, BlobRepositoryCloudTest, TestInPlaceUpdatesStandalone, MetricsConfigTest, TestExportWriter, TestTolerantSearch, HdfsSyncSliceTest, TestSystemCollAutoCreate, TestFaceting, TestInitQParser, SpellCheckCollatorWithCollapseTest, TestXmlQParser, ParsingFieldUpdateProcessorsTest, BlockCacheTest, SolrSlf4jReporterTest, ResponseHeaderTest, MoveReplicaHDFSUlogDirTest, SyncSliceTest, TestInfoStreamLogging, AddBlockUpdateTest, TestRandomDVFaceting, HdfsBasicDistributedZkTest, CoreAdminHandlerTest, XsltUpdateRequestHandlerTest, TestCollationFieldDocValues, PathHierarchyTokenizerFactoryTest, RAMDirectoryFactoryTest, HdfsLockFactoryTest, ShufflingReplicaListTransformerTest, DistributedFacetExistsSmallTest, SolrCLIZkUtilsTest, ConfigSetsAPITest, WordBreakSolrSpellCheckerTest, SolrShardReporterTest, RestartWhileUpdatingTest, BinaryUpdateRequestHandlerTest, TestHdfsBackupRestoreCore, DistribCursorPagingTest, TestUseDocValuesAsStored, CursorPagingTest, ForceLeaderTest, CachingDirectoryFactoryTest, TestGroupingSearch, TestStressRecovery, TestFieldCollectionResource, TestClusterProperties, TestHashPartitioner, TestManagedResource, TestLegacyField, SolrInfoBeanTest, TestSurroundQueryParser, TestWriterPerf, DirectSolrSpellCheckerTest, TestQueryTypes, XmlUpdateRequestHandlerTest, MoreLikeThisHandlerTest, FastVectorHighlighterTest, TestCollationField, MBeansHandlerTest, UniqFieldsUpdateProcessorFactoryTest, TestPartialUpdateDeduplication, SearchHandlerTest, HighlighterConfigTest, SOLR749Test, TestQuerySenderListener, AlternateDirectoryTest, TestSolrIndexConfig, TestQuerySenderNoQuery, BadComponentTest, TestMergePolicyConfig, TestSolrDeletionPolicy2, TestBinaryField, NumericFieldsTest, MinimalSchemaTest, TestConfig, TestSolrCoreProperties, DirectSolrConnectionTest]
   [junit4]   2> NOTE: reproduce with: ant test  -Dtestcase=DirectSolrConnectionTest -Dtests.seed=159E79CD90C5F18E -Dtests.slow=true -Dtests.locale=ar-BH -Dtests.timezone=Africa/Tripoli -Dtests.asserts=true -Dtests.file.encoding=UTF-8
   [junit4] ERROR   0.00s J0 | DirectSolrConnectionTest (suite) <<<
   [junit4]    > Throwable #1: java.io.IOException: Could not remove the following files (in the order of attempts):
   [junit4]    >    C:\Users\jenkins\workspace\Lucene-Solr-7.0-Windows\solr\build\solr-core\test\J0\temp\solr.servlet.DirectSolrConnectionTest_159E79CD90C5F18E-001\init-core-data-001: java.nio.file.AccessDeniedException: C:\Users\jenkins\workspace\Lucene-Solr-7.0-Windows\solr\build\solr-core\test\J0\temp\solr.servlet.DirectSolrConnectionTest_159E79CD90C5F18E-001\init-core-data-001
   [junit4]    >    C:\Users\jenkins\workspace\Lucene-Solr-7.0-Windows\solr\build\solr-core\test\J0\temp\solr.servlet.DirectSolrConnectionTest_159E79CD90C5F18E-001: java.nio.file.DirectoryNotEmptyException: C:\Users\jenkins\workspace\Lucene-Solr-7.0-Windows\solr\build\solr-core\test\J0\temp\solr.servlet.DirectSolrConnectionTest_159E79CD90C5F18E-001
   [junit4]    > 	at __randomizedtesting.SeedInfo.seed([159E79CD90C5F18E]:0)
   [junit4]    > 	at org.apache.lucene.util.IOUtils.rm(IOUtils.java:329)
   [junit4]    > 	at java.base/java.lang.Thread.run(Thread.java:844)
   [junit4] Completed [456/727 (1!)] on J0 in 0.66s, 2 tests, 1 error <<< FAILURES!

[...truncated 16 lines...]
   [junit4] Suite: org.apache.solr.EchoParamsTest
   [junit4]   2> Creating dataDir: C:\Users\jenkins\workspace\Lucene-Solr-7.0-Windows\solr\build\solr-core\test\J0\temp\solr.EchoParamsTest_159E79CD90C5F18E-001\init-core-data-001
   [junit4]   2> 2038494 WARN  (SUITE-EchoParamsTest-seed#[159E79CD90C5F18E]-worker) [    ] o.a.s.SolrTestCaseJ4 startTrackingSearchers: numOpens=1 numCloses=1
   [junit4]   2> 2038495 INFO  (SUITE-EchoParamsTest-seed#[159E79CD90C5F18E]-worker) [    ] o.a.s.SolrTestCaseJ4 Using PointFields (NUMERIC_POINTS_SYSPROP=true) w/NUMERIC_DOCVALUES_SYSPROP=false
   [junit4]   2> 2038498 INFO  (SUITE-EchoParamsTest-seed#[159E79CD90C5F18E]-worker) [    ] o.a.s.SolrTestCaseJ4 Randomized ssl (false) and clientAuth (true) via: @org.apache.solr.util.RandomizeSSL(reason="", value=0.0/0.0, ssl=0.0/0.0, clientAuth=0.0/0.0)
   [junit4]   2> 2038499 INFO  (SUITE-EchoParamsTest-seed#[159E79CD90C5F18E]-worker) [    ] o.a.s.SolrTestCaseJ4 ####initCore
   [junit4]   2> 2038500 INFO  (SUITE-EchoParamsTest-seed#[159E79CD90C5F18E]-worker) [    ] o.a.s.c.SolrResourceLoader [null] Added 2 libs to classloader, from paths: [/C:/Users/jenkins/workspace/Lucene-Solr-7.0-Windows/solr/core/src/test-files/solr/collection1/lib, /C:/Users/jenkins/workspace/Lucene-Solr-7.0-Windows/solr/core/src/test-files/solr/collection1/lib/classes]
   [junit4]   2> 2038549 INFO  (SUITE-EchoParamsTest-seed#[159E79CD90C5F18E]-worker) [    ] o.a.s.c.SolrConfig Using Lucene MatchVersion: 7.0.0
   [junit4]   2> 2038561 INFO  (SUITE-EchoParamsTest-seed#[159E79CD90C5F18E]-worker) [    ] o.a.s.s.IndexSchema [null] Schema name=test
   [junit4]   2> 2038567 INFO  (SUITE-EchoParamsTest-seed#[159E79CD90C5F18E]-worker) [    ] o.a.s.s.IndexSchema Loaded schema test/1.0 with uniqueid field id
   [junit4]   2> 2038605 INFO  (SUITE-EchoParamsTest-seed#[159E79CD90C5F18E]-worker) [    ] o.a.s.m.r.SolrJmxReporter JMX monitoring for 'solr.node' (registry 'solr.node') enabled at server: com.sun.jmx.mbeanserver.JmxMBeanServer@647383
   [junit4]   2> 2038609 INFO  (SUITE-EchoParamsTest-seed#[159E79CD90C5F18E]-worker) [    ] o.a.s.m.r.SolrJmxReporter JMX monitoring for 'solr.jvm' (registry 'solr.jvm') enabled at server: com.sun.jmx.mbeanserver.JmxMBeanServer@647383
   [junit4]   2> 2038609 INFO  (SUITE-EchoParamsTest-seed#[159E79CD90C5F18E]-worker) [    ] o.a.s.m.r.SolrJmxReporter JMX monitoring for 'solr.jetty' (registry 'solr.jetty') enabled at server: com.sun.jmx.mbeanserver.JmxMBeanServer@647383
   [junit4]   2> 2038611 INFO  (coreLoadExecutor-7674-thread-1) [    ] o.a.s.c.SolrResourceLoader [null] Added 2 libs to classloader, from paths: [/C:/Users/jenkins/workspace/Lucene-Solr-7.0-Windows/solr/core/src/test-files/solr/collection1/lib, /C:/Users/jenkins/workspace/Lucene-Solr-7.0-Windows/solr/core/src/test-files/solr/collection1/lib/classes]
   [junit4]   2> 2038661 INFO  (coreLoadExecutor-7674-thread-1) [    ] o.a.s.c.SolrConfig Using Lucene MatchVersion: 7.0.0
   [junit4]   2> 2038674 INFO  (coreLoadExecutor-7674-thread-1) [    ] o.a.s.s.IndexSchema [collection1] Schema name=test
   [junit4]   2> 2038675 INFO  (coreLoadExecutor-7674-thread-1) [    ] o.a.s.s.IndexSchema Loaded schema test/1.0 with uniqueid field id
   [junit4]   2> 2038675 INFO  (coreLoadExecutor-7674-thread-1) [    ] o.a.s.c.CoreContainer Creating SolrCore 'collection1' using configuration from instancedir C:\Users\jenkins\workspace\Lucene-Solr-7.0-Windows\solr\core\src\test-files\solr\collection1, trusted=true
   [junit4]   2> 2038675 INFO  (coreLoadExecutor-7674-thread-1) [    ] o.a.s.m.r.SolrJmxReporter JMX monitoring for 'solr.core.collection1' (registry 'solr.core.collection1') enabled at server: com.sun.jmx.mbeanserver.JmxMBeanServer@647383
   [junit4]   2> 2038675 INFO  (coreLoadExecutor-7674-thread-1) [    ] o.a.s.c.SolrCore solr.RecoveryStrategy.Builder
   [junit4]   2> 2038675 INFO  (coreLoadExecutor-7674-thread-1) [    ] o.a.s.c.SolrCore [[collection1] ] Opening new SolrCore at [C:\Users\jenkins\workspace\Lucene-Solr-7.0-Windows\solr\core\src\test-files\solr\collection1], dataDir=[C:\Users\jenkins\workspace\Lucene-Solr-7.0-Windows\solr\build\solr-core\test\J0\temp\solr.EchoParamsTest_159E79CD90C5F18E-001\init-core-data-001\]
   [junit4]   2> 2038681 INFO  (coreLoadExecutor-7674-thread-1) [    ] o.a.s.u.RandomMergePolicy RandomMergePolicy wrapping class org.apache.lucene.index.LogByteSizeMergePolicy: [LogByteSizeMergePolicy: minMergeSize=1677721, mergeFactor=31, maxMergeSize=2147483648, maxMergeSizeForForcedMerge=9223372036854775807, calibrateSizeByDeletes=false, maxMergeDocs=2147483647, maxCFSSegmentSizeMB=8.796093022207999E12, noCFSRatio=0.8741333833148378]
   [junit4]   2> 2038683 INFO  (coreLoadExecutor-7674-thread-1) [    ] o.a.s.r.XSLTResponseWriter xsltCacheLifetimeSeconds=60
   [junit4]   2> 2038754 INFO  (coreLoadExecutor-7674-thread-1) [    ] o.a.s.u.CommitTracker Hard AutoCommit: disabled
   [junit4]   2> 2038754 INFO  (coreLoadExecutor-7674-thread-1) [    ] o.a.s.u.CommitTracker Soft AutoCommit: disabled
   [junit4]   2> 2038756 INFO  (coreLoadExecutor-7674-thread-1) [    ] o.a.s.u.RandomMergePolicy RandomMergePolicy wrapping class org.apache.lucene.index.LogDocMergePolicy: [LogDocMergePolicy: minMergeSize=1000, mergeFactor=38, maxMergeSize=9223372036854775807, maxMergeSizeForForcedMerge=9223372036854775807, calibrateSizeByDeletes=true, maxMergeDocs=2147483647, maxCFSSegmentSizeMB=8.796093022207999E12, noCFSRatio=0.3834147965747673]
   [junit4]   2> 2038756 INFO  (coreLoadExecutor-7674-thread-1) [    ] o.a.s.s.SolrIndexSearcher Opening [Searcher@b67f14[collection1] main]
   [junit4]   2> 2038757 WARN  (coreLoadExecutor-7674-thread-1) [    ] o.a.s.r.ManagedResourceStorage Cannot write to config directory C:\Users\jenkins\workspace\Lucene-Solr-7.0-Windows\solr\core\src\test-files\solr\collection1\conf; switching to use InMemory storage instead.
   [junit4]   2> 2038758 INFO  (coreLoadExecutor-7674-thread-1) [    ] o.a.s.h.ReplicationHandler Commits will be reserved for  10000
   [junit4]   2> 2038759 INFO  (searcherExecutor-7675-thread-1) [    ] o.a.s.c.SolrCore [collection1] Registered new searcher Searcher@b67f14[collection1] main{ExitableDirectoryReader(UninvertingDirectoryReader())}
   [junit4]   2> 2038760 INFO  (SUITE-EchoParamsTest-seed#[159E79CD90C5F18E]-worker) [    ] o.a.s.SolrTestCaseJ4 ####initCore end
   [junit4]   2> 2038763 INFO  (TEST-EchoParamsTest.test-seed#[159E79CD90C5F18E]) [    ] o.a.s.SolrTestCaseJ4 ###Starting test
   [junit4]   2> 2038764 INFO  (TEST-EchoParamsTest.test-seed#[159E79CD90C5F18E]) [    ] o.a.s.c.S.Request [collection1]  webapp=null path=null params={q=foo&qt=&start=0&rows=20&version=2.2&wt=xml} hits=0 status=0 QTime=0
   [junit4]   2> 2038767 INFO  (TEST-EchoParamsTest.test-seed#[159E79CD90C5F18E]) [    ] o.a.s.c.S.Request [collection1]  webapp=null path=null params={q=foo&qt=&start=0&rows=20&version=2.2&wt=xml} hits=0 status=0 QTime=0
   [junit4]   2> 2038767 INFO  (TEST-EchoParamsTest.test-seed#[159E79CD90C5F18E]) [    ] o.a.s.c.S.Request [collection1]  webapp=null path=null params={q=foo&qt=&start=0&rows=20&wt=xml} hits=0 status=0 QTime=0
   [junit4]   2> 2038768 INFO  (TEST-EchoParamsTest.test-seed#[159E79CD90C5F18E]) [    ] o.a.s.c.S.Request [collection1]  webapp=null path=null params={q=foo&qt=&start=0&rows=20&wt=xml} hits=0 status=0 QTime=0
   [junit4]   2> 2038769 INFO  (TEST-EchoParamsTest.test-seed#[159E79CD90C5F18E]) [    ] o.a.s.c.S.Request [collection1]  webapp=null path=null params={q=foo&qt=&echoParams=explicit&start=0&rows=20&wt=xml&version=2.2} hits=0 status=0 QTime=0
   [junit4]   2> 2038770 INFO  (TEST-EchoParamsTest.test-seed#[159E79CD90C5F18E]) [    ] o.a.s.c.S.Request [collection1]  webapp=null path=null params={q=foo&qt=&echoParams=explicit&start=0&rows=20&wt=xml&version=2.2} hits=0 status=0 QTime=0
   [junit4]   2> 2038770 INFO  (TEST-EchoParamsTest.test-seed#[159E79CD90C5F18E]) [    ] o.a.s.c.S.Request [collection1]  webapp=null path=null params={q=foo&qt=&echoParams=explicit&start=0&rows=20&wt=xml&version=2.2} hits=0 status=0 QTime=0
   [junit4]   2> 2038771 INFO  (TEST-EchoParamsTest.test-seed#[159E79CD90C5F18E]) [    ] o.a.s.c.S.Request [collection1]  webapp=null path=null params={echoHandler=true&q=foo&qt=/crazy_custom_qt&echoParams=all&start=0&rows=20&version=2.2&wt=xml} hits=0 status=0 QTime=0
   [junit4]   2> 2038772 INFO  (TEST-EchoParamsTest.test-seed#[159E79CD90C5F18E]) [    ] o.a.s.c.S.Request [collection1]  webapp=null path=null params={echoHandler=true&q=foo&qt=/crazy_custom_qt&echoParams=all&start=0&rows=20&version=2.2&wt=xml} hits=0 status=0 QTime=0
   [junit4]   2> 2038772 INFO  (TEST-EchoParamsTest.test-seed#[159E79CD90C5F18E]) [    ] o.a.s.SolrTestCaseJ4 ###Ending test
   [junit4]   2> 2038773 INFO  (SUITE-EchoParamsTest-seed#[159E79CD90C5F18E]-worker) [    ] o.a.s.SolrTestCaseJ4 ###deleteCore
   [junit4]   2> 2038773 INFO  (SUITE-EchoParamsTest-seed#[159E79CD90C5F18E]-worker) [    ] o.a.s.c.CoreContainer Shutting down CoreContainer instance=11577830
   [junit4]   2> 2038773 INFO  (SUITE-EchoParamsTest-seed#[159E79CD90C5F18E]-worker) [    ] o.a.s.m.SolrMetricManager Closing metric reporters for registry=solr.node, tag=null
   [junit4]   2> 2038775 INFO  (SUITE-EchoParamsTest-seed#[159E79CD90C5F18E]-worker) [    ] o.a.s.m.SolrMetricManager Closing metric reporters for registry=solr.jvm, tag=null
   [junit4]   2> 2038776 INFO  (SUITE-EchoParamsTest-seed#[159E79CD90C5F18E]-worker) [    ] o.a.s.m.SolrMetricManager Closing metric reporters for registry=solr.jetty, tag=null
   [junit4]   2> 2038777 INFO  (SUITE-EchoParamsTest-seed#[159E79CD90C5F18E]-worker) [    ] o.a.s.c.TransientSolrCoreCacheDefault Allocating transient cache for 2147483647 transient cores
   [junit4]   2> 2038778 INFO  (coreCloseExecutor-7679-thread-1) [    ] o.a.s.c.SolrCore [collection1]  CLOSING SolrCore org.apache.solr.core.SolrCore@1225b97
   [junit4]   2> 2038780 INFO  (coreCloseExecutor-7679-thread-1) [    ] o.a.s.m.SolrMetricManager Closing metric reporters for registry=solr.core.collection1, tag=19028887
   [junit4]   2> 2038784 INFO  (SUITE-EchoParamsTest-seed#[159E79CD90C5F18E]-worker) [    ] o.a.s.SolrTestCaseJ4 ------------------------------------------------------- Done waiting for tracked resources to be released
   [junit4]   2> NOTE: test params are: codec=Asserting(Lucene70): {}, docValues:{}, maxPointsInLeafNode=1897, maxMBSortInHeap=7.483112419813001, sim=RandomSimilarity(queryNorm=false): {}, locale=en-CC, timezone=Europe/Zaporozhye
   [junit4]   2> NOTE: Windows 10 10.0 x86/Oracle Corporation 9 (32-bit)/cpus=3,threads=1,free=98631056,total=246108160
   [junit4]   2> NOTE: All tests run in this JVM: [SuggesterWFSTTest, TestTolerantUpdateProcessorCloud, TestChildDocTransformer, TestRTimerTree, TestMaxScoreQueryParser, TestSolrConfigHandlerCloud, TestLeaderElectionZkExpiry, CollectionTooManyReplicasTest, CoreSorterTest, DistributedFacetPivotSmallTest, TestNumericTerms64, TestLRUStatsCache, TestDeleteCollectionOnDownNodes, TestFuzzyAnalyzedSuggestions, CoreAdminRequestStatusTest, FieldAnalysisRequestHandlerTest, ZkControllerTest, CursorMarkTest, HLLSerializationTest, TestJsonFacetRefinement, TestStressReorder, TestStressVersions, TestOverriddenPrefixQueryForCustomFieldType, TestSubQueryTransformerCrossCore, IndexSchemaTest, MultiThreadedOCPTest, HdfsWriteToMultipleCollectionsTest, PrimitiveFieldTypeTest, SSLMigrationTest, JSONWriterTest, BigEndianAscendingWordSerializerTest, DistanceFunctionTest, TestPHPSerializedResponseWriter, TimeZoneUtilsTest, TestFreeTextSuggestions, MultiTermTest, TestReRankQParserPlugin, TestHttpShardHandlerFactory, TestSweetSpotSimilarityFactory, PropertiesRequestHandlerTest, CollectionReloadTest, TestRandomCollapseQParserPlugin, TestNumericRangeQuery64, InfixSuggestersTest, TestReplicaProperties, TestApiFramework, OutputWriterTest, TestBulkSchemaConcurrent, HdfsChaosMonkeySafeLeaderTest, TestDFISimilarityFactory, TestPseudoReturnFields, CdcrBootstrapTest, UUIDUpdateProcessorFallbackTest, BasicAuthStandaloneTest, TestPhraseSuggestions, TestDynamicFieldCollectionResource, TestCorePropertiesReload, RequestHandlersTest, OverseerTaskQueueTest, TestSimpleQParserPlugin, AliasIntegrationTest, TestFoldingMultitermQuery, TestExtendedDismaxParser, ManagedSchemaRoundRobinCloudTest, DeleteInactiveReplicaTest, TestFieldCache, TestUpdate, DeleteNodeTest, TestManagedSynonymGraphFilterFactory, TestReversedWildcardFilterFactory, TestHdfsUpdateLog, TestTrackingShardHandlerFactory, TestSchemaManager, TestStressLiveNodes, TestLazyCores, TestConfigSetsAPI, ShardRoutingTest, AsyncCallRequestStatusResponseTest, TestReqParamsAPI, TestPrepRecovery, TestCSVResponseWriter, TestLocalFSCloudBackupRestore, DistributedVersionInfoTest, ScriptEngineTest, PeerSyncTest, ShardSplitTest, ChaosMonkeyNothingIsSafeTest, TestClusterStateMutator, TestRandomRequestDistribution, TestSchemaSimilarityResource, TestDownShardTolerantSearch, TlogReplayBufferedWhileIndexingTest, OverseerRolesTest, WrapperMergePolicyFactoryTest, TestFieldTypeCollectionResource, SuggesterTest, BlockJoinFacetSimpleTest, TestMultiValuedNumericRangeQuery, DisMaxRequestHandlerTest, ClassificationUpdateProcessorTest, TestCodecSupport, DeleteShardTest, TestTestInjection, TestJsonRequest, TestSortByMinMaxFunction, TestSizeLimitedDistributedMap, DateFieldTest, CSVRequestHandlerTest, CurrencyFieldTypeTest, TestSolr4Spatial2, TestComplexPhraseQParserPlugin, TestDistributedStatsComponentCardinality, TestPullReplicaErrorHandling, BlockJoinFacetDistribTest, TestMiniSolrCloudCluster, ResponseLogComponentTest, BasicDistributedZkTest, TestSQLHandler, VersionInfoTest, TestScoreJoinQPNoScore, TestRawTransformer, CdcrVersionReplicationTest, RegexBoostProcessorTest, ReplaceNodeTest, SparseHLLTest, TestConfigSetsAPIZkFailure, TestLegacyFieldCache, ResourceLoaderTest, TestOmitPositions, VMParamsZkACLAndCredentialsProvidersTest, BlobRepositoryCloudTest, TestInPlaceUpdatesStandalone, MetricsConfigTest, TestExportWriter, TestTolerantSearch, HdfsSyncSliceTest, TestSystemCollAutoCreate, TestFaceting, TestInitQParser, SpellCheckCollatorWithCollapseTest, TestXmlQParser, ParsingFieldUpdateProcessorsTest, BlockCacheTest, SolrSlf4jReporterTest, ResponseHeaderTest, MoveReplicaHDFSUlogDirTest, SyncSliceTest, TestInfoStreamLogging, AddBlockUpdateTest, TestRandomDVFaceting, HdfsBasicDistributedZkTest, CoreAdminHandlerTest, XsltUpdateRequestHandlerTest, TestCollationFieldDocValues, PathHierarchyTokenizerFactoryTest, RAMDirectoryFactoryTest, HdfsLockFactoryTest, ShufflingReplicaListTransformerTest, DistributedFacetExistsSmallTest, SolrCLIZkUtilsTest, ConfigSetsAPITest, WordBreakSolrSpellCheckerTest, SolrShardReporterTest, RestartWhileUpdatingTest, BinaryUpdateRequestHandlerTest, TestHdfsBackupRestoreCore, DistribCursorPagingTest, TestUseDocValuesAsStored, CursorPagingTest, ForceLeaderTest, CachingDirectoryFactoryTest, TestGroupingSearch, TestStressRecovery, TestFieldCollectionResource, TestClusterProperties, TestHashPartitioner, TestManagedResource, TestLegacyField, SolrInfoBeanTest, TestSurroundQueryParser, TestWriterPerf, DirectSolrSpellCheckerTest, TestQueryTypes, XmlUpdateRequestHandlerTest, MoreLikeThisHandlerTest, FastVectorHighlighterTest, TestCollationField, MBeansHandlerTest, UniqFieldsUpdateProcessorFactoryTest, TestPartialUpdateDeduplication, SearchHandlerTest, HighlighterConfigTest, SOLR749Test, TestQuerySenderListener, AlternateDirectoryTest, TestSolrIndexConfig, TestQuerySenderNoQuery, BadComponentTest, TestMergePolicyConfig, TestSolrDeletionPolicy2, TestBinaryField, NumericFieldsTest, MinimalSchemaTest, TestConfig, TestSolrCoreProperties, DirectSolrConnectionTest, NotRequiredUniqueKeyTest, TestLuceneMatchVersion, SpellPossibilityIteratorTest, TestXIncludeConfig, EchoParamsTest]
   [junit4]   2> NOTE: reproduce with: ant test  -Dtestcase=EchoParamsTest -Dtests.seed=159E79CD90C5F18E -Dtests.slow=true -Dtests.locale=en-CC -Dtests.timezone=Europe/Zaporozhye -Dtests.asserts=true -Dtests.file.encoding=UTF-8
   [junit4] ERROR   0.00s J0 | EchoParamsTest (suite) <<<
   [junit4]    > Throwable #1: java.io.IOException: Could not remove the following files (in the order of attempts):
   [junit4]    >    C:\Users\jenkins\workspace\Lucene-Solr-7.0-Windows\solr\build\solr-core\test\J0\temp\solr.EchoParamsTest_159E79CD90C5F18E-001\init-core-data-001: java.nio.file.AccessDeniedException: C:\Users\jenkins\workspace\Lucene-Solr-7.0-Windows\solr\build\solr-core\test\J0\temp\solr.EchoParamsTest_159E79CD90C5F18E-001\init-core-data-001
   [junit4]    >    C:\Users\jenkins\workspace\Lucene-Solr-7.0-Windows\solr\build\solr-core\test\J0\temp\solr.EchoParamsTest_159E79CD90C5F18E-001: java.nio.file.DirectoryNotEmptyException: C:\Users\jenkins\workspace\Lucene-Solr-7.0-Windows\solr\build\solr-core\test\J0\temp\solr.EchoParamsTest_159E79CD90C5F18E-001
   [junit4]    > 	at __randomizedtesting.SeedInfo.seed([159E79CD90C5F18E]:0)
   [junit4]    > 	at org.apache.lucene.util.IOUtils.rm(IOUtils.java:329)
   [junit4]    > 	at java.base/java.lang.Thread.run(Thread.java:844)
   [junit4] Completed [462/727 (2!)] on J0 in 0.33s, 1 test, 1 error <<< FAILURES!

[...truncated 875 lines...]
   [junit4] JVM J1: stderr was not empty, see: C:\Users\jenkins\workspace\Lucene-Solr-7.0-Windows\solr\build\solr-core\test\temp\junit4-J1-20170806_232232_0228251113951905384639.syserr
   [junit4] >>> JVM J1 emitted unexpected output (verbatim) ----
   [junit4] Java HotSpot(TM) Server VM warning: Option UseConcMarkSweepGC was deprecated in version 9.0 and will likely be removed in a future release.
   [junit4] <<< JVM J1: EOF ----

[...truncated 4 lines...]
   [junit4] JVM J0: stderr was not empty, see: C:\Users\jenkins\workspace\Lucene-Solr-7.0-Windows\solr\build\solr-core\test\temp\junit4-J0-20170806_232232_0228439593171737655243.syserr
   [junit4] >>> JVM J0 emitted unexpected output (verbatim) ----
   [junit4] Java HotSpot(TM) Server VM warning: Option UseConcMarkSweepGC was deprecated in version 9.0 and will likely be removed in a future release.
   [junit4] <<< JVM J0: EOF ----

[...truncated 814 lines...]
   [junit4] JVM J1: stderr was not empty, see: C:\Users\jenkins\workspace\Lucene-Solr-7.0-Windows\solr\build\solr-solrj\test\temp\junit4-J1-20170807_001325_96510053722723918212188.syserr
   [junit4] >>> JVM J1 emitted unexpected output (verbatim) ----
   [junit4] Java HotSpot(TM) Server VM warning: Option UseConcMarkSweepGC was deprecated in version 9.0 and will likely be removed in a future release.
   [junit4] <<< JVM J1: EOF ----

[...truncated 21 lines...]
   [junit4] JVM J0: stderr was not empty, see: C:\Users\jenkins\workspace\Lucene-Solr-7.0-Windows\solr\build\solr-solrj\test\temp\junit4-J0-20170807_001325_9656438754416157094537.syserr
   [junit4] >>> JVM J0 emitted unexpected output (verbatim) ----
   [junit4] Java HotSpot(TM) Server VM warning: Option UseConcMarkSweepGC was deprecated in version 9.0 and will likely be removed in a future release.
   [junit4] <<< JVM J0: EOF ----

[...truncated 1241 lines...]
   [junit4] JVM J1: stderr was not empty, see: C:\Users\jenkins\workspace\Lucene-Solr-7.0-Windows\solr\build\contrib\solr-analysis-extras\test\temp\junit4-J1-20170807_001732_1357989938121033903114.syserr
   [junit4] >>> JVM J1 emitted unexpected output (verbatim) ----
   [junit4] Java HotSpot(TM) Server VM warning: Option UseConcMarkSweepGC was deprecated in version 9.0 and will likely be removed in a future release.
   [junit4] <<< JVM J1: EOF ----

   [junit4] JVM J0: stderr was not empty, see: C:\Users\jenkins\workspace\Lucene-Solr-7.0-Windows\solr\build\contrib\solr-analysis-extras\test\temp\junit4-J0-20170807_001732_1354433166743479024442.syserr
   [junit4] >>> JVM J0 emitted unexpected output (verbatim) ----
   [junit4] Java HotSpot(TM) Server VM warning: Option UseConcMarkSweepGC was deprecated in version 9.0 and will likely be removed in a future release.
   [junit4] <<< JVM J0: EOF ----

[...truncated 548 lines...]
   [junit4] JVM J0: stderr was not empty, see: C:\Users\jenkins\workspace\Lucene-Solr-7.0-Windows\solr\build\contrib\solr-analytics\test\temp\junit4-J0-20170807_001747_7359001616874498134168.syserr
   [junit4] >>> JVM J0 emitted unexpected output (verbatim) ----
   [junit4] Java HotSpot(TM) Server VM warning: Option UseConcMarkSweepGC was deprecated in version 9.0 and will likely be removed in a future release.
   [junit4] <<< JVM J0: EOF ----

[...truncated 3 lines...]
   [junit4] JVM J1: stderr was not empty, see: C:\Users\jenkins\workspace\Lucene-Solr-7.0-Windows\solr\build\contrib\solr-analytics\test\temp\junit4-J1-20170807_001747_73516284547745796785415.syserr
   [junit4] >>> JVM J1 emitted unexpected output (verbatim) ----
   [junit4] Java HotSpot(TM) Server VM warning: Option UseConcMarkSweepGC was deprecated in version 9.0 and will likely be removed in a future release.
   [junit4] <<< JVM J1: EOF ----

[...truncated 500 lines...]
   [junit4] JVM J1: stderr was not empty, see: C:\Users\jenkins\workspace\Lucene-Solr-7.0-Windows\solr\build\contrib\solr-clustering\test\temp\junit4-J1-20170807_001831_34514761798686972530049.syserr
   [junit4] >>> JVM J1 emitted unexpected output (verbatim) ----
   [junit4] Java HotSpot(TM) Server VM warning: Option UseConcMarkSweepGC was deprecated in version 9.0 and will likely be removed in a future release.
   [junit4] <<< JVM J1: EOF ----

[...truncated 3 lines...]
   [junit4] JVM J0: stderr was not empty, see: C:\Users\jenkins\workspace\Lucene-Solr-7.0-Windows\solr\build\contrib\solr-clustering\test\temp\junit4-J0-20170807_001831_3454099333174885499498.syserr
   [junit4] >>> JVM J0 emitted unexpected output (verbatim) ----
   [junit4] Java HotSpot(TM) Server VM warning: Option UseConcMarkSweepGC was deprecated in version 9.0 and will likely be removed in a future release.
   [junit4] <<< JVM J0: EOF ----

[...truncated 1130 lines...]
   [junit4] JVM J1: stderr was not empty, see: C:\Users\jenkins\workspace\Lucene-Solr-7.0-Windows\solr\build\contrib\solr-dataimporthandler-extras\test\temp\junit4-J1-20170807_001906_02313876787226745434523.syserr
   [junit4] >>> JVM J1 emitted unexpected output (verbatim) ----
   [junit4] Java HotSpot(TM) Server VM warning: Option UseConcMarkSweepGC was deprecated in version 9.0 and will likely be removed in a future release.
   [junit4] <<< JVM J1: EOF ----

[...truncated 3 lines...]
   [junit4] JVM J0: stderr was not empty, see: C:\Users\jenkins\workspace\Lucene-Solr-7.0-Windows\solr\build\contrib\solr-dataimporthandler-extras\test\temp\junit4-J0-20170807_001906_02312407256189931729927.syserr
   [junit4] >>> JVM J0 emitted unexpected output (verbatim) ----
   [junit4] Java HotSpot(TM) Server VM warning: Option UseConcMarkSweepGC was deprecated in version 9.0 and will likely be removed in a future release.
   [junit4] <<< JVM J0: EOF ----

[...truncated 596 lines...]
   [junit4] JVM J0: stderr was not empty, see: C:\Users\jenkins\workspace\Lucene-Solr-7.0-Windows\solr\build\contrib\solr-dataimporthandler\test\temp\junit4-J0-20170807_001918_8182690300483305502361.syserr
   [junit4] >>> JVM J0 emitted unexpected output (verbatim) ----
   [junit4] Java HotSpot(TM) Server VM warning: Option UseConcMarkSweepGC was deprecated in version 9.0 and will likely be removed in a future release.
   [junit4] <<< JVM J0: EOF ----

   [junit4] JVM J1: stderr was not empty, see: C:\Users\jenkins\workspace\Lucene-Solr-7.0-Windows\solr\build\contrib\solr-dataimporthandler\test\temp\junit4-J1-20170807_001918_81815623072898333454834.syserr
   [junit4] >>> JVM J1 emitted unexpected output (verbatim) ----
   [junit4] Java HotSpot(TM) Server VM warning: Option UseConcMarkSweepGC was deprecated in version 9.0 and will likely be removed in a future release.
   [junit4] <<< JVM J1: EOF ----

[...truncated 504 lines...]
   [junit4] JVM J1: stderr was not empty, see: C:\Users\jenkins\workspace\Lucene-Solr-7.0-Windows\solr\build\contrib\solr-cell\test\temp\junit4-J1-20170807_001949_9018104916610054294769.syserr
   [junit4] >>> JVM J1 emitted unexpected output (verbatim) ----
   [junit4] Java HotSpot(TM) Server VM warning: Option UseConcMarkSweepGC was deprecated in version 9.0 and will likely be removed in a future release.
   [junit4] <<< JVM J1: EOF ----

[...truncated 3 lines...]
   [junit4] JVM J0: stderr was not empty, see: C:\Users\jenkins\workspace\Lucene-Solr-7.0-Windows\solr\build\contrib\solr-cell\test\temp\junit4-J0-20170807_001949_90114915519882376769148.syserr
   [junit4] >>> JVM J0 emitted unexpected output (verbatim) ----
   [junit4] Java HotSpot(TM) Server VM warning: Option UseConcMarkSweepGC was deprecated in version 9.0 and will likely be removed in a future release.
   [junit4] <<< JVM J0: EOF ----

[...truncated 506 lines...]
   [junit4] JVM J1: stderr was not empty, see: C:\Users\jenkins\workspace\Lucene-Solr-7.0-Windows\solr\build\contrib\solr-langid\test\temp\junit4-J1-20170807_002005_20516353207818841847308.syserr
   [junit4] >>> JVM J1 emitted unexpected output (verbatim) ----
   [junit4] Java HotSpot(TM) Server VM warning: Option UseConcMarkSweepGC was deprecated in version 9.0 and will likely be removed in a future release.
   [junit4] <<< JVM J1: EOF ----

   [junit4] JVM J0: stderr was not empty, see: C:\Users\jenkins\workspace\Lucene-Solr-7.0-Windows\solr\build\contrib\solr-langid\test\temp\junit4-J0-20170807_002005_20512540679588226473588.syserr
   [junit4] >>> JVM J0 emitted unexpected output (verbatim) ----
   [junit4] Java HotSpot(TM) Server VM warning: Option UseConcMarkSweepGC was deprecated in version 9.0 and will likely be removed in a future release.
   [junit4] <<< JVM J0: EOF ----

[...truncated 593 lines...]
   [junit4] JVM J0: stderr was not empty, see: C:\Users\jenkins\workspace\Lucene-Solr-7.0-Windows\solr\build\contrib\solr-ltr\test\temp\junit4-J0-20170807_002017_08915616011368369715562.syserr
   [junit4] >>> JVM J0 emitted unexpected output (verbatim) ----
   [junit4] Java HotSpot(TM) Server VM warning: Option UseConcMarkSweepGC was deprecated in version 9.0 and will likely be removed in a future release.
   [junit4] <<< JVM J0: EOF ----

[...truncated 3 lines...]
   [junit4] JVM J1: stderr was not empty, see: C:\Users\jenkins\workspace\Lucene-Solr-7.0-Windows\solr\build\contrib\solr-ltr\test\temp\junit4-J1-20170807_002017_0897483804580850038671.syserr
   [junit4] >>> JVM J1 emitted unexpected output (verbatim) ----
   [junit4] Java HotSpot(TM) Server VM warning: Option UseConcMarkSweepGC was deprecated in version 9.0 and will likely be removed in a future release.
   [junit4] <<< JVM J1: EOF ----

[...truncated 538 lines...]
   [junit4] JVM J1: stderr was not empty, see: C:\Users\jenkins\workspace\Lucene-Solr-7.0-Windows\solr\build\contrib\solr-uima\test\temp\junit4-J1-20170807_002058_6392092226404414220440.syserr
   [junit4] >>> JVM J1 emitted unexpected output (verbatim) ----
   [junit4] Java HotSpot(TM) Server VM warning: Option UseConcMarkSweepGC was deprecated in version 9.0 and will likely be removed in a future release.
   [junit4] <<< JVM J1: EOF ----

[...truncated 3 lines...]
   [junit4] JVM J0: stderr was not empty, see: C:\Users\jenkins\workspace\Lucene-Solr-7.0-Windows\solr\build\contrib\solr-uima\test\temp\junit4-J0-20170807_002058_6394635957761538459840.syserr
   [junit4] >>> JVM J0 emitted unexpected output (verbatim) ----
   [junit4] Java HotSpot(TM) Server VM warning: Option UseConcMarkSweepGC was deprecated in version 9.0 and will likely be removed in a future release.
   [junit4] <<< JVM J0: EOF ----

[...truncated 495 lines...]
   [junit4] JVM J0: stderr was not empty, see: C:\Users\jenkins\workspace\Lucene-Solr-7.0-Windows\solr\build\contrib\solr-velocity\test\temp\junit4-J0-20170807_002125_60918114359146033537655.syserr
   [junit4] >>> JVM J0 emitted unexpected output (verbatim) ----
   [junit4] Java HotSpot(TM) Server VM warning: Option UseConcMarkSweepGC was deprecated in version 9.0 and will likely be removed in a future release.
   [junit4] <<< JVM J0: EOF ----

[...truncated 28990 lines...]

Mime
View raw message