lucene-dev mailing list archives

Site index · List index
Message view « Date » · « Thread »
Top « Date » · « Thread »
From Apache Jenkins Server <jenk...@builds.apache.org>
Subject [JENKINS] Lucene-Solr-NightlyTests-master - Build # 1371 - Still Unstable
Date Thu, 10 Aug 2017 14:00:12 GMT
Build: https://builds.apache.org/job/Lucene-Solr-NightlyTests-master/1371/

4 tests failed.
FAILED:  org.apache.solr.cloud.LeaderElectionContextKeyTest.test

Error Message:


Stack Trace:
java.lang.AssertionError
	at __randomizedtesting.SeedInfo.seed([AE54A65450A1BE5B:2600998EFE5DD3A3]:0)
	at org.junit.Assert.fail(Assert.java:92)
	at org.junit.Assert.assertTrue(Assert.java:43)
	at org.junit.Assert.assertTrue(Assert.java:54)
	at org.apache.solr.cloud.LeaderElectionContextKeyTest.test(LeaderElectionContextKeyTest.java:88)
	at sun.reflect.NativeMethodAccessorImpl.invoke0(Native Method)
	at sun.reflect.NativeMethodAccessorImpl.invoke(NativeMethodAccessorImpl.java:62)
	at sun.reflect.DelegatingMethodAccessorImpl.invoke(DelegatingMethodAccessorImpl.java:43)
	at java.lang.reflect.Method.invoke(Method.java:498)
	at com.carrotsearch.randomizedtesting.RandomizedRunner.invoke(RandomizedRunner.java:1713)
	at com.carrotsearch.randomizedtesting.RandomizedRunner$8.evaluate(RandomizedRunner.java:907)
	at com.carrotsearch.randomizedtesting.RandomizedRunner$9.evaluate(RandomizedRunner.java:943)
	at com.carrotsearch.randomizedtesting.RandomizedRunner$10.evaluate(RandomizedRunner.java:957)
	at com.carrotsearch.randomizedtesting.rules.SystemPropertiesRestoreRule$1.evaluate(SystemPropertiesRestoreRule.java:57)
	at org.apache.lucene.util.TestRuleSetupTeardownChained$1.evaluate(TestRuleSetupTeardownChained.java:49)
	at org.apache.lucene.util.AbstractBeforeAfterRule$1.evaluate(AbstractBeforeAfterRule.java:45)
	at org.apache.lucene.util.TestRuleThreadAndTestName$1.evaluate(TestRuleThreadAndTestName.java:48)
	at org.apache.lucene.util.TestRuleIgnoreAfterMaxFailures$1.evaluate(TestRuleIgnoreAfterMaxFailures.java:64)
	at org.apache.lucene.util.TestRuleMarkFailure$1.evaluate(TestRuleMarkFailure.java:47)
	at com.carrotsearch.randomizedtesting.rules.StatementAdapter.evaluate(StatementAdapter.java:36)
	at com.carrotsearch.randomizedtesting.ThreadLeakControl$StatementRunner.run(ThreadLeakControl.java:368)
	at com.carrotsearch.randomizedtesting.ThreadLeakControl.forkTimeoutingTask(ThreadLeakControl.java:817)
	at com.carrotsearch.randomizedtesting.ThreadLeakControl$3.evaluate(ThreadLeakControl.java:468)
	at com.carrotsearch.randomizedtesting.RandomizedRunner.runSingleTest(RandomizedRunner.java:916)
	at com.carrotsearch.randomizedtesting.RandomizedRunner$5.evaluate(RandomizedRunner.java:802)
	at com.carrotsearch.randomizedtesting.RandomizedRunner$6.evaluate(RandomizedRunner.java:852)
	at com.carrotsearch.randomizedtesting.RandomizedRunner$7.evaluate(RandomizedRunner.java:863)
	at com.carrotsearch.randomizedtesting.rules.StatementAdapter.evaluate(StatementAdapter.java:36)
	at com.carrotsearch.randomizedtesting.rules.SystemPropertiesRestoreRule$1.evaluate(SystemPropertiesRestoreRule.java:57)
	at org.apache.lucene.util.AbstractBeforeAfterRule$1.evaluate(AbstractBeforeAfterRule.java:45)
	at com.carrotsearch.randomizedtesting.rules.StatementAdapter.evaluate(StatementAdapter.java:36)
	at org.apache.lucene.util.TestRuleStoreClassName$1.evaluate(TestRuleStoreClassName.java:41)
	at com.carrotsearch.randomizedtesting.rules.NoShadowingOrOverridesOnMethodsRule$1.evaluate(NoShadowingOrOverridesOnMethodsRule.java:40)
	at com.carrotsearch.randomizedtesting.rules.NoShadowingOrOverridesOnMethodsRule$1.evaluate(NoShadowingOrOverridesOnMethodsRule.java:40)
	at com.carrotsearch.randomizedtesting.rules.StatementAdapter.evaluate(StatementAdapter.java:36)
	at com.carrotsearch.randomizedtesting.rules.StatementAdapter.evaluate(StatementAdapter.java:36)
	at com.carrotsearch.randomizedtesting.rules.StatementAdapter.evaluate(StatementAdapter.java:36)
	at org.apache.lucene.util.TestRuleAssertionsRequired$1.evaluate(TestRuleAssertionsRequired.java:53)
	at org.apache.lucene.util.TestRuleMarkFailure$1.evaluate(TestRuleMarkFailure.java:47)
	at org.apache.lucene.util.TestRuleIgnoreAfterMaxFailures$1.evaluate(TestRuleIgnoreAfterMaxFailures.java:64)
	at org.apache.lucene.util.TestRuleIgnoreTestSuites$1.evaluate(TestRuleIgnoreTestSuites.java:54)
	at com.carrotsearch.randomizedtesting.rules.StatementAdapter.evaluate(StatementAdapter.java:36)
	at com.carrotsearch.randomizedtesting.ThreadLeakControl$StatementRunner.run(ThreadLeakControl.java:368)
	at java.lang.Thread.run(Thread.java:748)


FAILED:  org.apache.solr.cloud.TestStressCloudBlindAtomicUpdates.test_dv

Error Message:
java.lang.RuntimeException: Error from server at http://127.0.0.1:49010/solr/test_col: Async exception during distributed update: Error from server at http://127.0.0.1:51107/solr/test_col_shard5_replica_n18: Server Error    request: http://127.0.0.1:51107/solr/test_col_shard5_replica_n18/update?update.distrib=TOLEADER&distrib.from=http%3A%2F%2F127.0.0.1%3A49010%2Fsolr%2Ftest_col_shard5_replica_n16%2F&wt=javabin&version=2 Remote error message: Failed synchronous update on shard StdNode: http://127.0.0.1:49010/solr/test_col_shard5_replica_n16/ update: org.apache.solr.client.solrj.request.UpdateRequest@78d8a501

Stack Trace:
java.util.concurrent.ExecutionException: java.lang.RuntimeException: Error from server at http://127.0.0.1:49010/solr/test_col: Async exception during distributed update: Error from server at http://127.0.0.1:51107/solr/test_col_shard5_replica_n18: Server Error



request: http://127.0.0.1:51107/solr/test_col_shard5_replica_n18/update?update.distrib=TOLEADER&distrib.from=http%3A%2F%2F127.0.0.1%3A49010%2Fsolr%2Ftest_col_shard5_replica_n16%2F&wt=javabin&version=2
Remote error message: Failed synchronous update on shard StdNode: http://127.0.0.1:49010/solr/test_col_shard5_replica_n16/ update: org.apache.solr.client.solrj.request.UpdateRequest@78d8a501
	at __randomizedtesting.SeedInfo.seed([AE54A65450A1BE5B:9840C412DAFC844A]:0)
	at java.util.concurrent.FutureTask.report(FutureTask.java:122)
	at java.util.concurrent.FutureTask.get(FutureTask.java:192)
	at org.apache.solr.cloud.TestStressCloudBlindAtomicUpdates.checkField(TestStressCloudBlindAtomicUpdates.java:283)
	at org.apache.solr.cloud.TestStressCloudBlindAtomicUpdates.test_dv(TestStressCloudBlindAtomicUpdates.java:195)
	at sun.reflect.NativeMethodAccessorImpl.invoke0(Native Method)
	at sun.reflect.NativeMethodAccessorImpl.invoke(NativeMethodAccessorImpl.java:62)
	at sun.reflect.DelegatingMethodAccessorImpl.invoke(DelegatingMethodAccessorImpl.java:43)
	at java.lang.reflect.Method.invoke(Method.java:498)
	at com.carrotsearch.randomizedtesting.RandomizedRunner.invoke(RandomizedRunner.java:1713)
	at com.carrotsearch.randomizedtesting.RandomizedRunner$8.evaluate(RandomizedRunner.java:907)
	at com.carrotsearch.randomizedtesting.RandomizedRunner$9.evaluate(RandomizedRunner.java:943)
	at com.carrotsearch.randomizedtesting.RandomizedRunner$10.evaluate(RandomizedRunner.java:957)
	at com.carrotsearch.randomizedtesting.rules.SystemPropertiesRestoreRule$1.evaluate(SystemPropertiesRestoreRule.java:57)
	at org.apache.lucene.util.TestRuleSetupTeardownChained$1.evaluate(TestRuleSetupTeardownChained.java:49)
	at org.apache.lucene.util.AbstractBeforeAfterRule$1.evaluate(AbstractBeforeAfterRule.java:45)
	at org.apache.lucene.util.TestRuleThreadAndTestName$1.evaluate(TestRuleThreadAndTestName.java:48)
	at org.apache.lucene.util.TestRuleIgnoreAfterMaxFailures$1.evaluate(TestRuleIgnoreAfterMaxFailures.java:64)
	at org.apache.lucene.util.TestRuleMarkFailure$1.evaluate(TestRuleMarkFailure.java:47)
	at com.carrotsearch.randomizedtesting.rules.StatementAdapter.evaluate(StatementAdapter.java:36)
	at com.carrotsearch.randomizedtesting.ThreadLeakControl$StatementRunner.run(ThreadLeakControl.java:368)
	at com.carrotsearch.randomizedtesting.ThreadLeakControl.forkTimeoutingTask(ThreadLeakControl.java:817)
	at com.carrotsearch.randomizedtesting.ThreadLeakControl$3.evaluate(ThreadLeakControl.java:468)
	at com.carrotsearch.randomizedtesting.RandomizedRunner.runSingleTest(RandomizedRunner.java:916)
	at com.carrotsearch.randomizedtesting.RandomizedRunner$5.evaluate(RandomizedRunner.java:802)
	at com.carrotsearch.randomizedtesting.RandomizedRunner$6.evaluate(RandomizedRunner.java:852)
	at com.carrotsearch.randomizedtesting.RandomizedRunner$7.evaluate(RandomizedRunner.java:863)
	at com.carrotsearch.randomizedtesting.rules.StatementAdapter.evaluate(StatementAdapter.java:36)
	at com.carrotsearch.randomizedtesting.rules.SystemPropertiesRestoreRule$1.evaluate(SystemPropertiesRestoreRule.java:57)
	at org.apache.lucene.util.AbstractBeforeAfterRule$1.evaluate(AbstractBeforeAfterRule.java:45)
	at com.carrotsearch.randomizedtesting.rules.StatementAdapter.evaluate(StatementAdapter.java:36)
	at org.apache.lucene.util.TestRuleStoreClassName$1.evaluate(TestRuleStoreClassName.java:41)
	at com.carrotsearch.randomizedtesting.rules.NoShadowingOrOverridesOnMethodsRule$1.evaluate(NoShadowingOrOverridesOnMethodsRule.java:40)
	at com.carrotsearch.randomizedtesting.rules.NoShadowingOrOverridesOnMethodsRule$1.evaluate(NoShadowingOrOverridesOnMethodsRule.java:40)
	at com.carrotsearch.randomizedtesting.rules.StatementAdapter.evaluate(StatementAdapter.java:36)
	at com.carrotsearch.randomizedtesting.rules.StatementAdapter.evaluate(StatementAdapter.java:36)
	at com.carrotsearch.randomizedtesting.rules.StatementAdapter.evaluate(StatementAdapter.java:36)
	at org.apache.lucene.util.TestRuleAssertionsRequired$1.evaluate(TestRuleAssertionsRequired.java:53)
	at org.apache.lucene.util.TestRuleMarkFailure$1.evaluate(TestRuleMarkFailure.java:47)
	at org.apache.lucene.util.TestRuleIgnoreAfterMaxFailures$1.evaluate(TestRuleIgnoreAfterMaxFailures.java:64)
	at org.apache.lucene.util.TestRuleIgnoreTestSuites$1.evaluate(TestRuleIgnoreTestSuites.java:54)
	at com.carrotsearch.randomizedtesting.rules.StatementAdapter.evaluate(StatementAdapter.java:36)
	at com.carrotsearch.randomizedtesting.ThreadLeakControl$StatementRunner.run(ThreadLeakControl.java:368)
	at java.lang.Thread.run(Thread.java:748)
Caused by: java.lang.RuntimeException: Error from server at http://127.0.0.1:49010/solr/test_col: Async exception during distributed update: Error from server at http://127.0.0.1:51107/solr/test_col_shard5_replica_n18: Server Error



request: http://127.0.0.1:51107/solr/test_col_shard5_replica_n18/update?update.distrib=TOLEADER&distrib.from=http%3A%2F%2F127.0.0.1%3A49010%2Fsolr%2Ftest_col_shard5_replica_n16%2F&wt=javabin&version=2
Remote error message: Failed synchronous update on shard StdNode: http://127.0.0.1:49010/solr/test_col_shard5_replica_n16/ update: org.apache.solr.client.solrj.request.UpdateRequest@78d8a501
	at org.apache.solr.cloud.TestStressCloudBlindAtomicUpdates$Worker.run(TestStressCloudBlindAtomicUpdates.java:411)
	at java.util.concurrent.Executors$RunnableAdapter.call(Executors.java:511)
	at java.util.concurrent.FutureTask.run(FutureTask.java:266)
	at org.apache.solr.common.util.ExecutorUtil$MDCAwareThreadPoolExecutor.lambda$execute$0(ExecutorUtil.java:188)
	at java.util.concurrent.ThreadPoolExecutor.runWorker(ThreadPoolExecutor.java:1149)
	at java.util.concurrent.ThreadPoolExecutor$Worker.run(ThreadPoolExecutor.java:624)
	... 1 more
Caused by: org.apache.solr.client.solrj.impl.HttpSolrClient$RemoteSolrException: Error from server at http://127.0.0.1:49010/solr/test_col: Async exception during distributed update: Error from server at http://127.0.0.1:51107/solr/test_col_shard5_replica_n18: Server Error



request: http://127.0.0.1:51107/solr/test_col_shard5_replica_n18/update?update.distrib=TOLEADER&distrib.from=http%3A%2F%2F127.0.0.1%3A49010%2Fsolr%2Ftest_col_shard5_replica_n16%2F&wt=javabin&version=2
Remote error message: Failed synchronous update on shard StdNode: http://127.0.0.1:49010/solr/test_col_shard5_replica_n16/ update: org.apache.solr.client.solrj.request.UpdateRequest@78d8a501
	at org.apache.solr.client.solrj.impl.HttpSolrClient.executeMethod(HttpSolrClient.java:627)
	at org.apache.solr.client.solrj.impl.HttpSolrClient.request(HttpSolrClient.java:253)
	at org.apache.solr.client.solrj.impl.HttpSolrClient.request(HttpSolrClient.java:242)
	at org.apache.solr.client.solrj.SolrRequest.process(SolrRequest.java:178)
	at org.apache.solr.client.solrj.SolrRequest.process(SolrRequest.java:195)
	at org.apache.solr.cloud.TestStressCloudBlindAtomicUpdates$Worker.doRandomAtomicUpdate(TestStressCloudBlindAtomicUpdates.java:370)
	at org.apache.solr.cloud.TestStressCloudBlindAtomicUpdates$Worker.run(TestStressCloudBlindAtomicUpdates.java:399)
	... 6 more


FAILED:  org.apache.solr.update.AutoCommitTest.testMaxDocs

Error Message:
Exception during query

Stack Trace:
java.lang.RuntimeException: Exception during query
	at __randomizedtesting.SeedInfo.seed([AE54A65450A1BE5B:17D5708B7C4BBAD1]:0)
	at org.apache.solr.SolrTestCaseJ4.assertQ(SolrTestCaseJ4.java:886)
	at org.apache.solr.update.AutoCommitTest.testMaxDocs(AutoCommitTest.java:225)
	at sun.reflect.NativeMethodAccessorImpl.invoke0(Native Method)
	at sun.reflect.NativeMethodAccessorImpl.invoke(NativeMethodAccessorImpl.java:62)
	at sun.reflect.DelegatingMethodAccessorImpl.invoke(DelegatingMethodAccessorImpl.java:43)
	at java.lang.reflect.Method.invoke(Method.java:498)
	at com.carrotsearch.randomizedtesting.RandomizedRunner.invoke(RandomizedRunner.java:1713)
	at com.carrotsearch.randomizedtesting.RandomizedRunner$8.evaluate(RandomizedRunner.java:907)
	at com.carrotsearch.randomizedtesting.RandomizedRunner$9.evaluate(RandomizedRunner.java:943)
	at com.carrotsearch.randomizedtesting.RandomizedRunner$10.evaluate(RandomizedRunner.java:957)
	at com.carrotsearch.randomizedtesting.rules.SystemPropertiesRestoreRule$1.evaluate(SystemPropertiesRestoreRule.java:57)
	at org.apache.lucene.util.TestRuleSetupTeardownChained$1.evaluate(TestRuleSetupTeardownChained.java:49)
	at org.apache.lucene.util.AbstractBeforeAfterRule$1.evaluate(AbstractBeforeAfterRule.java:45)
	at org.apache.lucene.util.TestRuleThreadAndTestName$1.evaluate(TestRuleThreadAndTestName.java:48)
	at org.apache.lucene.util.TestRuleIgnoreAfterMaxFailures$1.evaluate(TestRuleIgnoreAfterMaxFailures.java:64)
	at org.apache.lucene.util.TestRuleMarkFailure$1.evaluate(TestRuleMarkFailure.java:47)
	at com.carrotsearch.randomizedtesting.rules.StatementAdapter.evaluate(StatementAdapter.java:36)
	at com.carrotsearch.randomizedtesting.ThreadLeakControl$StatementRunner.run(ThreadLeakControl.java:368)
	at com.carrotsearch.randomizedtesting.ThreadLeakControl.forkTimeoutingTask(ThreadLeakControl.java:817)
	at com.carrotsearch.randomizedtesting.ThreadLeakControl$3.evaluate(ThreadLeakControl.java:468)
	at com.carrotsearch.randomizedtesting.RandomizedRunner.runSingleTest(RandomizedRunner.java:916)
	at com.carrotsearch.randomizedtesting.RandomizedRunner$5.evaluate(RandomizedRunner.java:802)
	at com.carrotsearch.randomizedtesting.RandomizedRunner$6.evaluate(RandomizedRunner.java:852)
	at com.carrotsearch.randomizedtesting.RandomizedRunner$7.evaluate(RandomizedRunner.java:863)
	at com.carrotsearch.randomizedtesting.rules.StatementAdapter.evaluate(StatementAdapter.java:36)
	at com.carrotsearch.randomizedtesting.rules.SystemPropertiesRestoreRule$1.evaluate(SystemPropertiesRestoreRule.java:57)
	at org.apache.lucene.util.AbstractBeforeAfterRule$1.evaluate(AbstractBeforeAfterRule.java:45)
	at com.carrotsearch.randomizedtesting.rules.StatementAdapter.evaluate(StatementAdapter.java:36)
	at org.apache.lucene.util.TestRuleStoreClassName$1.evaluate(TestRuleStoreClassName.java:41)
	at com.carrotsearch.randomizedtesting.rules.NoShadowingOrOverridesOnMethodsRule$1.evaluate(NoShadowingOrOverridesOnMethodsRule.java:40)
	at com.carrotsearch.randomizedtesting.rules.NoShadowingOrOverridesOnMethodsRule$1.evaluate(NoShadowingOrOverridesOnMethodsRule.java:40)
	at com.carrotsearch.randomizedtesting.rules.StatementAdapter.evaluate(StatementAdapter.java:36)
	at com.carrotsearch.randomizedtesting.rules.StatementAdapter.evaluate(StatementAdapter.java:36)
	at com.carrotsearch.randomizedtesting.rules.StatementAdapter.evaluate(StatementAdapter.java:36)
	at org.apache.lucene.util.TestRuleAssertionsRequired$1.evaluate(TestRuleAssertionsRequired.java:53)
	at org.apache.lucene.util.TestRuleMarkFailure$1.evaluate(TestRuleMarkFailure.java:47)
	at org.apache.lucene.util.TestRuleIgnoreAfterMaxFailures$1.evaluate(TestRuleIgnoreAfterMaxFailures.java:64)
	at org.apache.lucene.util.TestRuleIgnoreTestSuites$1.evaluate(TestRuleIgnoreTestSuites.java:54)
	at com.carrotsearch.randomizedtesting.rules.StatementAdapter.evaluate(StatementAdapter.java:36)
	at com.carrotsearch.randomizedtesting.ThreadLeakControl$StatementRunner.run(ThreadLeakControl.java:368)
	at java.lang.Thread.run(Thread.java:748)
Caused by: java.lang.RuntimeException: REQUEST FAILED: xpath=//result[@numFound=1]
	xml response was: <?xml version="1.0" encoding="UTF-8"?>
<response>
<lst name="responseHeader"><int name="status">0</int><int name="QTime">0</int></lst><result name="response" numFound="0" start="0"></result>
</response>

	request was:q=id:14&qt=&start=0&rows=20&version=2.2
	at org.apache.solr.SolrTestCaseJ4.assertQ(SolrTestCaseJ4.java:879)
	... 40 more


FAILED:  org.apache.solr.cloud.SharedFSAutoReplicaFailoverTest.test

Error Message:
expected:<2> but was:<3>

Stack Trace:
java.lang.AssertionError: expected:<2> but was:<3>
	at __randomizedtesting.SeedInfo.seed([AE54A65450A1BE5B:2600998EFE5DD3A3]:0)
	at org.junit.Assert.fail(Assert.java:93)
	at org.junit.Assert.failNotEquals(Assert.java:647)
	at org.junit.Assert.assertEquals(Assert.java:128)
	at org.junit.Assert.assertEquals(Assert.java:472)
	at org.junit.Assert.assertEquals(Assert.java:456)
	at org.apache.solr.cloud.SharedFSAutoReplicaFailoverTest.assertSliceAndReplicaCount(SharedFSAutoReplicaFailoverTest.java:403)
	at org.apache.solr.cloud.SharedFSAutoReplicaFailoverTest.testBasics(SharedFSAutoReplicaFailoverTest.java:248)
	at org.apache.solr.cloud.SharedFSAutoReplicaFailoverTest.test(SharedFSAutoReplicaFailoverTest.java:136)
	at sun.reflect.NativeMethodAccessorImpl.invoke0(Native Method)
	at sun.reflect.NativeMethodAccessorImpl.invoke(NativeMethodAccessorImpl.java:62)
	at sun.reflect.DelegatingMethodAccessorImpl.invoke(DelegatingMethodAccessorImpl.java:43)
	at java.lang.reflect.Method.invoke(Method.java:498)
	at com.carrotsearch.randomizedtesting.RandomizedRunner.invoke(RandomizedRunner.java:1713)
	at com.carrotsearch.randomizedtesting.RandomizedRunner$8.evaluate(RandomizedRunner.java:907)
	at com.carrotsearch.randomizedtesting.RandomizedRunner$9.evaluate(RandomizedRunner.java:943)
	at com.carrotsearch.randomizedtesting.RandomizedRunner$10.evaluate(RandomizedRunner.java:957)
	at org.apache.solr.BaseDistributedSearchTestCase$ShardsRepeatRule$ShardsFixedStatement.callStatement(BaseDistributedSearchTestCase.java:993)
	at org.apache.solr.BaseDistributedSearchTestCase$ShardsRepeatRule$ShardsStatement.evaluate(BaseDistributedSearchTestCase.java:968)
	at com.carrotsearch.randomizedtesting.rules.SystemPropertiesRestoreRule$1.evaluate(SystemPropertiesRestoreRule.java:57)
	at org.apache.lucene.util.TestRuleSetupTeardownChained$1.evaluate(TestRuleSetupTeardownChained.java:49)
	at org.apache.lucene.util.AbstractBeforeAfterRule$1.evaluate(AbstractBeforeAfterRule.java:45)
	at org.apache.lucene.util.TestRuleThreadAndTestName$1.evaluate(TestRuleThreadAndTestName.java:48)
	at org.apache.lucene.util.TestRuleIgnoreAfterMaxFailures$1.evaluate(TestRuleIgnoreAfterMaxFailures.java:64)
	at org.apache.lucene.util.TestRuleMarkFailure$1.evaluate(TestRuleMarkFailure.java:47)
	at com.carrotsearch.randomizedtesting.rules.StatementAdapter.evaluate(StatementAdapter.java:36)
	at com.carrotsearch.randomizedtesting.ThreadLeakControl$StatementRunner.run(ThreadLeakControl.java:368)
	at com.carrotsearch.randomizedtesting.ThreadLeakControl.forkTimeoutingTask(ThreadLeakControl.java:817)
	at com.carrotsearch.randomizedtesting.ThreadLeakControl$3.evaluate(ThreadLeakControl.java:468)
	at com.carrotsearch.randomizedtesting.RandomizedRunner.runSingleTest(RandomizedRunner.java:916)
	at com.carrotsearch.randomizedtesting.RandomizedRunner$5.evaluate(RandomizedRunner.java:802)
	at com.carrotsearch.randomizedtesting.RandomizedRunner$6.evaluate(RandomizedRunner.java:852)
	at com.carrotsearch.randomizedtesting.RandomizedRunner$7.evaluate(RandomizedRunner.java:863)
	at com.carrotsearch.randomizedtesting.rules.StatementAdapter.evaluate(StatementAdapter.java:36)
	at com.carrotsearch.randomizedtesting.rules.SystemPropertiesRestoreRule$1.evaluate(SystemPropertiesRestoreRule.java:57)
	at org.apache.lucene.util.AbstractBeforeAfterRule$1.evaluate(AbstractBeforeAfterRule.java:45)
	at com.carrotsearch.randomizedtesting.rules.StatementAdapter.evaluate(StatementAdapter.java:36)
	at org.apache.lucene.util.TestRuleStoreClassName$1.evaluate(TestRuleStoreClassName.java:41)
	at com.carrotsearch.randomizedtesting.rules.NoShadowingOrOverridesOnMethodsRule$1.evaluate(NoShadowingOrOverridesOnMethodsRule.java:40)
	at com.carrotsearch.randomizedtesting.rules.NoShadowingOrOverridesOnMethodsRule$1.evaluate(NoShadowingOrOverridesOnMethodsRule.java:40)
	at com.carrotsearch.randomizedtesting.rules.StatementAdapter.evaluate(StatementAdapter.java:36)
	at com.carrotsearch.randomizedtesting.rules.StatementAdapter.evaluate(StatementAdapter.java:36)
	at com.carrotsearch.randomizedtesting.rules.StatementAdapter.evaluate(StatementAdapter.java:36)
	at org.apache.lucene.util.TestRuleAssertionsRequired$1.evaluate(TestRuleAssertionsRequired.java:53)
	at org.apache.lucene.util.TestRuleMarkFailure$1.evaluate(TestRuleMarkFailure.java:47)
	at org.apache.lucene.util.TestRuleIgnoreAfterMaxFailures$1.evaluate(TestRuleIgnoreAfterMaxFailures.java:64)
	at org.apache.lucene.util.TestRuleIgnoreTestSuites$1.evaluate(TestRuleIgnoreTestSuites.java:54)
	at com.carrotsearch.randomizedtesting.rules.StatementAdapter.evaluate(StatementAdapter.java:36)
	at com.carrotsearch.randomizedtesting.ThreadLeakControl$StatementRunner.run(ThreadLeakControl.java:368)
	at java.lang.Thread.run(Thread.java:748)




Build Log:
[...truncated 11347 lines...]
   [junit4] Suite: org.apache.solr.cloud.LeaderElectionContextKeyTest
   [junit4]   2> 13060 INFO  (SUITE-LeaderElectionContextKeyTest-seed#[AE54A65450A1BE5B]-worker) [    ] o.a.s.SolrTestCaseJ4 SecureRandom sanity checks: test.solr.allowed.securerandom=null & java.security.egd=file:/dev/./urandom
   [junit4]   2> Creating dataDir: /x1/jenkins/jenkins-slave/workspace/Lucene-Solr-NightlyTests-master/checkout/solr/build/solr-core/test/J0/temp/solr.cloud.LeaderElectionContextKeyTest_AE54A65450A1BE5B-001/init-core-data-001
   [junit4]   2> 13072 WARN  (SUITE-LeaderElectionContextKeyTest-seed#[AE54A65450A1BE5B]-worker) [    ] o.a.s.SolrTestCaseJ4 startTrackingSearchers: numOpens=4 numCloses=4
   [junit4]   2> 13075 INFO  (SUITE-LeaderElectionContextKeyTest-seed#[AE54A65450A1BE5B]-worker) [    ] o.a.s.SolrTestCaseJ4 Using PointFields (NUMERIC_POINTS_SYSPROP=true) w/NUMERIC_DOCVALUES_SYSPROP=true
   [junit4]   2> 13077 INFO  (SUITE-LeaderElectionContextKeyTest-seed#[AE54A65450A1BE5B]-worker) [    ] o.a.s.SolrTestCaseJ4 Randomized ssl (false) and clientAuth (true) via: @org.apache.solr.util.RandomizeSSL(reason=, ssl=NaN, value=NaN, clientAuth=NaN)
   [junit4]   2> 13080 INFO  (SUITE-LeaderElectionContextKeyTest-seed#[AE54A65450A1BE5B]-worker) [    ] o.a.s.c.MiniSolrCloudCluster Starting cluster of 1 servers in /x1/jenkins/jenkins-slave/workspace/Lucene-Solr-NightlyTests-master/checkout/solr/build/solr-core/test/J0/temp/solr.cloud.LeaderElectionContextKeyTest_AE54A65450A1BE5B-001/tempDir-001
   [junit4]   2> 13099 INFO  (SUITE-LeaderElectionContextKeyTest-seed#[AE54A65450A1BE5B]-worker) [    ] o.a.s.c.ZkTestServer STARTING ZK TEST SERVER
   [junit4]   2> 13127 INFO  (Thread-14) [    ] o.a.s.c.ZkTestServer client port:0.0.0.0/0.0.0.0:0
   [junit4]   2> 13128 INFO  (Thread-14) [    ] o.a.s.c.ZkTestServer Starting server
   [junit4]   2> 13588 INFO  (SUITE-LeaderElectionContextKeyTest-seed#[AE54A65450A1BE5B]-worker) [    ] o.a.s.c.ZkTestServer start zk server on port:58457
   [junit4]   2> 13788 WARN  (NIOServerCxn.Factory:0.0.0.0/0.0.0.0:0) [    ] o.a.z.s.NIOServerCnxn Exception causing close of session 0x0 due to java.io.IOException: ZooKeeperServer not running
   [junit4]   2> 13802 ERROR (Thread-14) [    ] o.a.z.s.ZooKeeperServer ZKShutdownHandler is not registered, so ZooKeeper server won't take any action on ERROR or SHUTDOWN server state changes
   [junit4]   2> 15159 INFO  (jetty-launcher-9-thread-1) [    ] o.e.j.s.Server jetty-9.3.14.v20161028
   [junit4]   2> 15164 INFO  (jetty-launcher-9-thread-1) [    ] o.e.j.s.h.ContextHandler Started o.e.j.s.ServletContextHandler@36ebe2f{/solr,null,AVAILABLE}
   [junit4]   2> 15169 INFO  (jetty-launcher-9-thread-1) [    ] o.e.j.s.AbstractConnector Started ServerConnector@28326aa9{HTTP/1.1,[http/1.1]}{127.0.0.1:37253}
   [junit4]   2> 15169 INFO  (jetty-launcher-9-thread-1) [    ] o.e.j.s.Server Started @18717ms
   [junit4]   2> 15169 INFO  (jetty-launcher-9-thread-1) [    ] o.a.s.c.s.e.JettySolrRunner Jetty properties: {hostContext=/solr, hostPort=37253}
   [junit4]   2> 15170 ERROR (jetty-launcher-9-thread-1) [    ] o.a.s.s.StartupLoggingUtils Missing Java Option solr.log.dir. Logging may be missing or incomplete.
   [junit4]   2> 15170 INFO  (jetty-launcher-9-thread-1) [    ] o.a.s.s.SolrDispatchFilter  ___      _       Welcome to Apache Solr? version 8.0.0
   [junit4]   2> 15171 INFO  (jetty-launcher-9-thread-1) [    ] o.a.s.s.SolrDispatchFilter / __| ___| |_ _   Starting in cloud mode on port null
   [junit4]   2> 15171 INFO  (jetty-launcher-9-thread-1) [    ] o.a.s.s.SolrDispatchFilter \__ \/ _ \ | '_|  Install dir: null, Default config dir: null
   [junit4]   2> 15171 INFO  (jetty-launcher-9-thread-1) [    ] o.a.s.s.SolrDispatchFilter |___/\___/_|_|    Start time: 2017-08-10T12:10:36.954Z
   [junit4]   2> 15185 INFO  (jetty-launcher-9-thread-1) [    ] o.a.s.s.SolrDispatchFilter solr.xml found in ZooKeeper. Loading...
   [junit4]   2> 15256 INFO  (jetty-launcher-9-thread-1) [    ] o.a.s.c.ZkContainer Zookeeper client=127.0.0.1:58457/solr
   [junit4]   2> 16052 INFO  (jetty-launcher-9-thread-1) [n:127.0.0.1:37253_solr    ] o.a.s.c.Overseer Overseer (id=null) closing
   [junit4]   2> 16055 INFO  (jetty-launcher-9-thread-1) [n:127.0.0.1:37253_solr    ] o.a.s.c.OverseerElectionContext I am going to be the leader 127.0.0.1:37253_solr
   [junit4]   2> 16059 INFO  (jetty-launcher-9-thread-1) [n:127.0.0.1:37253_solr    ] o.a.s.c.Overseer Overseer (id=98459126007529475-127.0.0.1:37253_solr-n_0000000000) starting
   [junit4]   2> 16321 INFO  (jetty-launcher-9-thread-1) [n:127.0.0.1:37253_solr    ] o.a.s.c.ZkController Register node as live in ZooKeeper:/live_nodes/127.0.0.1:37253_solr
   [junit4]   2> 16359 INFO  (OverseerStateUpdate-98459126007529475-127.0.0.1:37253_solr-n_0000000000) [n:127.0.0.1:37253_solr    ] o.a.s.c.c.ZkStateReader Updated live nodes from ZooKeeper... (0) -> (1)
   [junit4]   2> 17190 INFO  (jetty-launcher-9-thread-1) [n:127.0.0.1:37253_solr    ] o.a.s.m.r.SolrJmxReporter JMX monitoring for 'solr_37253.solr.node' (registry 'solr.node') enabled at server: com.sun.jmx.mbeanserver.JmxMBeanServer@607eb919
   [junit4]   2> 17220 INFO  (jetty-launcher-9-thread-1) [n:127.0.0.1:37253_solr    ] o.a.s.m.r.SolrJmxReporter JMX monitoring for 'solr_37253.solr.jvm' (registry 'solr.jvm') enabled at server: com.sun.jmx.mbeanserver.JmxMBeanServer@607eb919
   [junit4]   2> 17221 INFO  (jetty-launcher-9-thread-1) [n:127.0.0.1:37253_solr    ] o.a.s.m.r.SolrJmxReporter JMX monitoring for 'solr_37253.solr.jetty' (registry 'solr.jetty') enabled at server: com.sun.jmx.mbeanserver.JmxMBeanServer@607eb919
   [junit4]   2> 17291 INFO  (jetty-launcher-9-thread-1) [n:127.0.0.1:37253_solr    ] o.a.s.c.CorePropertiesLocator Found 0 core definitions underneath /x1/jenkins/jenkins-slave/workspace/Lucene-Solr-NightlyTests-master/checkout/solr/build/solr-core/test/J0/temp/solr.cloud.LeaderElectionContextKeyTest_AE54A65450A1BE5B-001/tempDir-001/node1/.
   [junit4]   2> 17545 INFO  (SUITE-LeaderElectionContextKeyTest-seed#[AE54A65450A1BE5B]-worker) [    ] o.a.s.c.c.ZkStateReader Updated live nodes from ZooKeeper... (0) -> (1)
   [junit4]   2> 17552 INFO  (SUITE-LeaderElectionContextKeyTest-seed#[AE54A65450A1BE5B]-worker) [    ] o.a.s.c.s.i.ZkClientClusterStateProvider Cluster at 127.0.0.1:58457/solr ready
   [junit4]   2> 17649 INFO  (qtp1732399539-69) [n:127.0.0.1:37253_solr    ] o.a.s.h.a.CollectionsHandler Invoked Collection Action :create with params replicationFactor=1&collection.configName=config&maxShardsPerNode=1000&name=testCollection1&nrtReplicas=1&action=CREATE&numShards=2&wt=javabin&version=2 and sendToOCPQueue=true
   [junit4]   2> 17700 INFO  (OverseerThreadFactory-53-thread-1-processing-n:127.0.0.1:37253_solr) [n:127.0.0.1:37253_solr    ] o.a.s.c.CreateCollectionCmd Create collection testCollection1
   [junit4]   2> 18055 INFO  (OverseerStateUpdate-98459126007529475-127.0.0.1:37253_solr-n_0000000000) [n:127.0.0.1:37253_solr    ] o.a.s.c.o.SliceMutator createReplica() {
   [junit4]   2>   "operation":"ADDREPLICA",
   [junit4]   2>   "collection":"testCollection1",
   [junit4]   2>   "shard":"shard1",
   [junit4]   2>   "core":"testCollection1_shard1_replica_n1",
   [junit4]   2>   "state":"down",
   [junit4]   2>   "base_url":"http://127.0.0.1:37253/solr",
   [junit4]   2>   "type":"NRT"} 
   [junit4]   2> 18075 INFO  (OverseerStateUpdate-98459126007529475-127.0.0.1:37253_solr-n_0000000000) [n:127.0.0.1:37253_solr    ] o.a.s.c.o.SliceMutator createReplica() {
   [junit4]   2>   "operation":"ADDREPLICA",
   [junit4]   2>   "collection":"testCollection1",
   [junit4]   2>   "shard":"shard2",
   [junit4]   2>   "core":"testCollection1_shard2_replica_n3",
   [junit4]   2>   "state":"down",
   [junit4]   2>   "base_url":"http://127.0.0.1:37253/solr",
   [junit4]   2>   "type":"NRT"} 
   [junit4]   2> 18321 INFO  (qtp1732399539-67) [n:127.0.0.1:37253_solr    ] o.a.s.h.a.CoreAdminOperation core create command qt=/admin/cores&coreNodeName=core_node2&collection.configName=config&newCollection=true&name=testCollection1_shard1_replica_n1&action=CREATE&numShards=2&collection=testCollection1&shard=shard1&wt=javabin&version=2&replicaType=NRT
   [junit4]   2> 18325 INFO  (qtp1732399539-67) [n:127.0.0.1:37253_solr    ] o.a.s.c.TransientSolrCoreCacheDefault Allocating transient cache for 2147483647 transient cores
   [junit4]   2> 18326 INFO  (qtp1732399539-72) [n:127.0.0.1:37253_solr    ] o.a.s.h.a.CoreAdminOperation core create command qt=/admin/cores&coreNodeName=core_node4&collection.configName=config&newCollection=true&name=testCollection1_shard2_replica_n3&action=CREATE&numShards=2&collection=testCollection1&shard=shard2&wt=javabin&version=2&replicaType=NRT
   [junit4]   2> 18491 INFO  (zkCallback-16-thread-1-processing-n:127.0.0.1:37253_solr) [n:127.0.0.1:37253_solr    ] o.a.s.c.c.ZkStateReader A cluster state change: [WatchedEvent state:SyncConnected type:NodeDataChanged path:/collections/testCollection1/state.json] for collection [testCollection1] has occurred - updating... (live nodes size: [1])
   [junit4]   2> 18492 INFO  (zkCallback-16-thread-2-processing-n:127.0.0.1:37253_solr) [n:127.0.0.1:37253_solr    ] o.a.s.c.c.ZkStateReader A cluster state change: [WatchedEvent state:SyncConnected type:NodeDataChanged path:/collections/testCollection1/state.json] for collection [testCollection1] has occurred - updating... (live nodes size: [1])
   [junit4]   2> 19439 INFO  (qtp1732399539-72) [n:127.0.0.1:37253_solr c:testCollection1 s:shard2 r:core_node4 x:testCollection1_shard2_replica_n3] o.a.s.c.SolrConfig Using Lucene MatchVersion: 8.0.0
   [junit4]   2> 19471 INFO  (qtp1732399539-67) [n:127.0.0.1:37253_solr c:testCollection1 s:shard1 r:core_node2 x:testCollection1_shard1_replica_n1] o.a.s.c.SolrConfig Using Lucene MatchVersion: 8.0.0
   [junit4]   2> 19567 INFO  (qtp1732399539-72) [n:127.0.0.1:37253_solr c:testCollection1 s:shard2 r:core_node4 x:testCollection1_shard2_replica_n3] o.a.s.s.IndexSchema [testCollection1_shard2_replica_n3] Schema name=minimal
   [junit4]   2> 19568 INFO  (qtp1732399539-67) [n:127.0.0.1:37253_solr c:testCollection1 s:shard1 r:core_node2 x:testCollection1_shard1_replica_n1] o.a.s.s.IndexSchema [testCollection1_shard1_replica_n1] Schema name=minimal
   [junit4]   2> 19613 INFO  (qtp1732399539-72) [n:127.0.0.1:37253_solr c:testCollection1 s:shard2 r:core_node4 x:testCollection1_shard2_replica_n3] o.a.s.s.IndexSchema Loaded schema minimal/1.1 with uniqueid field id
   [junit4]   2> 19613 INFO  (qtp1732399539-72) [n:127.0.0.1:37253_solr c:testCollection1 s:shard2 r:core_node4 x:testCollection1_shard2_replica_n3] o.a.s.c.CoreContainer Creating SolrCore 'testCollection1_shard2_replica_n3' using configuration from collection testCollection1, trusted=true
   [junit4]   2> 19615 INFO  (qtp1732399539-72) [n:127.0.0.1:37253_solr c:testCollection1 s:shard2 r:core_node4 x:testCollection1_shard2_replica_n3] o.a.s.m.r.SolrJmxReporter JMX monitoring for 'solr_37253.solr.core.testCollection1.shard2.replica_n3' (registry 'solr.core.testCollection1.shard2.replica_n3') enabled at server: com.sun.jmx.mbeanserver.JmxMBeanServer@607eb919
   [junit4]   2> 19616 INFO  (qtp1732399539-72) [n:127.0.0.1:37253_solr c:testCollection1 s:shard2 r:core_node4 x:testCollection1_shard2_replica_n3] o.a.s.c.SolrCore solr.RecoveryStrategy.Builder
   [junit4]   2> 19616 INFO  (qtp1732399539-72) [n:127.0.0.1:37253_solr c:testCollection1 s:shard2 r:core_node4 x:testCollection1_shard2_replica_n3] o.a.s.c.SolrCore [[testCollection1_shard2_replica_n3] ] Opening new SolrCore at [/x1/jenkins/jenkins-slave/workspace/Lucene-Solr-NightlyTests-master/checkout/solr/build/solr-core/test/J0/temp/solr.cloud.LeaderElectionContextKeyTest_AE54A65450A1BE5B-001/tempDir-001/node1/testCollection1_shard2_replica_n3], dataDir=[/x1/jenkins/jenkins-slave/workspace/Lucene-Solr-NightlyTests-master/checkout/solr/build/solr-core/test/J0/temp/solr.cloud.LeaderElectionContextKeyTest_AE54A65450A1BE5B-001/tempDir-001/node1/./testCollection1_shard2_replica_n3/data/]
   [junit4]   2> 19617 INFO  (qtp1732399539-67) [n:127.0.0.1:37253_solr c:testCollection1 s:shard1 r:core_node2 x:testCollection1_shard1_replica_n1] o.a.s.s.IndexSchema Loaded schema minimal/1.1 with uniqueid field id
   [junit4]   2> 19617 INFO  (qtp1732399539-67) [n:127.0.0.1:37253_solr c:testCollection1 s:shard1 r:core_node2 x:testCollection1_shard1_replica_n1] o.a.s.c.CoreContainer Creating SolrCore 'testCollection1_shard1_replica_n1' using configuration from collection testCollection1, trusted=true
   [junit4]   2> 19617 INFO  (qtp1732399539-67) [n:127.0.0.1:37253_solr c:testCollection1 s:shard1 r:core_node2 x:testCollection1_shard1_replica_n1] o.a.s.m.r.SolrJmxReporter JMX monitoring for 'solr_37253.solr.core.testCollection1.shard1.replica_n1' (registry 'solr.core.testCollection1.shard1.replica_n1') enabled at server: com.sun.jmx.mbeanserver.JmxMBeanServer@607eb919
   [junit4]   2> 19623 INFO  (qtp1732399539-67) [n:127.0.0.1:37253_solr c:testCollection1 s:shard1 r:core_node2 x:testCollection1_shard1_replica_n1] o.a.s.c.SolrCore solr.RecoveryStrategy.Builder
   [junit4]   2> 19623 INFO  (qtp1732399539-67) [n:127.0.0.1:37253_solr c:testCollection1 s:shard1 r:core_node2 x:testCollection1_shard1_replica_n1] o.a.s.c.SolrCore [[testCollection1_shard1_replica_n1] ] Opening new SolrCore at [/x1/jenkins/jenkins-slave/workspace/Lucene-Solr-NightlyTests-master/checkout/solr/build/solr-core/test/J0/temp/solr.cloud.LeaderElectionContextKeyTest_AE54A65450A1BE5B-001/tempDir-001/node1/testCollection1_shard1_replica_n1], dataDir=[/x1/jenkins/jenkins-slave/workspace/Lucene-Solr-NightlyTests-master/checkout/solr/build/solr-core/test/J0/temp/solr.cloud.LeaderElectionContextKeyTest_AE54A65450A1BE5B-001/tempDir-001/node1/./testCollection1_shard1_replica_n1/data/]
   [junit4]   2> 20034 INFO  (qtp1732399539-72) [n:127.0.0.1:37253_solr c:testCollection1 s:shard2 r:core_node4 x:testCollection1_shard2_replica_n3] o.a.s.u.UpdateHandler Using UpdateLog implementation: org.apache.solr.update.UpdateLog
   [junit4]   2> 20034 INFO  (qtp1732399539-72) [n:127.0.0.1:37253_solr c:testCollection1 s:shard2 r:core_node4 x:testCollection1_shard2_replica_n3] o.a.s.u.UpdateLog Initializing UpdateLog: dataDir=null defaultSyncLevel=FLUSH numRecordsToKeep=100 maxNumLogsToKeep=10 numVersionBuckets=65536
   [junit4]   2> 20049 INFO  (qtp1732399539-72) [n:127.0.0.1:37253_solr c:testCollection1 s:shard2 r:core_node4 x:testCollection1_shard2_replica_n3] o.a.s.u.CommitTracker Hard AutoCommit: disabled
   [junit4]   2> 20049 INFO  (qtp1732399539-72) [n:127.0.0.1:37253_solr c:testCollection1 s:shard2 r:core_node4 x:testCollection1_shard2_replica_n3] o.a.s.u.CommitTracker Soft AutoCommit: disabled
   [junit4]   2> 20059 INFO  (qtp1732399539-67) [n:127.0.0.1:37253_solr c:testCollection1 s:shard1 r:core_node2 x:testCollection1_shard1_replica_n1] o.a.s.u.UpdateHandler Using UpdateLog implementation: org.apache.solr.update.UpdateLog
   [junit4]   2> 20068 INFO  (qtp1732399539-67) [n:127.0.0.1:37253_solr c:testCollection1 s:shard1 r:core_node2 x:testCollection1_shard1_replica_n1] o.a.s.u.UpdateLog Initializing UpdateLog: dataDir=null defaultSyncLevel=FLUSH numRecordsToKeep=100 maxNumLogsToKeep=10 numVersionBuckets=65536
   [junit4]   2> 20071 INFO  (qtp1732399539-67) [n:127.0.0.1:37253_solr c:testCollection1 s:shard1 r:core_node2 x:testCollection1_shard1_replica_n1] o.a.s.u.CommitTracker Hard AutoCommit: disabled
   [junit4]   2> 20071 INFO  (qtp1732399539-67) [n:127.0.0.1:37253_solr c:testCollection1 s:shard1 r:core_node2 x:testCollection1_shard1_replica_n1] o.a.s.u.CommitTracker Soft AutoCommit: disabled
   [junit4]   2> 20073 INFO  (qtp1732399539-72) [n:127.0.0.1:37253_solr c:testCollection1 s:shard2 r:core_node4 x:testCollection1_shard2_replica_n3] o.a.s.s.SolrIndexSearcher Opening [Searcher@49a56249[testCollection1_shard2_replica_n3] main]
   [junit4]   2> 20078 INFO  (qtp1732399539-72) [n:127.0.0.1:37253_solr c:testCollection1 s:shard2 r:core_node4 x:testCollection1_shard2_replica_n3] o.a.s.r.ManagedResourceStorage Configured ZooKeeperStorageIO with znodeBase: /configs/config
   [junit4]   2> 20079 INFO  (qtp1732399539-72) [n:127.0.0.1:37253_solr c:testCollection1 s:shard2 r:core_node4 x:testCollection1_shard2_replica_n3] o.a.s.r.ManagedResourceStorage Loaded null at path _rest_managed.json using ZooKeeperStorageIO:path=/configs/config
   [junit4]   2> 20082 INFO  (qtp1732399539-72) [n:127.0.0.1:37253_solr c:testCollection1 s:shard2 r:core_node4 x:testCollection1_shard2_replica_n3] o.a.s.h.ReplicationHandler Commits will be reserved for  10000
   [junit4]   2> 20097 INFO  (searcherExecutor-56-thread-1-processing-n:127.0.0.1:37253_solr x:testCollection1_shard2_replica_n3 s:shard2 c:testCollection1 r:core_node4) [n:127.0.0.1:37253_solr c:testCollection1 s:shard2 r:core_node4 x:testCollection1_shard2_replica_n3] o.a.s.c.SolrCore [testCollection1_shard2_replica_n3] Registered new searcher Searcher@49a56249[testCollection1_shard2_replica_n3] main{ExitableDirectoryReader(UninvertingDirectoryReader())}
   [junit4]   2> 20098 INFO  (qtp1732399539-72) [n:127.0.0.1:37253_solr c:testCollection1 s:shard2 r:core_node4 x:testCollection1_shard2_replica_n3] o.a.s.u.UpdateLog Could not find max version in index or recent updates, using new clock 1575346023307411456
   [junit4]   2> 20104 INFO  (qtp1732399539-67) [n:127.0.0.1:37253_solr c:testCollection1 s:shard1 r:core_node2 x:testCollection1_shard1_replica_n1] o.a.s.s.SolrIndexSearcher Opening [Searcher@64a4b914[testCollection1_shard1_replica_n1] main]
   [junit4]   2> 20107 INFO  (qtp1732399539-67) [n:127.0.0.1:37253_solr c:testCollection1 s:shard1 r:core_node2 x:testCollection1_shard1_replica_n1] o.a.s.r.ManagedResourceStorage Configured ZooKeeperStorageIO with znodeBase: /configs/config
   [junit4]   2> 20108 INFO  (qtp1732399539-67) [n:127.0.0.1:37253_solr c:testCollection1 s:shard1 r:core_node2 x:testCollection1_shard1_replica_n1] o.a.s.r.ManagedResourceStorage Loaded null at path _rest_managed.json using ZooKeeperStorageIO:path=/configs/config
   [junit4]   2> 20110 INFO  (qtp1732399539-67) [n:127.0.0.1:37253_solr c:testCollection1 s:shard1 r:core_node2 x:testCollection1_shard1_replica_n1] o.a.s.h.ReplicationHandler Commits will be reserved for  10000
   [junit4]   2> 20114 INFO  (searcherExecutor-57-thread-1-processing-n:127.0.0.1:37253_solr x:testCollection1_shard1_replica_n1 s:shard1 c:testCollection1 r:core_node2) [n:127.0.0.1:37253_solr c:testCollection1 s:shard1 r:core_node2 x:testCollection1_shard1_replica_n1] o.a.s.c.SolrCore [testCollection1_shard1_replica_n1] Registered new searcher Searcher@64a4b914[testCollection1_shard1_replica_n1] main{ExitableDirectoryReader(UninvertingDirectoryReader())}
   [junit4]   2> 20115 INFO  (qtp1732399539-67) [n:127.0.0.1:37253_solr c:testCollection1 s:shard1 r:core_node2 x:testCollection1_shard1_replica_n1] o.a.s.u.UpdateLog Could not find max version in index or recent updates, using new clock 1575346023325237248
   [junit4]   2> 20180 INFO  (qtp1732399539-72) [n:127.0.0.1:37253_solr c:testCollection1 s:shard2 r:core_node4 x:testCollection1_shard2_replica_n3] o.a.s.c.ShardLeaderElectionContext Enough replicas found to continue.
   [junit4]   2> 20180 INFO  (qtp1732399539-72) [n:127.0.0.1:37253_solr c:testCollection1 s:shard2 r:core_node4 x:testCollection1_shard2_replica_n3] o.a.s.c.ShardLeaderElectionContext I may be the new leader - try and sync
   [junit4]   2> 20180 INFO  (qtp1732399539-72) [n:127.0.0.1:37253_solr c:testCollection1 s:shard2 r:core_node4 x:testCollection1_shard2_replica_n3] o.a.s.c.SyncStrategy Sync replicas to http://127.0.0.1:37253/solr/testCollection1_shard2_replica_n3/
   [junit4]   2> 20181 INFO  (qtp1732399539-67) [n:127.0.0.1:37253_solr c:testCollection1 s:shard1 r:core_node2 x:testCollection1_shard1_replica_n1] o.a.s.c.ShardLeaderElectionContext Enough replicas found to continue.
   [junit4]   2> 20182 INFO  (qtp1732399539-67) [n:127.0.0.1:37253_solr c:testCollection1 s:shard1 r:core_node2 x:testCollection1_shard1_replica_n1] o.a.s.c.ShardLeaderElectionContext I may be the new leader - try and sync
   [junit4]   2> 20182 INFO  (qtp1732399539-67) [n:127.0.0.1:37253_solr c:testCollection1 s:shard1 r:core_node2 x:testCollection1_shard1_replica_n1] o.a.s.c.SyncStrategy Sync replicas to http://127.0.0.1:37253/solr/testCollection1_shard1_replica_n1/
   [junit4]   2> 20185 INFO  (qtp1732399539-72) [n:127.0.0.1:37253_solr c:testCollection1 s:shard2 r:core_node4 x:testCollection1_shard2_replica_n3] o.a.s.c.SyncStrategy Sync Success - now sync replicas to me
   [junit4]   2> 20187 INFO  (qtp1732399539-72) [n:127.0.0.1:37253_solr c:testCollection1 s:shard2 r:core_node4 x:testCollection1_shard2_replica_n3] o.a.s.c.SyncStrategy http://127.0.0.1:37253/solr/testCollection1_shard2_replica_n3/ has no replicas
   [junit4]   2> 20187 INFO  (qtp1732399539-72) [n:127.0.0.1:37253_solr c:testCollection1 s:shard2 r:core_node4 x:testCollection1_shard2_replica_n3] o.a.s.c.ShardLeaderElectionContext Found all replicas participating in election, clear LIR
   [junit4]   2> 20185 INFO  (qtp1732399539-67) [n:127.0.0.1:37253_solr c:testCollection1 s:shard1 r:core_node2 x:testCollection1_shard1_replica_n1] o.a.s.c.SyncStrategy Sync Success - now sync replicas to me
   [junit4]   2> 20187 INFO  (qtp1732399539-67) [n:127.0.0.1:37253_solr c:testCollection1 s:shard1 r:core_node2 x:testCollection1_shard1_replica_n1] o.a.s.c.SyncStrategy http://127.0.0.1:37253/solr/testCollection1_shard1_replica_n1/ has no replicas
   [junit4]   2> 20188 INFO  (qtp1732399539-67) [n:127.0.0.1:37253_solr c:testCollection1 s:shard1 r:core_node2 x:testCollection1_shard1_replica_n1] o.a.s.c.ShardLeaderElectionContext Found all replicas participating in election, clear LIR
   [junit4]   2> 20325 INFO  (zkCallback-16-thread-1-processing-n:127.0.0.1:37253_solr) [n:127.0.0.1:37253_solr    ] o.a.s.c.c.ZkStateReader A cluster state change: [WatchedEvent state:SyncConnected type:NodeDataChanged path:/collections/testCollection1/state.json] for collection [testCollection1] has occurred - updating... (live nodes size: [1])
   [junit4]   2> 20326 INFO  (zkCallback-16-thread-2-processing-n:127.0.0.1:37253_solr) [n:127.0.0.1:37253_solr    ] o.a.s.c.c.ZkStateReader A cluster state change: [WatchedEvent state:SyncConnected type:NodeDataChanged path:/collections/testCollection1/state.json] for collection [testCollection1] has occurred - updating... (live nodes size: [1])
   [junit4]   2> 20377 INFO  (qtp1732399539-67) [n:127.0.0.1:37253_solr c:testCollection1 s:shard1 r:core_node2 x:testCollection1_shard1_replica_n1] o.a.s.c.ShardLeaderElectionContext I am the new leader: http://127.0.0.1:37253/solr/testCollection1_shard1_replica_n1/ shard1
   [junit4]   2> 20377 INFO  (qtp1732399539-72) [n:127.0.0.1:37253_solr c:testCollection1 s:shard2 r:core_node4 x:testCollection1_shard2_replica_n3] o.a.s.c.ShardLeaderElectionContext I am the new leader: http://127.0.0.1:37253/solr/testCollection1_shard2_replica_n3/ shard2
   [junit4]   2> 20489 INFO  (zkCallback-16-thread-1-processing-n:127.0.0.1:37253_solr) [n:127.0.0.1:37253_solr    ] o.a.s.c.c.ZkStateReader A cluster state change: [WatchedEvent state:SyncConnected type:NodeDataChanged path:/collections/testCollection1/state.json] for collection [testCollection1] has occurred - updating... (live nodes size: [1])
   [junit4]   2> 20489 INFO  (zkCallback-16-thread-2-processing-n:127.0.0.1:37253_solr) [n:127.0.0.1:37253_solr    ] o.a.s.c.c.ZkStateReader A cluster state change: [WatchedEvent state:SyncConnected type:NodeDataChanged path:/collections/testCollection1/state.json] for collection [testCollection1] has occurred - updating... (live nodes size: [1])
   [junit4]   2> 20531 INFO  (qtp1732399539-72) [n:127.0.0.1:37253_solr c:testCollection1 s:shard2 r:core_node4 x:testCollection1_shard2_replica_n3] o.a.s.c.ZkController I am the leader, no recovery necessary
   [junit4]   2> 20532 INFO  (qtp1732399539-67) [n:127.0.0.1:37253_solr c:testCollection1 s:shard1 r:core_node2 x:testCollection1_shard1_replica_n1] o.a.s.c.ZkController I am the leader, no recovery necessary
   [junit4]   2> 20536 INFO  (qtp1732399539-67) [n:127.0.0.1:37253_solr c:testCollection1 s:shard1 r:core_node2 x:testCollection1_shard1_replica_n1] o.a.s.s.HttpSolrCall [admin] webapp=null path=/admin/cores params={qt=/admin/cores&coreNodeName=core_node2&collection.configName=config&newCollection=true&name=testCollection1_shard1_replica_n1&action=CREATE&numShards=2&collection=testCollection1&shard=shard1&wt=javabin&version=2&replicaType=NRT} status=0 QTime=2219
   [junit4]   2> 20543 INFO  (qtp1732399539-72) [n:127.0.0.1:37253_solr c:testCollection1 s:shard2 r:core_node4 x:testCollection1_shard2_replica_n3] o.a.s.s.HttpSolrCall [admin] webapp=null path=/admin/cores params={qt=/admin/cores&coreNodeName=core_node4&collection.configName=config&newCollection=true&name=testCollection1_shard2_replica_n3&action=CREATE&numShards=2&collection=testCollection1&shard=shard2&wt=javabin&version=2&replicaType=NRT} status=0 QTime=2217
   [junit4]   2> 20614 INFO  (qtp1732399539-69) [n:127.0.0.1:37253_solr    ] o.a.s.h.a.CollectionsHandler Wait for new collection to be active for at most 30 seconds. Check all shard replicas
   [junit4]   2> 20654 INFO  (zkCallback-16-thread-1-processing-n:127.0.0.1:37253_solr) [n:127.0.0.1:37253_solr    ] o.a.s.c.c.ZkStateReader A cluster state change: [WatchedEvent state:SyncConnected type:NodeDataChanged path:/collections/testCollection1/state.json] for collection [testCollection1] has occurred - updating... (live nodes size: [1])
   [junit4]   2> 20654 INFO  (zkCallback-16-thread-2-processing-n:127.0.0.1:37253_solr) [n:127.0.0.1:37253_solr    ] o.a.s.c.c.ZkStateReader A cluster state change: [WatchedEvent state:SyncConnected type:NodeDataChanged path:/collections/testCollection1/state.json] for collection [testCollection1] has occurred - updating... (live nodes size: [1])
   [junit4]   2> 21615 INFO  (qtp1732399539-69) [n:127.0.0.1:37253_solr    ] o.a.s.s.HttpSolrCall [admin] webapp=null path=/admin/collections params={replicationFactor=1&collection.configName=config&maxShardsPerNode=1000&name=testCollection1&nrtReplicas=1&action=CREATE&numShards=2&wt=javabin&version=2} status=0 QTime=3973
   [junit4]   2> 21619 INFO  (qtp1732399539-70) [n:127.0.0.1:37253_solr    ] o.a.s.h.a.CollectionsHandler Invoked Collection Action :create with params replicationFactor=1&collection.configName=config&maxShardsPerNode=1000&name=testCollection2&nrtReplicas=1&action=CREATE&numShards=2&wt=javabin&version=2 and sendToOCPQueue=true
   [junit4]   2> 21636 INFO  (OverseerCollectionConfigSetProcessor-98459126007529475-127.0.0.1:37253_solr-n_0000000000) [n:127.0.0.1:37253_solr    ] o.a.s.c.OverseerTaskQueue Response ZK path: /overseer/collection-queue-work/qnr-0000000000 doesn't exist.  Requestor may have disconnected from ZooKeeper
   [junit4]   2> 21637 INFO  (OverseerThreadFactory-53-thread-2-processing-n:127.0.0.1:37253_solr) [n:127.0.0.1:37253_solr    ] o.a.s.c.CreateCollectionCmd Create collection testCollection2
   [junit4]   2> 22033 INFO  (OverseerStateUpdate-98459126007529475-127.0.0.1:37253_solr-n_0000000000) [n:127.0.0.1:37253_solr    ] o.a.s.c.o.SliceMutator createReplica() {
   [junit4]   2>   "operation":"ADDREPLICA",
   [junit4]   2>   "collection":"testCollection2",
   [junit4]   2>   "shard":"shard1",
   [junit4]   2>   "core":"testCollection2_shard1_replica_n1",
   [junit4]   2>   "state":"down",
   [junit4]   2>   "base_url":"http://127.0.0.1:37253/solr",
   [junit4]   2>   "type":"NRT"} 
   [junit4]   2> 22044 INFO  (OverseerStateUpdate-98459126007529475-127.0.0.1:37253_solr-n_0000000000) [n:127.0.0.1:37253_solr    ] o.a.s.c.o.SliceMutator createReplica() {
   [junit4]   2>   "operation":"ADDREPLICA",
   [junit4]   2>   "collection":"testCollection2",
   [junit4]   2>   "shard":"shard2",
   [junit4]   2>   "core":"testCollection2_shard2_replica_n2",
   [junit4]   2>   "state":"down",
   [junit4]   2>   "base_url":"http://127.0.0.1:37253/solr",
   [junit4]   2>   "type":"NRT"} 
   [junit4]   2> 22248 INFO  (qtp1732399539-73) [n:127.0.0.1:37253_solr    ] o.a.s.h.a.CoreAdminOperation core create command qt=/admin/cores&coreNodeName=core_node4&collection.configName=config&newCollection=true&name=testCollection2_shard2_replica_n2&action=CREATE&numShards=2&collection=testCollection2&shard=shard2&wt=javabin&version=2&replicaType=NRT
   [junit4]   2> 22249 INFO  (qtp1732399539-71) [n:127.0.0.1:37253_solr    ] o.a.s.h.a.CoreAdminOperation core create command qt=/admin/cores&coreNodeName=core_node3&collection.configName=config&newCollection=true&name=testCollection2_shard1_replica_n1&action=CREATE&numShards=2&collection=testCollection2&shard=shard1&wt=javabin&version=2&replicaType=NRT
   [junit4]   2> 22379 INFO  (zkCallback-16-thread-1-processing-n:127.0.0.1:37253_solr) [n:127.0.0.1:37253_solr    ] o.a.s.c.c.ZkStateReader A cluster state change: [WatchedEvent state:SyncConnected type:NodeDataChanged path:/collections/testCollection2/state.json] for collection [testCollection2] has occurred - updating... (live nodes size: [1])
   [junit4]   2> 22379 INFO  (zkCallback-16-thread-2-processing-n:127.0.0.1:37253_solr) [n:127.0.0.1:37253_solr    ] o.a.s.c.c.ZkStateReader A cluster state change: [WatchedEvent state:SyncConnected type:NodeDataChanged path:/collections/testCollection2/state.json] for collection [testCollection2] has occurred - updating... (live nodes size: [1])
   [junit4]   2> 23298 INFO  (qtp1732399539-71) [n:127.0.0.1:37253_solr c:testCollection2 s:shard1 r:core_node3 x:testCollection2_shard1_replica_n1] o.a.s.c.SolrConfig Using Lucene MatchVersion: 8.0.0
   [junit4]   2> 23298 INFO  (qtp1732399539-73) [n:127.0.0.1:37253_solr c:testCollection2 s:shard2 r:core_node4 x:testCollection2_shard2_replica_n2] o.a.s.c.SolrConfig Using Lucene MatchVersion: 8.0.0
   [junit4]   2> 23337 INFO  (qtp1732399539-71) [n:127.0.0.1:37253_solr c:testCollection2 s:shard1 r:core_node3 x:testCollection2_shard1_replica_n1] o.a.s.s.IndexSchema [testCollection2_shard1_replica_n1] Schema name=minimal
   [junit4]   2> 23377 INFO  (qtp1732399539-71) [n:127.0.0.1:37253_solr c:testCollection2 s:shard1 r:core_node3 x:testCollection2_shard1_replica_n1] o.a.s.s.IndexSchema Loaded schema minimal/1.1 with uniqueid field id
   [junit4]   2> 23377 INFO  (qtp1732399539-71) [n:127.0.0.1:37253_solr c:testCollection2 s:shard1 r:core_node3 x:testCollection2_shard1_replica_n1] o.a.s.c.CoreContainer Creating SolrCore 'testCollection2_shard1_replica_n1' using configuration from collection testCollection2, trusted=true
   [junit4]   2> 23378 INFO  (qtp1732399539-71) [n:127.0.0.1:37253_solr c:testCollection2 s:shard1 r:core_node3 x:testCollection2_shard1_replica_n1] o.a.s.m.r.SolrJmxReporter JMX monitoring for 'solr_37253.solr.core.testCollection2.shard1.replica_n1' (registry 'solr.core.testCollection2.shard1.replica_n1') enabled at server: com.sun.jmx.mbeanserver.JmxMBeanServer@607eb919
   [junit4]   2> 23378 INFO  (qtp1732399539-71) [n:127.0.0.1:37253_solr c:testCollection2 s:shard1 r:core_node3 x:testCollection2_shard1_replica_n1] o.a.s.c.SolrCore solr.RecoveryStrategy.Builder
   [junit4]   2> 23378 INFO  (qtp1732399539-71) [n:127.0.0.1:37253_solr c:testCollection2 s:shard1 r:core_node3 x:testCollection2_shard1_replica_n1] o.a.s.c.SolrCore [[testCollection2_shard1_replica_n1] ] Opening new SolrCore at [/x1/jenkins/jenkins-slave/workspace/Lucene-Solr-NightlyTests-master/checkout/solr/build/solr-core/test/J0/temp/solr.cloud.LeaderElectionContextKeyTest_AE54A65450A1BE5B-001/tempDir-001/node1/testCollection2_shard1_replica_n1], dataDir=[/x1/jenkins/jenkins-slave/workspace/Lucene-Solr-NightlyTests-master/checkout/solr/build/solr-core/test/J0/temp/solr.cloud.LeaderElectionContextKeyTest_AE54A65450A1BE5B-001/tempDir-001/node1/./testCollection2_shard1_replica_n1/data/]
   [junit4]   2> 23390 INFO  (qtp1732399539-73) [n:127.0.0.1:37253_solr c:testCollection2 s:shard2 r:core_node4 x:testCollection2_shard2_replica_n2] o.a.s.s.IndexSchema [testCollection2_shard2_replica_n2] Schema name=minimal
   [junit4]   2> 23438 INFO  (qtp1732399539-73) [n:127.0.0.1:37253_solr c:testCollection2 s:shard2 r:core_node4 x:testCollection2_shard2_replica_n2] o.a.s.s.IndexSchema Loaded schema minimal/1.1 with uniqueid field id
   [junit4]   2> 23438 INFO  (qtp1732399539-73) [n:127.0.0.1:37253_solr c:testCollection2 s:shard2 r:core_node4 x:testCollection2_shard2_replica_n2] o.a.s.c.CoreContainer Creating SolrCore 'testCollection2_shard2_replica_n2' using configuration from collection testCollection2, trusted=true
   [junit4]   2> 23439 INFO  (qtp1732399539-73) [n:127.0.0.1:37253_solr c:testCollection2 s:shard2 r:core_node4 x:testCollection2_shard2_replica_n2] o.a.s.m.r.SolrJmxReporter JMX monitoring for 'solr_37253.solr.core.testCollection2.shard2.replica_n2' (registry 'solr.core.testCollection2.shard2.replica_n2') enabled at server: com.sun.jmx.mbeanserver.JmxMBeanServer@607eb919
   [junit4]   2> 23439 INFO  (qtp1732399539-73) [n:127.0.0.1:37253_solr c:testCollection2 s:shard2 r:core_node4 x:testCollection2_shard2_replica_n2] o.a.s.c.SolrCore solr.RecoveryStrategy.Builder
   [junit4]   2> 23439 INFO  (qtp1732399539-73) [n:127.0.0.1:37253_solr c:testCollection2 s:shard2 r:core_node4 x:testCollection2_shard2_replica_n2] o.a.s.c.SolrCore [[testCollection2_shard2_replica_n2] ] Opening new SolrCore at [/x1/jenkins/jenkins-slave/workspace/Lucene-Solr-NightlyTests-master/checkout/solr/build/solr-core/test/J0/temp/solr.cloud.LeaderElectionContextKeyTest_AE54A65450A1BE5B-001/tempDir-001/node1/testCollection2_shard2_replica_n2], dataDir=[/x1/jenkins/jenkins-slave/workspace/Lucene-Solr-NightlyTests-master/checkout/solr/build/solr-core/test/J0/temp/solr.cloud.LeaderElectionContextKeyTest_AE54A65450A1BE5B-001/tempDir-001/node1/./testCollection2_shard2_replica_n2/data/]
   [junit4]   2> 24043 INFO  (qtp1732399539-71) [n:127.0.0.1:37253_solr c:testCollection2 s:shard1 r:core_node3 x:testCollection2_shard1_replica_n1] o.a.s.u.UpdateHandler Using UpdateLog implementation: org.apache.solr.update.UpdateLog
   [junit4]   2> 24044 INFO  (qtp1732399539-71) [n:127.0.0.1:37253_solr c:testCollection2 s:shard1 r:core_node3 x:testCollection2_shard1_replica_n1] o.a.s.u.UpdateLog Initializing UpdateLog: dataDir=null defaultSyncLevel=FLUSH numRecordsToKeep=100 maxNumLogsToKeep=10 numVersionBuckets=65536
   [junit4]   2> 24046 INFO  (qtp1732399539-71) [n:127.0.0.1:37253_solr c:testCollection2 s:shard1 r:core_node3 x:testCollection2_shard1_replica_n1] o.a.s.u.CommitTracker Hard AutoCommit: disabled
   [junit4]   2> 24046 INFO  (qtp1732399539-71) [n:127.0.0.1:37253_solr c:testCollection2 s:shard1 r:core_node3 x:testCollection2_shard1_replica_n1] o.a.s.u.CommitTracker Soft AutoCommit: disabled
   [junit4]   2> 24051 INFO  (qtp1732399539-71) [n:127.0.0.1:37253_solr c:testCollection2 s:shard1 r:core_node3 x:testCollection2_shard1_replica_n1] o.a.s.s.SolrIndexSearcher Opening [Searcher@229914ca[testCollection2_shard1_replica_n1] main]
   [junit4]   2> 24055 INFO  (qtp1732399539-71) [n:127.0.0.1:37253_solr c:testCollection2 s:shard1 r:core_node3 x:testCollection2_shard1_replica_n1] o.a.s.r.ManagedResourceStorage Configured ZooKeeperStorageIO with znodeBase: /configs/config
   [junit4]   2> 24055 INFO  (qtp1732399539-71) [n:127.0.0.1:37253_solr c:testCollection2 s:shard1 r:core_node3 x:testCollection2_shard1_replica_n1] o.a.s.r.ManagedResourceStorage Loaded null at path _rest_managed.json using ZooKeeperStorageIO:path=/configs/config
   [junit4]   2> 24057 INFO  (qtp1732399539-71) [n:127.0.0.1:37253_solr c:testCollection2 s:shard1 r:core_node3 x:testCollection2_shard1_replica_n1] o.a.s.h.ReplicationHandler Commits will be reserved for  10000
   [junit4]   2> 24067 INFO  (qtp1732399539-73) [n:127.0.0.1:37253_solr c:testCollection2 s:shard2 r:core_node4 x:testCollection2_shard2_replica_n2] o.a.s.u.UpdateHandler Using UpdateLog implementation: org.apache.solr.update.UpdateLog
   [junit4]   2> 24068 INFO  (qtp1732399539-73) [n:127.0.0.1:37253_solr c:testCollection2 s:shard2 r:core_node4 x:testCollection2_shard2_replica_n2] o.a.s.u.UpdateLog Initializing UpdateLog: dataDir=null defaultSyncLevel=FLUSH numRecordsToKeep=100 maxNumLogsToKeep=10 numVersionBuckets=65536
   [junit4]   2> 24070 INFO  (qtp1732399539-73) [n:127.0.0.1:37253_solr c:testCollection2 s:shard2 r:core_node4 x:testCollection2_shard2_replica_n2] o.a.s.u.CommitTracker Hard AutoCommit: disabled
   [junit4]   2> 24070 INFO  (qtp1732399539-73) [n:127.0.0.1:37253_solr c:testCollection2 s:shard2 r:core_node4 x:testCollection2_shard2_replica_n2] o.a.s.u.CommitTracker Soft AutoCommit: disabled
   [junit4]   2> 24073 INFO  (qtp1732399539-71) [n:127.0.0.1:37253_solr c:testCollection2 s:shard1 r:core_node3 x:testCollection2_shard1_replica_n1] o.a.s.u.UpdateLog Could not find max version in index or recent updates, using new clock 1575346027475501056
   [junit4]   2> 24077 INFO  (searcherExecutor-66-thread-1-processing-n:127.0.0.1:37253_solr x:testCollection2_shard1_replica_n1 s:shard1 c:testCollection2 r:core_node3) [n:127.0.0.1:37253_solr c:testCollection2 s:shard1 r:core_node3 x:testCollection2_shard1_replica_n1] o.a.s.c.SolrCore [testCollection2_shard1_replica_n1] Registered new searcher Searcher@229914ca[testCollection2_shard1_replica_n1] main{ExitableDirectoryReader(UninvertingDirectoryReader())}
   [junit4]   2> 24078 INFO  (qtp1732399539-73) [n:127.0.0.1:37253_solr c:testCollection2 s:shard2 r:core_node4 x:testCollection2_shard2_replica_n2] o.a.s.s.SolrIndexSearcher Opening [Searcher@53a3ff69[testCollection2_shard2_replica_n2] main]
   [junit4]   2> 24082 INFO  (qtp1732399539-73) [n:127.0.0.1:37253_solr c:testCollection2 s:shard2 r:core_node4 x:testCollection2_shard2_replica_n2] o.a.s.r.ManagedResourceStorage Configured ZooKeeperStorageIO with znodeBase: /configs/config
   [junit4]   2> 24083 INFO  (qtp1732399539-73) [n:127.0.0.1:37253_solr c:testCollection2 s:shard2 r:core_node4 x:testCollection2_shard2_replica_n2] o.a.s.r.ManagedResourceStorage Loaded null at path _rest_managed.json using ZooKeeperStorageIO:path=/configs/config
   [junit4]   2> 24084 INFO  (qtp1732399539-73) [n:127.0.0.1:37253_solr c:testCollection2 s:shard2 r:core_node4 x:testCollection2_shard2_replica_n2] o.a.s.h.ReplicationHandler Commits will be reserved for  10000
   [junit4]   2> 24084 INFO  (qtp1732399539-73) [n:127.0.0.1:37253_solr c:testCollection2 s:shard2 r:core_node4 x:testCollection2_shard2_replica_n2] o.a.s.u.UpdateLog Could not find max version in index or recent updates, using new clock 1575346027487035392
   [junit4]   2> 24089 INFO  (searcherExecutor-67-thread-1-processing-n:127.0.0.1:37253_solr x:testCollection2_shard2_replica_n2 s:shard2 c:testCollection2 r:core_node4) [n:127.0.0.1:37253_solr c:testCollection2 s:shard2 r:core_node4 x:testCollection2_shard2_replica_n2] o.a.s.c.SolrCore [testCollection2_shard2_replica_n2] Registered new searcher Searcher@53a3ff69[testCollection2_shard2_replica_n2] main{ExitableDirectoryReader(UninvertingDirectoryReader())}
   [junit4]   2> 24104 INFO  (qtp1732399539-71) [n:127.0.0.1:37253_solr c:testCollection2 s:shard1 r:core_node3 x:testCollection2_shard1_replica_n1] o.a.s.c.ShardLeaderElectionContext Enough replicas found to continue.
   [junit4]   2> 24104 INFO  (qtp1732399539-71) [n:127.0.0.1:37253_solr c:testCollection2 s:shard1 r:core_node3 x:testCollection2_shard1_replica_n1] o.a.s.c.ShardLeaderElectionContext I may be the new leader - try and sync
   [junit4]   2> 24104 INFO  (qtp1732399539-71) [n:127.0.0.1:37253_solr c:testCollection2 s:shard1 r:core_node3 x:testCollection2_shard1_replica_n1] o.a.s.c.SyncStrategy Sync replicas to http://127.0.0.1:37253/solr/testCollection2_shard1_replica_n1/
   [junit4]   2> 24104 INFO  (qtp1732399539-71) [n:127.0.0.1:37253_solr c:testCollection2 s:shard1 r:core_node3 x:testCollection2_shard1_replica_n1] o.a.s.c.SyncStrategy Sync Success - now sync replicas to me
   [junit4]   2> 24105 INFO  (qtp1732399539-71) [n:127.0.0.1:37253_solr c:testCollection2 s:shard1 r:core_node3 x:testCollection2_shard1_replica_n1] o.a.s.c.SyncStrategy http://127.0.0.1:37253/solr/testCollection2_shard1_replica_n1/ has no replicas
   [junit4]   2> 24105 INFO  (qtp1732399539-71) [n:127.0.0.1:37253_solr c:testCollection2 s:shard1 r:core_node3 x:testCollection2_shard1_replica_n1] o.a.s.c.ShardLeaderElectionContext Found all replicas participating in election, clear LIR
   [junit4]   2> 24117 INFO  (qtp1732399539-71) [n:127.0.0.1:37253_solr c:testCollection2 s:shard1 r:core_node3 x:testCollection2_shard1_replica_n1] o.a.s.c.ShardLeaderElectionContext I am the new leader: http://127.0.0.1:37253/solr/testCollection2_shard1_replica_n1/ shard1
   [junit4]   2> 24166 INFO  (qtp1732399539-73) [n:127.0.0.1:37253_solr c:testCollection2 s:shard2 r:core_node4 x:testCollection2_shard2_replica_n2] o.a.s.c.ShardLeaderElectionContext Enough replicas found to continue.
   [junit4]   2> 24166 INFO  (qtp1732399539-73) [n:127.0.0.1:37253_solr c:testCollection2 s:shard2 r:core_node4 x:testCollection2_shard2_replica_n2] o.a.s.c.ShardLeaderElectionContext I may be the new leader - try and sync
   [junit4]   2> 24166 INFO  (qtp1732399539-73) [n:127.0.0.1:37253_solr c:testCollection2 s:shard2 r:core_node4 x:testCollection2_shard2_replica_n2] o.a.s.c.SyncStrategy Sync replicas to http://127.0.0.1:37253/solr/testCollection2_shard2_replica_n2/
   [junit4]   2> 24166 INFO  (qtp1732399539-73) [n:127.0.0.1:37253_solr c:testCollection2 s:shard2 r:core_node4 x:testCollection2_shard2_replica_n2] o.a.s.c.SyncStrategy Sync Success - now sync replicas to me
   [junit4]   2> 24167 INFO  (qtp1732399539-73) [n:127.0.0.1:37253_solr c:testCollection2 s:shard2 r:core_node4 x:testCollection2_shard2_replica_n2] o.a.s.c.SyncStrategy http://127.0.0.1:37253/solr/testCollection2_shard2_replica_n2/ has no replicas
   [junit4]   2> 24167 INFO  (qtp1732399539-73) [n:127.0.0.1:37253_solr c:testCollection2 s:shard2 r:core_node4 x:testCollection2_shard2_replica_n2] o.a.s.c.ShardLeaderElectionContext Found all replicas participating in election, clear LIR
   [junit4]   2> 24200 INFO  (qtp1732399539-73) [n:127.0.0.1:37253_solr c:testCollection2 s:shard2 r:core_node4 x:testCollection2_shard2_replica_n2] o.a.s.c.ShardLeaderElectionContext I am the new leader: http://127.0.0.1:37253/solr/testCollection2_shard2_replica_n2/ shard2
   [junit4]   2> 24320 INFO  (zkCallback-16-thread-1-processing-n:127.0.0.1:37253_solr) [n:127.0.0.1:37253_solr    ] o.a.s.c.c.ZkStateReader A cluster state change: [WatchedEvent state:SyncConnected type:NodeDataChanged path:/collections/testCollection2/state.json] for collection [testCollection2] has occurred - updating... (live nodes size: [1])
   [junit4]   2> 24320 INFO  (zkCallback-16-thread-2-processing-n:127.0.0.1:37253_solr) [n:127.0.0.1:37253_solr    ] o.a.s.c.c.ZkStateReader A cluster state change: [WatchedEvent state:SyncConnected type:NodeDataChanged path:/collections/testCollection2/state.json] for collection [testCollection2] has occurred - updating... (live nodes size: [1])
   [junit4]   2> 24326 INFO  (qtp1732399539-71) [n:127.0.0.1:37253_solr c:testCollection2 s:shard1 r:core_node3 x:testCollection2_shard1_replica_n1] o.a.s.c.ZkController I am the leader, no recovery necessary
   [junit4]   2> 24329 INFO  (qtp1732399539-71) [n:127.0.0.1:37253_solr c:testCollection2 s:shard1 r:core_node3 x:testCollection2_shard1_replica_n1] o.a.s.s.HttpSolrCall [admin] webapp=null path=/admin/cores params={qt=/admin/cores&coreNodeName=core_node3&collection.configName=config&newCollection=true&name=testCollection2_shard1_replica_n1&action=CREATE&numShards=2&collection=testCollection2&shard=shard1&wt=javabin&version=2&replicaType=NRT} status=0 QTime=2080
   [junit4]   2> 24422 INFO  (qtp1732399539-73) [n:127.0.0.1:37253_solr c:testCollection2 s:shard2 r:core_node4 x:testCollection2_shard2_replica_n2] o.a.s.c.ZkController I am the leader, no recovery necessary
   [junit4]   2> 24428 INFO  (qtp1732399539-73) [n:127.0.0.1:37253_solr c:testCollection2 s:shard2 r:core_node4 x:testCollection2_shard2_replica_n2] o.a.s.s.HttpSolrCall [admin] webapp=null path=/admin/cores params={qt=/admin/cores&coreNodeName=core_node4&collection.configName=config&newCollection=true&name=testCollection2_shard2_replica_n2&action=CREATE&numShards=2&collection=testCollection2&shard=shard2&wt=javabin&version=2&replicaType=NRT} status=0 QTime=2179
   [junit4]   2> 24435 INFO  (qtp1732399539-70) [n:127.0.0.1:37253_solr    ] o.a.s.h.a.CollectionsHandler Wait for new collection to be active for at most 30 seconds. Check all shard replicas
   [junit4]   2> 24537 INFO  (zkCallback-16-thread-1-processing-n:127.0.0.1:37253_solr) [n:127.0.0.1:37253_solr    ] o.a.s.c.c.ZkStateReader A cluster state change: [WatchedEvent state:SyncConnected type:NodeDataChanged path:/collections/testCollection2/state.json] for collection [testCollection2] has occurred - updating... (live nodes size: [1])
   [junit4]   2> 24537 INFO  (zkCallback-16-thread-2-processing-n:127.0.0.1:37253_solr) [n:127.0.0.1:37253_solr    ] o.a.s.c.c.ZkStateReader A cluster state change: [WatchedEvent state:SyncConnected type:NodeDataChanged path:/collections/testCollection2/state.json] for collection [testCollection2] has occurred - updating... (live nodes size: [1])
   [junit4]   2> 25435 INFO  (qtp1732399539-70) [n:127.0.0.1:37253_solr    ] o.a.s.s.HttpSolrCall [admin] webapp=null path=/admin/collections params={replicationFactor=1&collection.configName=config&maxShardsPerNode=1000&name=testCollection2&nrtReplicas=1&action=CREATE&numShards=2&wt=javabin&version=2} status=0 QTime=3816
   [junit4]   2> 25443 INFO  (SUITE-LeaderElectionContextKeyTest-seed#[AE54A65450A1BE5B]-worker) [    ] o.a.s.c.AbstractDistribZkTestBase Wait for recoveries to finish - collection: testCollection1 failOnTimeout:true timeout (sec):30
   [junit4]   2> 25447 INFO  (SUITE-LeaderElectionContextKeyTest-seed#[AE54A65450A1BE5B]-worker) [    ] o.a.s.c.AbstractDistribZkTestBase Recoveries finished - collection: testCollection1
   [junit4]   2> 25447 INFO  (SUITE-LeaderElectionContextKeyTest-seed#[AE54A65450A1BE5B]-worker) [    ] o.a.s.c.AbstractDistribZkTestBase Wait for recoveries to finish - collection: testCollection2 failOnTimeout:true timeout (sec):30
   [junit4]   2> 25448 INFO  (SUITE-LeaderElectionContextKeyTest-seed#[AE54A65450A1BE5B]-worker) [    ] o.a.s.c.AbstractDistribZkTestBase Recoveries finished - collection: testCollection2
   [junit4]   2> 25495 INFO  (TEST-LeaderElectionContextKeyTest.test-seed#[AE54A65450A1BE5B]) [    ] o.a.s.SolrTestCaseJ4 ###Starting test
   [junit4]   2> 25526 INFO  (qtp1732399539-67) [n:127.0.0.1:37253_solr    ] o.a.s.m.SolrMetricManager Closing metric reporters for registry=solr.core.testCollection1.shard2.replica_n3, tag=null
   [junit4]   2> 25560 INFO  (qtp1732399539-67) [n:127.0.0.1:37253_solr    ] o.a.s.c.SolrCore [testCollection1_shard2_replica_n3]  CLOSING SolrCore org.apache.solr.core.SolrCore@cb1b2b5
   [junit4]   2> 25619 INFO  (qtp1732399539-67) [n:127.0.0.1:37253_solr    ] o.a.s.m.SolrMetricManager Closing metric reporters for registry=solr.core.testCollection1.shard2.replica_n3, tag=212972213
   [junit4]   2> 25619 INFO  (qtp1732399539-67) [n:127.0.0.1:37253_solr    ] o.a.s.m.SolrMetricManager Closing metric reporters for registry=solr.collection.testCollection1.shard2.leader, tag=212972213
   [junit4]   2> 25626 INFO  (qtp1732399539-67) [n:127.0.0.1:37253_solr    ] o.a.s.s.HttpSolrCall [admin] webapp=null path=/admin/cores params={deleteInstanceDir=false&core=testCollection1_shard2_replica_n3&deleteDataDir=false&action=UNLOAD&indexInfo=true&wt=javabin&version=2&deleteIndex=false} status=0 QTime=112
   [junit4]   2> 25628 INFO  (TEST-LeaderElectionContextKeyTest.test-seed#[AE54A65450A1BE5B]) [    ] o.a.s.SolrTestCaseJ4 ###Ending test
   [junit4]   2> NOTE: download the large Jenkins line-docs file by running 'ant get-jenkins-line-docs' in the lucene directory.
   [junit4]   2> NOTE: reproduce with: ant test  -Dtestcase=LeaderElectionContextKeyTest -Dtests.method=test -Dtests.seed=AE54A65450A1BE5B -Dtests.multiplier=2 -Dtests.nightly=true -Dtests.slow=true -Dtests.linedocsfile=/home/jenkins/jenkins-slave/workspace/Lucene-Solr-NightlyTests-master/test-data/enwiki.random.lines.txt -Dtests.locale=pt-BR -Dtests.timezone=Asia/Atyrau -Dtests.asserts=true -Dtests.file.encoding=US-ASCII
   [junit4] FAILURE 0.19s J0 | LeaderElectionContextKeyTest.test <<<
   [junit4]    > Throwable #1: java.lang.AssertionError
   [junit4]    > 	at __randomizedtesting.SeedInfo.seed([AE54A65450A1BE5B:2600998EFE5DD3A3]:0)
   [junit4]    > 	at org.apache.solr.cloud.LeaderElectionContextKeyTest.test(LeaderElectionContextKeyTest.java:88)
   [junit4]    > 	at java.lang.Thread.run(Thread.java:748)
   [junit4]   2> 25667 INFO  (OverseerCollectionConfigSetProcessor-98459126007529475-127.0.0.1:37253_solr-n_0000000000) [n:127.0.0.1:37253_solr    ] o.a.s.c.OverseerTaskQueue Response ZK path: /overseer/collection-queue-work/qnr-0000000002 doesn't exist.  Requestor may have disconnected from ZooKeeper
   [junit4]   2> 25687 INFO  (jetty-closer-10-thread-1) [    ] o.e.j.s.AbstractConnector Stopped ServerConnector@28326aa9{HTTP/1.1,[http/1.1]}{127.0.0.1:0}
   [junit4]   2> 25688 INFO  (jetty-closer-10-thread-1) [    ] o.a.s.c.CoreContainer Shutting down CoreContainer instance=654612227
   [junit4]   2> 25695 INFO  (jetty-closer-10-thread-1) [    ] o.a.s.m.SolrMetricManager Closing metric reporters for registry=solr.node, tag=null
   [junit4]   2> 25703 INFO  (jetty-closer-10-thread-1) [    ] o.a.s.m.SolrMetricManager Closing metric reporters for registry=solr.jvm, tag=null
   [junit4]   2> 25707 INFO  (jetty-closer-10-thread-1) [    ] o.a.s.m.SolrMetricManager Closing metric reporters for registry=solr.jetty, tag=null
   [junit4]   2> 25714 INFO  (jetty-closer-10-thread-1) [    ] o.a.s.m.SolrMetricManager Closing metric reporters for registry=solr.cluster, tag=null
   [junit4]   2> 25751 INFO  (coreCloseExecutor-76-thread-1) [n:127.0.0.1:37253_solr c:testCollection1 s:shard1 r:core_node2 x:testCollection1_shard1_replica_n1] o.a.s.c.SolrCore [testCollection1_shard1_replica_n1]  CLOSING SolrCore org.apache.solr.core.SolrCore@815c346
   [junit4]   2> 25771 INFO  (coreCloseExecutor-76-thread-2) [n:127.0.0.1:37253_solr c:testCollection2 s:shard1 r:core_node3 x:testCollection2_shard1_replica_n1] o.a.s.c.SolrCore [testCollection2_shard1_replica_n1]  CLOSING SolrCore org.apache.solr.core.SolrCore@33ed6f3b
   [junit4]   2> 25800 INFO  (coreCloseExecutor-76-thread-1) [n:127.0.0.1:37253_solr c:testCollection1 s:shard1 r:core_node2 x:testCollection1_shard1_replica_n1] o.a.s.m.SolrMetricManager Closing metric reporters for registry=solr.core.testCollection1.shard1.replica_n1, tag=135643974
   [junit4]   2> 25816 INFO  (coreCloseExecutor-76-thread-3) [n:127.0.0.1:37253_solr c:testCollection2 s:shard2 r:core_node4 x:testCollection2_shard2_replica_n2] o.a.s.c.SolrCore [testCollection2_shard2_replica_n2]  CLOSING SolrCore org.apache.solr.core.SolrCore@75f4df02
   [junit4]   2> 25818 INFO  (coreCloseExecutor-76-thread-1) [n:127.0.0.1:37253_solr c:testCollection1 s:shard1 r:core_node2 x:testCollection1_shard1_replica_n1] o.a.s.m.SolrMetricManager Closing metric reporters for registry=solr.collection.testCollection1.shard1.leader, tag=135643974
   [junit4]   2> 25821 INFO  (zkCallback-16-thread-1-processing-n:127.0.0.1:37253_solr) [n:127.0.0.1:37253_solr    ] o.a.s.c.c.ZkStateReader A cluster state change: [WatchedEvent state:SyncConnected type:NodeDataChanged path:/collections/testCollection1/state.json] for collection [testCollection1] has occurred - updating... (live nodes size: [1])
   [junit4]   2> 25821 INFO  (zkCallback-16-thread-2-processing-n:127.0.0.1:37253_solr) [n:127.0.0.1:37253_solr    ] o.a.s.c.c.ZkStateReader A cluster state change: [WatchedEvent state:SyncConnected type:NodeDataChanged path:/collections/testCollection1/state.json] for collection [testCollection1] has occurred - updating... (live nodes size: [1])
   [junit4]   2> 25825 INFO  (zkCallback-16-thread-2-processing-n:127.0.0.1:37253_solr) [n:127.0.0.1:37253_solr    ] o.a.s.c.c.ZkStateReader A cluster state change: [WatchedEvent state:SyncConnected type:NodeDataChanged path:/collections/testCollection2/state.json] for collection [testCollection2] has occurred - updating... (live nodes size: [1])
   [junit4]   2> 25825 INFO  (zkCallback-16-thread-1-processing-n:127.0.0.1:37253_solr) [n:127.0.0.1:37253_solr    ] o.a.s.c.c.ZkStateReader A cluster state change: [WatchedEvent state:SyncConnected type:NodeDataChanged path:/collections/testCollection2/state.json] for collection [testCollection2] has occurred - updating... (live nodes size: [1])
   [junit4]   2> 25869 INFO  (coreCloseExecutor-76-thread-3) [n:127.0.0.1:37253_solr c:testCollection2 s:shard2 r:core_node4 x:testCollection2_shard2_replica_n2] o.a.s.m.SolrMetricManager Closing metric reporters for registry=solr.core.testCollection2.shard2.replica_n2, tag=1978982146
   [junit4]   2> 26047 INFO  (coreCloseExecutor-76-thread-3) [n:127.0.0.1:37253_solr c:testCollection2 s:shard2 r:core_node4 x:testCollection2_shard2_replica_n2] o.a.s.m.SolrMetricManager Closing metric reporters for registry=solr.collection.testCollection2.shard2.leader, tag=1978982146
   [junit4]   2> 26055 INFO  (coreCloseExecutor-76-thread-2) [n:127.0.0.1:37253_solr c:testCollection2 s:shard1 r:core_node3 x:testCollection2_shard1_replica_n1] o.a.s.m.SolrMetricManager Closing metric reporters for registry=solr.core.testCollection2.shard1.replica_n1, tag=871198523
   [junit4]   2> 26068 INFO  (coreCloseExecutor-76-thread-2) [n:127.0.0.1:37253_solr c:testCollection2 s:shard1 r:core_node3 x:testCollection2_shard1_replica_n1] o.a.s.m.SolrMetricManager Closing metric reporters for registry=solr.collection.testCollection2.shard1.leader, tag=871198523
   [junit4]   2> 26069 INFO  (jetty-closer-10-thread-1) [    ] o.a.s.c.Overseer Overseer (id=98459126007529475-127.0.0.1:37253_solr-n_0000000000) closing
   [junit4]   2> 26070 INFO  (OverseerStateUpdate-98459126007529475-127.0.0.1:37253_solr-n_0000000000) [n:127.0.0.1:37253_solr    ] o.a.s.c.Overseer Overseer Loop exiting : 127.0.0.1:37253_solr
   [junit4]   2> 27606 WARN  (zkCallback-16-thread-1-processing-n:127.0.0.1:37253_solr) [n:127.0.0.1:37253_solr    ] o.a.s.c.c.ZkStateReader ZooKeeper watch triggered, but Solr cannot talk to ZK: [KeeperErrorCode = Session expired for /live_nodes]
   [junit4]   2> 27607 INFO  (jetty-closer-10-thread-1) [    ] o.e.j.s.h.ContextHandler Stopped o.e.j.s.ServletContextHandler@36ebe2f{/solr,null,UNAVAILABLE}
   [junit4]   2> 27610 ERROR (SUITE-LeaderElectionContextKeyTest-seed#[AE54A65450A1BE5B]-worker) [    ] o.a.z.s.ZooKeeperServer ZKShutdownHandler is not registered, so ZooKeeper server won't take any action on ERROR or SHUTDOWN server state changes
   [junit4]   2> 27612 INFO  (SUITE-LeaderElectionContextKeyTest-seed#[AE54A65450A1BE5B]-worker) [    ] o.a.s.c.ZkTestServer connecting to 127.0.0.1:58457 58457
   [junit4]   2> 27728 INFO  (Thread-14) [    ] o.a.s.c.ZkTestServer connecting to 127.0.0.1:58457 58457
   [junit4]   2> 27730 WARN  (Thread-14) [    ] o.a.s.c.ZkTestServer Watch limit violations: 
   [junit4]   2> Maximum concurrent create/delete watches above limit:
   [junit4]   2> 
   [junit4]   2> 	2	/solr/aliases.json
   [junit4]   2> 	2	/solr/clusterprops.json
   [junit4]   2> 
   [junit4]   2> Maximum concurrent data watches above limit:
   [junit4]   2> 
   [junit4]   2> 	7	/solr/collections/testCollection1/state.json
   [junit4]   2> 	6	/solr/collections/testCollection2/state.json
   [junit4]   2> 	2	/solr/clusterstate.json
   [junit4]   2> 
   [junit4]   2> Maximum concurrent children watches above limit:
   [junit4]   2> 
   [junit4]   2> 	2	/solr/live_nodes
   [junit4]   2> 	2	/solr/collections
   [junit4]   2> 
   [junit4]   2> NOTE: leaving temporary files on disk at: /x1/jenkins/jenkins-slave/workspace/Lucene-Solr-NightlyTests-master/checkout/solr/build/solr-core/test/J0/temp/solr.cloud.LeaderElectionContextKeyTest_AE54A65450A1BE5B-001
   [junit4]   2> Aug 10, 2017 12:10:49 PM com.carrotsearch.randomizedtesting.ThreadLeakControl checkThreadLeaks
   [junit4]   2> WARNING: Will linger awaiting termination of 1 leaked thread(s).
   [junit4]   2> NOTE: test params are: codec=FastCompressingStoredFields(storedFieldsFormat=CompressingStoredFieldsFormat(compressionMode=FAST, chunkSize=19494, maxDocsPerChunk=8, blockSize=1), termVectorsFormat=CompressingTermVectorsFormat(compressionMode=FAST, chunkSize=19494, blockSize=1)), sim=RandomSimilarity(queryNorm=false): {}, locale=pt-BR, timezone=Asia/Atyrau
   [junit4]   2> NOTE: Linux 3.13.0-88-generic amd64/Oracle Corporation 1.8.0_144 (64-bit)/cpus=4,threads=1,free=243296000,total=324534272
   [junit4]   2> NOTE: All tests run in this JVM: [TestBinaryField, TestConfigSets, LeaderElectionContextKeyTest]
   [junit4] Completed [9/729 (1!)] on J0 in 15.31s, 1 test, 1 failure <<< FAILURES!

[...truncated 1166 lines...]
   [junit4] Suite: org.apache.solr.update.AutoCommitTest
   [junit4]   2> 2560028 INFO  (SUITE-AutoCommitTest-seed#[AE54A65450A1BE5B]-worker) [    ] o.a.s.SolrTestCaseJ4 SecureRandom sanity checks: test.solr.allowed.securerandom=null & java.security.egd=file:/dev/./urandom
   [junit4]   2> Creating dataDir: /x1/jenkins/jenkins-slave/workspace/Lucene-Solr-NightlyTests-master/checkout/solr/build/solr-core/test/J2/temp/solr.update.AutoCommitTest_AE54A65450A1BE5B-001/init-core-data-001
   [junit4]   2> 2560029 WARN  (SUITE-AutoCommitTest-seed#[AE54A65450A1BE5B]-worker) [    ] o.a.s.SolrTestCaseJ4 startTrackingSearchers: numOpens=2 numCloses=2
   [junit4]   2> 2560029 INFO  (SUITE-AutoCommitTest-seed#[AE54A65450A1BE5B]-worker) [    ] o.a.s.SolrTestCaseJ4 Using PointFields (NUMERIC_POINTS_SYSPROP=true) w/NUMERIC_DOCVALUES_SYSPROP=false
   [junit4]   2> 2560032 INFO  (SUITE-AutoCommitTest-seed#[AE54A65450A1BE5B]-worker) [    ] o.a.s.SolrTestCaseJ4 Randomized ssl (true) and clientAuth (false) via: @org.apache.solr.util.RandomizeSSL(reason=, ssl=NaN, value=NaN, clientAuth=NaN)
   [junit4]   2> 2560033 INFO  (SUITE-AutoCommitTest-seed#[AE54A65450A1BE5B]-worker) [    ] o.a.s.SolrTestCaseJ4 ####initCore
   [junit4]   2> 2560033 INFO  (SUITE-AutoCommitTest-seed#[AE54A65450A1BE5B]-worker) [    ] o.a.s.c.SolrResourceLoader [null] Added 2 libs to classloader, from paths: [/x1/jenkins/jenkins-slave/workspace/Lucene-Solr-NightlyTests-master/checkout/solr/core/src/test-files/solr/collection1/lib, /x1/jenkins/jenkins-slave/workspace/Lucene-Solr-NightlyTests-master/checkout/solr/core/src/test-files/solr/collection1/lib/classes]
   [junit4]   2> 2560064 INFO  (SUITE-AutoCommitTest-seed#[AE54A65450A1BE5B]-worker) [    ] o.a.s.c.SolrConfig Using Lucene MatchVersion: 8.0.0
   [junit4]   2> 2560088 INFO  (SUITE-AutoCommitTest-seed#[AE54A65450A1BE5B]-worker) [    ] o.a.s.s.IndexSchema [null] Schema name=test
   [junit4]   2> 2560226 INFO  (SUITE-AutoCommitTest-seed#[AE54A65450A1BE5B]-worker) [    ] o.a.s.s.IndexSchema Loaded schema test/1.0 with uniqueid field id
   [junit4]   2> 2560318 INFO  (SUITE-AutoCommitTest-seed#[AE54A65450A1BE5B]-worker) [    ] o.a.s.m.r.SolrJmxReporter JMX monitoring for 'solr.node' (registry 'solr.node') enabled at server: com.sun.jmx.mbeanserver.JmxMBeanServer@e9375ba
   [junit4]   2> 2560323 INFO  (SUITE-AutoCommitTest-seed#[AE54A65450A1BE5B]-worker) [    ] o.a.s.m.r.SolrJmxReporter JMX monitoring for 'solr.jvm' (registry 'solr.jvm') enabled at server: com.sun.jmx.mbeanserver.JmxMBeanServer@e9375ba
   [junit4]   2> 2560324 INFO  (SUITE-AutoCommitTest-seed#[AE54A65450A1BE5B]-worker) [    ] o.a.s.m.r.SolrJmxReporter JMX monitoring for 'solr.jetty' (registry 'solr.jetty') enabled at server: com.sun.jmx.mbeanserver.JmxMBeanServer@e9375ba
   [junit4]   2> 2560329 INFO  (coreLoadExecutor-9732-thread-1) [    x:collection1] o.a.s.c.SolrResourceLoader [null] Added 2 libs to classloader, from paths: [/x1/jenkins/jenkins-slave/workspace/Lucene-Solr-NightlyTests-master/checkout/solr/core/src/test-files/solr/collection1/lib, /x1/jenkins/jenkins-slave/workspace/Lucene-Solr-NightlyTests-master/checkout/solr/core/src/test-files/solr/collection1/lib/classes]
   [junit4]   2> 2560376 INFO  (coreLoadExecutor-9732-thread-1) [    x:collection1] o.a.s.c.SolrConfig Using Lucene MatchVersion: 8.0.0
   [junit4]   2> 2560400 INFO  (coreLoadExecutor-9732-thread-1) [    x:collection1] o.a.s.s.IndexSchema [collection1] Schema name=test
   [junit4]   2> 2560520 INFO  (coreLoadExecutor-9732-thread-1) [    x:collection1] o.a.s.s.IndexSchema Loaded schema test/1.0 with uniqueid field id
   [junit4]   2> 2560528 INFO  (coreLoadExecutor-9732-thread-1) [    x:collection1] o.a.s.c.CoreContainer Creating SolrCore 'collection1' using configuration from instancedir /x1/jenkins/jenkins-slave/workspace/Lucene-Solr-NightlyTests-master/checkout/solr/core/src/test-files/solr/collection1, trusted=true
   [junit4]   2> 2560528 INFO  (coreLoadExecutor-9732-thread-1) [    x:collection1] o.a.s.m.r.SolrJmxReporter JMX monitoring for 'solr.core.collection1' (registry 'solr.core.collection1') enabled at server: com.sun.jmx.mbeanserver.JmxMBeanServer@e9375ba
   [junit4]   2> 2560529 INFO  (coreLoadExecutor-9732-thread-1) [    x:collection1] o.a.s.c.SolrCore solr.RecoveryStrategy.Builder
   [junit4]   2> 2560529 INFO  (coreLoadExecutor-9732-thread-1) [    x:collection1] o.a.s.c.SolrCore [[collection1] ] Opening new SolrCore at [/x1/jenkins/jenkins-slave/workspace/Lucene-Solr-NightlyTests-master/checkout/solr/core/src/test-files/solr/collection1], dataDir=[/x1/jenkins/jenkins-slave/workspace/Lucene-Solr-NightlyTests-master/checkout/solr/build/solr-core/test/J2/temp/solr.update.AutoCommitTest_AE54A65450A1BE5B-001/init-core-data-001/]
   [junit4]   2> 2560530 INFO  (coreLoadExecutor-9732-thread-1) [    x:collection1] o.a.s.u.RandomMergePolicy RandomMergePolicy wrapping class org.apache.lucene.index.TieredMergePolicy: [TieredMergePolicy: maxMergeAtOnce=25, maxMergeAtOnceExplicit=30, maxMergedSegmentMB=3.1943359375, floorSegmentMB=1.2392578125, forceMergeDeletesPctAllowed=28.227444989997405, segmentsPerTier=31.0, maxCFSSegmentSizeMB=8.796093022207999E12, noCFSRatio=0.0
   [junit4]   2> 2560633 INFO  (coreLoadExecutor-9732-thread-1) [    x:collection1] o.a.s.u.UpdateHandler Using UpdateLog implementation: org.apache.solr.update.UpdateLog
   [junit4]   2> 2560633 INFO  (coreLoadExecutor-9732-thread-1) [    x:collection1] o.a.s.u.UpdateLog Initializing UpdateLog: dataDir= defaultSyncLevel=FLUSH numRecordsToKeep=100 maxNumLogsToKeep=10 numVersionBuckets=65536
   [junit4]   2> 2560634 INFO  (coreLoadExecutor-9732-thread-1) [    x:collection1] o.a.s.u.CommitTracker Hard AutoCommit: disabled
   [junit4]   2> 2560634 INFO  (coreLoadExecutor-9732-thread-1) [    x:collection1] o.a.s.u.CommitTracker Soft AutoCommit: disabled
   [junit4]   2> 2560635 INFO  (coreLoadExecutor-9732-thread-1) [    x:collection1] o.a.s.u.RandomMergePolicy RandomMergePolicy wrapping class org.apache.lucene.index.LogDocMergePolicy: [LogDocMergePolicy: minMergeSize=1000, mergeFactor=24, maxMergeSize=9223372036854775807, maxMergeSizeForForcedMerge=9223372036854775807, calibrateSizeByDeletes=false, maxMergeDocs=2147483647, maxCFSSegmentSizeMB=8.796093022207999E12, noCFSRatio=0.154818092729096]
   [junit4]   2> 2560639 INFO  (coreLoadExecutor-9732-thread-1) [    x:collection1] o.a.s.s.SolrIndexSearcher Opening [Searcher@10e42276[collection1] main]
   [junit4]   2> 2560640 INFO  (coreLoadExecutor-9732-thread-1) [    x:collection1] o.a.s.h.c.SpellCheckComponent Initializing spell checkers
   [junit4]   2> 2560647 INFO  (coreLoadExecutor-9732-thread-1) [    x:collection1] o.a.s.s.DirectSolrSpellChecker init: {name=direct,classname=DirectSolrSpellChecker,field=lowerfilt,minQueryLength=3}
   [junit4]   2> 2560673 INFO  (coreLoadExecutor-9732-thread-1) [    x:collection1] o.a.s.h.ReplicationHandler Commits will be reserved for  10000
   [junit4]   2> 2560673 INFO  (searcherExecutor-9733-thread-1-processing-x:collection1) [    x:collection1] o.a.s.h.c.SpellCheckComponent Loading spell index for spellchecker: default
   [junit4]   2> 2560673 INFO  (coreLoadExecutor-9732-thread-1) [    x:collection1] o.a.s.u.UpdateLog Could not find max version in index or recent updates, using new clock 1575348688027385856
   [junit4]   2> 2560673 INFO  (searcherExecutor-9733-thread-1-processing-x:collection1) [    x:collection1] o.a.s.h.c.SpellCheckComponent Loading spell index for spellchecker: direct
   [junit4]   2> 2560673 INFO  (searcherExecutor-9733-thread-1-processing-x:collection1) [    x:collection1] o.a.s.h.c.SpellCheckComponent Loading spell index for spellchecker: wordbreak
   [junit4]   2> 2560673 INFO  (searcherExecutor-9733-thread-1-processing-x:collection1) [    x:collection1] o.a.s.h.c.SpellCheckComponent Loading spell index for spellchecker: multipleFields
   [junit4]   2> 2560674 INFO  (searcherExecutor-9733-thread-1-processing-x:collection1) [    x:collection1] o.a.s.h.c.SpellCheckComponent Loading spell index for spellchecker: jarowinkler
   [junit4]   2> 2560674 INFO  (searcherExecutor-9733-thread-1-processing-x:collection1) [    x:collection1] o.a.s.h.c.SpellCheckComponent Loading spell index for spellchecker: external
   [junit4]   2> 2560674 INFO  (searcherExecutor-9733-thread-1-processing-x:collection1) [    x:collection1] o.a.s.h.c.SpellCheckComponent Loading spell index for spellchecker: freq
   [junit4]   2> 2560674 INFO  (searcherExecutor-9733-thread-1-processing-x:collection1) [    x:collection1] o.a.s.h.c.SpellCheckComponent Loading spell index for spellchecker: fqcn
   [junit4]   2> 2560675 INFO  (searcherExecutor-9733-thread-1-processing-x:collection1) [    x:collection1] o.a.s.h.c.SpellCheckComponent Loading spell index for spellchecker: perDict
   [junit4]   2> 2560676 INFO  (searcherExecutor-9733-thread-1-processing-x:collection1) [    x:collection1] o.a.s.c.SolrCore [collection1] Registered new searcher Searcher@10e42276[collection1] main{ExitableDirectoryReader(UninvertingDirectoryReader())}
   [junit4]   2> 2560678 INFO  (SUITE-AutoCommitTest-seed#[AE54A65450A1BE5B]-worker) [    ] o.a.s.SolrTestCaseJ4 ####initCore end
   [junit4]   2> 2560681 INFO  (TEST-AutoCommitTest.testMaxTime-seed#[AE54A65450A1BE5B]) [    ] o.a.s.SolrTestCaseJ4 ###Starting testMaxTime
   [junit4]   2> 2560681 INFO  (TEST-AutoCommitTest.testMaxTime-seed#[AE54A65450A1BE5B]) [    ] o.a.s.u.DirectUpdateHandler2 [collection1] REMOVING ALL DOCUMENTS FROM INDEX
   [junit4]   2> 2560682 INFO  (TEST-AutoCommitTest.testMaxTime-seed#[AE54A65450A1BE5B]) [    ] o.a.s.s.SolrIndexSearcher Opening [Searcher@c9a80f2[collection1] realtime]
   [junit4]   2> 2560682 INFO  (TEST-AutoCommitTest.testMaxTime-seed#[AE54A65450A1BE5B]) [    ] o.a.s.u.p.LogUpdateProcessorFactory [collection1]  webapp=null path=null params={_version_=-9223372036854775807&update.distrib=FROMLEADER&versions=true&wt=json&indent=true}{deleteByQuery=*:* (-9223372036854775807)} 0 1
   [junit4]   2> 2560683 ERROR (TEST-AutoCommitTest.testMaxTime-seed#[AE54A65450A1BE5B]) [    ] o.a.s.c.CorePropertiesLocator Couldn't load core descriptor from /x1/jenkins/jenkins-slave/workspace/Lucene-Solr-NightlyTests-master/checkout/solr/core/src/test-files/solr/collection1/core.properties:java.nio.file.NoSuchFileException: /x1/jenkins/jenkins-slave/workspace/Lucene-Solr-NightlyTests-master/checkout/solr/core/src/test-files/solr/collection1/core.properties
   [junit4]   2> 2560684 INFO  (TEST-AutoCommitTest.testMaxTime-seed#[AE54A65450A1BE5B]) [    ] o.a.s.c.SolrResourceLoader [null] Added 2 libs to classloader, from paths: [/x1/jenkins/jenkins-slave/workspace/Lucene-Solr-NightlyTests-master/checkout/solr/core/src/test-files/solr/collection1/lib, /x1/jenkins/jenkins-slave/workspace/Lucene-Solr-NightlyTests-master/checkout/solr/core/src/

[...truncated too long message...]

n expired for /live_nodes]
   [junit4]   2> 4251297 INFO  (jetty-closer-28818-thread-6) [    ] o.e.j.s.h.ContextHandler Stopped o.e.j.s.ServletContextHandler@25f929a0{/solr,null,UNAVAILABLE}
   [junit4]   2> 4251297 INFO  (jetty-closer-28818-thread-5) [    ] o.e.j.s.h.ContextHandler Stopped o.e.j.s.ServletContextHandler@55d8700e{/solr,null,UNAVAILABLE}
   [junit4]   2> 4251308 WARN  (zkCallback-28870-thread-3-processing-n:127.0.0.1:40131_solr) [n:127.0.0.1:40131_solr    ] o.a.s.c.c.ZkStateReader ZooKeeper watch triggered, but Solr cannot talk to ZK: [KeeperErrorCode = Session expired for /live_nodes]
   [junit4]   2> 4251308 INFO  (jetty-closer-28818-thread-10) [    ] o.e.j.s.h.ContextHandler Stopped o.e.j.s.ServletContextHandler@65f723aa{/solr,null,UNAVAILABLE}
   [junit4]   2> 4251309 WARN  (zkCallback-28859-thread-4-processing-n:127.0.0.1:33325_solr) [n:127.0.0.1:33325_solr    ] o.a.s.c.c.ZkStateReader ZooKeeper watch triggered, but Solr cannot talk to ZK: [KeeperErrorCode = Session expired for /live_nodes]
   [junit4]   2> 4251310 INFO  (jetty-closer-28818-thread-8) [    ] o.e.j.s.h.ContextHandler Stopped o.e.j.s.ServletContextHandler@3dd2b61d{/solr,null,UNAVAILABLE}
   [junit4]   2> 4251311 ERROR (SUITE-TestStressCloudBlindAtomicUpdates-seed#[AE54A65450A1BE5B]-worker) [    ] o.a.z.s.ZooKeeperServer ZKShutdownHandler is not registered, so ZooKeeper server won't take any action on ERROR or SHUTDOWN server state changes
   [junit4]   2> 4251312 INFO  (SUITE-TestStressCloudBlindAtomicUpdates-seed#[AE54A65450A1BE5B]-worker) [    ] o.a.s.c.ZkTestServer connecting to 127.0.0.1:50063 50063
   [junit4]   2> 4251416 INFO  (Thread-9876) [    ] o.a.s.c.ZkTestServer connecting to 127.0.0.1:50063 50063
   [junit4]   2> 4251419 WARN  (Thread-9876) [    ] o.a.s.c.ZkTestServer Watch limit violations: 
   [junit4]   2> Maximum concurrent create/delete watches above limit:
   [junit4]   2> 
   [junit4]   2> 	11	/solr/aliases.json
   [junit4]   2> 	11	/solr/clusterprops.json
   [junit4]   2> 	10	/solr/configs/org.apache.solr.cloud.TestStressCloudBlindAtomicUpdates_config-set
   [junit4]   2> 	10	/solr/security.json
   [junit4]   2> 
   [junit4]   2> Maximum concurrent data watches above limit:
   [junit4]   2> 
   [junit4]   2> 	2070	/solr/collections/test_col/state.json
   [junit4]   2> 	11	/solr/clusterstate.json
   [junit4]   2> 	3	/solr/overseer_elect/election/98459383858921496-127.0.0.1:33325_solr-n_0000000003
   [junit4]   2> 	2	/solr/overseer_elect/election/98459383858921495-127.0.0.1:39077_solr-n_0000000004
   [junit4]   2> 
   [junit4]   2> Maximum concurrent children watches above limit:
   [junit4]   2> 
   [junit4]   2> 	11	/solr/live_nodes
   [junit4]   2> 	11	/solr/collections
   [junit4]   2> 
   [junit4]   2> NOTE: leaving temporary files on disk at: /x1/jenkins/jenkins-slave/workspace/Lucene-Solr-NightlyTests-master/checkout/solr/build/solr-core/test/J2/temp/solr.cloud.TestStressCloudBlindAtomicUpdates_AE54A65450A1BE5B-001
   [junit4]   2> Aug 10, 2017 1:21:13 PM com.carrotsearch.randomizedtesting.ThreadLeakControl checkThreadLeaks
   [junit4]   2> WARNING: Will linger awaiting termination of 1 leaked thread(s).
   [junit4]   2> NOTE: test params are: codec=Asserting(Lucene70): {id=PostingsFormat(name=Asserting)}, docValues:{_version_=DocValuesFormat(name=Lucene70), long_dv_idx=DocValuesFormat(name=Direct), long_dv_stored=DocValuesFormat(name=Lucene70), id=DocValuesFormat(name=Lucene70), long_dv=DocValuesFormat(name=Direct), long_dv_stored_idx=DocValuesFormat(name=Direct)}, maxPointsInLeafNode=1932, maxMBSortInHeap=5.589011820785171, sim=RandomSimilarity(queryNorm=true): {}, locale=hr, timezone=Pacific/Guadalcanal
   [junit4]   2> NOTE: Linux 3.13.0-88-generic amd64/Oracle Corporation 1.8.0_144 (64-bit)/cpus=4,threads=1,free=73924848,total=534773760
   [junit4]   2> NOTE: All tests run in this JVM: [TestJmxIntegration, SuggesterTest, SimplePostToolTest, TestPointFields, OverseerStatusTest, TestHighFrequencyDictionaryFactory, DeleteNodeTest, ClassificationUpdateProcessorFactoryTest, CdcrVersionReplicationTest, AsyncCallRequestStatusResponseTest, TestFastWriter, TestCustomStream, MultiTermTest, HttpPartitionTest, TestRandomFlRTGCloud, TestSubQueryTransformer, TestCodecSupport, TestDistributedMissingSort, TestSolrDeletionPolicy2, TestBulkSchemaAPI, TestPrepRecovery, CoreMergeIndexesAdminHandlerTest, TestDFRSimilarityFactory, TestFieldTypeCollectionResource, ReplicationFactorTest, TestSort, TestNumericTokenStream, TestOverriddenPrefixQueryForCustomFieldType, HLLUtilTest, DateMathParserTest, BlobRepositoryCloudTest, PeerSyncWithIndexFingerprintCachingTest, DistributedSuggestComponentTest, TestFieldCacheSort, BasicAuthStandaloneTest, BufferStoreTest, DirectUpdateHandlerTest, SolrCloudReportersTest, TestRawTransformer, DateFieldTest, ShowFileRequestHandlerTest, SignatureUpdateProcessorFactoryTest, CircularListTest, XsltUpdateRequestHandlerTest, AddSchemaFieldsUpdateProcessorFactoryTest, SortByFunctionTest, MigrateRouteKeyTest, TestSchemaResource, TestZkChroot, TimeZoneUtilsTest, TestQueryWrapperFilter, TestExpandComponent, RecoveryAfterSoftCommitTest, TestCloudNestedDocsSort, SearchHandlerTest, TestNumericTerms64, SolrTestCaseJ4Test, TestDefaultStatsCache, TestLockTree, TestFilteredDocIdSet, V2StandaloneTest, PrimitiveFieldTypeTest, TestTolerantSearch, CollectionReloadTest, TestStressReorder, TestExportWriter, TestTrie, TestSizeLimitedDistributedMap, TestInfoStreamLogging, URLClassifyProcessorTest, SuggesterFSTTest, SuggestComponentContextFilterQueryTest, RecoveryZkTest, TestConfigSetsAPIExclusivity, SolrGraphiteReporterTest, AnalyticsQueryTest, ResponseLogComponentTest, SolrCoreCheckLockOnStartupTest, TestDelegationWithHadoopAuth, TestStressLiveNodes, AnalysisErrorHandlingTest, TestReload, TestSuggestSpellingConverter, TestScoreJoinQPScore, TestMultiValuedNumericRangeQuery, PreAnalyzedFieldTest, TestAuthenticationFramework, DistribJoinFromCollectionTest, CustomCollectionTest, SolrCLIZkUtilsTest, BlockJoinFacetRandomTest, TestSolrConfigHandler, TestNonDefinedSimilarityFactory, TestQuerySenderListener, TestGroupingSearch, TestRecovery, TestBackupRepositoryFactory, TestBlendedInfixSuggestions, SpellPossibilityIteratorTest, TestExceedMaxTermLength, TestUnifiedSolrHighlighter, TestLegacyFieldReuse, TestJavabinTupleStreamParser, BigEndianAscendingWordDeserializerTest, TestJsonFacets, DistributedFacetPivotLongTailTest, ReplicaListTransformerTest, LeaderFailureAfterFreshStartTest, TestTolerantUpdateProcessorRandomCloud, TemplateUpdateProcessorTest, WrapperMergePolicyFactoryTest, TestJettySolrRunner, DocumentBuilderTest, NotRequiredUniqueKeyTest, TestTrackingShardHandlerFactory, TestPKIAuthenticationPlugin, TestSolrCoreSnapshots, SimpleMLTQParserTest, BasicDistributedZk2Test, UnloadDistributedZkTest, OpenCloseCoreStressTest, TestReplicationHandler, LeaderElectionTest, ZkSolrClientTest, ZkCLITest, ShardRoutingCustomTest, AutoCommitTest, TestFaceting, TestHashPartitioner, DistributedSpellCheckComponentTest, ZkControllerTest, TestStressVersions, DistributedTermsComponentTest, TestCoreContainer, SimpleFacetsTest, SolrCoreTest, StatsComponentTest, BadIndexSchemaTest, ConvertedLegacyTest, TestFiltering, TestFunctionQuery, TestIndexSearcher, HighlighterTest, DistributedQueryElevationComponentTest, TestCoreDiscovery, TestExtendedDismaxParser, SpellCheckCollatorTest, CoreAdminHandlerTest, TestFoldingMultitermQuery, DocValuesTest, SuggesterWFSTTest, TestCSVLoader, PolyFieldTest, SchemaVersionSpecificBehaviorTest, TestPseudoReturnFields, FieldMutatingUpdateProcessorTest, QueryEqualityTest, DirectUpdateHandlerOptimizeTest, DefaultValueUpdateProcessorTest, StatelessScriptUpdateProcessorFactoryTest, TestSolrDeletionPolicy1, SolrInfoBeanTest, TestSurroundQueryParser, LukeRequestHandlerTest, TestQueryUtils, TestWriterPerf, DirectSolrSpellCheckerTest, TestReversedWildcardFilterFactory, TestQueryTypes, FileBasedSpellCheckerTest, TermsComponentTest, XmlUpdateRequestHandlerTest, RequestHandlersTest, PathHierarchyTokenizerFactoryTest, MoreLikeThisHandlerTest, RequiredFieldsTest, FieldAnalysisRequestHandlerTest, FastVectorHighlighterTest, LoggingHandlerTest, RegexBoostProcessorTest, IndexSchemaTest, ReturnFieldsTest, MBeansHandlerTest, TestAnalyzedSuggestions, UniqFieldsUpdateProcessorFactoryTest, BinaryUpdateRequestHandlerTest, TestPartialUpdateDeduplication, TestPHPSerializedResponseWriter, PingRequestHandlerTest, UpdateParamsTest, TestQuerySenderNoQuery, CopyFieldTest, SolrIndexConfigTest, TestStressRecovery, TestMergePolicyConfig, NumericFieldsTest, MinimalSchemaTest, TestConfig, TestFuzzyAnalyzedSuggestions, ExternalFileFieldSortTest, TestSolrCoreProperties, TestCharFilters, SynonymTokenizerTest, TestLMJelinekMercerSimilarityFactory, TestIBSimilarityFactory, ResourceLoaderTest, TestFastOutputStream, ScriptEngineTest, PluginInfoTest, TestSystemIdResolver, SpellingQueryConverterTest, ClusterStateTest, TestSolrJ, TestLRUCache, TestUtils, TestDocumentBuilder, ZkNodePropsTest, SystemInfoHandlerTest, UUIDFieldTest, DistributedMLTComponentTest, DistributedIntervalFacetingTest, TestCursorMarkWithoutUniqueKey, ConnectionReuseTest, AliasIntegrationTest, AssignBackwardCompatibilityTest, CdcrReplicationDistributedZkTest, CdcrReplicationHandlerTest, CollectionsAPIAsyncDistributedZkTest, ConfigSetsAPITest, DeleteInactiveReplicaTest, DeleteStatusTest, DistributedQueueTest, DocValuesNotIndexedTest, LeaderInitiatedRecoveryOnShardRestartTest, MoveReplicaHDFSUlogDirTest, MultiThreadedOCPTest, SSLMigrationTest, SaslZkACLProviderTest, ShardSplitTest, TestCollectionAPI, TestCollectionsAPIViaSolrCloudCluster, TestCryptoKeys, TestLeaderElectionZkExpiry, TestLeaderInitiatedRecoveryThread, TestOnReconnectListenerSupport, TestReplicaProperties, TestRequestForwarding, TestSSLRandomization, TestShortCircuitedRequests, TestStressCloudBlindAtomicUpdates]
   [junit4] Completed [556/729 (4!)] on J2 in 304.69s, 5 tests, 1 error <<< FAILURES!

[...truncated 43868 lines...]

Mime
View raw message