lucene-dev mailing list archives

Site index · List index
Message view « Date » · « Thread »
Top « Date » · « Thread »
From Apache Jenkins Server <jenk...@builds.apache.org>
Subject [JENKINS] Lucene-Solr-NightlyTests-master - Build # 1375 - Still unstable
Date Mon, 14 Aug 2017 23:29:46 GMT
Build: https://builds.apache.org/job/Lucene-Solr-NightlyTests-master/1375/

6 tests failed.
FAILED:  org.apache.lucene.index.TestIndexWriterDelete.testUpdatesOnDiskFull

Error Message:
Test abandoned because suite timeout was reached.

Stack Trace:
java.lang.Exception: Test abandoned because suite timeout was reached.
	at __randomizedtesting.SeedInfo.seed([5E0E51F6A345DF49]:0)


FAILED:  junit.framework.TestSuite.org.apache.lucene.index.TestIndexWriterDelete

Error Message:
Suite timeout exceeded (>= 7200000 msec).

Stack Trace:
java.lang.Exception: Suite timeout exceeded (>= 7200000 msec).
	at __randomizedtesting.SeedInfo.seed([5E0E51F6A345DF49]:0)


FAILED:  org.apache.solr.cloud.hdfs.HdfsCollectionsAPIDistributedZkTest.testCollectionsAPI

Error Message:
Something is broken in the assert for no shards using the same indexDir - probably something was changed in the attributes published in the MBean of SolrCore : {}

Stack Trace:
java.lang.AssertionError: Something is broken in the assert for no shards using the same indexDir - probably something was changed in the attributes published in the MBean of SolrCore : {}
	at __randomizedtesting.SeedInfo.seed([4ADF9B3A4D1170B2:2AAEF8E4B225F27]:0)
	at org.junit.Assert.fail(Assert.java:93)
	at org.junit.Assert.assertTrue(Assert.java:43)
	at org.apache.solr.cloud.CollectionsAPIDistributedZkTest.checkNoTwoShardsUseTheSameIndexDir(CollectionsAPIDistributedZkTest.java:581)
	at org.apache.solr.cloud.CollectionsAPIDistributedZkTest.testCollectionsAPI(CollectionsAPIDistributedZkTest.java:462)
	at sun.reflect.NativeMethodAccessorImpl.invoke0(Native Method)
	at sun.reflect.NativeMethodAccessorImpl.invoke(NativeMethodAccessorImpl.java:62)
	at sun.reflect.DelegatingMethodAccessorImpl.invoke(DelegatingMethodAccessorImpl.java:43)
	at java.lang.reflect.Method.invoke(Method.java:498)
	at com.carrotsearch.randomizedtesting.RandomizedRunner.invoke(RandomizedRunner.java:1713)
	at com.carrotsearch.randomizedtesting.RandomizedRunner$8.evaluate(RandomizedRunner.java:907)
	at com.carrotsearch.randomizedtesting.RandomizedRunner$9.evaluate(RandomizedRunner.java:943)
	at com.carrotsearch.randomizedtesting.RandomizedRunner$10.evaluate(RandomizedRunner.java:957)
	at com.carrotsearch.randomizedtesting.rules.SystemPropertiesRestoreRule$1.evaluate(SystemPropertiesRestoreRule.java:57)
	at org.apache.lucene.util.TestRuleSetupTeardownChained$1.evaluate(TestRuleSetupTeardownChained.java:49)
	at org.apache.lucene.util.AbstractBeforeAfterRule$1.evaluate(AbstractBeforeAfterRule.java:45)
	at org.apache.lucene.util.TestRuleThreadAndTestName$1.evaluate(TestRuleThreadAndTestName.java:48)
	at org.apache.lucene.util.TestRuleIgnoreAfterMaxFailures$1.evaluate(TestRuleIgnoreAfterMaxFailures.java:64)
	at org.apache.lucene.util.TestRuleMarkFailure$1.evaluate(TestRuleMarkFailure.java:47)
	at com.carrotsearch.randomizedtesting.rules.StatementAdapter.evaluate(StatementAdapter.java:36)
	at com.carrotsearch.randomizedtesting.ThreadLeakControl$StatementRunner.run(ThreadLeakControl.java:368)
	at com.carrotsearch.randomizedtesting.ThreadLeakControl.forkTimeoutingTask(ThreadLeakControl.java:817)
	at com.carrotsearch.randomizedtesting.ThreadLeakControl$3.evaluate(ThreadLeakControl.java:468)
	at com.carrotsearch.randomizedtesting.RandomizedRunner.runSingleTest(RandomizedRunner.java:916)
	at com.carrotsearch.randomizedtesting.RandomizedRunner$5.evaluate(RandomizedRunner.java:802)
	at com.carrotsearch.randomizedtesting.RandomizedRunner$6.evaluate(RandomizedRunner.java:852)
	at com.carrotsearch.randomizedtesting.RandomizedRunner$7.evaluate(RandomizedRunner.java:863)
	at com.carrotsearch.randomizedtesting.rules.StatementAdapter.evaluate(StatementAdapter.java:36)
	at com.carrotsearch.randomizedtesting.rules.SystemPropertiesRestoreRule$1.evaluate(SystemPropertiesRestoreRule.java:57)
	at org.apache.lucene.util.AbstractBeforeAfterRule$1.evaluate(AbstractBeforeAfterRule.java:45)
	at com.carrotsearch.randomizedtesting.rules.StatementAdapter.evaluate(StatementAdapter.java:36)
	at org.apache.lucene.util.TestRuleStoreClassName$1.evaluate(TestRuleStoreClassName.java:41)
	at com.carrotsearch.randomizedtesting.rules.NoShadowingOrOverridesOnMethodsRule$1.evaluate(NoShadowingOrOverridesOnMethodsRule.java:40)
	at com.carrotsearch.randomizedtesting.rules.NoShadowingOrOverridesOnMethodsRule$1.evaluate(NoShadowingOrOverridesOnMethodsRule.java:40)
	at com.carrotsearch.randomizedtesting.rules.StatementAdapter.evaluate(StatementAdapter.java:36)
	at com.carrotsearch.randomizedtesting.rules.StatementAdapter.evaluate(StatementAdapter.java:36)
	at com.carrotsearch.randomizedtesting.rules.StatementAdapter.evaluate(StatementAdapter.java:36)
	at org.apache.lucene.util.TestRuleAssertionsRequired$1.evaluate(TestRuleAssertionsRequired.java:53)
	at org.apache.lucene.util.TestRuleMarkFailure$1.evaluate(TestRuleMarkFailure.java:47)
	at org.apache.lucene.util.TestRuleIgnoreAfterMaxFailures$1.evaluate(TestRuleIgnoreAfterMaxFailures.java:64)
	at org.apache.lucene.util.TestRuleIgnoreTestSuites$1.evaluate(TestRuleIgnoreTestSuites.java:54)
	at com.carrotsearch.randomizedtesting.rules.StatementAdapter.evaluate(StatementAdapter.java:36)
	at com.carrotsearch.randomizedtesting.ThreadLeakControl$StatementRunner.run(ThreadLeakControl.java:368)
	at java.lang.Thread.run(Thread.java:748)


FAILED:  org.apache.solr.cloud.ForceLeaderTest.testReplicasInLIRNoLeader

Error Message:
Doc with id=1 not found in http://127.0.0.1:47049/forceleader_test_collection due to: Path not found: /id; rsp={doc=null}

Stack Trace:
java.lang.AssertionError: Doc with id=1 not found in http://127.0.0.1:47049/forceleader_test_collection due to: Path not found: /id; rsp={doc=null}
	at __randomizedtesting.SeedInfo.seed([4ADF9B3A4D1170B2:AC48AFFA749389D3]:0)
	at org.junit.Assert.fail(Assert.java:93)
	at org.junit.Assert.assertTrue(Assert.java:43)
	at org.apache.solr.cloud.HttpPartitionTest.assertDocExists(HttpPartitionTest.java:603)
	at org.apache.solr.cloud.HttpPartitionTest.assertDocsExistInAllReplicas(HttpPartitionTest.java:556)
	at org.apache.solr.cloud.ForceLeaderTest.testReplicasInLIRNoLeader(ForceLeaderTest.java:142)
	at sun.reflect.NativeMethodAccessorImpl.invoke0(Native Method)
	at sun.reflect.NativeMethodAccessorImpl.invoke(NativeMethodAccessorImpl.java:62)
	at sun.reflect.DelegatingMethodAccessorImpl.invoke(DelegatingMethodAccessorImpl.java:43)
	at java.lang.reflect.Method.invoke(Method.java:498)
	at com.carrotsearch.randomizedtesting.RandomizedRunner.invoke(RandomizedRunner.java:1713)
	at com.carrotsearch.randomizedtesting.RandomizedRunner$8.evaluate(RandomizedRunner.java:907)
	at com.carrotsearch.randomizedtesting.RandomizedRunner$9.evaluate(RandomizedRunner.java:943)
	at com.carrotsearch.randomizedtesting.RandomizedRunner$10.evaluate(RandomizedRunner.java:957)
	at org.apache.solr.BaseDistributedSearchTestCase$ShardsRepeatRule$ShardsFixedStatement.callStatement(BaseDistributedSearchTestCase.java:993)
	at org.apache.solr.BaseDistributedSearchTestCase$ShardsRepeatRule$ShardsStatement.evaluate(BaseDistributedSearchTestCase.java:968)
	at com.carrotsearch.randomizedtesting.rules.SystemPropertiesRestoreRule$1.evaluate(SystemPropertiesRestoreRule.java:57)
	at org.apache.lucene.util.TestRuleSetupTeardownChained$1.evaluate(TestRuleSetupTeardownChained.java:49)
	at org.apache.lucene.util.AbstractBeforeAfterRule$1.evaluate(AbstractBeforeAfterRule.java:45)
	at org.apache.lucene.util.TestRuleThreadAndTestName$1.evaluate(TestRuleThreadAndTestName.java:48)
	at org.apache.lucene.util.TestRuleIgnoreAfterMaxFailures$1.evaluate(TestRuleIgnoreAfterMaxFailures.java:64)
	at org.apache.lucene.util.TestRuleMarkFailure$1.evaluate(TestRuleMarkFailure.java:47)
	at com.carrotsearch.randomizedtesting.rules.StatementAdapter.evaluate(StatementAdapter.java:36)
	at com.carrotsearch.randomizedtesting.ThreadLeakControl$StatementRunner.run(ThreadLeakControl.java:368)
	at com.carrotsearch.randomizedtesting.ThreadLeakControl.forkTimeoutingTask(ThreadLeakControl.java:817)
	at com.carrotsearch.randomizedtesting.ThreadLeakControl$3.evaluate(ThreadLeakControl.java:468)
	at com.carrotsearch.randomizedtesting.RandomizedRunner.runSingleTest(RandomizedRunner.java:916)
	at com.carrotsearch.randomizedtesting.RandomizedRunner$5.evaluate(RandomizedRunner.java:802)
	at com.carrotsearch.randomizedtesting.RandomizedRunner$6.evaluate(RandomizedRunner.java:852)
	at com.carrotsearch.randomizedtesting.RandomizedRunner$7.evaluate(RandomizedRunner.java:863)
	at com.carrotsearch.randomizedtesting.rules.StatementAdapter.evaluate(StatementAdapter.java:36)
	at com.carrotsearch.randomizedtesting.rules.SystemPropertiesRestoreRule$1.evaluate(SystemPropertiesRestoreRule.java:57)
	at org.apache.lucene.util.AbstractBeforeAfterRule$1.evaluate(AbstractBeforeAfterRule.java:45)
	at com.carrotsearch.randomizedtesting.rules.StatementAdapter.evaluate(StatementAdapter.java:36)
	at org.apache.lucene.util.TestRuleStoreClassName$1.evaluate(TestRuleStoreClassName.java:41)
	at com.carrotsearch.randomizedtesting.rules.NoShadowingOrOverridesOnMethodsRule$1.evaluate(NoShadowingOrOverridesOnMethodsRule.java:40)
	at com.carrotsearch.randomizedtesting.rules.NoShadowingOrOverridesOnMethodsRule$1.evaluate(NoShadowingOrOverridesOnMethodsRule.java:40)
	at com.carrotsearch.randomizedtesting.rules.StatementAdapter.evaluate(StatementAdapter.java:36)
	at com.carrotsearch.randomizedtesting.rules.StatementAdapter.evaluate(StatementAdapter.java:36)
	at com.carrotsearch.randomizedtesting.rules.StatementAdapter.evaluate(StatementAdapter.java:36)
	at org.apache.lucene.util.TestRuleAssertionsRequired$1.evaluate(TestRuleAssertionsRequired.java:53)
	at org.apache.lucene.util.TestRuleMarkFailure$1.evaluate(TestRuleMarkFailure.java:47)
	at org.apache.lucene.util.TestRuleIgnoreAfterMaxFailures$1.evaluate(TestRuleIgnoreAfterMaxFailures.java:64)
	at org.apache.lucene.util.TestRuleIgnoreTestSuites$1.evaluate(TestRuleIgnoreTestSuites.java:54)
	at com.carrotsearch.randomizedtesting.rules.StatementAdapter.evaluate(StatementAdapter.java:36)
	at com.carrotsearch.randomizedtesting.ThreadLeakControl$StatementRunner.run(ThreadLeakControl.java:368)
	at java.lang.Thread.run(Thread.java:748)


FAILED:  org.apache.solr.cloud.TestStressCloudBlindAtomicUpdates.test_dv

Error Message:
java.lang.RuntimeException: Error from server at http://127.0.0.1:33737/solr/test_col_shard1_replica_n2: Failed synchronous update on shard StdNode: http://127.0.0.1:40040/solr/test_col_shard1_replica_n1/ update: org.apache.solr.client.solrj.request.UpdateRequest@3b83c9e7

Stack Trace:
java.util.concurrent.ExecutionException: java.lang.RuntimeException: Error from server at http://127.0.0.1:33737/solr/test_col_shard1_replica_n2: Failed synchronous update on shard StdNode: http://127.0.0.1:40040/solr/test_col_shard1_replica_n1/ update: org.apache.solr.client.solrj.request.UpdateRequest@3b83c9e7
	at __randomizedtesting.SeedInfo.seed([4ADF9B3A4D1170B2:7CCBF97CC74C4AA3]:0)
	at java.util.concurrent.FutureTask.report(FutureTask.java:122)
	at java.util.concurrent.FutureTask.get(FutureTask.java:192)
	at org.apache.solr.cloud.TestStressCloudBlindAtomicUpdates.checkField(TestStressCloudBlindAtomicUpdates.java:283)
	at org.apache.solr.cloud.TestStressCloudBlindAtomicUpdates.test_dv(TestStressCloudBlindAtomicUpdates.java:195)
	at sun.reflect.NativeMethodAccessorImpl.invoke0(Native Method)
	at sun.reflect.NativeMethodAccessorImpl.invoke(NativeMethodAccessorImpl.java:62)
	at sun.reflect.DelegatingMethodAccessorImpl.invoke(DelegatingMethodAccessorImpl.java:43)
	at java.lang.reflect.Method.invoke(Method.java:498)
	at com.carrotsearch.randomizedtesting.RandomizedRunner.invoke(RandomizedRunner.java:1713)
	at com.carrotsearch.randomizedtesting.RandomizedRunner$8.evaluate(RandomizedRunner.java:907)
	at com.carrotsearch.randomizedtesting.RandomizedRunner$9.evaluate(RandomizedRunner.java:943)
	at com.carrotsearch.randomizedtesting.RandomizedRunner$10.evaluate(RandomizedRunner.java:957)
	at com.carrotsearch.randomizedtesting.rules.SystemPropertiesRestoreRule$1.evaluate(SystemPropertiesRestoreRule.java:57)
	at org.apache.lucene.util.TestRuleSetupTeardownChained$1.evaluate(TestRuleSetupTeardownChained.java:49)
	at org.apache.lucene.util.AbstractBeforeAfterRule$1.evaluate(AbstractBeforeAfterRule.java:45)
	at org.apache.lucene.util.TestRuleThreadAndTestName$1.evaluate(TestRuleThreadAndTestName.java:48)
	at org.apache.lucene.util.TestRuleIgnoreAfterMaxFailures$1.evaluate(TestRuleIgnoreAfterMaxFailures.java:64)
	at org.apache.lucene.util.TestRuleMarkFailure$1.evaluate(TestRuleMarkFailure.java:47)
	at com.carrotsearch.randomizedtesting.rules.StatementAdapter.evaluate(StatementAdapter.java:36)
	at com.carrotsearch.randomizedtesting.ThreadLeakControl$StatementRunner.run(ThreadLeakControl.java:368)
	at com.carrotsearch.randomizedtesting.ThreadLeakControl.forkTimeoutingTask(ThreadLeakControl.java:817)
	at com.carrotsearch.randomizedtesting.ThreadLeakControl$3.evaluate(ThreadLeakControl.java:468)
	at com.carrotsearch.randomizedtesting.RandomizedRunner.runSingleTest(RandomizedRunner.java:916)
	at com.carrotsearch.randomizedtesting.RandomizedRunner$5.evaluate(RandomizedRunner.java:802)
	at com.carrotsearch.randomizedtesting.RandomizedRunner$6.evaluate(RandomizedRunner.java:852)
	at com.carrotsearch.randomizedtesting.RandomizedRunner$7.evaluate(RandomizedRunner.java:863)
	at com.carrotsearch.randomizedtesting.rules.StatementAdapter.evaluate(StatementAdapter.java:36)
	at com.carrotsearch.randomizedtesting.rules.SystemPropertiesRestoreRule$1.evaluate(SystemPropertiesRestoreRule.java:57)
	at org.apache.lucene.util.AbstractBeforeAfterRule$1.evaluate(AbstractBeforeAfterRule.java:45)
	at com.carrotsearch.randomizedtesting.rules.StatementAdapter.evaluate(StatementAdapter.java:36)
	at org.apache.lucene.util.TestRuleStoreClassName$1.evaluate(TestRuleStoreClassName.java:41)
	at com.carrotsearch.randomizedtesting.rules.NoShadowingOrOverridesOnMethodsRule$1.evaluate(NoShadowingOrOverridesOnMethodsRule.java:40)
	at com.carrotsearch.randomizedtesting.rules.NoShadowingOrOverridesOnMethodsRule$1.evaluate(NoShadowingOrOverridesOnMethodsRule.java:40)
	at com.carrotsearch.randomizedtesting.rules.StatementAdapter.evaluate(StatementAdapter.java:36)
	at com.carrotsearch.randomizedtesting.rules.StatementAdapter.evaluate(StatementAdapter.java:36)
	at com.carrotsearch.randomizedtesting.rules.StatementAdapter.evaluate(StatementAdapter.java:36)
	at org.apache.lucene.util.TestRuleAssertionsRequired$1.evaluate(TestRuleAssertionsRequired.java:53)
	at org.apache.lucene.util.TestRuleMarkFailure$1.evaluate(TestRuleMarkFailure.java:47)
	at org.apache.lucene.util.TestRuleIgnoreAfterMaxFailures$1.evaluate(TestRuleIgnoreAfterMaxFailures.java:64)
	at org.apache.lucene.util.TestRuleIgnoreTestSuites$1.evaluate(TestRuleIgnoreTestSuites.java:54)
	at com.carrotsearch.randomizedtesting.rules.StatementAdapter.evaluate(StatementAdapter.java:36)
	at com.carrotsearch.randomizedtesting.ThreadLeakControl$StatementRunner.run(ThreadLeakControl.java:368)
	at java.lang.Thread.run(Thread.java:748)
Caused by: java.lang.RuntimeException: Error from server at http://127.0.0.1:33737/solr/test_col_shard1_replica_n2: Failed synchronous update on shard StdNode: http://127.0.0.1:40040/solr/test_col_shard1_replica_n1/ update: org.apache.solr.client.solrj.request.UpdateRequest@3b83c9e7
	at org.apache.solr.cloud.TestStressCloudBlindAtomicUpdates$Worker.run(TestStressCloudBlindAtomicUpdates.java:411)
	at java.util.concurrent.Executors$RunnableAdapter.call(Executors.java:511)
	at java.util.concurrent.FutureTask.run(FutureTask.java:266)
	at org.apache.solr.common.util.ExecutorUtil$MDCAwareThreadPoolExecutor.lambda$execute$0(ExecutorUtil.java:188)
	at java.util.concurrent.ThreadPoolExecutor.runWorker(ThreadPoolExecutor.java:1149)
	at java.util.concurrent.ThreadPoolExecutor$Worker.run(ThreadPoolExecutor.java:624)
	... 1 more
Caused by: org.apache.solr.client.solrj.impl.CloudSolrClient$RouteException: Error from server at http://127.0.0.1:33737/solr/test_col_shard1_replica_n2: Failed synchronous update on shard StdNode: http://127.0.0.1:40040/solr/test_col_shard1_replica_n1/ update: org.apache.solr.client.solrj.request.UpdateRequest@3b83c9e7
	at org.apache.solr.client.solrj.impl.CloudSolrClient.directUpdate(CloudSolrClient.java:539)
	at org.apache.solr.client.solrj.impl.CloudSolrClient.sendRequest(CloudSolrClient.java:993)
	at org.apache.solr.client.solrj.impl.CloudSolrClient.requestWithRetryOnStaleState(CloudSolrClient.java:862)
	at org.apache.solr.client.solrj.impl.CloudSolrClient.request(CloudSolrClient.java:793)
	at org.apache.solr.client.solrj.SolrRequest.process(SolrRequest.java:178)
	at org.apache.solr.client.solrj.SolrRequest.process(SolrRequest.java:195)
	at org.apache.solr.cloud.TestStressCloudBlindAtomicUpdates$Worker.doRandomAtomicUpdate(TestStressCloudBlindAtomicUpdates.java:370)
	at org.apache.solr.cloud.TestStressCloudBlindAtomicUpdates$Worker.run(TestStressCloudBlindAtomicUpdates.java:399)
	... 6 more
Caused by: org.apache.solr.client.solrj.impl.HttpSolrClient$RemoteSolrException: Error from server at http://127.0.0.1:33737/solr/test_col_shard1_replica_n2: Failed synchronous update on shard StdNode: http://127.0.0.1:40040/solr/test_col_shard1_replica_n1/ update: org.apache.solr.client.solrj.request.UpdateRequest@3b83c9e7
	at org.apache.solr.client.solrj.impl.HttpSolrClient.executeMethod(HttpSolrClient.java:627)
	at org.apache.solr.client.solrj.impl.HttpSolrClient.request(HttpSolrClient.java:253)
	at org.apache.solr.client.solrj.impl.HttpSolrClient.request(HttpSolrClient.java:242)
	at org.apache.solr.client.solrj.impl.LBHttpSolrClient.doRequest(LBHttpSolrClient.java:483)
	at org.apache.solr.client.solrj.impl.LBHttpSolrClient.request(LBHttpSolrClient.java:413)
	at org.apache.solr.client.solrj.impl.CloudSolrClient.lambda$directUpdate$0(CloudSolrClient.java:516)
	... 5 more


FAILED:  org.apache.solr.cloud.SharedFSAutoReplicaFailoverTest.test

Error Message:
Timeout waiting for all live and active

Stack Trace:
java.lang.AssertionError: Timeout waiting for all live and active
	at __randomizedtesting.SeedInfo.seed([4ADF9B3A4D1170B2:C28BA4E0E3ED1D4A]:0)
	at org.junit.Assert.fail(Assert.java:93)
	at org.junit.Assert.assertTrue(Assert.java:43)
	at org.apache.solr.cloud.SharedFSAutoReplicaFailoverTest.testBasics(SharedFSAutoReplicaFailoverTest.java:317)
	at org.apache.solr.cloud.SharedFSAutoReplicaFailoverTest.test(SharedFSAutoReplicaFailoverTest.java:136)
	at sun.reflect.NativeMethodAccessorImpl.invoke0(Native Method)
	at sun.reflect.NativeMethodAccessorImpl.invoke(NativeMethodAccessorImpl.java:62)
	at sun.reflect.DelegatingMethodAccessorImpl.invoke(DelegatingMethodAccessorImpl.java:43)
	at java.lang.reflect.Method.invoke(Method.java:498)
	at com.carrotsearch.randomizedtesting.RandomizedRunner.invoke(RandomizedRunner.java:1713)
	at com.carrotsearch.randomizedtesting.RandomizedRunner$8.evaluate(RandomizedRunner.java:907)
	at com.carrotsearch.randomizedtesting.RandomizedRunner$9.evaluate(RandomizedRunner.java:943)
	at com.carrotsearch.randomizedtesting.RandomizedRunner$10.evaluate(RandomizedRunner.java:957)
	at org.apache.solr.BaseDistributedSearchTestCase$ShardsRepeatRule$ShardsFixedStatement.callStatement(BaseDistributedSearchTestCase.java:993)
	at org.apache.solr.BaseDistributedSearchTestCase$ShardsRepeatRule$ShardsStatement.evaluate(BaseDistributedSearchTestCase.java:968)
	at com.carrotsearch.randomizedtesting.rules.SystemPropertiesRestoreRule$1.evaluate(SystemPropertiesRestoreRule.java:57)
	at org.apache.lucene.util.TestRuleSetupTeardownChained$1.evaluate(TestRuleSetupTeardownChained.java:49)
	at org.apache.lucene.util.AbstractBeforeAfterRule$1.evaluate(AbstractBeforeAfterRule.java:45)
	at org.apache.lucene.util.TestRuleThreadAndTestName$1.evaluate(TestRuleThreadAndTestName.java:48)
	at org.apache.lucene.util.TestRuleIgnoreAfterMaxFailures$1.evaluate(TestRuleIgnoreAfterMaxFailures.java:64)
	at org.apache.lucene.util.TestRuleMarkFailure$1.evaluate(TestRuleMarkFailure.java:47)
	at com.carrotsearch.randomizedtesting.rules.StatementAdapter.evaluate(StatementAdapter.java:36)
	at com.carrotsearch.randomizedtesting.ThreadLeakControl$StatementRunner.run(ThreadLeakControl.java:368)
	at com.carrotsearch.randomizedtesting.ThreadLeakControl.forkTimeoutingTask(ThreadLeakControl.java:817)
	at com.carrotsearch.randomizedtesting.ThreadLeakControl$3.evaluate(ThreadLeakControl.java:468)
	at com.carrotsearch.randomizedtesting.RandomizedRunner.runSingleTest(RandomizedRunner.java:916)
	at com.carrotsearch.randomizedtesting.RandomizedRunner$5.evaluate(RandomizedRunner.java:802)
	at com.carrotsearch.randomizedtesting.RandomizedRunner$6.evaluate(RandomizedRunner.java:852)
	at com.carrotsearch.randomizedtesting.RandomizedRunner$7.evaluate(RandomizedRunner.java:863)
	at com.carrotsearch.randomizedtesting.rules.StatementAdapter.evaluate(StatementAdapter.java:36)
	at com.carrotsearch.randomizedtesting.rules.SystemPropertiesRestoreRule$1.evaluate(SystemPropertiesRestoreRule.java:57)
	at org.apache.lucene.util.AbstractBeforeAfterRule$1.evaluate(AbstractBeforeAfterRule.java:45)
	at com.carrotsearch.randomizedtesting.rules.StatementAdapter.evaluate(StatementAdapter.java:36)
	at org.apache.lucene.util.TestRuleStoreClassName$1.evaluate(TestRuleStoreClassName.java:41)
	at com.carrotsearch.randomizedtesting.rules.NoShadowingOrOverridesOnMethodsRule$1.evaluate(NoShadowingOrOverridesOnMethodsRule.java:40)
	at com.carrotsearch.randomizedtesting.rules.NoShadowingOrOverridesOnMethodsRule$1.evaluate(NoShadowingOrOverridesOnMethodsRule.java:40)
	at com.carrotsearch.randomizedtesting.rules.StatementAdapter.evaluate(StatementAdapter.java:36)
	at com.carrotsearch.randomizedtesting.rules.StatementAdapter.evaluate(StatementAdapter.java:36)
	at com.carrotsearch.randomizedtesting.rules.StatementAdapter.evaluate(StatementAdapter.java:36)
	at org.apache.lucene.util.TestRuleAssertionsRequired$1.evaluate(TestRuleAssertionsRequired.java:53)
	at org.apache.lucene.util.TestRuleMarkFailure$1.evaluate(TestRuleMarkFailure.java:47)
	at org.apache.lucene.util.TestRuleIgnoreAfterMaxFailures$1.evaluate(TestRuleIgnoreAfterMaxFailures.java:64)
	at org.apache.lucene.util.TestRuleIgnoreTestSuites$1.evaluate(TestRuleIgnoreTestSuites.java:54)
	at com.carrotsearch.randomizedtesting.rules.StatementAdapter.evaluate(StatementAdapter.java:36)
	at com.carrotsearch.randomizedtesting.ThreadLeakControl$StatementRunner.run(ThreadLeakControl.java:368)
	at java.lang.Thread.run(Thread.java:748)




Build Log:
[...truncated 1896 lines...]
   [junit4] Suite: org.apache.lucene.index.TestIndexWriterDelete
   [junit4]   2> Aug 14, 2017 10:21:56 PM com.carrotsearch.randomizedtesting.ThreadLeakControl$2 evaluate
   [junit4]   2> WARNING: Suite execution timed out: org.apache.lucene.index.TestIndexWriterDelete
   [junit4]   2>    1) Thread[id=1, name=main, state=WAITING, group=main]
   [junit4]   2>         at java.lang.Object.wait(Native Method)
   [junit4]   2>         at java.lang.Thread.join(Thread.java:1252)
   [junit4]   2>         at java.lang.Thread.join(Thread.java:1326)
   [junit4]   2>         at com.carrotsearch.randomizedtesting.RandomizedRunner.runSuite(RandomizedRunner.java:608)
   [junit4]   2>         at com.carrotsearch.randomizedtesting.RandomizedRunner.run(RandomizedRunner.java:457)
   [junit4]   2>         at com.carrotsearch.ant.tasks.junit4.slave.SlaveMain.execute(SlaveMain.java:251)
   [junit4]   2>         at com.carrotsearch.ant.tasks.junit4.slave.SlaveMain.main(SlaveMain.java:368)
   [junit4]   2>         at com.carrotsearch.ant.tasks.junit4.slave.SlaveMainSafe.main(SlaveMainSafe.java:13)
   [junit4]   2>    2) Thread[id=10352, name=SUITE-TestIndexWriterDelete-seed#[5E0E51F6A345DF49], state=RUNNABLE, group=TGRP-TestIndexWriterDelete]
   [junit4]   2>         at java.lang.Thread.getStackTrace(Thread.java:1559)
   [junit4]   2>         at com.carrotsearch.randomizedtesting.ThreadLeakControl$4.run(ThreadLeakControl.java:696)
   [junit4]   2>         at com.carrotsearch.randomizedtesting.ThreadLeakControl$4.run(ThreadLeakControl.java:693)
   [junit4]   2>         at java.security.AccessController.doPrivileged(Native Method)
   [junit4]   2>         at com.carrotsearch.randomizedtesting.ThreadLeakControl.getStackTrace(ThreadLeakControl.java:693)
   [junit4]   2>         at com.carrotsearch.randomizedtesting.ThreadLeakControl.getThreadsWithTraces(ThreadLeakControl.java:709)
   [junit4]   2>         at com.carrotsearch.randomizedtesting.ThreadLeakControl.formatThreadStacksFull(ThreadLeakControl.java:689)
   [junit4]   2>         at com.carrotsearch.randomizedtesting.ThreadLeakControl.access$1000(ThreadLeakControl.java:65)
   [junit4]   2>         at com.carrotsearch.randomizedtesting.ThreadLeakControl$2.evaluate(ThreadLeakControl.java:415)
   [junit4]   2>         at com.carrotsearch.randomizedtesting.RandomizedRunner.runSuite(RandomizedRunner.java:678)
   [junit4]   2>         at com.carrotsearch.randomizedtesting.RandomizedRunner.access$200(RandomizedRunner.java:140)
   [junit4]   2>         at com.carrotsearch.randomizedtesting.RandomizedRunner$2.run(RandomizedRunner.java:598)
   [junit4]   2>    3) Thread[id=10353, name=TEST-TestIndexWriterDelete.testUpdatesOnDiskFull-seed#[5E0E51F6A345DF49], state=TIMED_WAITING, group=TGRP-TestIndexWriterDelete]
   [junit4]   2>         at java.lang.Thread.sleep(Native Method)
   [junit4]   2>         at org.apache.lucene.store.SlowClosingMockIndexInputWrapper.close(SlowClosingMockIndexInputWrapper.java:39)
   [junit4]   2>         at org.apache.lucene.store.Directory.copyFrom(Directory.java:163)
   [junit4]   2>         at org.apache.lucene.util.TestUtil.ramCopyOf(TestUtil.java:1294)
   [junit4]   2>         at org.apache.lucene.index.TestIndexWriterDelete.doTestOperationsOnDiskFull(TestIndexWriterDelete.java:528)
   [junit4]   2>         at org.apache.lucene.index.TestIndexWriterDelete.testUpdatesOnDiskFull(TestIndexWriterDelete.java:490)
   [junit4]   2>         at sun.reflect.NativeMethodAccessorImpl.invoke0(Native Method)
   [junit4]   2>         at sun.reflect.NativeMethodAccessorImpl.invoke(NativeMethodAccessorImpl.java:62)
   [junit4]   2>         at sun.reflect.DelegatingMethodAccessorImpl.invoke(DelegatingMethodAccessorImpl.java:43)
   [junit4]   2>         at java.lang.reflect.Method.invoke(Method.java:498)
   [junit4]   2>         at com.carrotsearch.randomizedtesting.RandomizedRunner.invoke(RandomizedRunner.java:1713)
   [junit4]   2>         at com.carrotsearch.randomizedtesting.RandomizedRunner$8.evaluate(RandomizedRunner.java:907)
   [junit4]   2>         at com.carrotsearch.randomizedtesting.RandomizedRunner$9.evaluate(RandomizedRunner.java:943)
   [junit4]   2>         at com.carrotsearch.randomizedtesting.RandomizedRunner$10.evaluate(RandomizedRunner.java:957)
   [junit4]   2>         at org.apache.lucene.util.TestRuleSetupTeardownChained$1.evaluate(TestRuleSetupTeardownChained.java:49)
   [junit4]   2>         at org.apache.lucene.util.AbstractBeforeAfterRule$1.evaluate(AbstractBeforeAfterRule.java:45)
   [junit4]   2>         at org.apache.lucene.util.TestRuleThreadAndTestName$1.evaluate(TestRuleThreadAndTestName.java:48)
   [junit4]   2>         at org.apache.lucene.util.TestRuleIgnoreAfterMaxFailures$1.evaluate(TestRuleIgnoreAfterMaxFailures.java:64)
   [junit4]   2>         at org.apache.lucene.util.TestRuleMarkFailure$1.evaluate(TestRuleMarkFailure.java:47)
   [junit4]   2>         at com.carrotsearch.randomizedtesting.rules.StatementAdapter.evaluate(StatementAdapter.java:36)
   [junit4]   2>         at com.carrotsearch.randomizedtesting.ThreadLeakControl$StatementRunner.run(ThreadLeakControl.java:368)
   [junit4]   2>         at com.carrotsearch.randomizedtesting.ThreadLeakControl.forkTimeoutingTask(ThreadLeakControl.java:817)
   [junit4]   2>         at com.carrotsearch.randomizedtesting.ThreadLeakControl$3.evaluate(ThreadLeakControl.java:468)
   [junit4]   2>         at com.carrotsearch.randomizedtesting.RandomizedRunner.runSingleTest(RandomizedRunner.java:916)
   [junit4]   2>         at com.carrotsearch.randomizedtesting.RandomizedRunner$5.evaluate(RandomizedRunner.java:802)
   [junit4]   2>         at com.carrotsearch.randomizedtesting.RandomizedRunner$6.evaluate(RandomizedRunner.java:852)
   [junit4]   2>         at com.carrotsearch.randomizedtesting.RandomizedRunner$7.evaluate(RandomizedRunner.java:863)
   [junit4]   2>         at org.apache.lucene.util.AbstractBeforeAfterRule$1.evaluate(AbstractBeforeAfterRule.java:45)
   [junit4]   2>         at com.carrotsearch.randomizedtesting.rules.StatementAdapter.evaluate(StatementAdapter.java:36)
   [junit4]   2>         at org.apache.lucene.util.TestRuleStoreClassName$1.evaluate(TestRuleStoreClassName.java:41)
   [junit4]   2>         at com.carrotsearch.randomizedtesting.rules.NoShadowingOrOverridesOnMethodsRule$1.evaluate(NoShadowingOrOverridesOnMethodsRule.java:40)
   [junit4]   2>         at com.carrotsearch.randomizedtesting.rules.NoShadowingOrOverridesOnMethodsRule$1.evaluate(NoShadowingOrOverridesOnMethodsRule.java:40)
   [junit4]   2>         at com.carrotsearch.randomizedtesting.rules.StatementAdapter.evaluate(StatementAdapter.java:36)
   [junit4]   2>         at com.carrotsearch.randomizedtesting.rules.StatementAdapter.evaluate(StatementAdapter.java:36)
   [junit4]   2>         at com.carrotsearch.randomizedtesting.rules.StatementAdapter.evaluate(StatementAdapter.java:36)
   [junit4]   2>         at org.apache.lucene.util.TestRuleAssertionsRequired$1.evaluate(TestRuleAssertionsRequired.java:53)
   [junit4]   2>         at org.apache.lucene.util.TestRuleMarkFailure$1.evaluate(TestRuleMarkFailure.java:47)
   [junit4]   2>         at org.apache.lucene.util.TestRuleIgnoreAfterMaxFailures$1.evaluate(TestRuleIgnoreAfterMaxFailures.java:64)
   [junit4]   2>         at org.apache.lucene.util.TestRuleIgnoreTestSuites$1.evaluate(TestRuleIgnoreTestSuites.java:54)
   [junit4]   2>         at com.carrotsearch.randomizedtesting.rules.StatementAdapter.evaluate(StatementAdapter.java:36)
   [junit4]   2>         at com.carrotsearch.randomizedtesting.ThreadLeakControl$StatementRunner.run(ThreadLeakControl.java:368)
   [junit4]   2>         at java.lang.Thread.run(Thread.java:748)
   [junit4]   2>    4) Thread[id=9, name=JUnit4-serializer-daemon, state=TIMED_WAITING, group=main]
   [junit4]   2>         at java.lang.Thread.sleep(Native Method)
   [junit4]   2>         at com.carrotsearch.ant.tasks.junit4.events.Serializer$1.run(Serializer.java:50)
   [junit4]   2> NOTE: download the large Jenkins line-docs file by running 'ant get-jenkins-line-docs' in the lucene directory.
   [junit4]   2> NOTE: reproduce with: ant test  -Dtestcase=TestIndexWriterDelete -Dtests.method=testUpdatesOnDiskFull -Dtests.seed=5E0E51F6A345DF49 -Dtests.multiplier=2 -Dtests.nightly=true -Dtests.slow=true -Dtests.linedocsfile=/home/jenkins/jenkins-slave/workspace/Lucene-Solr-NightlyTests-master/test-data/enwiki.random.lines.txt -Dtests.locale=en-GB -Dtests.timezone=Europe/Vaduz -Dtests.asserts=true -Dtests.file.encoding=UTF-8
   [junit4] ERROR   7200s J1 | TestIndexWriterDelete.testUpdatesOnDiskFull <<<
   [junit4]    > Throwable #1: java.lang.Exception: Test abandoned because suite timeout was reached.
   [junit4]    > 	at __randomizedtesting.SeedInfo.seed([5E0E51F6A345DF49]:0)
   [junit4]   2> Aug 14, 2017 10:21:56 PM com.carrotsearch.randomizedtesting.ThreadLeakControl checkThreadLeaks
   [junit4]   2> WARNING: Will linger awaiting termination of 1 leaked thread(s).
   [junit4]   2> Aug 14, 2017 10:22:16 PM com.carrotsearch.randomizedtesting.ThreadLeakControl checkThreadLeaks
   [junit4]   2> SEVERE: 1 thread leaked from SUITE scope at org.apache.lucene.index.TestIndexWriterDelete: 
   [junit4]   2>    1) Thread[id=10353, name=TEST-TestIndexWriterDelete.testUpdatesOnDiskFull-seed#[5E0E51F6A345DF49], state=TIMED_WAITING, group=TGRP-TestIndexWriterDelete]
   [junit4]   2>         at java.lang.Thread.sleep(Native Method)
   [junit4]   2>         at org.apache.lucene.store.SlowOpeningMockIndexInputWrapper.<init>(SlowOpeningMockIndexInputWrapper.java:33)
   [junit4]   2>         at org.apache.lucene.store.MockDirectoryWrapper.openInput(MockDirectoryWrapper.java:772)
   [junit4]   2>         at org.apache.lucene.codecs.lucene50.Lucene50PostingsReader.<init>(Lucene50PostingsReader.java:88)
   [junit4]   2>         at org.apache.lucene.codecs.memory.FSTOrdPostingsFormat.fieldsProducer(FSTOrdPostingsFormat.java:66)
   [junit4]   2>         at org.apache.lucene.codecs.perfield.PerFieldPostingsFormat$FieldsReader.<init>(PerFieldPostingsFormat.java:292)
   [junit4]   2>         at org.apache.lucene.codecs.perfield.PerFieldPostingsFormat.fieldsProducer(PerFieldPostingsFormat.java:372)
   [junit4]   2>         at org.apache.lucene.index.SegmentCoreReaders.<init>(SegmentCoreReaders.java:112)
   [junit4]   2>         at org.apache.lucene.index.SegmentReader.<init>(SegmentReader.java:78)
   [junit4]   2>         at org.apache.lucene.index.CheckIndex.checkIndex(CheckIndex.java:702)
   [junit4]   2>         at org.apache.lucene.util.TestUtil.checkIndex(TestUtil.java:300)
   [junit4]   2>         at org.apache.lucene.util.TestUtil.checkIndex(TestUtil.java:285)
   [junit4]   2>         at org.apache.lucene.util.TestUtil.checkIndex(TestUtil.java:281)
   [junit4]   2>         at org.apache.lucene.index.TestIndexWriterDelete.doTestOperationsOnDiskFull(TestIndexWriterDelete.java:638)
   [junit4]   2>         at org.apache.lucene.index.TestIndexWriterDelete.testUpdatesOnDiskFull(TestIndexWriterDelete.java:490)
   [junit4]   2>         at sun.reflect.NativeMethodAccessorImpl.invoke0(Native Method)
   [junit4]   2>         at sun.reflect.NativeMethodAccessorImpl.invoke(NativeMethodAccessorImpl.java:62)
   [junit4]   2>         at sun.reflect.DelegatingMethodAccessorImpl.invoke(DelegatingMethodAccessorImpl.java:43)
   [junit4]   2>         at java.lang.reflect.Method.invoke(Method.java:498)
   [junit4]   2>         at com.carrotsearch.randomizedtesting.RandomizedRunner.invoke(RandomizedRunner.java:1713)
   [junit4]   2>         at com.carrotsearch.randomizedtesting.RandomizedRunner$8.evaluate(RandomizedRunner.java:907)
   [junit4]   2>         at com.carrotsearch.randomizedtesting.RandomizedRunner$9.evaluate(RandomizedRunner.java:943)
   [junit4]   2>         at com.carrotsearch.randomizedtesting.RandomizedRunner$10.evaluate(RandomizedRunner.java:957)
   [junit4]   2>         at org.apache.lucene.util.TestRuleSetupTeardownChained$1.evaluate(TestRuleSetupTeardownChained.java:49)
   [junit4]   2>         at org.apache.lucene.util.AbstractBeforeAfterRule$1.evaluate(AbstractBeforeAfterRule.java:45)
   [junit4]   2>         at org.apache.lucene.util.TestRuleThreadAndTestName$1.evaluate(TestRuleThreadAndTestName.java:48)
   [junit4]   2>         at org.apache.lucene.util.TestRuleIgnoreAfterMaxFailures$1.evaluate(TestRuleIgnoreAfterMaxFailures.java:64)
   [junit4]   2>         at org.apache.lucene.util.TestRuleMarkFailure$1.evaluate(TestRuleMarkFailure.java:47)
   [junit4]   2>         at com.carrotsearch.randomizedtesting.rules.StatementAdapter.evaluate(StatementAdapter.java:36)
   [junit4]   2>         at com.carrotsearch.randomizedtesting.ThreadLeakControl$StatementRunner.run(ThreadLeakControl.java:368)
   [junit4]   2>         at com.carrotsearch.randomizedtesting.ThreadLeakControl.forkTimeoutingTask(ThreadLeakControl.java:817)
   [junit4]   2>         at com.carrotsearch.randomizedtesting.ThreadLeakControl$3.evaluate(ThreadLeakControl.java:468)
   [junit4]   2>         at com.carrotsearch.randomizedtesting.RandomizedRunner.runSingleTest(RandomizedRunner.java:916)
   [junit4]   2>         at com.carrotsearch.randomizedtesting.RandomizedRunner$5.evaluate(RandomizedRunner.java:802)
   [junit4]   2>         at com.carrotsearch.randomizedtesting.RandomizedRunner$6.evaluate(RandomizedRunner.java:852)
   [junit4]   2>         at com.carrotsearch.randomizedtesting.RandomizedRunner$7.evaluate(RandomizedRunner.java:863)
   [junit4]   2>         at org.apache.lucene.util.AbstractBeforeAfterRule$1.evaluate(AbstractBeforeAfterRule.java:45)
   [junit4]   2>         at com.carrotsearch.randomizedtesting.rules.StatementAdapter.evaluate(StatementAdapter.java:36)
   [junit4]   2>         at org.apache.lucene.util.TestRuleStoreClassName$1.evaluate(TestRuleStoreClassName.java:41)
   [junit4]   2>         at com.carrotsearch.randomizedtesting.rules.NoShadowingOrOverridesOnMethodsRule$1.evaluate(NoShadowingOrOverridesOnMethodsRule.java:40)
   [junit4]   2>         at com.carrotsearch.randomizedtesting.rules.NoShadowingOrOverridesOnMethodsRule$1.evaluate(NoShadowingOrOverridesOnMethodsRule.java:40)
   [junit4]   2>         at com.carrotsearch.randomizedtesting.rules.StatementAdapter.evaluate(StatementAdapter.java:36)
   [junit4]   2>         at com.carrotsearch.randomizedtesting.rules.StatementAdapter.evaluate(StatementAdapter.java:36)
   [junit4]   2>         at com.carrotsearch.randomizedtesting.rules.StatementAdapter.evaluate(StatementAdapter.java:36)
   [junit4]   2>         at org.apache.lucene.util.TestRuleAssertionsRequired$1.evaluate(TestRuleAssertionsRequired.java:53)
   [junit4]   2>         at org.apache.lucene.util.TestRuleMarkFailure$1.evaluate(TestRuleMarkFailure.java:47)
   [junit4]   2>         at org.apache.lucene.util.TestRuleIgnoreAfterMaxFailures$1.evaluate(TestRuleIgnoreAfterMaxFailures.java:64)
   [junit4]   2>         at org.apache.lucene.util.TestRuleIgnoreTestSuites$1.evaluate(TestRuleIgnoreTestSuites.java:54)
   [junit4]   2>         at com.carrotsearch.randomizedtesting.rules.StatementAdapter.evaluate(StatementAdapter.java:36)
   [junit4]   2>         at com.carrotsearch.randomizedtesting.ThreadLeakControl$StatementRunner.run(ThreadLeakControl.java:368)
   [junit4]   2>         at java.lang.Thread.run(Thread.java:748)
   [junit4]   2> Aug 14, 2017 10:22:16 PM com.carrotsearch.randomizedtesting.ThreadLeakControl tryToInterruptAll
   [junit4]   2> INFO: Starting to interrupt leaked threads:
   [junit4]   2>    1) Thread[id=10353, name=TEST-TestIndexWriterDelete.testUpdatesOnDiskFull-seed#[5E0E51F6A345DF49], state=TIMED_WAITING, group=TGRP-TestIndexWriterDelete]
   [junit4]   1> CheckIndex failed
   [junit4]   1> Segments file=segments_1 numSegments=40 version=8.0.0 id=ewbsl7cwp8ejxl0jzn36sx9e2
   [junit4]   1>   1 of 40: name=_0 maxDoc=4
   [junit4]   1>     version=8.0.0
   [junit4]   1>     id=ewbsl7cwp8ejxl0jzn36sx9cy
   [junit4]   1>     codec=Asserting(Lucene70)
   [junit4]   1>     compound=false
   [junit4]   1>     numFiles=18
   [junit4]   1>     size (MB)=0.002
   [junit4]   1>     diagnostics = {java.runtime.version=1.8.0_144-b01, java.vendor=Oracle Corporation, java.version=1.8.0_144, java.vm.version=25.144-b01, lucene.version=8.0.0, os=Linux, os.arch=amd64, os.version=3.13.0-88-generic, source=flush, timestamp=1502734917018}
   [junit4]   1>     no deletions
   [junit4]   1>     test: open reader.........OK [took 0.000 sec]
   [junit4]   1>     test: check integrity.....OK [took 0.000 sec]
   [junit4]   1>     test: check live docs.....OK [took 0.000 sec]
   [junit4]   1>     test: field infos.........OK [3 fields] [took 0.000 sec]
   [junit4]   1>     test: field norms.........OK [1 fields] [took 0.000 sec]
   [junit4]   1>     test: terms, freq, prox...OK [9 terms; 12 terms/docs pairs; 8 tokens] [took 0.000 sec]
   [junit4]   1>     test: stored fields.......OK [4 total field count; avg 1.0 fields per doc] [took 0.000 sec]
   [junit4]   1>     test: term vectors........OK [4 total term vector count; avg 1.0 term/freq vector fields per doc] [took 0.000 sec]
   [junit4]   1>     test: docvalues...........OK [1 docvalues fields; 0 BINARY; 1 NUMERIC; 0 SORTED; 0 SORTED_NUMERIC; 0 SORTED_SET] [took 0.000 sec]
   [junit4]   1>     test: points..............OK [0 fields, 0 points] [took 0.000 sec]
   [junit4]   1> 
   [junit4]   1>   2 of 40: name=_1 maxDoc=4
   [junit4]   1>     version=8.0.0
   [junit4]   1>     id=ewbsl7cwp8ejxl0jzn36sx9cz
   [junit4]   1>     codec=Asserting(Lucene70)
   [junit4]   1>     compound=false
   [junit4]   1>     numFiles=18
   [junit4]   1>     size (MB)=0.002
   [junit4]   1>     diagnostics = {java.runtime.version=1.8.0_144-b01, java.vendor=Oracle Corporation, java.version=1.8.0_144, java.vm.version=25.144-b01, lucene.version=8.0.0, os=Linux, os.arch=amd64, os.version=3.13.0-88-generic, source=flush, timestamp=1502734917023}
   [junit4]   1>     no deletions
   [junit4]   1>     test: open reader.........OK [took 0.000 sec]
   [junit4]   1>     test: check integrity.....OK [took 0.000 sec]
   [junit4]   1>     test: check live docs.....OK [took 0.000 sec]
   [junit4]   1>     test: field infos.........OK [3 fields] [took 0.000 sec]
   [junit4]   1>     test: field norms.........OK [1 fields] [took 0.000 sec]
   [junit4]   1>     test: terms, freq, prox...OK [9 terms; 12 terms/docs pairs; 8 tokens] [took 0.000 sec]
   [junit4]   1>     test: stored fields.......OK [4 total field count; avg 1.0 fields per doc] [took 0.000 sec]
   [junit4]   1>     test: term vectors........OK [4 total term vector count; avg 1.0 term/freq vector fields per doc] [took 0.000 sec]
   [junit4]   1>     test: docvalues...........OK [1 docvalues fields; 0 BINARY; 1 NUMERIC; 0 SORTED; 0 SORTED_NUMERIC; 0 SORTED_SET] [took 0.000 sec]
   [junit4]   1>     test: points..............OK [0 fields, 0 points] [took 0.000 sec]
   [junit4]   1> 
   [junit4]   1>   3 of 40: name=_2 maxDoc=4
   [junit4]   1>     version=8.0.0
   [junit4]   1>     id=ewbsl7cwp8ejxl0jzn36sx9d0
   [junit4]   1>     codec=Asserting(Lucene70)
   [junit4]   1>     compound=false
   [junit4]   1>     numFiles=18
   [junit4]   1>     size (MB)=0.002
   [junit4]   1>     diagnostics = {java.runtime.version=1.8.0_144-b01, java.vendor=Oracle Corporation, java.version=1.8.0_144, java.vm.version=25.144-b01, lucene.version=8.0.0, os=Linux, os.arch=amd64, os.version=3.13.0-88-generic, source=flush, timestamp=1502734917024}
   [junit4]   1>     no deletions
   [junit4]   1>     test: open reader.........OK [took 0.000 sec]
   [junit4]   1>     test: check integrity.....OK [took 0.000 sec]
   [junit4]   1>     test: check live docs.....OK [took 0.000 sec]
   [junit4]   1>     test: field infos.........OK [3 fields] [took 0.000 sec]
   [junit4]   1>     test: field norms.........OK [1 fields] [took 0.000 sec]
   [junit4]   1>     test: terms, freq, prox...OK [9 terms; 12 terms/docs pairs; 8 tokens] [took 0.000 sec]
   [junit4]   1>     test: stored fields.......OK [4 total field count; avg 1.0 fields per doc] [took 0.000 sec]
   [junit4]   1>     test: term vectors........OK [4 total term vector count; avg 1.0 term/freq vector fields per doc] [took 0.000 sec]
   [junit4]   1>     test: docvalues...........OK [1 docvalues fields; 0 BINARY; 1 NUMERIC; 0 SORTED; 0 SORTED_NUMERIC; 0 SORTED_SET] [took 0.000 sec]
   [junit4]   1>     test: points..............OK [0 fields, 0 points] [took 0.000 sec]
   [junit4]   1> 
   [junit4]   1>   4 of 40: name=_3 maxDoc=4
   [junit4]   1>     version=8.0.0
   [junit4]   1>     id=ewbsl7cwp8ejxl0jzn36sx9d1
   [junit4]   1>     codec=Asserting(Lucene70)
   [junit4]   1>     compound=false
   [junit4]   1>     numFiles=18
   [junit4]   1>     size (MB)=0.002
   [junit4]   1>     diagnostics = {java.runtime.version=1.8.0_144-b01, java.vendor=Oracle Corporation, java.version=1.8.0_144, java.vm.version=25.144-b01, lucene.version=8.0.0, os=Linux, os.arch=amd64, os.version=3.13.0-88-generic, source=flush, timestamp=1502734917024}
   [junit4]   1>     no deletions
   [junit4]   1>     test: open reader.........OK [took 0.000 sec]
   [junit4]   1>     test: check integrity.....OK [took 0.000 sec]
   [junit4]   1>     test: check live docs.....OK [took 0.000 sec]
   [junit4]   1>     test: field infos.........OK [3 fields] [took 0.000 sec]
   [junit4]   1>     test: field norms.........OK [1 fields] [took 0.000 sec]
   [junit4]   1>     test: terms, freq, prox...OK [9 terms; 12 terms/docs pairs; 8 tokens] [took 0.000 sec]
   [junit4]   1>     test: stored fields.......OK [4 total field count; avg 1.0 fields per doc] [took 0.000 sec]
   [junit4]   1>     test: term vectors........OK [4 total term vector count; avg 1.0 term/freq vector fields per doc] [took 0.000 sec]
   [junit4]   1>     test: docvalues...........OK [1 docvalues fields; 0 BINARY; 1 NUMERIC; 0 SORTED; 0 SORTED_NUMERIC; 0 SORTED_SET] [took 0.000 sec]
   [junit4]   1>     test: points..............OK [0 fields, 0 points] [took 0.000 sec]
   [junit4]   1> 
   [junit4]   1>   5 of 40: name=_4 maxDoc=4
   [junit4]   1>     version=8.0.0
   [junit4]   1>     id=ewbsl7cwp8ejxl0jzn36sx9d2
   [junit4]   1>     codec=Asserting(Lucene70)
   [junit4]   1>     compound=false
   [junit4]   1>     numFiles=18
   [junit4]   1>     size (MB)=0.002
   [junit4]   1>     diagnostics = {java.runtime.version=1.8.0_144-b01, java.vendor=Oracle Corporation, java.version=1.8.0_144, java.vm.version=25.144-b01, lucene.version=8.0.0, os=Linux, os.arch=amd64, os.version=3.13.0-88-generic, source=flush, timestamp=1502734917031}
   [junit4]   1>     no deletions
   [junit4]   1>     test: open reader.........OK [took 0.000 sec]
   [junit4]   1>     test: check integrity.....OK [took 0.000 sec]
   [junit4]   1>     test: check live docs.....OK [took 0.000 sec]
   [junit4]   1>     test: field infos.........OK [3 fields] [took 0.000 sec]
   [junit4]   1>     test: field norms.........OK [1 fields] [took 0.000 sec]
   [junit4]   1>     test: terms, freq, prox...OK [9 terms; 12 terms/docs pairs; 8 tokens] [took 0.000 sec]
   [junit4]   1>     test: stored fields.......OK [4 total field count; avg 1.0 fields per doc] [took 0.000 sec]
   [junit4]   1>     test: term vectors........OK [4 total term vector count; avg 1.0 term/freq vector fields per doc] [took 0.000 sec]
   [junit4]   1>     test: docvalues...........OK [1 docvalues fields; 0 BINARY; 1 NUMERIC; 0 SORTED; 0 SORTED_NUMERIC; 0 SORTED_SET] [took 0.000 sec]
   [junit4]   1>     test: points..............OK [0 fields, 0 points] [took 0.000 sec]
   [junit4]   1> 
   [junit4]   1>   6 of 40: name=_5 maxDoc=4
   [junit4]   1>     version=8.0.0
   [junit4]   1>     id=ewbsl7cwp8ejxl0jzn36sx9d3
   [junit4]   1>     codec=Asserting(Lucene70)
   [junit4]   1>     compound=false
   [junit4]   1>     numFiles=18
   [junit4]   1>     size (MB)=0.002
   [junit4]   1>     diagnostics = {java.runtime.version=1.8.0_144-b01, java.vendor=Oracle Corporation, java.version=1.8.0_144, java.vm.version=25.144-b01, lucene.version=8.0.0, os=Linux, os.arch=amd64, os.version=3.13.0-88-generic, source=flush, timestamp=1502734917032}
   [junit4]   1>     no deletions
   [junit4]   1>     test: open reader.........OK [took 0.000 sec]
   [junit4]   1>     test: check integrity.....OK [took 0.000 sec]
   [junit4]   1>     test: check live docs.....OK [took 0.000 sec]
   [junit4]   1>     test: field infos.........OK [3 fields] [took 0.000 sec]
   [junit4]   1>     test: field norms.........OK [1 fields] [took 0.000 sec]
   [junit4]   1>     test: terms, freq, prox...OK [9 terms; 12 terms/docs pairs; 8 tokens] [took 0.000 sec]
   [junit4]   1>     test: stored fields.......OK [4 total field count; avg 1.0 fields per doc] [took 0.000 sec]
   [junit4]   1>     test: term vectors........OK [4 total term vector count; avg 1.0 term/freq vector fields per doc] [took 0.000 sec]
   [junit4]   1>     test: docvalues...........OK [1 docvalues fields; 0 BINARY; 1 NUMERIC; 0 SORTED; 0 SORTED_NUMERIC; 0 SORTED_SET] [took 0.000 sec]
   [junit4]   1>     test: points..............OK [0 fields, 0 points] [took 0.000 sec]
   [junit4]   1> 
   [junit4]   1>   7 of 40: name=_6 maxDoc=4
   [junit4]   1>     version=8.0.0
   [junit4]   1>     id=ewbsl7cwp8ejxl0jzn36sx9d4
   [junit4]   1>     codec=Asserting(Lucene70)
   [junit4]   1>     compound=false
   [junit4]   1>     numFiles=18
   [junit4]   1>     size (MB)=0.002
   [junit4]   1>     diagnostics = {java.runtime.version=1.8.0_144-b01, java.vendor=Oracle Corporation, java.version=1.8.0_144, java.vm.version=25.144-b01, lucene.version=8.0.0, os=Linux, os.arch=amd64, os.version=3.13.0-88-generic, source=flush, timestamp=1502734917032}
   [junit4]   1>     no deletions
   [junit4]   1>     test: open reader.........OK [took 0.000 sec]
   [junit4]   1>     test: check integrity.....OK [took 0.000 sec]
   [junit4]   1>     test: check live docs.....OK [took 0.000 sec]
   [junit4]   1>     test: field infos.........OK [3 fields] [took 0.000 sec]
   [junit4]   1>     test: field norms.........OK [1 fields] [took 0.000 sec]
   [junit4]   1>     test: terms, freq, prox...OK [9 terms; 12 terms/docs pairs; 8 tokens] [took 0.000 sec]
   [junit4]   1>     test: stored fields.......OK [4 total field count; avg 1.0 fields per doc] [took 0.000 sec]
   [junit4]   1>     test: term vectors........OK [4 total term vector count; avg 1.0 term/freq vector fields per doc] [took 0.000 sec]
   [junit4]   1>     test: docvalues...........OK [1 docvalues fields; 0 BINARY; 1 NUMERIC; 0 SORTED; 0 SORTED_NUMERIC; 0 SORTED_SET] [took 0.000 sec]
   [junit4]   1>     test: points..............OK [0 fields, 0 points] [took 0.000 sec]
   [junit4]   1> 
   [junit4]   1>   8 of 40: name=_7 maxDoc=4
   [junit4]   1>     version=8.0.0
   [junit4]   1>     id=ewbsl7cwp8ejxl0jzn36sx9d5
   [junit4]   1>     codec=Asserting(Lucene70)
   [junit4]   1>     compound=false
   [junit4]   1>     numFiles=18
   [junit4]   1>     size (MB)=0.002
   [junit4]   1>     diagnostics = {java.runtime.version=1.8.0_144-b01, java.vendor=Oracle Corporation, java.version=1.8.0_144, java.vm.version=25.144-b01, lucene.version=8.0.0, os=Linux, os.arch=amd64, os.version=3.13.0-88-generic, source=flush, timestamp=1502734917033}
   [junit4]   1>     no deletions
   [junit4]   1>     test: open reader.........OK [took 0.000 sec]
   [junit4]   1>     test: check integrity.....OK [took 0.000 sec]
   [junit4]   1>     test: check live docs.....OK [took 0.000 sec]
   [junit4]   1>     test: field infos.........OK [3 fields] [took 0.000 sec]
   [junit4]   1>     test: field norms.........OK [1 fields] [took 0.000 sec]
   [junit4]   1>     test: terms, freq, prox...OK [9 terms; 12 terms/docs pairs; 8 tokens] [took 0.000 sec]
   [junit4]   1>     test: stored fields.......OK [4 total field count; avg 1.0 fields per doc] [took 0.000 sec]
   [junit4]   1>     test: term vectors........OK [4 total term vector count; avg 1.0 term/freq vector fields per doc] [took 0.000 sec]
   [junit4]   1>     test: docvalues...........OK [1 docvalues fields; 0 BINARY; 1 NUMERIC; 0 SORTED; 0 SORTED_NUMERIC; 0 SORTED_SET] [took 0.000 sec]
   [junit4]   1>     test: points..............OK [0 fields, 0 points] [took 0.000 sec]
   [junit4]   1> 
   [junit4]   1>   9 of 40: name=_8 maxDoc=4
   [junit4]   1>     version=8.0.0
   [junit4]   1>     id=ewbsl7cwp8ejxl0jzn36sx9d6
   [junit4]   1>     codec=Asserting(Lucene70)
   [junit4]   1>     compound=false
   [junit4]   1>     numFiles=18
   [junit4]   1>     size (MB)=0.002
   [junit4]   1>     diagnostics = {java.runtime.version=1.8.0_144-b01, java.vendor=Oracle Corporation, java.version=1.8.0_144, java.vm.version=25.144-b01, lucene.version=8.0.0, os=Linux, os.arch=amd64, os.version=3.13.0-88-generic, source=flush, timestamp=1502734917039}
   [junit4]   1>     no deletions
   [junit4]   1>     test: open reader.........OK [took 0.000 sec]
   [junit4]   1>     test: check integrity.....OK [took 0.000 sec]
   [junit4]   1>     test: check live docs.....OK [took 0.000 sec]
   [junit4]   1>     test: field infos.........OK [3 fields] [took 0.000 sec]
   [junit4]   1>     test: field norms.........OK [1 fields] [took 0.000 sec]
   [junit4]   1>     test: terms, freq, prox...OK [9 terms; 12 terms/docs pairs; 8 tokens] [took 0.000 sec]
   [junit4]   1>     test: stored fields.......OK [4 total field count; avg 1.0 fields per doc] [took 0.000 sec]
   [junit4]   1>     test: term vectors........OK [4 total term vector count; avg 1.0 term/freq vector fields per doc] [took 0.000 sec]
   [junit4]   1>     test: docvalues...........OK [1 docvalues fields; 0 BINARY; 1 NUMERIC; 0 SORTED; 0 SORTED_NUMERIC; 0 SORTED_SET] [took 0.000 sec]
   [junit4]   1>     test: points..............OK [0 fields, 0 points] [took 0.000 sec]
   [junit4]   1> 
   [junit4]   1>   10 of 40: name=_9 maxDoc=4
   [junit4]   1>     version=8.0.0
   [junit4]   1>     id=ewbsl7cwp8ejxl0jzn36sx9d7
   [junit4]   1>     codec=Asserting(Lucene70)
   [junit4]   1>     compound=false
   [junit4]   1>     numFiles=18
   [junit4]   1>     size (MB)=0.002
   [junit4]   1>     diagnostics = {java.runtime.version=1.8.0_144-b01, java.vendor=Oracle Corporation, java.version=1.8.0_144, java.vm.version=25.144-b01, lucene.version=8.0.0, os=Linux, os.arch=amd64, os.version=3.13.0-88-generic, source=flush, timestamp=1502734917040}
   [junit4]   1>     no deletions
   [junit4]   1>     test: open reader.........FAILED
   [junit4]   1>     WARNING: exorciseIndex() would remove reference to this segment; full exception:
   [junit4]   1> org.apache.lucene.util.ThreadInterruptedException: java.lang.InterruptedException: sleep interrupted
   [junit4]   1> 	at org.apache.lucene.store.SlowOpeningMockIndexInputWrapper.<init>(SlowOpeningMockIndexInputWrapper.java:38)
   [junit4]   1> 	at org.apache.lucene.store.MockDirectoryWrapper.openInput(MockDirectoryWrapper.java:772)
   [junit4]   1> 	at org.apache.lucene.codecs.lucene50.Lucene50PostingsReader.<init>(Lucene50PostingsReader.java:88)
   [junit4]   1> 	at org.apache.lucene.codecs.memory.FSTOrdPostingsFormat.fieldsProducer(FSTOrdPostingsFormat.java:66)
   [junit4]   1> 	at org.apache.lucene.codecs.perfield.PerFieldPostingsFormat$FieldsReader.<init>(PerFieldPostingsFormat.java:292)
   [junit4]   1> 	at org.apache.lucene.codecs.perfield.PerFieldPostingsFormat.fieldsProducer(PerFieldPostingsFormat.java:372)
   [junit4]   1> 	at org.apache.lucene.index.SegmentCoreReaders.<init>(SegmentCoreReaders.java:112)
   [junit4]   1> 	at org.apache.lucene.index.SegmentReader.<init>(SegmentReader.java:78)
   [junit4]   1> 	at org.apache.lucene.index.CheckIndex.checkIndex(CheckIndex.java:702)
   [junit4]   1> 	at org.apache.lucene.util.TestUtil.checkIndex(TestUtil.java:300)
   [junit4]   1> 	at org.apache.lucene.util.TestUtil.checkIndex(TestUtil.java:285)
   [junit4]   1> 	at org.apache.lucene.util.TestUtil.checkIndex(TestUtil.java:281)
   [junit4]   1> 	at org.apache.lucene.index.TestIndexWriterDelete.doTestOperationsOnDiskFull(TestIndexWriterDelete.java:638)
   [junit4]   1> 	at org.apache.lucene.index.TestIndexWriterDelete.testUpdatesOnDiskFull(TestIndexWriterDelete.java:490)
   [junit4]   1> 	at sun.reflect.NativeMethodAccessorImpl.invoke0(Native Method)
   [junit4]   1> 	at sun.reflect.NativeMethodAccessorImpl.invoke(NativeMethodAccessorImpl.java:62)
   [junit4]   1> 	at sun.reflect.DelegatingMethodAccessorImpl.invoke(DelegatingMethodAccessorImpl.java:43)
   [junit4]   1> 	at java.lang.reflect.Method.invoke(Method.java:498)
   [junit4]   1> 	at com.carrotsearch.randomizedtesting.RandomizedRunner.invoke(RandomizedRunner.java:1713)
   [junit4]   1> 	at com.carrotsearch.randomizedtesting.RandomizedRunner$8.evaluate(RandomizedRunner.java:907)
   [junit4]   1> 	at com.carrotsearch.randomizedtesting.RandomizedRunner$9.evaluate(RandomizedRunner.java:943)
   [junit4]   1> 	at com.carrotsearch.randomizedtesting.RandomizedRunner$10.evaluate(RandomizedRunner.java:957)
   [junit4]   1> 	at org.apache.lucene.util.TestRuleSetupTeardownChained$1.evaluate(TestRuleSetupTeardownChained.java:49)
   [junit4]   1> 	at org.apache.lucene.util.AbstractBeforeAfterRule$1.evaluate(AbstractBeforeAfterRule.java:45)
   [junit4]   1> 	at org.apache.lucene.util.TestRuleThreadAndTestName$1.evaluate(TestRuleThreadAndTestName.java:48)
   [junit4]   1> 	at org.apache.lucene.util.TestRuleIgnoreAfterMaxFailures$1.evaluate(TestRuleIgnoreAfterMaxFailures.java:64)
   [junit4]   1> 	at org.apache.lucene.util.TestRuleMarkFailure$1.evaluate(TestRuleMarkFailure.java:47)
   [junit4]   1> 	at com.carrotsearch.randomizedtesting.rules.StatementAdapter.evaluate(StatementAdapter.java:36)
   [junit4]   1> 	at com.carrotsearch.randomizedtesting.ThreadLeakControl$StatementRunner.run(ThreadLeakControl.java:368)
   [junit4]   1> 	at com.carrotsearch.randomizedtesting.ThreadLeakControl.forkTimeoutingTask(ThreadLeakControl.java:817)
   [junit4]   1> 	at com.carrotsearch.randomizedtesting.ThreadLeakControl$3.evaluate(ThreadLeakControl.java:468)
   [junit4]   1> 	at com.carrotsearch.randomizedtesting.RandomizedRunner.runSingleTest(RandomizedRunner.java:916)
   [junit4]   1> 	at com.carrotsearch.randomizedtesting.RandomizedRunner$5.evaluate(RandomizedRunner.java:802)
   [junit4]   1> 	at com.carrotsearch.randomizedtesting.RandomizedRunner$6.evaluate(RandomizedRunner.java:852)
   [junit4]   1> 	at com.carrotsearch.randomizedtesting.RandomizedRunner$7.evaluate(RandomizedRunner.java:863)
   [junit4]   1> 	at org.apache.lucene.util.AbstractBeforeAfterRule$1.evaluate(AbstractBeforeAfterRule.java:45)
   [junit4]   1> 	at com.carrotsearch.randomizedtesting.rules.StatementAdapter.evaluate(StatementAdapter.java:36)
   [junit4]   1> 	at org.apache.lucene.util.TestRuleStoreClassName$1.evaluate(TestRuleStoreClassName.java:41)
   [junit4]   1> 	at com.carrotsearch.randomizedtesting.rules.NoShadowingOrOverridesOnMethodsRule$1.evaluate(NoShadowingOrOverridesOnMethodsRule.java:40)
   [junit4]   1> 	at com.carrotsearch.randomizedtesting.rules.NoShadowingOrOverridesOnMethodsRule$1.evaluate(NoShadowingOrOverridesOnMethodsRule.java:40)
   [junit4]   1> 	at com.carrotsearch.randomizedtesting.rules.StatementAdapter.evaluate(StatementAdapter.java:36)
   [junit4]   1> 	at com.carrotsearch.randomizedtesting.rules.StatementAdapter.evaluate(StatementAdapter.java:36)
   [junit4]   1> 	at com.carrotsearch.randomizedtesting.rules.StatementAdapter.evaluate(StatementAdapter.java:36)
   [junit4]   1> 	at org.apache.lucene.util.TestRuleAssertionsRequired$1.evaluate(TestRuleAssertionsRequired.java:53)
   [junit4]   1> 	at org.apache.lucene.util.TestRuleMarkFailure$1.evaluate(TestRuleMarkFailure.java:47)
   [junit4]   1> 	at org.apache.lucene.util.TestRuleIgnoreAfterMaxFailures$1.evaluate(TestRuleIgnoreAfterMaxFailures.java:64)
   [junit4]   1> 	at org.apache.lucene.util.TestRuleIgnoreTestSuites$1.evaluate(TestRuleIgnoreTestSuites.java:54)
   [junit4]   1> 	at com.carrotsearch.randomizedtesting.rules.StatementAdapter.evaluate(StatementAdapter.java:36)
   [junit4]   1> 	at com.carrotsearch.randomizedtesting.ThreadLeakControl$StatementRunner.run(ThreadLeakControl.java:368)
   [junit4]   1> 	at java.lang.Thread.run(Thread.java:748)
   [junit4]   1> Caused by: java.lang.InterruptedException: sleep interrupted
   [junit4]   1> 	at java.lang.Thread.sleep(Native Method)
   [junit4]   1> 	at org.apache.lucene.store.SlowOpeningMockIndexInputWrapper.<init>(SlowOpeningMockIndexInputWrapper.java:33)
   [junit4]   1> 	... 49 more
   [junit4]   1> 
   [junit4]   1>   11 of 40: name=_a maxDoc=4
   [junit4]   1>     version=8.0.0
   [junit4]   1>     id=ewbsl7cwp8ejxl0jzn36sx9d8
   [junit4]   1>     codec=Asserting(Lucene70)
   [junit4]   1>     compound=false
   [junit4]   1>     numFiles=18
   [junit4]   1>     size (MB)=0.002
   [junit4]   1>     diagnostics = {java.runtime.version=1.8.0_144-b01, java.vendor=Oracle Corporation, java.version=1.8.0_144, java.vm.version=25.144-b01, lucene.version=8.0.0, os=Linux, os.arch=amd64, os.version=3.13.0-88-generic, source=flush, timestamp=1502734917041}
   [junit4]   1>     no deletions
   [junit4]   1>     test: open reader.........OK [took 0.001 sec]
   [junit4]   1>     test: check integrity.....OK [took 0.000 sec]
   [junit4]   1>     test: check live docs.....OK [took 0.000 sec]
   [junit4]   1>     test: field infos.........OK [3 fields] [took 0.000 sec]
   [junit4]   1>     test: field norms.........OK [1 fields] [took 0.000 sec]
   [junit4]   1>     test: terms, freq, prox...OK [9 terms; 12 terms/docs pairs; 8 tokens] [took 0.000 sec]
   [junit4]   1>     test: stored fields.......OK [4 total field count; avg 1.0 fields per doc] [took 0.000 sec]
   [junit4]   1>     test: term vectors........OK [4 total term vector count; avg 1.0 term/freq vector fields per doc] [took 0.000 sec]
   [junit4]   1>     test: docvalues...........OK [1 docvalues fields; 0 BINARY; 1 NUMERIC; 0 SORTED; 0 SORTED_NUMERIC; 0 SORTED_SET] [took 0.000 sec]
   [junit4]   1>     test: points..............OK [0 fields, 0 points] [took 0.000 sec]
   [junit4]   1> 
   [junit4]   1>   12 of 40: name=_b maxDoc=4
   [junit4]   1>     version=8.0.0
   [junit4]   1>     id=ewbsl7cwp8ejxl0jzn36sx9d9
   [junit4]   1>     codec=Asserting(Lucene70)
   [junit4]   1>     compound=false
   [junit4]   1>     numFiles=18
   [junit4]   1>     size (MB)=0.002
   [junit4]   1>     diagnostics = {java.runtime.version=1.8.0_144-b01, java.vendor=Oracle Corporation, java.version=1.8.0_144, java.vm.version=25.144-b01, lucene.version=8.0.0, os=Linux, os.arch=amd64, os.version=3.13.0-88-generic, source=flush, timestamp=1502734917047}
   [junit4]   1>     no deletions
   [junit4]   1>     test: open reader.........OK [took 0.001 sec]
   [junit4]   1>     test: check integrity.....OK [took 0.000 sec]
   [junit4]   1>     test: check live docs.....OK [took 0.000 sec]
   [junit4]   1>     test: field infos.........OK [3 fields] [took 0.000 sec]
   [junit4]   1>     test: field norms.........OK [1 fields] [took 0.000 sec]
   [junit4]   1>     test: terms, freq, prox...OK [9 terms; 12 terms/docs pairs; 8 tokens] [took 0.000 sec]
   [junit4]   1>     test: stored fields.......OK [4 total field count; avg 1.0 fields per doc] [took 0.000 sec]
   [junit4]   1>     test: term vectors........OK [4 total term vector count; avg 1.0 term/freq vector fields per doc] [took 0.000 sec]
   [junit4]   1>     test: docvalues...........OK [1 docvalues fields; 0 BINARY; 1 NUMERIC; 0 SORTED; 0 SORTED_NUMERIC; 0 SORTED_SET] [took 0.000 sec]
   [junit4]   1>     test: points..............OK [0 fields, 0 points] [took 0.000 sec]
   [junit4]   1> 
   [junit4]   1>   13 of 40: name=_c maxDoc=4
   [junit4]   1>     version=8.0.0
   [junit4]   1>     id=ewbsl7cwp8ejxl0jzn36sx9da
   [junit4]   1>     codec=Asserting(Lucene70)
   [junit4]   1>     compound=false
   [junit4]   1>     numFiles=18
   [junit4]   1>     size (MB)=0.002
   [junit4]   1>     diagnostics = {java.runtime.version=1.8.0_144-b01, java.vendor=Oracle Corporation, java.version=1.8.0_144, java.vm.version=25.144-b01, lucene.version=8.0.0, os=Linux, os.arch=amd64, os.version=3.13.0-88-generic, source=flush, timestamp=1502734917048}
   [junit4]   1>     no deletions
   [junit4]   1>     test: open reader.........OK [took 0.001 sec]
   [junit4]   1>     test: check integrity.....OK [took 0.000 sec]
   [junit4]   1>     test: check live docs.....OK [took 0.000 sec]
   [junit4]   1>     test: field infos.........OK [3 fields] [took 0.000 sec]
   [junit4]   1>     test: field norms.........OK [1 fields] [took 0.000 sec]
   [junit4]   1>     test: terms, freq, prox...OK [9 terms; 12 terms/docs pairs; 8 tokens] [took 0.000 sec]
   [junit4]   1>     test: stored fields.......OK [4 total field count; avg 1.0 fields per doc] [took 0.000 sec]
   [junit4]   1>     test: term vectors........OK [4 total term vector count; avg 1.0 term/freq vector fields per doc] [took 0.000 sec]
   [junit4]   1>     test: docvalues...........OK [1 docvalues fields; 0 BINARY; 1 NUMERIC; 0 SORTED; 0 SORTED_NUMERIC; 0 SORTED_SET] [took 0.000 sec]
   [junit4]   1>     test: points..............OK [0 fields, 0 points] [took 0.000 sec]
   [junit4]   1> 
   [junit4]   1>   14 of 40: name=_d maxDoc=4
   [junit4]   1>     version=8.0.0
   [junit4]   1>     id=ewbsl7cwp8ejxl0jzn36sx9db
   [junit4]   1>     codec=Asserting(Lucene70)
   [junit4]   1>     compound=false
   [junit4]   1>     numFiles=18
   [junit4]   1>     size (MB)=0.002
   [junit4]   1>     diagnostics = {java.runtime.version=1.8.0_144-b01, java.vendor=Oracle Corporation, java.version=1.8.0_144, java.vm.version=25.144-b01, lucene.version=8.0.0, os=Linux, os.arch=amd64, os.version=3.13.0-88-generic, source=flush, timestamp=1502734917051}
   [junit4]   1>     no deletions
   [junit4]   1>     test: open reader.........OK [took 0.001 sec]
   [junit4]   1>     test: check integrity.....OK [took 0.000 sec]
   [junit4]   1>     test: check live docs.....OK [took 0.000 sec]
   [junit4]   1>     test: field infos.........OK [3 fields] [took 0.000 sec]
   [junit4]   1>     test: field norms.........OK [1 fields] [took 0.000 sec]
   [junit4]   1>     test: terms, freq, prox...OK [9 terms; 12 terms/docs pairs; 8 tokens] [took 0.000 sec]
   [junit4]   1>     test: stored fields.......OK [4 total field count; avg 1.0 fields per doc] [took 0.000 sec]
   [junit4]   1>     test: term vectors........OK [4 total term vector count; avg 1.0 term/freq vector fields per doc] [took 0.000 sec]
   [junit4]   1>     test: docvalues...........OK [1 docvalues fields; 0 BINARY; 1 NUMERIC; 0 SORTED; 0 SORTED_NUMERIC; 0 SORTED_SET] [took 0.000 sec]
   [junit4]   1>     test: points..............OK [0 fields, 0 points] [took 0.000 sec]
   [junit4]   1> 
   [junit4]   1>   15 of 40: name=_e maxDoc=4
   [junit4]   1>     version=8.0.0
   [junit4]   1>     id=ewbsl7cwp8ejxl0jzn36sx9dc
   [junit4]   1>     codec=Asserting(Lucene70)
   [junit4]   1>     compound=false
   [junit4]   1>     numFiles=18
   [junit4]   1>     size (MB)=0.002
   [junit4]   1>     diagnostics = {java.runtime.version=1.8.0_144-b01, java.vendor=Oracle Corporation, java.version=1.8.0_144, java.vm.version=25.144-b01, lucene.version=8.0.0, os=Linux, os.arch=amd64, os.version=3.13.0-88-generic, source=flush, timestamp=1502734917051}
   [junit4]   1>     no deletions
   [junit4]   1>     test: open reader.........OK [took 0.001 sec]
   [junit4]   1>     test: check integrity.....OK [took 0.000 sec]
   [junit4]   1>     test: check live docs.....OK [took 0.000 sec]
   [junit4]   1>     test: field infos.........OK [3 fields] [took 0.000 sec]
   [junit4]   1>     test: field norms.........OK [1 fields] [took 0.000 sec]
   [junit4]   1>     test: terms, freq, prox...OK [9 terms; 12 terms/docs pairs; 8 tokens] [took 0.000 sec]
   [junit4]   1>     test: stored fields.......OK [4 total field count; avg 1.0 fields per doc] [took 0.000 sec]
   [junit4]   1>     test: term vectors........OK [4 total term vector count; avg 1.0 term/freq vector fields per doc] [took 0.000 sec]
   [junit4]   1>     test: docvalues...........OK [1 docvalues fields; 0 BINARY; 1 NUMERIC; 0 SORTED; 0 SORTED_NUMERIC; 0 SORTED_SET] [took 0.000 sec]
   [junit4]   1>     test: points..............OK [0 fields, 0 points] [took 0.000 sec]
   [junit4]   1> 
   [junit4]   1>   16 of 40: name=_f maxDoc=4
   [junit4]   1>     version=8.0.0
   [junit4]   1>     id=ewbsl7cwp8ejxl0jzn36sx9dd
   [junit4]   1>     codec=Asserting(Lucene70)
   [junit4]   1>     compound=false
   [junit4]   1>     numFiles=18
   [junit4]   1>     size (MB)=0.002
   [junit4]   1>     diagnostics = {java.runtime.version=1.8.0_144-b01, java.vendor=Oracle Corporation, java.version=1.8.0_144, java.vm.version=25.144-b01, lucene.version=8.0.0, os=Linux, os.arch=amd64, os.version=3.13.0-88-generic, source=flush, timestamp=1502734917055}
   [junit4]   1>     no deletions
   [junit4]   1>     test: open reader.........OK [took 0.001 sec]
   [junit4]   1>     test: check integrity.....OK [took 0.000 sec]
   [junit4]   1>     test: check live docs.....OK [took 0.000 sec]
   [junit4]   1>     test: field infos.........OK [3 fields] [took 0.000 sec]
   [junit4]   1>     test: field norms.........OK [1 fields] [took 0.000 sec]
   [junit4]   1>     test: terms, freq, prox...OK [9 terms; 12 terms/docs pairs; 8 tokens] [took 0.000 sec]
   [junit4]   1>     test: stored fields.......OK [4 total field count; avg 1.0 fields per doc] [took 0.000 sec]
   [junit4]   1>     test: term vectors........OK [4 total term vector count; avg 1.0 term/freq vector fields per doc] [took 0.000 sec]
   [junit4]   1>     test: docvalues...........OK [1 docvalues fields; 0 BINARY; 1 NUMERIC; 0 SORTED; 0 SORTED_NUMERIC; 0 SORTED_SET] [took 0.000 sec]
   [junit4]   1>     test: points..............OK [0 fields, 0 points] [took 0.000 sec]
   [junit4]   1> 
   [junit4]   1>   17 of 40: name=_g maxDoc=4
   [junit4]   1>     version=8.0.0
   [junit4]   1>     id=ewbsl7cwp8ejxl0jzn36sx9de
   [junit4]   1>     codec=Asserting(Lucene70)
   [junit4]   1>     compound=false
   [junit4]   1>     numFiles=18
   [junit4]   1>     size (MB)=0.002
   [junit4]   1>     diagnostics = {java.runtime.version=1.8.0_144-b01, java.vendor=Oracle Corporation, java.version=1.8.0_144, java.vm.version=25.144-b01, lucene.version=8.0.0, os=Linux, os.arch=amd64, os.version=3.13.0-88-generic, source=flush, timestamp=1502734917056}
   [junit4]   1>     no deletions
   [junit4]   1>     test: open reader.........OK [took 0.000 sec]
   [junit4]   1>     test: check integrity.....OK [took 0.000 sec]
   [junit4]   1>     test: check live docs.....OK [took 0.000 sec]
   [junit4]   1>     test: field infos.........OK [3 fields] [took 0.000 sec]
   [junit4]   1>     test: field norms.........OK [1 fields] [took 0.000 sec]
   [junit4]   1>     test: terms, freq, prox...OK [9 terms; 12 terms/docs pairs; 8 tokens] [took 0.000 sec]
   [junit4]   1>     test: stored fields.......OK [4 total field count; avg 1.0 fields per doc] [took 0.000 sec]
   [junit4]   1>     test: term vectors........OK [4 total term vector count; avg 1.0 term/freq vector fields per doc] [took 0.000 sec]
   [junit4]   1>     test: docvalues...........OK [1 docvalues fields; 0 BINARY; 1 NUMERIC; 0 SORTED; 0 SORTED_NUMERIC; 0 SORTED_SET] [took 0.000 sec]
   [junit4]   1>     test: points..............OK [0 fields, 0 points] [took 0.000 sec]
   [junit4]   1> 
   [junit4]   1>   18 of 40: name=_h maxDoc=4
   [junit4]   1>     version=8.0.0
   [junit4]   1>     id=ewbsl7cwp8ejxl0jzn36sx9df
   [junit4]   1>     codec=Asserting(Lucene70)
   [junit4]   1>     compound=false
   [junit4]   1>     numFiles=18
   [junit4]   1>     size (MB)=0.002
   [junit4]   1>     diagnostics = {java.runtime.version=1.8.0_144-b01, java.vendor=Oracle Corporation, java.version=1.8.0_144, java.vm.version=25.144-b01, lucene.version=8.0.0, os=Linux, os.arch=amd64, os.version=3.13.0-88-generic, source=flush, timestamp=1502734917057}
   [junit4]   1>     no deletions
   [junit4]   1>     test: open reader.........OK [took 0.000 sec]
   [junit4]   1>     test: check integrity.....OK [took 0.000 sec]
   [junit4]   1>     test: check live docs.....OK [took 0.000 sec]
   [junit4]   1>     test: field infos.........OK [3 fields] [took 0.000 sec]
   [junit4]   1>     test: field norms.........OK [1 fields] [took 0.000 sec]
   [junit4]   1>     test: terms, freq, prox...OK [9 terms; 12 terms/docs pairs; 8 tokens] [took 0.000 sec]
   [junit4]   1>     test: stored fields.......OK [4 total field count; avg 1.0 fields per doc] [took 0.000 sec]
   [junit4]   1>     test: term vectors........OK [4 total term vector count; avg 1.0 term/freq vector fields per doc] [took 0.000 sec]
   [junit4]   1>     test: docvalues...........OK [1 docvalues fields; 0 BINARY; 1 NUMERIC; 0 SORTED; 0 SORTED_NUMERIC; 0 SORTED_SET] [took 0.000 sec]
   [junit4]   1>     test: points..............OK [0 fields, 0 points] [took 0.000 sec]
   [junit4]   1> 
   [junit4]   1>   19 of 40: name=_i maxDoc=4
   [junit4]   1>     version=8.0.0
   [junit4]   1>     id=ewbsl7cwp8ejxl0jzn36sx9dg
   [junit4]   1>     codec=Asserting(Lucene70)
   [junit4]   1>     compound=false
   [junit4]   1>     numFiles=18
   [junit4]   1>     size (MB)=0.002
   [junit4]   1>     diagnostics = {java.runtime.version=1.8.0_144-b01, java.vendor=Oracle Corporation, java.version=1.8.0_144, java.vm.version=25.144-b01, lucene.version=8.0.0, os=Linux, os.arch=amd64, os.version=3.13.0-88-generic, source=flush, timestamp=1502734917063}
   [junit4]   1>     no deletions
   [junit4]   1>     test: open reader.........OK [took 0.000 sec]
   [junit4]   1>     test: check integrity.....OK [took 0.000 sec]
   [junit4]   1>     test: check live docs.....OK [took 0.000 sec]
   [junit4]   1>     test: field infos.........OK [3 fields] [took 0.000 sec]
   [junit4]   1>     test: field norms.........OK [1 fields] [took 0.000 sec]
   [junit4]   1>     test: terms, freq, prox...OK [9 terms; 12 terms/docs pairs; 8 tokens] [took 0.000 sec]
   [junit4]   1>     test: stored fields.......OK [4 total field count; avg 1.0 fields per doc] [took 0.000 sec]
   [junit4]   1>     test: term vectors........OK [4 total term vector count; avg 1.0 term/freq vector fields per doc] [took 0.000 sec]
   [junit4]   1>     test: docvalues...........OK [1 docvalues fields; 0 BINARY; 1 NUMERIC; 0 SORTED; 0 SORTED_NUMERIC; 0 SORTED_SET] [took 0.000 sec]
   [junit4]   1>     test: points..............OK [0 fields, 0 points] [took 0.000 sec]
   [junit4]   1> 
   [junit4]   1>   20 of 40: name=_j maxDoc=4
   [junit4]   1>     version=8.0.0
   [junit4]   1>     id=ewbsl7cwp8ejxl0jzn36sx9dh
   [junit4]   1>     codec=Asserting(Lucene70)
   [junit4]   1>     compound=false
   [junit4]   1>     numFiles=18
   [junit4]   1>     size (MB)=0.002
   [junit4]   1>     diagnostics = {java.runtime.version=1.8.0_144-b01, java.vendor=Oracle Corporation, java.version=1.8.0_144, java.vm.version=25.144-b01, lucene.version=8.0.0, os=Linux, os.arch=amd64, os.version=3.13.0-88-generic, source=flush, timestamp=1502734917080}
   [junit4]   1>     no deletions
   [junit4]   1>     test: open reader.........OK [took 0.000 sec]
   [junit4]   1>     test: check integrity.....OK [took 0.000 sec]
   [junit4]   1>     test: check live docs.....OK [took 0.000 sec]
   [junit4]   1>     test: field infos.........OK [3 fields] [took 0.000 sec]
   [junit4]   1>     test: field norms.........OK [1 fields] [took 0.000 sec]
   [junit4]   1>     test: terms, freq, prox...OK [9 terms; 12 terms/docs pairs; 8 tokens] [took 0.000 sec]
   [junit4]   1>     test: stored fields.......OK [4 total field count; avg 1.0 fields per doc] [took 0.000 sec]
   [junit4]   1>     test: term vectors........OK [4 total term vector count; avg 1.0 term/freq vector fields per doc] [took 0.000 sec]
   [junit4]   1>     test: docvalues...........OK [1 docvalues fields; 0 BINARY; 1 NUMERIC; 0 SORTED; 0 SORTED_NUMERIC; 0 SORTED_SET] [took 0.000 sec]
   [junit4]   1>     test: points..............OK [0 fields, 0 points] [took 0.000 sec]
   [junit4]   1> 
   [junit4]   1>   21 of 40: name=_k maxDoc=4
   [junit4]   1>     version=8.0.0
   [junit4]   1>     id=ewbsl7cwp8ejxl0jzn36sx9di
   [junit4]   1>     codec=Asserting(Lucene70)
   [junit4]   1>     compound=false
   [junit4]   1>     numFiles=18
   [junit4]   1>     size (MB)=0.002
   [junit4]   1>     diagnostics = {java.runtime.version=1.8.0_144-b01, java.vendor=Oracle Corporation, java.version=1.8.0_144, java.vm.version=25.144-b01, lucene.version=8.0.0, os=Linux, os.arch=amd64, os.version=3.13.0-88-generic, source=flush, timestamp=1502734917081}
   [junit4]   1>     no deletions
   [junit4]   1>     test: open reader.........OK [took 0.000 sec]
   [junit4]   1>     test: check integrity.....OK [took 0.000 sec]
   [junit4]   1>     test: check live docs.....OK [took 0.000 sec]
   [junit4]   1>     test: field infos.........OK [3 fields] [took 0.000 sec]
   [junit4]   1>     test: field norms.........OK [1 fields] [took 0.000 sec]
   [junit4]   1>     test: terms, freq, prox...OK [9 terms; 12 terms/docs pairs; 8 tokens] [took 0.000 sec]
   [junit4]   1>     test: stored fields.......OK [4 total field count; avg 1.0 fields per doc] [took 0.000 sec]
   [junit4]   1>     test: term vectors........OK [4 total term vector count; avg 1.0 term/freq vector fields per doc] [took 0.000 sec]
   [junit4]   1>     test: docvalues...........OK [1 docvalues fields; 0 BINARY; 1 NUMERIC; 0 SORTED; 0 SORTED_NUMERIC; 0 SORTED_SET] [took 0.000 sec]
   [junit4]   1>     test: points..............OK [0 fields, 0 points] [took 0.000 sec]
   [junit4]   1> 
   [junit4]   1>   22 of 40: name=_l maxDoc=4
   [junit4]   1>     version=8.0.0
   [junit4]   1>     id=ewbsl7cwp8ejxl0jzn36sx9dj
   [junit4]   1>     codec=Asserting(Lucene70)
   [junit4]   1>     compound=false
   [junit4]   1>     numFiles=18
   [junit4]   1>     size (MB)=0.002
   [junit4]   1>     diagnostics = {java.runtime.version=1.8.0_144-b01, java.vendor=Oracle Corporation, java.version=1.8.0_144, java.vm.version=25.144-b01, lucene.version=8.0.0, os=Linux, os.arch=amd64, os.version=3.13.0-88-generic, source=flush, timestamp=1502734917082}
   [junit4]   1>     no deletions
   [junit4]   1>     test: open reader.........OK [took 0.000 sec]
   [junit4]   1>     test: check integrity.....OK [took 0.000 sec]
   [junit4]   1>     test: check live docs.....OK [took 0.000 sec]
   [junit4]   1>     test: field infos.........OK [3 fields] [took 0.000 sec]
   [junit4]   1>     test: field norms.........OK [1 fields] [took 0.000 sec]
   [junit4]   1>     test: terms, freq, prox...OK [9 terms; 12 terms/docs pairs; 8 tokens] [took 0.000 sec]
   [junit4]   1>     test: stored fields.......OK [4 total field count; avg 1.0 fields per doc] [took 0.000 sec]
   [junit4]   1>     test: term vectors........OK [4 total term vector count; avg 1.0 term/freq vector fields per doc] [took 0.000 sec]
   [junit4]   1>     test: docvalues...........OK [1 docvalues fields; 0 BINARY; 1 NUMERIC; 0 SORTED; 0 SORTED_NUMERIC; 0 SORTED_SET] [took 0.000 sec]
   [junit4]   1>     test: points..............OK [0 fields, 0 points] [took 0.000 sec]
   [junit4]   1> 
   [junit4]   1>   23 of 40: name=_m maxDoc=4
   [junit4]   1>     version=8.0.0
   [junit4]   1>     id=ewbsl7cwp8ejxl0jzn36sx9dk
   [junit4]   1>     codec=Asserting(Lucene70)
   [junit4]   1>     compound=false
   [junit4]   1>     numFiles=18
   [junit4]   1>     size (MB)=0.002
   [junit4]   1>     diagnostics = {java.runtime.version=1.8.0_144-b01, java.vendor=Oracle Corporation, java.version=1.8.0_144, java.vm.version=25.144-b01, lucene.version=8.0.0, os=Linux, os.arch=amd64, os.version=3.13.0-88-generic, source=flush, timestamp=1502734917084}
   [junit4]   1>     no deletions
   [junit4]   1>     test: open reader.........OK [took 0.000 sec]
   [junit4]   1>     test: check integrity.....OK [took 0.000 sec]
   [junit4]   1>     test: check live docs.....OK [took 0.000 sec]
   [junit4]   1>     test: field infos.........OK [3 fields] [took 0.000 sec]
   [junit4]   1>     test: field norms.........OK [1 fields] [took 0.000 sec]
   [junit4]   1>     test: terms, freq, prox...OK [9 terms; 12 terms/docs pairs; 8 tokens] [took 0.000 sec]
   [junit4]   1>     test: stored fields.......OK [4 total field count; avg 1.0 fields per doc] [took 0.000 sec]
   [junit4]   1>     test: term vectors........OK [4 total term vector count; avg 1.0 term/freq vector fields per doc] [took 0.000 sec]
   [junit4]   1>     test: docvalues...........OK [1 docvalues fields; 0 BINARY; 1 NUMERIC; 0 SORTED; 0 SORTED_NUMERIC; 0 SORTED_SET] [took 0.000 sec]
   [junit4]   1>     test: points..............OK [0 fields, 0 points] [took 0.000 sec]
   [junit4]   1> 
   [junit4]   1>   24 of 40: name=_n maxDoc=4
   [junit4]   1>     version=8.0.0
   [junit4]   1>     id=ewbsl7cwp8ejxl0jzn36sx9dl
   [junit4]   1>     codec=Asserting(Lucene70)
   [junit4]   1>     compound=false
   [junit4]   1>     numFiles=18
   [junit4]   1>     size (MB)=0.002
   [junit4]   1>     diagnostics = {java.runtime.version=1.8.0_144-b01, java.vendor=Oracle Corporation, java.version=1.8.0_144, java.vm.version=25.144-b01, lucene.version=8.0.0, os=Linux, os.arch=amd64, os.version=3.13.0-88-generic, source=flush, timestamp=1502734917085}
   [junit4]   1>     no deletions
   [junit4]   1>     test: open reader.........OK [took 0.000 sec]
   [junit4]   1>     test: check integrity.....OK [took 0.000 sec]
   [junit4]   1>     test: check live docs.....OK [took 0.000 sec]
   [junit4]   1>     test: field infos.........OK [3 fields] [took 0.000 sec]
   [junit4]   1>     test: field norms.........OK [1 fields] [took 0.000 sec]
   [junit4]   1>     test: terms, freq, prox...OK [9 terms; 12 terms/docs pairs; 8 tokens] [took 0.000 sec]
   [junit4]   1>     test: stored fields.......OK [4 total field count; avg 1.0 fields per doc] [took 0.000 sec]
   [junit4]   1>     test: term vectors........OK [4 total term vector count; avg 1.0 term/freq vector fields per doc] [took 0.000 sec]
   [junit4]   1>     test: docvalues...........OK [1 docvalues fields; 0 BINARY; 1 NUMERIC; 0 SORTED; 0 SORTED_NUMERIC; 0 SORTED_SET] [took 0.000 sec]
   [junit4]   1>     test: points..............OK [0 fields, 0 points] [took 0.000 sec]
   [junit4]   1> 
   [junit4]   1>   25 of 40: name=_o maxDoc=4
   [junit4]   1>     version=8.0.0
   [junit4]   1>     id=ewbsl7cwp8ejxl0jzn36sx9dm
   [junit4]   1>     codec=Asserting(Lucene70)
   [junit4]   1>     compound=false
   [junit4]   1>     numFiles=18
   [junit4]   1>     size (MB)=0.002
   [junit4]   1>     diagnostics = {java.runtime.version=1.8.0_144-b01, java.vendor=Oracle Corporation, java.version=1.8.0_144, java.vm.version=25.144-b01, lucene.version=8.0.0, os=Linux, os.arch=amd64, os.version=3.13.0-88-generic, source=flush, timestamp=1502734917091}
   [junit4]   1>     no deletions
   [junit4]   1>     test: open reader.........OK [took 0.000 sec]
   [junit4]   1>     test: check integrity.....OK [took 0.000 sec]
   [junit4]   1>     test: check live docs.....OK [took 0.000 sec]
   [junit4]   1>     test: field infos.........OK [3 fields] [took 0.000 sec]
   [junit4]   1>     test: field norms.........OK [1 fields] [took 0.000 sec]
   [junit4]   1>     test: terms, freq, prox...OK [9 terms; 12 terms/docs pairs; 8 tokens] [took 0.000 sec]
   [junit4]   1>     test: stored fields.......OK [4 total field count; avg 1.0 fields per doc] [took 0.000 sec]
   [junit4]   1>     test: term vectors........OK [4 total term vector count; avg 1.0 term/freq vector fields per doc] [took 0.000 sec]
   [junit4]   1>     test: docvalues...........OK [1 docvalues fields; 0 BINARY; 1 NUMERIC; 0 SORTED; 0 SORTED_NUMERIC; 0 SORTED_SET] [took 0.000 sec]
   [junit4]   1>     test: points..............OK [0 fields, 0 points] [took 0.000 sec]
   [junit4]   1> 
   [junit4]   1>   26 of 40: name=_p maxDoc=4
   [junit4]   1>     version=8.0.0
   [junit4]   1>     id=ewbsl7cwp8ejxl0jzn36sx9dn
   [junit4]   1>     codec=Asserting(Lucene70)
   [junit4]   1>     compound=false
   [junit4]   1>     numFiles=18
   [junit4]   1>     size (MB)=0.002
   [junit4]   1>     diagnostics = {java.runtime.version=1.8.0_144-b01, java.vendor=Oracle Corporation, java.version=1.8.0_144, java.vm.version=25.144-b01, lucene.version=8.0.0, os=Linux, os.arch=amd64, os.version=3.13.0-88-generic, source=flush, timestamp=1502734917092}
   [junit4]   1>     no deletions
   [junit4]   1>     test: open reader.........OK [took 0.000 sec]
   [junit4]   1>     test: check integrity.....OK [took 0.000 sec]
   [junit4]   1>     test: check live docs.....OK [took 0.000 sec]
   [junit4]   1>     test: field infos.........OK [3 fields] [took 0.000 sec]
   [junit4]   1>     test: field norms.........OK [1 fields] [took 0.000 sec]
   [junit4]   1>     test: terms, freq, prox...OK [9 terms; 12 terms/docs pairs; 8 tokens] [took 0.000 sec]
   [junit4]   1>     test: stored fields.......OK [4 total field count; avg 1.0 fields per doc] [took 0.000 sec]
   [junit4]   1>     test: term vectors........OK [4 total term vector count; avg 1.0 term/freq vector fields per doc] [took 0.000 sec]
   [junit4]   1>     test: docvalues...........OK [1 docvalues fields; 0 BINARY; 1 NUMERIC; 0 SORTED; 0 SORTED_NUMERIC; 0 SORTED_SET] [took 0.000 sec]
   [junit4]   1>     test: points..............OK [0 fields, 0 points] [took 0.000 sec]
   [junit4]   1> 
   [junit4]   1>   27 of 40: name=_q maxDoc=4
   [junit4]   1>     version=8.0.0
   [junit4]   1>     id=ewbsl7cwp8ejxl0jzn36sx9do
   [junit4]   1>     codec=Asserting(Lucene70)
   [junit4]   1>     compound=false
   [junit4]   1>     numFiles=18
   [junit4]   1>     size (MB)=0.002
   [junit4]   1>     diagnostics = {java.runtime.version=1.8.0_144-b01, java.vendor=Oracle Corporation, java.version=1.8.0_144, java.vm.version=25.144-b01, lucene.version=8.0.0, os=Linux, os.arch=amd64, os.version=3.13.0-88-generic, source=flush, timestamp=1502734917099}
   [junit4]   1>     no deletions
   [junit4]   1>     test: open reader.........OK [took 0.000 sec]
   [junit4]   1>     test: check integrity.....OK [took 0.000 sec]
   [junit4]   1>     test: check live docs.....OK [took 0.000 sec]
   [junit4]   1>     test: field infos.........OK [3 fields] [took 0.000 sec]
   [junit4]   1>     test: field norms.........OK [1 fields] [took 0.000 sec]
   [junit4]   1>     test: terms, freq, prox...OK [9 terms; 12 terms/docs pairs; 8 tokens] [took 0.000 sec]
   [junit4]   1>     test: stored fields.......OK [4 total field count; avg 1.0 fields per doc] [took 0.000 sec]
   [junit4]   1>     test: term vectors........OK [4 total term vector count; avg 1.0 term/freq vector fields per doc] [took 0.000 sec]
   [junit4]   1>     test: docvalues...........OK [1 docvalues fields; 0 BINARY; 1 NUMERIC; 0 SORTED; 0 SORTED_NUMERIC; 0 SORTED_SET] [took 0.000 sec]
   [junit4]   1>     test: points..............OK [0 fields, 0 points] [took 0.000 sec]
   [junit4]   1> 
   [junit4]   1>   28 of 40: name=_r maxDoc=4
   [junit4]   1>     version=8.0.0
   [junit4]   1>     id=ewbsl7cwp8ejxl0jzn36sx9dp
   [junit4]   1>     codec=Asserting(Lucene70)
   [junit4]   1>     compound=false
   [junit4]   1>     numFiles=18
   [junit4]   1>     size (MB)=0.002
   [junit4]   1>     diagnostics = {java.runtime.version=1.8.0_144-b01, java.vendor=Oracle Corporation, java.version=1.8.0_144, java.vm.version=25.144-b01, lucene.version=8.0.0, os=Linux, os.arch=amd64, os.version=3.13.0-88-generic, source=flush, timestamp=1502734917100}
   [junit4]   1>     no deletions
   [junit4]   1>     test: open reader.........OK [took 0.000 sec]
   [junit4]   1>     test: check integrity.....OK [took 0.000 sec]
   [junit4]   1>     test: check live docs.....OK [took 0.000 sec]
   [junit4]   1>     test: field infos.........OK [3 fields] [took 0.000 sec]
   [junit4]   1>     test: field norms.........OK [1 fields] [took 0.000 sec]
   [junit4]   1>     test: terms, freq, prox...OK [9 terms; 12 terms/docs pairs; 8 tokens] [took 0.000 sec]
   [junit4]   1>     test: stored fields.......OK [4 total field count; avg 1.0 fields per doc] [took 0.000 sec]
   [junit4]   1>     test: term vectors........OK [4 total term vector count; avg 1.0 term/freq vector fields per doc] [took 0.000 sec]
   [junit4]   1>     test: docvalues...........OK [1 docvalues fields; 0 BINARY; 1 NUMERIC; 0 SORTED; 0 SORTED_NUMERIC; 0 SORTED_SET] [took 0.000 sec]
   [junit4]   1>     test: points..............OK [0 fields, 0 points] [took 0.000 sec]
   [junit4]   1> 
   [junit4]   1>   29 of 40: name=_s maxDoc=4
   [junit4]   1>     version=8.0.0
   [junit4]   1>     id=ewbsl7cwp8ejxl0jzn36sx9dq
   [junit4]   1>     codec=Asserting(Lucene70)
   [junit4]   1>     compound=false
   [junit4]   1>     numFiles=18
   [junit4]   1>     size (MB)=0.002
   [junit4]   1>     diagnostics = {java.runtime.version=1.8.0_144-b01, java.vendor=Oracle Corporation, java.version=1.8.0_144, java.vm.version=25.144-b01, lucene.version=8.0.0, os=Linux, os.arch=amd64, os.version=3.13.0-88-generic, source=flush, timestamp=1502734917101}
   [junit4]   1>     no deletions
   [junit4]   1>     test: open reader.........OK [took 0.000 sec]
   [junit4]   1>     test: check integrity.....OK [took 0.000 sec]
   [junit4]   1>     test: check live docs.....OK [took 0.000 sec]
   [junit4]   1>     test: field infos.........OK [3 fields] [took 0.000 sec]
   [junit4]   1>     test: field norms.........OK [1 fields] [took 0.000 sec]
   [junit4]   1>     test: terms, freq, prox...OK [9 terms; 12 terms/docs pairs; 8 tokens] [took 0.000 sec]
   [junit4]   1>     test: stored fields.......OK [4 total field count; avg 1.0 fields per doc] [took 0.000 sec]
   [junit4]   1>     test: term vectors........OK [4 total term vector count; avg 1.0 term/freq vector fields per doc] [took 0.000 sec]
   [junit4]   1>     test: docvalues...........OK [1 docvalues fields; 0 BINARY; 1 NUMERIC; 0 SORTED; 0 SORTED_NUMERIC; 0 SORTED_SET] [took 0.000 sec]
   [junit4]   1>     test: points..............OK [0 fields, 0 points] [took 0.000 sec]
   [junit4]   1> 
   [junit4]   1>   30 of 40: name=_t maxDoc=4
   [junit4]   1>     version=8.0.0
   [junit4]   1>     id=ewbsl7cwp8ejxl0jzn36sx9dr
   [junit4]   1>     codec=Asserting(Lucene70)
   [junit4]   1>     compound=false
   [junit4]   1>     numFiles=18
   [junit4]   1>     size (MB)=0.002
   [junit4]   1>     diagnostics = {java.runtime.version=1.8.0_144-b01, java.vendor=Oracle Corporation, java.version=1.8.0_144, java.vm.version=25.144-b01, lucene.version=8.0.0, os=Linux, os.arch=amd64, os.version=3.13.0-88-generic, source=flush, timestamp=1502734917102}
   [junit4]   1>     no deletions
   [junit4]   1>     test: open reader.........OK [took 0.000 sec]
   [junit4]   1>     test: check integrity.....OK [took 0.000 sec]
   [junit4]   1>     test: check live docs.....OK [took 0.000 sec]
   [junit4]   1>     test: field infos.........OK [3 fields] [took 0.000 sec]
   [junit4]   1>     test: field norms.........OK [1 fields] [took 0.000 sec]
   [junit4]   1>     test: terms, freq, prox...OK [9 terms; 12 terms/docs pairs; 8 tokens] [took 0.000 sec]
   [junit4]   1>     test: stored fields.......OK [4 total field count; avg 1.0 fields per doc] [took 0.000 sec]
   [junit4]   1>

[...truncated too long message...]

er Closing metric reporters for registry=solr.collection.test_col.shard5.leader, tag=1174421763
   [junit4]   2> 4001531 INFO  (coreCloseExecutor-8784-thread-1) [n:127.0.0.1:38631_solr c:test_col s:shard5 r:core_node19 x:test_col_shard5_replica_n16] o.a.s.m.SolrMetricManager Closing metric reporters for registry=solr.collection.test_col.shard5.leader, tag=1958168922
   [junit4]   2> 4001534 INFO  (zkCallback-3625-thread-8-processing-n:127.0.0.1:40040_solr) [n:127.0.0.1:40040_solr    ] o.a.s.c.c.ZkStateReader Updated live nodes from ZooKeeper... (5) -> (1)
   [junit4]   2> 4002651 WARN  (zkCallback-3618-thread-7-processing-n:127.0.0.1:51401_solr) [n:127.0.0.1:51401_solr    ] o.a.s.c.c.ZkStateReader ZooKeeper watch triggered, but Solr cannot talk to ZK: [KeeperErrorCode = Session expired for /live_nodes]
   [junit4]   2> 4002653 INFO  (jetty-closer-3570-thread-5) [    ] o.e.j.s.h.ContextHandler Stopped o.e.j.s.ServletContextHandler@6b2af7ba{/solr,null,UNAVAILABLE}
   [junit4]   2> 4002803 WARN  (zkCallback-3617-thread-9-processing-n:127.0.0.1:42437_solr) [n:127.0.0.1:42437_solr    ] o.a.s.c.c.ZkStateReader ZooKeeper watch triggered, but Solr cannot talk to ZK: [KeeperErrorCode = Session expired for /live_nodes]
   [junit4]   2> 4002804 INFO  (jetty-closer-3570-thread-9) [    ] o.e.j.s.h.ContextHandler Stopped o.e.j.s.ServletContextHandler@487f65d4{/solr,null,UNAVAILABLE}
   [junit4]   2> 4002943 WARN  (zkCallback-3600-thread-7-processing-n:127.0.0.1:46800_solr) [n:127.0.0.1:46800_solr    ] o.a.s.c.c.ZkStateReader ZooKeeper watch triggered, but Solr cannot talk to ZK: [KeeperErrorCode = Session expired for /live_nodes]
   [junit4]   2> 4002945 INFO  (jetty-closer-3570-thread-8) [    ] o.e.j.s.h.ContextHandler Stopped o.e.j.s.ServletContextHandler@6641b6ef{/solr,null,UNAVAILABLE}
   [junit4]   2> 4002945 WARN  (zkCallback-3623-thread-8-processing-n:127.0.0.1:52016_solr) [n:127.0.0.1:52016_solr    ] o.a.s.c.c.ZkStateReader ZooKeeper watch triggered, but Solr cannot talk to ZK: [KeeperErrorCode = Session expired for /live_nodes]
   [junit4]   2> 4002947 INFO  (jetty-closer-3570-thread-1) [    ] o.e.j.s.h.ContextHandler Stopped o.e.j.s.ServletContextHandler@a97b11c{/solr,null,UNAVAILABLE}
   [junit4]   2> 4003033 WARN  (zkCallback-3599-thread-7-processing-n:127.0.0.1:48744_solr) [n:127.0.0.1:48744_solr    ] o.a.s.c.c.ZkStateReader ZooKeeper watch triggered, but Solr cannot talk to ZK: [KeeperErrorCode = Session expired for /live_nodes]
   [junit4]   2> 4003035 INFO  (jetty-closer-3570-thread-4) [    ] o.e.j.s.h.ContextHandler Stopped o.e.j.s.ServletContextHandler@f39a49e{/solr,null,UNAVAILABLE}
   [junit4]   2> 4003040 WARN  (zkCallback-3616-thread-9-processing-n:127.0.0.1:38631_solr) [n:127.0.0.1:38631_solr    ] o.a.s.c.c.ZkStateReader ZooKeeper watch triggered, but Solr cannot talk to ZK: [KeeperErrorCode = Session expired for /live_nodes]
   [junit4]   2> 4003041 WARN  (zkCallback-3614-thread-12-processing-n:127.0.0.1:60470_solr) [n:127.0.0.1:60470_solr    ] o.a.s.c.c.ZkStateReader ZooKeeper watch triggered, but Solr cannot talk to ZK: [KeeperErrorCode = Session expired for /live_nodes]
   [junit4]   2> 4003041 WARN  (zkCallback-3611-thread-7-processing-n:127.0.0.1:33737_solr) [n:127.0.0.1:33737_solr    ] o.a.s.c.c.ZkStateReader ZooKeeper watch triggered, but Solr cannot talk to ZK: [KeeperErrorCode = Session expired for /live_nodes]
   [junit4]   2> 4003041 INFO  (jetty-closer-3570-thread-7) [    ] o.e.j.s.h.ContextHandler Stopped o.e.j.s.ServletContextHandler@63caebec{/solr,null,UNAVAILABLE}
   [junit4]   2> 4003042 INFO  (jetty-closer-3570-thread-3) [    ] o.e.j.s.h.ContextHandler Stopped o.e.j.s.ServletContextHandler@6c732588{/solr,null,UNAVAILABLE}
   [junit4]   2> 4003043 INFO  (jetty-closer-3570-thread-10) [    ] o.e.j.s.h.ContextHandler Stopped o.e.j.s.ServletContextHandler@2bd909c{/solr,null,UNAVAILABLE}
   [junit4]   2> 4003069 WARN  (zkCallback-3625-thread-8-processing-n:127.0.0.1:40040_solr) [n:127.0.0.1:40040_solr    ] o.a.s.c.c.ZkStateReader ZooKeeper watch triggered, but Solr cannot talk to ZK: [KeeperErrorCode = Session expired for /live_nodes]
   [junit4]   2> 4003070 INFO  (jetty-closer-3570-thread-2) [    ] o.e.j.s.h.ContextHandler Stopped o.e.j.s.ServletContextHandler@6bc14ec5{/solr,null,UNAVAILABLE}
   [junit4]   2> 4003071 ERROR (SUITE-TestStressCloudBlindAtomicUpdates-seed#[4ADF9B3A4D1170B2]-worker) [    ] o.a.z.s.ZooKeeperServer ZKShutdownHandler is not registered, so ZooKeeper server won't take any action on ERROR or SHUTDOWN server state changes
   [junit4]   2> 4003072 INFO  (SUITE-TestStressCloudBlindAtomicUpdates-seed#[4ADF9B3A4D1170B2]-worker) [    ] o.a.s.c.ZkTestServer connecting to 127.0.0.1:52356 52356
   [junit4]   2> 4003159 INFO  (Thread-37463) [    ] o.a.s.c.ZkTestServer connecting to 127.0.0.1:52356 52356
   [junit4]   2> 4003161 WARN  (Thread-37463) [    ] o.a.s.c.ZkTestServer Watch limit violations: 
   [junit4]   2> Maximum concurrent create/delete watches above limit:
   [junit4]   2> 
   [junit4]   2> 	11	/solr/aliases.json
   [junit4]   2> 	11	/solr/clusterprops.json
   [junit4]   2> 	10	/solr/configs/org.apache.solr.cloud.TestStressCloudBlindAtomicUpdates_config-set
   [junit4]   2> 	10	/solr/security.json
   [junit4]   2> 
   [junit4]   2> Maximum concurrent data watches above limit:
   [junit4]   2> 
   [junit4]   2> 	3882	/solr/collections/test_col/state.json
   [junit4]   2> 	11	/solr/clusterstate.json
   [junit4]   2> 	4	/solr/overseer_elect/election/98484319382274072-127.0.0.1:38631_solr-n_0000000002
   [junit4]   2> 	2	/solr/overseer_elect/election/98484319382274078-127.0.0.1:40040_solr-n_0000000006
   [junit4]   2> 
   [junit4]   2> Maximum concurrent children watches above limit:
   [junit4]   2> 
   [junit4]   2> 	11	/solr/live_nodes
   [junit4]   2> 	11	/solr/collections
   [junit4]   2> 
   [junit4]   2> NOTE: leaving temporary files on disk at: /x1/jenkins/jenkins-slave/workspace/Lucene-Solr-NightlyTests-master/checkout/solr/build/solr-core/test/J1/temp/solr.cloud.TestStressCloudBlindAtomicUpdates_4ADF9B3A4D1170B2-001
   [junit4]   2> Aug 14, 2017 11:08:09 PM com.carrotsearch.randomizedtesting.ThreadLeakControl checkThreadLeaks
   [junit4]   2> WARNING: Will linger awaiting termination of 1 leaked thread(s).
   [junit4]   2> NOTE: test params are: codec=CheapBastard, sim=RandomSimilarity(queryNorm=true): {}, locale=ar-JO, timezone=Asia/Riyadh
   [junit4]   2> NOTE: Linux 3.13.0-88-generic amd64/Oracle Corporation 1.8.0_144 (64-bit)/cpus=4,threads=1,free=249674288,total=525860864
   [junit4]   2> NOTE: All tests run in this JVM: [PreAnalyzedFieldManagedSchemaCloudTest, RollingRestartTest, OverseerRolesTest, LoggingHandlerTest, TestSolrConfigHandlerCloud, DistanceFunctionTest, TestMultiWordSynonyms, CoreAdminRequestStatusTest, TestCoreDiscovery, TestSchemaManager, PKIAuthenticationIntegrationTest, TestFiltering, TestSolrJ, LukeRequestHandlerTest, TestPullReplicaErrorHandling, TestFastLRUCache, TestUseDocValuesAsStored2, TestIntervalFaceting, TestStressUserVersions, UninvertDocValuesMergePolicyTest, TestUninvertingReader, TestPerFieldSimilarity, TestManagedSchemaAPI, SampleTest, QueryParsingTest, ResourceLoaderTest, TestTolerantUpdateProcessorCloud, TestHdfsUpdateLog, TestSubQueryTransformerCrossCore, TestRuleBasedAuthorizationPlugin, TestNamedUpdateProcessors, IndexSchemaRuntimeFieldTest, AtomicUpdateProcessorFactoryTest, FileUtilsTest, BlockJoinFacetSimpleTest, BJQParserTest, CachingDirectoryFactoryTest, SolrMetricManagerTest, TestCursorMarkWithoutUniqueKey, RulesTest, TestImpersonationWithHadoopAuth, CursorMarkTest, TestPostingsSolrHighlighter, BadComponentTest, ShardSplitTest, TestRTGBase, DocValuesTest, LeaderFailoverAfterPartitionTest, TestJsonRequest, TestManagedResourceStorage, TestLocalFSCloudBackupRestore, TestCharFilters, ConcurrentDeleteAndCreateCollectionTest, TestShortCircuitedRequests, DisMaxRequestHandlerTest, TestElisionMultitermQuery, AlternateDirectoryTest, CdcrUpdateLogTest, LeaderInitiatedRecoveryOnShardRestartTest, CreateCollectionCleanupTest, DirectoryFactoryTest, TestNRTOpen, ChaosMonkeySafeLeaderTest, ScriptEngineTest, SpatialFilterTest, TestSolrCoreParser, TestFuzzyAnalyzedSuggestions, TestCloudInspectUtil, TestLegacyField, TestOnReconnectListenerSupport, TestLRUStatsCache, TestCopyFieldCollectionResource, TestRecoveryHdfs, TestGeoJSONResponseWriter, ReplaceNodeTest, SoftAutoCommitTest, SchemaVersionSpecificBehaviorTest, CdcrBootstrapTest, SliceStateTest, ConvertedLegacyTest, DocValuesMissingTest, TestNestedDocsSort, TestEmbeddedSolrServerSchemaAPI, TestPolicyCloud, HdfsChaosMonkeyNothingIsSafeTest, DistributedFacetPivotSmallTest, HdfsRestartWhileUpdatingTest, ClusterStateUpdateTest, ZkControllerTest, HttpSolrCallGetCoreTest, TestXmlQParserPlugin, HdfsTlogReplayBufferedWhileIndexingTest, MetricsHandlerTest, CollectionsAPIDistributedZkTest, TestRTimerTree, TestClusterProperties, ClassificationUpdateProcessorIntegrationTest, SOLR749Test, TestRestoreCore, ChaosMonkeySafeLeaderWithPullReplicasTest, TestCloudPseudoReturnFields, BlockCacheTest, PeerSyncReplicationTest, DistributedVersionInfoTest, TestValueSourceCache, TestSimpleTextCodec, HdfsNNFailoverTest, HealthCheckHandlerTest, TestDownShardTolerantSearch, DistributedQueryComponentOptimizationTest, TestHashPartitioner, TestFieldCache, TestSimpleTrackingShardHandler, DeleteShardTest, OpenCloseCoreStressTest, TestLegacyNumericRangeQueryBuilder, TestManagedSynonymGraphFilterFactory, StressHdfsTest, DistributedIntervalFacetingTest, TestSolrCloudWithKerberosAlt, SolrJmxReporterTest, TestLeaderElectionWithEmptyReplica, SolrXmlInZkTest, TestAuthenticationFramework, TestCloudJSONFacetJoinDomain, TestCryptoKeys, TestHdfsCloudBackupRestore, TestLockTree, TestMiniSolrCloudClusterSSL, TestRebalanceLeaders, TestSSLRandomization, TestSegmentSorting, TestStressCloudBlindAtomicUpdates]
   [junit4] Completed [651/730 (4!)] on J1 in 634.88s, 5 tests, 1 error <<< FAILURES!

[...truncated 43490 lines...]

Mime
View raw message