lucene-dev mailing list archives

Site index · List index
Message view « Date » · « Thread »
Top « Date » · « Thread »
From Apache Jenkins Server <jenk...@builds.apache.org>
Subject [JENKINS] Lucene-Solr-NightlyTests-master - Build # 1368 - Still Unstable
Date Wed, 02 Aug 2017 06:53:02 GMT
Build: https://builds.apache.org/job/Lucene-Solr-NightlyTests-master/1368/

6 tests failed.
FAILED:  org.apache.solr.cloud.ChaosMonkeySafeLeaderTest.test

Error Message:
The Monkey ran for over 45 seconds and no jetties were stopped - this is worth investigating!

Stack Trace:
java.lang.AssertionError: The Monkey ran for over 45 seconds and no jetties were stopped - this is worth investigating!
	at __randomizedtesting.SeedInfo.seed([AD8EFD58D857BCD8:25DAC28276ABD120]:0)
	at org.junit.Assert.fail(Assert.java:93)
	at org.apache.solr.cloud.ChaosMonkey.stopTheMonkey(ChaosMonkey.java:587)
	at org.apache.solr.cloud.ChaosMonkeySafeLeaderTest.test(ChaosMonkeySafeLeaderTest.java:133)
	at sun.reflect.NativeMethodAccessorImpl.invoke0(Native Method)
	at sun.reflect.NativeMethodAccessorImpl.invoke(NativeMethodAccessorImpl.java:62)
	at sun.reflect.DelegatingMethodAccessorImpl.invoke(DelegatingMethodAccessorImpl.java:43)
	at java.lang.reflect.Method.invoke(Method.java:498)
	at com.carrotsearch.randomizedtesting.RandomizedRunner.invoke(RandomizedRunner.java:1713)
	at com.carrotsearch.randomizedtesting.RandomizedRunner$8.evaluate(RandomizedRunner.java:907)
	at com.carrotsearch.randomizedtesting.RandomizedRunner$9.evaluate(RandomizedRunner.java:943)
	at com.carrotsearch.randomizedtesting.RandomizedRunner$10.evaluate(RandomizedRunner.java:957)
	at org.apache.solr.BaseDistributedSearchTestCase$ShardsRepeatRule$ShardsFixedStatement.callStatement(BaseDistributedSearchTestCase.java:985)
	at org.apache.solr.BaseDistributedSearchTestCase$ShardsRepeatRule$ShardsStatement.evaluate(BaseDistributedSearchTestCase.java:960)
	at com.carrotsearch.randomizedtesting.rules.SystemPropertiesRestoreRule$1.evaluate(SystemPropertiesRestoreRule.java:57)
	at org.apache.lucene.util.TestRuleSetupTeardownChained$1.evaluate(TestRuleSetupTeardownChained.java:49)
	at org.apache.lucene.util.AbstractBeforeAfterRule$1.evaluate(AbstractBeforeAfterRule.java:45)
	at org.apache.lucene.util.TestRuleThreadAndTestName$1.evaluate(TestRuleThreadAndTestName.java:48)
	at org.apache.lucene.util.TestRuleIgnoreAfterMaxFailures$1.evaluate(TestRuleIgnoreAfterMaxFailures.java:64)
	at org.apache.lucene.util.TestRuleMarkFailure$1.evaluate(TestRuleMarkFailure.java:47)
	at com.carrotsearch.randomizedtesting.rules.StatementAdapter.evaluate(StatementAdapter.java:36)
	at com.carrotsearch.randomizedtesting.ThreadLeakControl$StatementRunner.run(ThreadLeakControl.java:368)
	at com.carrotsearch.randomizedtesting.ThreadLeakControl.forkTimeoutingTask(ThreadLeakControl.java:817)
	at com.carrotsearch.randomizedtesting.ThreadLeakControl$3.evaluate(ThreadLeakControl.java:468)
	at com.carrotsearch.randomizedtesting.RandomizedRunner.runSingleTest(RandomizedRunner.java:916)
	at com.carrotsearch.randomizedtesting.RandomizedRunner$5.evaluate(RandomizedRunner.java:802)
	at com.carrotsearch.randomizedtesting.RandomizedRunner$6.evaluate(RandomizedRunner.java:852)
	at com.carrotsearch.randomizedtesting.RandomizedRunner$7.evaluate(RandomizedRunner.java:863)
	at com.carrotsearch.randomizedtesting.rules.StatementAdapter.evaluate(StatementAdapter.java:36)
	at com.carrotsearch.randomizedtesting.rules.SystemPropertiesRestoreRule$1.evaluate(SystemPropertiesRestoreRule.java:57)
	at org.apache.lucene.util.AbstractBeforeAfterRule$1.evaluate(AbstractBeforeAfterRule.java:45)
	at com.carrotsearch.randomizedtesting.rules.StatementAdapter.evaluate(StatementAdapter.java:36)
	at org.apache.lucene.util.TestRuleStoreClassName$1.evaluate(TestRuleStoreClassName.java:41)
	at com.carrotsearch.randomizedtesting.rules.NoShadowingOrOverridesOnMethodsRule$1.evaluate(NoShadowingOrOverridesOnMethodsRule.java:40)
	at com.carrotsearch.randomizedtesting.rules.NoShadowingOrOverridesOnMethodsRule$1.evaluate(NoShadowingOrOverridesOnMethodsRule.java:40)
	at com.carrotsearch.randomizedtesting.rules.StatementAdapter.evaluate(StatementAdapter.java:36)
	at com.carrotsearch.randomizedtesting.rules.StatementAdapter.evaluate(StatementAdapter.java:36)
	at com.carrotsearch.randomizedtesting.rules.StatementAdapter.evaluate(StatementAdapter.java:36)
	at org.apache.lucene.util.TestRuleAssertionsRequired$1.evaluate(TestRuleAssertionsRequired.java:53)
	at org.apache.lucene.util.TestRuleMarkFailure$1.evaluate(TestRuleMarkFailure.java:47)
	at org.apache.lucene.util.TestRuleIgnoreAfterMaxFailures$1.evaluate(TestRuleIgnoreAfterMaxFailures.java:64)
	at org.apache.lucene.util.TestRuleIgnoreTestSuites$1.evaluate(TestRuleIgnoreTestSuites.java:54)
	at com.carrotsearch.randomizedtesting.rules.StatementAdapter.evaluate(StatementAdapter.java:36)
	at com.carrotsearch.randomizedtesting.ThreadLeakControl$StatementRunner.run(ThreadLeakControl.java:368)
	at java.lang.Thread.run(Thread.java:748)


FAILED:  org.apache.solr.TestDistributedSearch.test

Error Message:
.responseHeader.status!=warnings (unordered or missing)

Stack Trace:
junit.framework.AssertionFailedError: .responseHeader.status!=warnings (unordered or missing)
	at __randomizedtesting.SeedInfo.seed([AD8EFD58D857BCD8:25DAC28276ABD120]:0)
	at junit.framework.Assert.fail(Assert.java:50)
	at org.apache.solr.BaseDistributedSearchTestCase.compareSolrResponses(BaseDistributedSearchTestCase.java:913)
	at org.apache.solr.BaseDistributedSearchTestCase.compareResponses(BaseDistributedSearchTestCase.java:932)
	at org.apache.solr.BaseDistributedSearchTestCase.query(BaseDistributedSearchTestCase.java:607)
	at org.apache.solr.BaseDistributedSearchTestCase.query(BaseDistributedSearchTestCase.java:587)
	at org.apache.solr.BaseDistributedSearchTestCase.query(BaseDistributedSearchTestCase.java:566)
	at org.apache.solr.TestDistributedSearch.test(TestDistributedSearch.java:241)
	at sun.reflect.NativeMethodAccessorImpl.invoke0(Native Method)
	at sun.reflect.NativeMethodAccessorImpl.invoke(NativeMethodAccessorImpl.java:62)
	at sun.reflect.DelegatingMethodAccessorImpl.invoke(DelegatingMethodAccessorImpl.java:43)
	at java.lang.reflect.Method.invoke(Method.java:498)
	at com.carrotsearch.randomizedtesting.RandomizedRunner.invoke(RandomizedRunner.java:1713)
	at com.carrotsearch.randomizedtesting.RandomizedRunner$8.evaluate(RandomizedRunner.java:907)
	at com.carrotsearch.randomizedtesting.RandomizedRunner$9.evaluate(RandomizedRunner.java:943)
	at com.carrotsearch.randomizedtesting.RandomizedRunner$10.evaluate(RandomizedRunner.java:957)
	at org.apache.solr.BaseDistributedSearchTestCase$ShardsRepeatRule$ShardsRepeatStatement.callStatement(BaseDistributedSearchTestCase.java:1011)
	at org.apache.solr.BaseDistributedSearchTestCase$ShardsRepeatRule$ShardsStatement.evaluate(BaseDistributedSearchTestCase.java:960)
	at com.carrotsearch.randomizedtesting.rules.SystemPropertiesRestoreRule$1.evaluate(SystemPropertiesRestoreRule.java:57)
	at org.apache.lucene.util.TestRuleSetupTeardownChained$1.evaluate(TestRuleSetupTeardownChained.java:49)
	at org.apache.lucene.util.AbstractBeforeAfterRule$1.evaluate(AbstractBeforeAfterRule.java:45)
	at org.apache.lucene.util.TestRuleThreadAndTestName$1.evaluate(TestRuleThreadAndTestName.java:48)
	at org.apache.lucene.util.TestRuleIgnoreAfterMaxFailures$1.evaluate(TestRuleIgnoreAfterMaxFailures.java:64)
	at org.apache.lucene.util.TestRuleMarkFailure$1.evaluate(TestRuleMarkFailure.java:47)
	at com.carrotsearch.randomizedtesting.rules.StatementAdapter.evaluate(StatementAdapter.java:36)
	at com.carrotsearch.randomizedtesting.ThreadLeakControl$StatementRunner.run(ThreadLeakControl.java:368)
	at com.carrotsearch.randomizedtesting.ThreadLeakControl.forkTimeoutingTask(ThreadLeakControl.java:817)
	at com.carrotsearch.randomizedtesting.ThreadLeakControl$3.evaluate(ThreadLeakControl.java:468)
	at com.carrotsearch.randomizedtesting.RandomizedRunner.runSingleTest(RandomizedRunner.java:916)
	at com.carrotsearch.randomizedtesting.RandomizedRunner$5.evaluate(RandomizedRunner.java:802)
	at com.carrotsearch.randomizedtesting.RandomizedRunner$6.evaluate(RandomizedRunner.java:852)
	at com.carrotsearch.randomizedtesting.RandomizedRunner$7.evaluate(RandomizedRunner.java:863)
	at com.carrotsearch.randomizedtesting.rules.StatementAdapter.evaluate(StatementAdapter.java:36)
	at com.carrotsearch.randomizedtesting.rules.SystemPropertiesRestoreRule$1.evaluate(SystemPropertiesRestoreRule.java:57)
	at org.apache.lucene.util.AbstractBeforeAfterRule$1.evaluate(AbstractBeforeAfterRule.java:45)
	at com.carrotsearch.randomizedtesting.rules.StatementAdapter.evaluate(StatementAdapter.java:36)
	at org.apache.lucene.util.TestRuleStoreClassName$1.evaluate(TestRuleStoreClassName.java:41)
	at com.carrotsearch.randomizedtesting.rules.NoShadowingOrOverridesOnMethodsRule$1.evaluate(NoShadowingOrOverridesOnMethodsRule.java:40)
	at com.carrotsearch.randomizedtesting.rules.NoShadowingOrOverridesOnMethodsRule$1.evaluate(NoShadowingOrOverridesOnMethodsRule.java:40)
	at com.carrotsearch.randomizedtesting.rules.StatementAdapter.evaluate(StatementAdapter.java:36)
	at com.carrotsearch.randomizedtesting.rules.StatementAdapter.evaluate(StatementAdapter.java:36)
	at com.carrotsearch.randomizedtesting.rules.StatementAdapter.evaluate(StatementAdapter.java:36)
	at org.apache.lucene.util.TestRuleAssertionsRequired$1.evaluate(TestRuleAssertionsRequired.java:53)
	at org.apache.lucene.util.TestRuleMarkFailure$1.evaluate(TestRuleMarkFailure.java:47)
	at org.apache.lucene.util.TestRuleIgnoreAfterMaxFailures$1.evaluate(TestRuleIgnoreAfterMaxFailures.java:64)
	at org.apache.lucene.util.TestRuleIgnoreTestSuites$1.evaluate(TestRuleIgnoreTestSuites.java:54)
	at com.carrotsearch.randomizedtesting.rules.StatementAdapter.evaluate(StatementAdapter.java:36)
	at com.carrotsearch.randomizedtesting.ThreadLeakControl$StatementRunner.run(ThreadLeakControl.java:368)
	at java.lang.Thread.run(Thread.java:748)


FAILED:  org.apache.solr.cloud.hdfs.StressHdfsTest.test

Error Message:
Could not find collection:delete_data_dir

Stack Trace:
java.lang.AssertionError: Could not find collection:delete_data_dir
	at __randomizedtesting.SeedInfo.seed([AD8EFD58D857BCD8:25DAC28276ABD120]:0)
	at org.junit.Assert.fail(Assert.java:93)
	at org.junit.Assert.assertTrue(Assert.java:43)
	at org.junit.Assert.assertNotNull(Assert.java:526)
	at org.apache.solr.cloud.AbstractDistribZkTestBase.waitForRecoveriesToFinish(AbstractDistribZkTestBase.java:155)
	at org.apache.solr.cloud.AbstractDistribZkTestBase.waitForRecoveriesToFinish(AbstractDistribZkTestBase.java:140)
	at org.apache.solr.cloud.AbstractDistribZkTestBase.waitForRecoveriesToFinish(AbstractDistribZkTestBase.java:135)
	at org.apache.solr.cloud.AbstractFullDistribZkTestBase.waitForRecoveriesToFinish(AbstractFullDistribZkTestBase.java:908)
	at org.apache.solr.cloud.hdfs.StressHdfsTest.createAndDeleteCollection(StressHdfsTest.java:160)
	at org.apache.solr.cloud.hdfs.StressHdfsTest.test(StressHdfsTest.java:104)
	at sun.reflect.NativeMethodAccessorImpl.invoke0(Native Method)
	at sun.reflect.NativeMethodAccessorImpl.invoke(NativeMethodAccessorImpl.java:62)
	at sun.reflect.DelegatingMethodAccessorImpl.invoke(DelegatingMethodAccessorImpl.java:43)
	at java.lang.reflect.Method.invoke(Method.java:498)
	at com.carrotsearch.randomizedtesting.RandomizedRunner.invoke(RandomizedRunner.java:1713)
	at com.carrotsearch.randomizedtesting.RandomizedRunner$8.evaluate(RandomizedRunner.java:907)
	at com.carrotsearch.randomizedtesting.RandomizedRunner$9.evaluate(RandomizedRunner.java:943)
	at com.carrotsearch.randomizedtesting.RandomizedRunner$10.evaluate(RandomizedRunner.java:957)
	at org.apache.solr.BaseDistributedSearchTestCase$ShardsRepeatRule$ShardsFixedStatement.callStatement(BaseDistributedSearchTestCase.java:985)
	at org.apache.solr.BaseDistributedSearchTestCase$ShardsRepeatRule$ShardsStatement.evaluate(BaseDistributedSearchTestCase.java:960)
	at com.carrotsearch.randomizedtesting.rules.SystemPropertiesRestoreRule$1.evaluate(SystemPropertiesRestoreRule.java:57)
	at org.apache.lucene.util.TestRuleSetupTeardownChained$1.evaluate(TestRuleSetupTeardownChained.java:49)
	at org.apache.lucene.util.AbstractBeforeAfterRule$1.evaluate(AbstractBeforeAfterRule.java:45)
	at org.apache.lucene.util.TestRuleThreadAndTestName$1.evaluate(TestRuleThreadAndTestName.java:48)
	at org.apache.lucene.util.TestRuleIgnoreAfterMaxFailures$1.evaluate(TestRuleIgnoreAfterMaxFailures.java:64)
	at org.apache.lucene.util.TestRuleMarkFailure$1.evaluate(TestRuleMarkFailure.java:47)
	at com.carrotsearch.randomizedtesting.rules.StatementAdapter.evaluate(StatementAdapter.java:36)
	at com.carrotsearch.randomizedtesting.ThreadLeakControl$StatementRunner.run(ThreadLeakControl.java:368)
	at com.carrotsearch.randomizedtesting.ThreadLeakControl.forkTimeoutingTask(ThreadLeakControl.java:817)
	at com.carrotsearch.randomizedtesting.ThreadLeakControl$3.evaluate(ThreadLeakControl.java:468)
	at com.carrotsearch.randomizedtesting.RandomizedRunner.runSingleTest(RandomizedRunner.java:916)
	at com.carrotsearch.randomizedtesting.RandomizedRunner$5.evaluate(RandomizedRunner.java:802)
	at com.carrotsearch.randomizedtesting.RandomizedRunner$6.evaluate(RandomizedRunner.java:852)
	at com.carrotsearch.randomizedtesting.RandomizedRunner$7.evaluate(RandomizedRunner.java:863)
	at com.carrotsearch.randomizedtesting.rules.StatementAdapter.evaluate(StatementAdapter.java:36)
	at com.carrotsearch.randomizedtesting.rules.SystemPropertiesRestoreRule$1.evaluate(SystemPropertiesRestoreRule.java:57)
	at org.apache.lucene.util.AbstractBeforeAfterRule$1.evaluate(AbstractBeforeAfterRule.java:45)
	at com.carrotsearch.randomizedtesting.rules.StatementAdapter.evaluate(StatementAdapter.java:36)
	at org.apache.lucene.util.TestRuleStoreClassName$1.evaluate(TestRuleStoreClassName.java:41)
	at com.carrotsearch.randomizedtesting.rules.NoShadowingOrOverridesOnMethodsRule$1.evaluate(NoShadowingOrOverridesOnMethodsRule.java:40)
	at com.carrotsearch.randomizedtesting.rules.NoShadowingOrOverridesOnMethodsRule$1.evaluate(NoShadowingOrOverridesOnMethodsRule.java:40)
	at com.carrotsearch.randomizedtesting.rules.StatementAdapter.evaluate(StatementAdapter.java:36)
	at com.carrotsearch.randomizedtesting.rules.StatementAdapter.evaluate(StatementAdapter.java:36)
	at com.carrotsearch.randomizedtesting.rules.StatementAdapter.evaluate(StatementAdapter.java:36)
	at org.apache.lucene.util.TestRuleAssertionsRequired$1.evaluate(TestRuleAssertionsRequired.java:53)
	at org.apache.lucene.util.TestRuleMarkFailure$1.evaluate(TestRuleMarkFailure.java:47)
	at org.apache.lucene.util.TestRuleIgnoreAfterMaxFailures$1.evaluate(TestRuleIgnoreAfterMaxFailures.java:64)
	at org.apache.lucene.util.TestRuleIgnoreTestSuites$1.evaluate(TestRuleIgnoreTestSuites.java:54)
	at com.carrotsearch.randomizedtesting.rules.StatementAdapter.evaluate(StatementAdapter.java:36)
	at com.carrotsearch.randomizedtesting.ThreadLeakControl$StatementRunner.run(ThreadLeakControl.java:368)
	at java.lang.Thread.run(Thread.java:748)


FAILED:  org.apache.solr.cloud.TestAuthenticationFramework.testBasics

Error Message:
Error from server at http://127.0.0.1:51381/solr/testcollection_shard1_replica_n2: Expected mime type application/octet-stream but got text/html. <html> <head> <meta http-equiv="Content-Type" content="text/html;charset=ISO-8859-1"/> <title>Error 404 </title> </head> <body> <h2>HTTP ERROR: 404</h2> <p>Problem accessing /solr/testcollection_shard1_replica_n2/update. Reason: <pre>    Can not find: /solr/testcollection_shard1_replica_n2/update</pre></p> <hr /><a href="http://eclipse.org/jetty">Powered by Jetty:// 9.3.14.v20161028</a><hr/> </body> </html> 

Stack Trace:
org.apache.solr.client.solrj.impl.CloudSolrClient$RouteException: Error from server at http://127.0.0.1:51381/solr/testcollection_shard1_replica_n2: Expected mime type application/octet-stream but got text/html. <html>
<head>
<meta http-equiv="Content-Type" content="text/html;charset=ISO-8859-1"/>
<title>Error 404 </title>
</head>
<body>
<h2>HTTP ERROR: 404</h2>
<p>Problem accessing /solr/testcollection_shard1_replica_n2/update. Reason:
<pre>    Can not find: /solr/testcollection_shard1_replica_n2/update</pre></p>
<hr /><a href="http://eclipse.org/jetty">Powered by Jetty:// 9.3.14.v20161028</a><hr/>
</body>
</html>

	at __randomizedtesting.SeedInfo.seed([AD8EFD58D857BCD8:90565374E0B9E2A8]:0)
	at org.apache.solr.client.solrj.impl.CloudSolrClient.directUpdate(CloudSolrClient.java:539)
	at org.apache.solr.client.solrj.impl.CloudSolrClient.sendRequest(CloudSolrClient.java:993)
	at org.apache.solr.client.solrj.impl.CloudSolrClient.requestWithRetryOnStaleState(CloudSolrClient.java:862)
	at org.apache.solr.client.solrj.impl.CloudSolrClient.request(CloudSolrClient.java:793)
	at org.apache.solr.client.solrj.SolrRequest.process(SolrRequest.java:178)
	at org.apache.solr.client.solrj.request.UpdateRequest.commit(UpdateRequest.java:233)
	at org.apache.solr.cloud.TestAuthenticationFramework.collectionCreateSearchDeleteTwice(TestAuthenticationFramework.java:126)
	at org.apache.solr.cloud.TestAuthenticationFramework.testBasics(TestAuthenticationFramework.java:74)
	at sun.reflect.NativeMethodAccessorImpl.invoke0(Native Method)
	at sun.reflect.NativeMethodAccessorImpl.invoke(NativeMethodAccessorImpl.java:62)
	at sun.reflect.DelegatingMethodAccessorImpl.invoke(DelegatingMethodAccessorImpl.java:43)
	at java.lang.reflect.Method.invoke(Method.java:498)
	at com.carrotsearch.randomizedtesting.RandomizedRunner.invoke(RandomizedRunner.java:1713)
	at com.carrotsearch.randomizedtesting.RandomizedRunner$8.evaluate(RandomizedRunner.java:907)
	at com.carrotsearch.randomizedtesting.RandomizedRunner$9.evaluate(RandomizedRunner.java:943)
	at com.carrotsearch.randomizedtesting.RandomizedRunner$10.evaluate(RandomizedRunner.java:957)
	at com.carrotsearch.randomizedtesting.rules.SystemPropertiesRestoreRule$1.evaluate(SystemPropertiesRestoreRule.java:57)
	at org.apache.lucene.util.TestRuleSetupTeardownChained$1.evaluate(TestRuleSetupTeardownChained.java:49)
	at org.apache.lucene.util.AbstractBeforeAfterRule$1.evaluate(AbstractBeforeAfterRule.java:45)
	at org.apache.lucene.util.TestRuleThreadAndTestName$1.evaluate(TestRuleThreadAndTestName.java:48)
	at org.apache.lucene.util.TestRuleIgnoreAfterMaxFailures$1.evaluate(TestRuleIgnoreAfterMaxFailures.java:64)
	at org.apache.lucene.util.TestRuleMarkFailure$1.evaluate(TestRuleMarkFailure.java:47)
	at com.carrotsearch.randomizedtesting.rules.StatementAdapter.evaluate(StatementAdapter.java:36)
	at com.carrotsearch.randomizedtesting.ThreadLeakControl$StatementRunner.run(ThreadLeakControl.java:368)
	at com.carrotsearch.randomizedtesting.ThreadLeakControl.forkTimeoutingTask(ThreadLeakControl.java:817)
	at com.carrotsearch.randomizedtesting.ThreadLeakControl$3.evaluate(ThreadLeakControl.java:468)
	at com.carrotsearch.randomizedtesting.RandomizedRunner.runSingleTest(RandomizedRunner.java:916)
	at com.carrotsearch.randomizedtesting.RandomizedRunner$5.evaluate(RandomizedRunner.java:802)
	at com.carrotsearch.randomizedtesting.RandomizedRunner$6.evaluate(RandomizedRunner.java:852)
	at com.carrotsearch.randomizedtesting.RandomizedRunner$7.evaluate(RandomizedRunner.java:863)
	at com.carrotsearch.randomizedtesting.rules.StatementAdapter.evaluate(StatementAdapter.java:36)
	at com.carrotsearch.randomizedtesting.rules.SystemPropertiesRestoreRule$1.evaluate(SystemPropertiesRestoreRule.java:57)
	at org.apache.lucene.util.AbstractBeforeAfterRule$1.evaluate(AbstractBeforeAfterRule.java:45)
	at com.carrotsearch.randomizedtesting.rules.StatementAdapter.evaluate(StatementAdapter.java:36)
	at org.apache.lucene.util.TestRuleStoreClassName$1.evaluate(TestRuleStoreClassName.java:41)
	at com.carrotsearch.randomizedtesting.rules.NoShadowingOrOverridesOnMethodsRule$1.evaluate(NoShadowingOrOverridesOnMethodsRule.java:40)
	at com.carrotsearch.randomizedtesting.rules.NoShadowingOrOverridesOnMethodsRule$1.evaluate(NoShadowingOrOverridesOnMethodsRule.java:40)
	at com.carrotsearch.randomizedtesting.rules.StatementAdapter.evaluate(StatementAdapter.java:36)
	at com.carrotsearch.randomizedtesting.rules.StatementAdapter.evaluate(StatementAdapter.java:36)
	at com.carrotsearch.randomizedtesting.rules.StatementAdapter.evaluate(StatementAdapter.java:36)
	at org.apache.lucene.util.TestRuleAssertionsRequired$1.evaluate(TestRuleAssertionsRequired.java:53)
	at org.apache.lucene.util.TestRuleMarkFailure$1.evaluate(TestRuleMarkFailure.java:47)
	at org.apache.lucene.util.TestRuleIgnoreAfterMaxFailures$1.evaluate(TestRuleIgnoreAfterMaxFailures.java:64)
	at org.apache.lucene.util.TestRuleIgnoreTestSuites$1.evaluate(TestRuleIgnoreTestSuites.java:54)
	at com.carrotsearch.randomizedtesting.rules.StatementAdapter.evaluate(StatementAdapter.java:36)
	at com.carrotsearch.randomizedtesting.ThreadLeakControl$StatementRunner.run(ThreadLeakControl.java:368)
	at java.lang.Thread.run(Thread.java:748)
Caused by: org.apache.solr.client.solrj.impl.HttpSolrClient$RemoteSolrException: Error from server at http://127.0.0.1:51381/solr/testcollection_shard1_replica_n2: Expected mime type application/octet-stream but got text/html. <html>
<head>
<meta http-equiv="Content-Type" content="text/html;charset=ISO-8859-1"/>
<title>Error 404 </title>
</head>
<body>
<h2>HTTP ERROR: 404</h2>
<p>Problem accessing /solr/testcollection_shard1_replica_n2/update. Reason:
<pre>    Can not find: /solr/testcollection_shard1_replica_n2/update</pre></p>
<hr /><a href="http://eclipse.org/jetty">Powered by Jetty:// 9.3.14.v20161028</a><hr/>
</body>
</html>

	at org.apache.solr.client.solrj.impl.HttpSolrClient.executeMethod(HttpSolrClient.java:588)
	at org.apache.solr.client.solrj.impl.HttpSolrClient.request(HttpSolrClient.java:252)
	at org.apache.solr.client.solrj.impl.HttpSolrClient.request(HttpSolrClient.java:241)
	at org.apache.solr.client.solrj.impl.LBHttpSolrClient.doRequest(LBHttpSolrClient.java:483)
	at org.apache.solr.client.solrj.impl.LBHttpSolrClient.request(LBHttpSolrClient.java:413)
	at org.apache.solr.client.solrj.impl.CloudSolrClient.lambda$directUpdate$0(CloudSolrClient.java:516)
	at java.util.concurrent.FutureTask.run(FutureTask.java:266)
	at org.apache.solr.common.util.ExecutorUtil$MDCAwareThreadPoolExecutor.lambda$execute$0(ExecutorUtil.java:188)
	at java.util.concurrent.ThreadPoolExecutor.runWorker(ThreadPoolExecutor.java:1149)
	at java.util.concurrent.ThreadPoolExecutor$Worker.run(ThreadPoolExecutor.java:624)
	... 1 more


FAILED:  org.apache.solr.cloud.hdfs.HdfsChaosMonkeySafeLeaderTest.test

Error Message:
The Monkey ran for over 45 seconds and no jetties were stopped - this is worth investigating!

Stack Trace:
java.lang.AssertionError: The Monkey ran for over 45 seconds and no jetties were stopped - this is worth investigating!
	at __randomizedtesting.SeedInfo.seed([AD8EFD58D857BCD8:25DAC28276ABD120]:0)
	at org.junit.Assert.fail(Assert.java:93)
	at org.apache.solr.cloud.ChaosMonkey.stopTheMonkey(ChaosMonkey.java:587)
	at org.apache.solr.cloud.ChaosMonkeySafeLeaderTest.test(ChaosMonkeySafeLeaderTest.java:133)
	at sun.reflect.NativeMethodAccessorImpl.invoke0(Native Method)
	at sun.reflect.NativeMethodAccessorImpl.invoke(NativeMethodAccessorImpl.java:62)
	at sun.reflect.DelegatingMethodAccessorImpl.invoke(DelegatingMethodAccessorImpl.java:43)
	at java.lang.reflect.Method.invoke(Method.java:498)
	at com.carrotsearch.randomizedtesting.RandomizedRunner.invoke(RandomizedRunner.java:1713)
	at com.carrotsearch.randomizedtesting.RandomizedRunner$8.evaluate(RandomizedRunner.java:907)
	at com.carrotsearch.randomizedtesting.RandomizedRunner$9.evaluate(RandomizedRunner.java:943)
	at com.carrotsearch.randomizedtesting.RandomizedRunner$10.evaluate(RandomizedRunner.java:957)
	at org.apache.solr.BaseDistributedSearchTestCase$ShardsRepeatRule$ShardsFixedStatement.callStatement(BaseDistributedSearchTestCase.java:985)
	at org.apache.solr.BaseDistributedSearchTestCase$ShardsRepeatRule$ShardsStatement.evaluate(BaseDistributedSearchTestCase.java:960)
	at com.carrotsearch.randomizedtesting.rules.SystemPropertiesRestoreRule$1.evaluate(SystemPropertiesRestoreRule.java:57)
	at org.apache.lucene.util.TestRuleSetupTeardownChained$1.evaluate(TestRuleSetupTeardownChained.java:49)
	at org.apache.lucene.util.AbstractBeforeAfterRule$1.evaluate(AbstractBeforeAfterRule.java:45)
	at org.apache.lucene.util.TestRuleThreadAndTestName$1.evaluate(TestRuleThreadAndTestName.java:48)
	at org.apache.lucene.util.TestRuleIgnoreAfterMaxFailures$1.evaluate(TestRuleIgnoreAfterMaxFailures.java:64)
	at org.apache.lucene.util.TestRuleMarkFailure$1.evaluate(TestRuleMarkFailure.java:47)
	at com.carrotsearch.randomizedtesting.rules.StatementAdapter.evaluate(StatementAdapter.java:36)
	at com.carrotsearch.randomizedtesting.ThreadLeakControl$StatementRunner.run(ThreadLeakControl.java:368)
	at com.carrotsearch.randomizedtesting.ThreadLeakControl.forkTimeoutingTask(ThreadLeakControl.java:817)
	at com.carrotsearch.randomizedtesting.ThreadLeakControl$3.evaluate(ThreadLeakControl.java:468)
	at com.carrotsearch.randomizedtesting.RandomizedRunner.runSingleTest(RandomizedRunner.java:916)
	at com.carrotsearch.randomizedtesting.RandomizedRunner$5.evaluate(RandomizedRunner.java:802)
	at com.carrotsearch.randomizedtesting.RandomizedRunner$6.evaluate(RandomizedRunner.java:852)
	at com.carrotsearch.randomizedtesting.RandomizedRunner$7.evaluate(RandomizedRunner.java:863)
	at com.carrotsearch.randomizedtesting.rules.StatementAdapter.evaluate(StatementAdapter.java:36)
	at com.carrotsearch.randomizedtesting.rules.SystemPropertiesRestoreRule$1.evaluate(SystemPropertiesRestoreRule.java:57)
	at org.apache.lucene.util.AbstractBeforeAfterRule$1.evaluate(AbstractBeforeAfterRule.java:45)
	at com.carrotsearch.randomizedtesting.rules.StatementAdapter.evaluate(StatementAdapter.java:36)
	at org.apache.lucene.util.TestRuleStoreClassName$1.evaluate(TestRuleStoreClassName.java:41)
	at com.carrotsearch.randomizedtesting.rules.NoShadowingOrOverridesOnMethodsRule$1.evaluate(NoShadowingOrOverridesOnMethodsRule.java:40)
	at com.carrotsearch.randomizedtesting.rules.NoShadowingOrOverridesOnMethodsRule$1.evaluate(NoShadowingOrOverridesOnMethodsRule.java:40)
	at com.carrotsearch.randomizedtesting.rules.StatementAdapter.evaluate(StatementAdapter.java:36)
	at com.carrotsearch.randomizedtesting.rules.StatementAdapter.evaluate(StatementAdapter.java:36)
	at com.carrotsearch.randomizedtesting.rules.StatementAdapter.evaluate(StatementAdapter.java:36)
	at org.apache.lucene.util.TestRuleAssertionsRequired$1.evaluate(TestRuleAssertionsRequired.java:53)
	at org.apache.lucene.util.TestRuleMarkFailure$1.evaluate(TestRuleMarkFailure.java:47)
	at org.apache.lucene.util.TestRuleIgnoreAfterMaxFailures$1.evaluate(TestRuleIgnoreAfterMaxFailures.java:64)
	at org.apache.lucene.util.TestRuleIgnoreTestSuites$1.evaluate(TestRuleIgnoreTestSuites.java:54)
	at com.carrotsearch.randomizedtesting.rules.StatementAdapter.evaluate(StatementAdapter.java:36)
	at com.carrotsearch.randomizedtesting.ThreadLeakControl$StatementRunner.run(ThreadLeakControl.java:368)
	at java.lang.Thread.run(Thread.java:748)


FAILED:  org.apache.solr.cloud.SharedFSAutoReplicaFailoverTest.test

Error Message:
Timeout waiting for all live and active

Stack Trace:
java.lang.AssertionError: Timeout waiting for all live and active
	at __randomizedtesting.SeedInfo.seed([AD8EFD58D857BCD8:25DAC28276ABD120]:0)
	at org.junit.Assert.fail(Assert.java:93)
	at org.junit.Assert.assertTrue(Assert.java:43)
	at org.apache.solr.cloud.SharedFSAutoReplicaFailoverTest.testBasics(SharedFSAutoReplicaFailoverTest.java:246)
	at org.apache.solr.cloud.SharedFSAutoReplicaFailoverTest.test(SharedFSAutoReplicaFailoverTest.java:136)
	at sun.reflect.NativeMethodAccessorImpl.invoke0(Native Method)
	at sun.reflect.NativeMethodAccessorImpl.invoke(NativeMethodAccessorImpl.java:62)
	at sun.reflect.DelegatingMethodAccessorImpl.invoke(DelegatingMethodAccessorImpl.java:43)
	at java.lang.reflect.Method.invoke(Method.java:498)
	at com.carrotsearch.randomizedtesting.RandomizedRunner.invoke(RandomizedRunner.java:1713)
	at com.carrotsearch.randomizedtesting.RandomizedRunner$8.evaluate(RandomizedRunner.java:907)
	at com.carrotsearch.randomizedtesting.RandomizedRunner$9.evaluate(RandomizedRunner.java:943)
	at com.carrotsearch.randomizedtesting.RandomizedRunner$10.evaluate(RandomizedRunner.java:957)
	at org.apache.solr.BaseDistributedSearchTestCase$ShardsRepeatRule$ShardsFixedStatement.callStatement(BaseDistributedSearchTestCase.java:985)
	at org.apache.solr.BaseDistributedSearchTestCase$ShardsRepeatRule$ShardsStatement.evaluate(BaseDistributedSearchTestCase.java:960)
	at com.carrotsearch.randomizedtesting.rules.SystemPropertiesRestoreRule$1.evaluate(SystemPropertiesRestoreRule.java:57)
	at org.apache.lucene.util.TestRuleSetupTeardownChained$1.evaluate(TestRuleSetupTeardownChained.java:49)
	at org.apache.lucene.util.AbstractBeforeAfterRule$1.evaluate(AbstractBeforeAfterRule.java:45)
	at org.apache.lucene.util.TestRuleThreadAndTestName$1.evaluate(TestRuleThreadAndTestName.java:48)
	at org.apache.lucene.util.TestRuleIgnoreAfterMaxFailures$1.evaluate(TestRuleIgnoreAfterMaxFailures.java:64)
	at org.apache.lucene.util.TestRuleMarkFailure$1.evaluate(TestRuleMarkFailure.java:47)
	at com.carrotsearch.randomizedtesting.rules.StatementAdapter.evaluate(StatementAdapter.java:36)
	at com.carrotsearch.randomizedtesting.ThreadLeakControl$StatementRunner.run(ThreadLeakControl.java:368)
	at com.carrotsearch.randomizedtesting.ThreadLeakControl.forkTimeoutingTask(ThreadLeakControl.java:817)
	at com.carrotsearch.randomizedtesting.ThreadLeakControl$3.evaluate(ThreadLeakControl.java:468)
	at com.carrotsearch.randomizedtesting.RandomizedRunner.runSingleTest(RandomizedRunner.java:916)
	at com.carrotsearch.randomizedtesting.RandomizedRunner$5.evaluate(RandomizedRunner.java:802)
	at com.carrotsearch.randomizedtesting.RandomizedRunner$6.evaluate(RandomizedRunner.java:852)
	at com.carrotsearch.randomizedtesting.RandomizedRunner$7.evaluate(RandomizedRunner.java:863)
	at com.carrotsearch.randomizedtesting.rules.StatementAdapter.evaluate(StatementAdapter.java:36)
	at com.carrotsearch.randomizedtesting.rules.SystemPropertiesRestoreRule$1.evaluate(SystemPropertiesRestoreRule.java:57)
	at org.apache.lucene.util.AbstractBeforeAfterRule$1.evaluate(AbstractBeforeAfterRule.java:45)
	at com.carrotsearch.randomizedtesting.rules.StatementAdapter.evaluate(StatementAdapter.java:36)
	at org.apache.lucene.util.TestRuleStoreClassName$1.evaluate(TestRuleStoreClassName.java:41)
	at com.carrotsearch.randomizedtesting.rules.NoShadowingOrOverridesOnMethodsRule$1.evaluate(NoShadowingOrOverridesOnMethodsRule.java:40)
	at com.carrotsearch.randomizedtesting.rules.NoShadowingOrOverridesOnMethodsRule$1.evaluate(NoShadowingOrOverridesOnMethodsRule.java:40)
	at com.carrotsearch.randomizedtesting.rules.StatementAdapter.evaluate(StatementAdapter.java:36)
	at com.carrotsearch.randomizedtesting.rules.StatementAdapter.evaluate(StatementAdapter.java:36)
	at com.carrotsearch.randomizedtesting.rules.StatementAdapter.evaluate(StatementAdapter.java:36)
	at org.apache.lucene.util.TestRuleAssertionsRequired$1.evaluate(TestRuleAssertionsRequired.java:53)
	at org.apache.lucene.util.TestRuleMarkFailure$1.evaluate(TestRuleMarkFailure.java:47)
	at org.apache.lucene.util.TestRuleIgnoreAfterMaxFailures$1.evaluate(TestRuleIgnoreAfterMaxFailures.java:64)
	at org.apache.lucene.util.TestRuleIgnoreTestSuites$1.evaluate(TestRuleIgnoreTestSuites.java:54)
	at com.carrotsearch.randomizedtesting.rules.StatementAdapter.evaluate(StatementAdapter.java:36)
	at com.carrotsearch.randomizedtesting.ThreadLeakControl$StatementRunner.run(ThreadLeakControl.java:368)
	at java.lang.Thread.run(Thread.java:748)




Build Log:
[...truncated 11959 lines...]
   [junit4] Suite: org.apache.solr.cloud.ChaosMonkeySafeLeaderTest
   [junit4]   2> Creating dataDir: /x1/jenkins/jenkins-slave/workspace/Lucene-Solr-NightlyTests-master/checkout/solr/build/solr-core/test/J1/temp/solr.cloud.ChaosMonkeySafeLeaderTest_AD8EFD58D857BCD8-001/init-core-data-001
   [junit4]   2> 772197 WARN  (SUITE-ChaosMonkeySafeLeaderTest-seed#[AD8EFD58D857BCD8]-worker) [    ] o.a.s.SolrTestCaseJ4 startTrackingSearchers: numOpens=12 numCloses=12
   [junit4]   2> 772197 INFO  (SUITE-ChaosMonkeySafeLeaderTest-seed#[AD8EFD58D857BCD8]-worker) [    ] o.a.s.SolrTestCaseJ4 Using PointFields (NUMERIC_POINTS_SYSPROP=true) w/NUMERIC_DOCVALUES_SYSPROP=true
   [junit4]   2> 772198 INFO  (SUITE-ChaosMonkeySafeLeaderTest-seed#[AD8EFD58D857BCD8]-worker) [    ] o.a.s.SolrTestCaseJ4 Randomized ssl (true) and clientAuth (false) via: @org.apache.solr.util.RandomizeSSL(reason=, ssl=NaN, value=NaN, clientAuth=NaN)
   [junit4]   2> 772199 INFO  (SUITE-ChaosMonkeySafeLeaderTest-seed#[AD8EFD58D857BCD8]-worker) [    ] o.a.s.SolrTestCaseJ4 SecureRandom sanity checks: test.solr.allowed.securerandom=null & java.security.egd=file:/dev/./urandom
   [junit4]   2> 772199 INFO  (SUITE-ChaosMonkeySafeLeaderTest-seed#[AD8EFD58D857BCD8]-worker) [    ] o.a.s.BaseDistributedSearchTestCase Setting hostContext system property: /kx_/
   [junit4]   2> 772212 INFO  (TEST-ChaosMonkeySafeLeaderTest.test-seed#[AD8EFD58D857BCD8]) [    ] o.a.s.c.ZkTestServer STARTING ZK TEST SERVER
   [junit4]   2> 772212 INFO  (Thread-1586) [    ] o.a.s.c.ZkTestServer client port:0.0.0.0/0.0.0.0:0
   [junit4]   2> 772212 INFO  (Thread-1586) [    ] o.a.s.c.ZkTestServer Starting server
   [junit4]   2> 772215 ERROR (Thread-1586) [    ] o.a.z.s.ZooKeeperServer ZKShutdownHandler is not registered, so ZooKeeper server won't take any action on ERROR or SHUTDOWN server state changes
   [junit4]   2> 772312 INFO  (TEST-ChaosMonkeySafeLeaderTest.test-seed#[AD8EFD58D857BCD8]) [    ] o.a.s.c.ZkTestServer start zk server on port:60226
   [junit4]   2> 772333 INFO  (TEST-ChaosMonkeySafeLeaderTest.test-seed#[AD8EFD58D857BCD8]) [    ] o.a.s.c.AbstractZkTestCase put /x1/jenkins/jenkins-slave/workspace/Lucene-Solr-NightlyTests-master/checkout/solr/core/src/test-files/solr/collection1/conf/solrconfig-tlog.xml to /configs/conf1/solrconfig.xml
   [junit4]   2> 772334 INFO  (TEST-ChaosMonkeySafeLeaderTest.test-seed#[AD8EFD58D857BCD8]) [    ] o.a.s.c.AbstractZkTestCase put /x1/jenkins/jenkins-slave/workspace/Lucene-Solr-NightlyTests-master/checkout/solr/core/src/test-files/solr/collection1/conf/schema15.xml to /configs/conf1/schema.xml
   [junit4]   2> 772336 INFO  (TEST-ChaosMonkeySafeLeaderTest.test-seed#[AD8EFD58D857BCD8]) [    ] o.a.s.c.AbstractZkTestCase put /x1/jenkins/jenkins-slave/workspace/Lucene-Solr-NightlyTests-master/checkout/solr/core/src/test-files/solr/collection1/conf/solrconfig.snippet.randomindexconfig.xml to /configs/conf1/solrconfig.snippet.randomindexconfig.xml
   [junit4]   2> 772339 INFO  (TEST-ChaosMonkeySafeLeaderTest.test-seed#[AD8EFD58D857BCD8]) [    ] o.a.s.c.AbstractZkTestCase put /x1/jenkins/jenkins-slave/workspace/Lucene-Solr-NightlyTests-master/checkout/solr/core/src/test-files/solr/collection1/conf/stopwords.txt to /configs/conf1/stopwords.txt
   [junit4]   2> 772340 INFO  (TEST-ChaosMonkeySafeLeaderTest.test-seed#[AD8EFD58D857BCD8]) [    ] o.a.s.c.AbstractZkTestCase put /x1/jenkins/jenkins-slave/workspace/Lucene-Solr-NightlyTests-master/checkout/solr/core/src/test-files/solr/collection1/conf/protwords.txt to /configs/conf1/protwords.txt
   [junit4]   2> 772341 INFO  (TEST-ChaosMonkeySafeLeaderTest.test-seed#[AD8EFD58D857BCD8]) [    ] o.a.s.c.AbstractZkTestCase put /x1/jenkins/jenkins-slave/workspace/Lucene-Solr-NightlyTests-master/checkout/solr/core/src/test-files/solr/collection1/conf/currency.xml to /configs/conf1/currency.xml
   [junit4]   2> 772342 INFO  (TEST-ChaosMonkeySafeLeaderTest.test-seed#[AD8EFD58D857BCD8]) [    ] o.a.s.c.AbstractZkTestCase put /x1/jenkins/jenkins-slave/workspace/Lucene-Solr-NightlyTests-master/checkout/solr/core/src/test-files/solr/collection1/conf/enumsConfig.xml to /configs/conf1/enumsConfig.xml
   [junit4]   2> 772343 INFO  (TEST-ChaosMonkeySafeLeaderTest.test-seed#[AD8EFD58D857BCD8]) [    ] o.a.s.c.AbstractZkTestCase put /x1/jenkins/jenkins-slave/workspace/Lucene-Solr-NightlyTests-master/checkout/solr/core/src/test-files/solr/collection1/conf/open-exchange-rates.json to /configs/conf1/open-exchange-rates.json
   [junit4]   2> 772345 INFO  (TEST-ChaosMonkeySafeLeaderTest.test-seed#[AD8EFD58D857BCD8]) [    ] o.a.s.c.AbstractZkTestCase put /x1/jenkins/jenkins-slave/workspace/Lucene-Solr-NightlyTests-master/checkout/solr/core/src/test-files/solr/collection1/conf/mapping-ISOLatin1Accent.txt to /configs/conf1/mapping-ISOLatin1Accent.txt
   [junit4]   2> 772346 INFO  (TEST-ChaosMonkeySafeLeaderTest.test-seed#[AD8EFD58D857BCD8]) [    ] o.a.s.c.AbstractZkTestCase put /x1/jenkins/jenkins-slave/workspace/Lucene-Solr-NightlyTests-master/checkout/solr/core/src/test-files/solr/collection1/conf/old_synonyms.txt to /configs/conf1/old_synonyms.txt
   [junit4]   2> 772347 INFO  (TEST-ChaosMonkeySafeLeaderTest.test-seed#[AD8EFD58D857BCD8]) [    ] o.a.s.c.AbstractZkTestCase put /x1/jenkins/jenkins-slave/workspace/Lucene-Solr-NightlyTests-master/checkout/solr/core/src/test-files/solr/collection1/conf/synonyms.txt to /configs/conf1/synonyms.txt
   [junit4]   2> 772353 INFO  (TEST-ChaosMonkeySafeLeaderTest.test-seed#[AD8EFD58D857BCD8]) [    ] o.a.s.c.AbstractFullDistribZkTestBase Will use NRT replicas unless explicitly asked otherwise
   [junit4]   2> 772476 INFO  (TEST-ChaosMonkeySafeLeaderTest.test-seed#[AD8EFD58D857BCD8]) [    ] o.e.j.s.Server jetty-9.3.14.v20161028
   [junit4]   2> 772482 INFO  (TEST-ChaosMonkeySafeLeaderTest.test-seed#[AD8EFD58D857BCD8]) [    ] o.e.j.s.h.ContextHandler Started o.e.j.s.ServletContextHandler@23fa75a3{/kx_,null,AVAILABLE}
   [junit4]   2> 772483 INFO  (TEST-ChaosMonkeySafeLeaderTest.test-seed#[AD8EFD58D857BCD8]) [    ] o.e.j.s.AbstractConnector Started ServerConnector@4fb14798{SSL,[ssl, http/1.1]}{127.0.0.1:46633}
   [junit4]   2> 772483 INFO  (TEST-ChaosMonkeySafeLeaderTest.test-seed#[AD8EFD58D857BCD8]) [    ] o.e.j.s.Server Started @780373ms
   [junit4]   2> 772483 INFO  (TEST-ChaosMonkeySafeLeaderTest.test-seed#[AD8EFD58D857BCD8]) [    ] o.a.s.c.s.e.JettySolrRunner Jetty properties: {solr.data.dir=/x1/jenkins/jenkins-slave/workspace/Lucene-Solr-NightlyTests-master/checkout/solr/build/solr-core/test/J1/temp/solr.cloud.ChaosMonkeySafeLeaderTest_AD8EFD58D857BCD8-001/tempDir-001/control/data, hostContext=/kx_, hostPort=46633, coreRootDirectory=/x1/jenkins/jenkins-slave/workspace/Lucene-Solr-NightlyTests-master/checkout/solr/build/solr-core/test/J1/temp/solr.cloud.ChaosMonkeySafeLeaderTest_AD8EFD58D857BCD8-001/control-001/cores}
   [junit4]   2> 772483 ERROR (TEST-ChaosMonkeySafeLeaderTest.test-seed#[AD8EFD58D857BCD8]) [    ] o.a.s.s.StartupLoggingUtils Missing Java Option solr.log.dir. Logging may be missing or incomplete.
   [junit4]   2> 772483 INFO  (TEST-ChaosMonkeySafeLeaderTest.test-seed#[AD8EFD58D857BCD8]) [    ] o.a.s.s.SolrDispatchFilter  ___      _       Welcome to Apache Solr? version 8.0.0
   [junit4]   2> 772483 INFO  (TEST-ChaosMonkeySafeLeaderTest.test-seed#[AD8EFD58D857BCD8]) [    ] o.a.s.s.SolrDispatchFilter / __| ___| |_ _   Starting in cloud mode on port null
   [junit4]   2> 772483 INFO  (TEST-ChaosMonkeySafeLeaderTest.test-seed#[AD8EFD58D857BCD8]) [    ] o.a.s.s.SolrDispatchFilter \__ \/ _ \ | '_|  Install dir: null, Default config dir: null
   [junit4]   2> 772483 INFO  (TEST-ChaosMonkeySafeLeaderTest.test-seed#[AD8EFD58D857BCD8]) [    ] o.a.s.s.SolrDispatchFilter |___/\___/_|_|    Start time: 2017-08-02T05:30:01.574Z
   [junit4]   2> 772488 INFO  (TEST-ChaosMonkeySafeLeaderTest.test-seed#[AD8EFD58D857BCD8]) [    ] o.a.s.s.SolrDispatchFilter Loading solr.xml from SolrHome (not found in ZooKeeper)
   [junit4]   2> 772488 INFO  (TEST-ChaosMonkeySafeLeaderTest.test-seed#[AD8EFD58D857BCD8]) [    ] o.a.s.c.SolrXmlConfig Loading container configuration from /x1/jenkins/jenkins-slave/workspace/Lucene-Solr-NightlyTests-master/checkout/solr/build/solr-core/test/J1/temp/solr.cloud.ChaosMonkeySafeLeaderTest_AD8EFD58D857BCD8-001/control-001/solr.xml
   [junit4]   2> 772505 INFO  (TEST-ChaosMonkeySafeLeaderTest.test-seed#[AD8EFD58D857BCD8]) [    ] o.a.s.c.SolrXmlConfig MBean server found: com.sun.jmx.mbeanserver.JmxMBeanServer@7795d894, but no JMX reporters were configured - adding default JMX reporter.
   [junit4]   2> 772509 INFO  (TEST-ChaosMonkeySafeLeaderTest.test-seed#[AD8EFD58D857BCD8]) [    ] o.a.s.c.ZkContainer Zookeeper client=127.0.0.1:60226/solr
   [junit4]   2> 772589 INFO  (TEST-ChaosMonkeySafeLeaderTest.test-seed#[AD8EFD58D857BCD8]) [n:127.0.0.1:46633_kx_    ] o.a.s.c.Overseer Overseer (id=null) closing
   [junit4]   2> 772590 INFO  (TEST-ChaosMonkeySafeLeaderTest.test-seed#[AD8EFD58D857BCD8]) [n:127.0.0.1:46633_kx_    ] o.a.s.c.OverseerElectionContext I am going to be the leader 127.0.0.1:46633_kx_
   [junit4]   2> 772590 INFO  (TEST-ChaosMonkeySafeLeaderTest.test-seed#[AD8EFD58D857BCD8]) [n:127.0.0.1:46633_kx_    ] o.a.s.c.Overseer Overseer (id=98412252450258949-127.0.0.1:46633_kx_-n_0000000000) starting
   [junit4]   2> 772595 INFO  (TEST-ChaosMonkeySafeLeaderTest.test-seed#[AD8EFD58D857BCD8]) [n:127.0.0.1:46633_kx_    ] o.a.s.c.ZkController Register node as live in ZooKeeper:/live_nodes/127.0.0.1:46633_kx_
   [junit4]   2> 772599 INFO  (zkCallback-26338-thread-1-processing-n:127.0.0.1:46633_kx_) [n:127.0.0.1:46633_kx_    ] o.a.s.c.c.ZkStateReader Updated live nodes from ZooKeeper... (0) -> (1)
   [junit4]   2> 772648 INFO  (TEST-ChaosMonkeySafeLeaderTest.test-seed#[AD8EFD58D857BCD8]) [n:127.0.0.1:46633_kx_    ] o.a.s.m.r.SolrJmxReporter JMX monitoring for 'solr.node' (registry 'solr.node') enabled at server: com.sun.jmx.mbeanserver.JmxMBeanServer@7795d894
   [junit4]   2> 772652 INFO  (TEST-ChaosMonkeySafeLeaderTest.test-seed#[AD8EFD58D857BCD8]) [n:127.0.0.1:46633_kx_    ] o.a.s.m.r.SolrJmxReporter JMX monitoring for 'solr.jvm' (registry 'solr.jvm') enabled at server: com.sun.jmx.mbeanserver.JmxMBeanServer@7795d894
   [junit4]   2> 772652 INFO  (TEST-ChaosMonkeySafeLeaderTest.test-seed#[AD8EFD58D857BCD8]) [n:127.0.0.1:46633_kx_    ] o.a.s.m.r.SolrJmxReporter JMX monitoring for 'solr.jetty' (registry 'solr.jetty') enabled at server: com.sun.jmx.mbeanserver.JmxMBeanServer@7795d894
   [junit4]   2> 772653 INFO  (TEST-ChaosMonkeySafeLeaderTest.test-seed#[AD8EFD58D857BCD8]) [n:127.0.0.1:46633_kx_    ] o.a.s.c.CorePropertiesLocator Found 0 core definitions underneath /x1/jenkins/jenkins-slave/workspace/Lucene-Solr-NightlyTests-master/checkout/solr/build/solr-core/test/J1/temp/solr.cloud.ChaosMonkeySafeLeaderTest_AD8EFD58D857BCD8-001/control-001/cores
   [junit4]   2> 772667 INFO  (TEST-ChaosMonkeySafeLeaderTest.test-seed#[AD8EFD58D857BCD8]) [    ] o.a.s.c.c.ZkStateReader Updated live nodes from ZooKeeper... (0) -> (1)
   [junit4]   2> 772668 INFO  (TEST-ChaosMonkeySafeLeaderTest.test-seed#[AD8EFD58D857BCD8]) [    ] o.a.s.c.s.i.ZkClientClusterStateProvider Cluster at 127.0.0.1:60226/solr ready
   [junit4]   2> 772691 INFO  (qtp432671262-98987) [n:127.0.0.1:46633_kx_    ] o.a.s.h.a.CollectionsHandler Invoked Collection Action :create with params replicationFactor=1&collection.configName=conf1&name=control_collection&nrtReplicas=1&action=CREATE&numShards=1&createNodeSet=127.0.0.1:46633_kx_&wt=javabin&version=2 and sendToOCPQueue=true
   [junit4]   2> 772694 INFO  (OverseerThreadFactory-7240-thread-1-processing-n:127.0.0.1:46633_kx_) [n:127.0.0.1:46633_kx_    ] o.a.s.c.CreateCollectionCmd Create collection control_collection
   [junit4]   2> 772810 INFO  (qtp432671262-98984) [n:127.0.0.1:46633_kx_    ] o.a.s.h.a.CoreAdminOperation core create command qt=/admin/cores&collection.configName=conf1&newCollection=true&name=control_collection_shard1_replica_n1&action=CREATE&numShards=1&collection=control_collection&shard=shard1&wt=javabin&version=2&replicaType=NRT
   [junit4]   2> 772811 INFO  (qtp432671262-98984) [n:127.0.0.1:46633_kx_    ] o.a.s.c.TransientSolrCoreCacheDefault Allocating transient cache for 4 transient cores
   [junit4]   2> 772915 INFO  (zkCallback-26338-thread-1-processing-n:127.0.0.1:46633_kx_) [n:127.0.0.1:46633_kx_    ] o.a.s.c.c.ZkStateReader A cluster state change: [WatchedEvent state:SyncConnected type:NodeDataChanged path:/collections/control_collection/state.json] for collection [control_collection] has occurred - updating... (live nodes size: [1])
   [junit4]   2> 773823 INFO  (qtp432671262-98984) [n:127.0.0.1:46633_kx_ c:control_collection s:shard1  x:control_collection_shard1_replica_n1] o.a.s.c.SolrConfig Using Lucene MatchVersion: 8.0.0
   [junit4]   2> 773834 INFO  (qtp432671262-98984) [n:127.0.0.1:46633_kx_ c:control_collection s:shard1  x:control_collection_shard1_replica_n1] o.a.s.s.IndexSchema [control_collection_shard1_replica_n1] Schema name=test
   [junit4]   2> 773917 INFO  (qtp432671262-98984) [n:127.0.0.1:46633_kx_ c:control_collection s:shard1  x:control_collection_shard1_replica_n1] o.a.s.s.IndexSchema Loaded schema test/1.6 with uniqueid field id
   [junit4]   2> 773926 INFO  (qtp432671262-98984) [n:127.0.0.1:46633_kx_ c:control_collection s:shard1  x:control_collection_shard1_replica_n1] o.a.s.c.CoreContainer Creating SolrCore 'control_collection_shard1_replica_n1' using configuration from collection control_collection, trusted=true
   [junit4]   2> 773926 INFO  (qtp432671262-98984) [n:127.0.0.1:46633_kx_ c:control_collection s:shard1  x:control_collection_shard1_replica_n1] o.a.s.m.r.SolrJmxReporter JMX monitoring for 'solr.core.control_collection.shard1.replica_n1' (registry 'solr.core.control_collection.shard1.replica_n1') enabled at server: com.sun.jmx.mbeanserver.JmxMBeanServer@7795d894
   [junit4]   2> 773926 INFO  (qtp432671262-98984) [n:127.0.0.1:46633_kx_ c:control_collection s:shard1  x:control_collection_shard1_replica_n1] o.a.s.c.SolrCore solr.RecoveryStrategy.Builder
   [junit4]   2> 773926 INFO  (qtp432671262-98984) [n:127.0.0.1:46633_kx_ c:control_collection s:shard1  x:control_collection_shard1_replica_n1] o.a.s.c.SolrCore [[control_collection_shard1_replica_n1] ] Opening new SolrCore at [/x1/jenkins/jenkins-slave/workspace/Lucene-Solr-NightlyTests-master/checkout/solr/build/solr-core/test/J1/temp/solr.cloud.ChaosMonkeySafeLeaderTest_AD8EFD58D857BCD8-001/control-001/cores/control_collection_shard1_replica_n1], dataDir=[/x1/jenkins/jenkins-slave/workspace/Lucene-Solr-NightlyTests-master/checkout/solr/build/solr-core/test/J1/temp/solr.cloud.ChaosMonkeySafeLeaderTest_AD8EFD58D857BCD8-001/control-001/cores/control_collection_shard1_replica_n1/data/]
   [junit4]   2> 773929 INFO  (qtp432671262-98984) [n:127.0.0.1:46633_kx_ c:control_collection s:shard1  x:control_collection_shard1_replica_n1] o.a.s.u.RandomMergePolicy RandomMergePolicy wrapping class org.apache.lucene.index.MockRandomMergePolicy: org.apache.lucene.index.MockRandomMergePolicy@35acfb7d
   [junit4]   2> 773939 WARN  (qtp432671262-98984) [n:127.0.0.1:46633_kx_ c:control_collection s:shard1  x:control_collection_shard1_replica_n1] o.a.s.c.RequestHandlers INVALID paramSet a in requestHandler {type = requestHandler,name = /dump,class = DumpRequestHandler,attributes = {initParams=a, name=/dump, class=DumpRequestHandler},args = {defaults={a=A,b=B}}}
   [junit4]   2> 773973 INFO  (qtp432671262-98984) [n:127.0.0.1:46633_kx_ c:control_collection s:shard1  x:control_collection_shard1_replica_n1] o.a.s.u.UpdateHandler Using UpdateLog implementation: org.apache.solr.update.UpdateLog
   [junit4]   2> 773973 INFO  (qtp432671262-98984) [n:127.0.0.1:46633_kx_ c:control_collection s:shard1  x:control_collection_shard1_replica_n1] o.a.s.u.UpdateLog Initializing UpdateLog: dataDir= defaultSyncLevel=FLUSH numRecordsToKeep=100 maxNumLogsToKeep=10 numVersionBuckets=65536
   [junit4]   2> 773974 INFO  (qtp432671262-98984) [n:127.0.0.1:46633_kx_ c:control_collection s:shard1  x:control_collection_shard1_replica_n1] o.a.s.u.CommitTracker Hard AutoCommit: if uncommited for 15000ms; 
   [junit4]   2> 773974 INFO  (qtp432671262-98984) [n:127.0.0.1:46633_kx_ c:control_collection s:shard1  x:control_collection_shard1_replica_n1] o.a.s.u.CommitTracker Soft AutoCommit: disabled
   [junit4]   2> 773975 INFO  (qtp432671262-98984) [n:127.0.0.1:46633_kx_ c:control_collection s:shard1  x:control_collection_shard1_replica_n1] o.a.s.u.RandomMergePolicy RandomMergePolicy wrapping class org.apache.lucene.index.LogByteSizeMergePolicy: [LogByteSizeMergePolicy: minMergeSize=1677721, mergeFactor=47, maxMergeSize=2147483648, maxMergeSizeForForcedMerge=9223372036854775807, calibrateSizeByDeletes=false, maxMergeDocs=2147483647, maxCFSSegmentSizeMB=8.796093022207999E12, noCFSRatio=0.24462359847687198]
   [junit4]   2> 773976 INFO  (qtp432671262-98984) [n:127.0.0.1:46633_kx_ c:control_collection s:shard1  x:control_collection_shard1_replica_n1] o.a.s.s.SolrIndexSearcher Opening [Searcher@4b852292[control_collection_shard1_replica_n1] main]
   [junit4]   2> 773977 INFO  (qtp432671262-98984) [n:127.0.0.1:46633_kx_ c:control_collection s:shard1  x:control_collection_shard1_replica_n1] o.a.s.r.ManagedResourceStorage Configured ZooKeeperStorageIO with znodeBase: /configs/conf1
   [junit4]   2> 773977 INFO  (qtp432671262-98984) [n:127.0.0.1:46633_kx_ c:control_collection s:shard1  x:control_collection_shard1_replica_n1] o.a.s.r.ManagedResourceStorage Loaded null at path _rest_managed.json using ZooKeeperStorageIO:path=/configs/conf1
   [junit4]   2> 773978 INFO  (qtp432671262-98984) [n:127.0.0.1:46633_kx_ c:control_collection s:shard1  x:control_collection_shard1_replica_n1] o.a.s.h.ReplicationHandler Commits will be reserved for  10000
   [junit4]   2> 773979 INFO  (searcherExecutor-7243-thread-1-processing-n:127.0.0.1:46633_kx_ x:control_collection_shard1_replica_n1 s:shard1 c:control_collection) [n:127.0.0.1:46633_kx_ c:control_collection s:shard1  x:control_collection_shard1_replica_n1] o.a.s.c.SolrCore [control_collection_shard1_replica_n1] Registered new searcher Searcher@4b852292[control_collection_shard1_replica_n1] main{ExitableDirectoryReader(UninvertingDirectoryReader())}
   [junit4]   2> 773979 INFO  (qtp432671262-98984) [n:127.0.0.1:46633_kx_ c:control_collection s:shard1  x:control_collection_shard1_replica_n1] o.a.s.u.UpdateLog Could not find max version in index or recent updates, using new clock 1574596041055928320
   [junit4]   2> 773989 INFO  (qtp432671262-98984) [n:127.0.0.1:46633_kx_ c:control_collection s:shard1  x:control_collection_shard1_replica_n1] o.a.s.c.ShardLeaderElectionContext Enough replicas found to continue.
   [junit4]   2> 773989 INFO  (qtp432671262-98984) [n:127.0.0.1:46633_kx_ c:control_collection s:shard1  x:control_collection_shard1_replica_n1] o.a.s.c.ShardLeaderElectionContext I may be the new leader - try and sync
   [junit4]   2> 773989 INFO  (qtp432671262-98984) [n:127.0.0.1:46633_kx_ c:control_collection s:shard1  x:control_collection_shard1_replica_n1] o.a.s.c.SyncStrategy Sync replicas to https://127.0.0.1:46633/kx_/control_collection_shard1_replica_n1/
   [junit4]   2> 773989 INFO  (qtp432671262-98984) [n:127.0.0.1:46633_kx_ c:control_collection s:shard1  x:control_collection_shard1_replica_n1] o.a.s.c.SyncStrategy Sync Success - now sync replicas to me
   [junit4]   2> 773989 INFO  (qtp432671262-98984) [n:127.0.0.1:46633_kx_ c:control_collection s:shard1  x:control_collection_shard1_replica_n1] o.a.s.c.SyncStrategy https://127.0.0.1:46633/kx_/control_collection_shard1_replica_n1/ has no replicas
   [junit4]   2> 773989 INFO  (qtp432671262-98984) [n:127.0.0.1:46633_kx_ c:control_collection s:shard1  x:control_collection_shard1_replica_n1] o.a.s.c.ShardLeaderElectionContext Found all replicas participating in election, clear LIR
   [junit4]   2> 773992 INFO  (qtp432671262-98984) [n:127.0.0.1:46633_kx_ c:control_collection s:shard1  x:control_collection_shard1_replica_n1] o.a.s.c.ShardLeaderElectionContext I am the new leader: https://127.0.0.1:46633/kx_/control_collection_shard1_replica_n1/ shard1
   [junit4]   2> 774094 INFO  (zkCallback-26338-thread-1-processing-n:127.0.0.1:46633_kx_) [n:127.0.0.1:46633_kx_    ] o.a.s.c.c.ZkStateReader A cluster state change: [WatchedEvent state:SyncConnected type:NodeDataChanged path:/collections/control_collection/state.json] for collection [control_collection] has occurred - updating... (live nodes size: [1])
   [junit4]   2> 774143 INFO  (qtp432671262-98984) [n:127.0.0.1:46633_kx_ c:control_collection s:shard1  x:control_collection_shard1_replica_n1] o.a.s.c.ZkController I am the leader, no recovery necessary
   [junit4]   2> 774146 INFO  (qtp432671262-98984) [n:127.0.0.1:46633_kx_ c:control_collection s:shard1  x:control_collection_shard1_replica_n1] o.a.s.s.HttpSolrCall [admin] webapp=null path=/admin/cores params={qt=/admin/cores&collection.configName=conf1&newCollection=true&name=control_collection_shard1_replica_n1&action=CREATE&numShards=1&collection=control_collection&shard=shard1&wt=javabin&version=2&replicaType=NRT} status=0 QTime=1336
   [junit4]   2> 774154 INFO  (qtp432671262-98987) [n:127.0.0.1:46633_kx_    ] o.a.s.h.a.CollectionsHandler Wait for new collection to be active for at most 30 seconds. Check all shard replicas
   [junit4]   2> 774251 INFO  (zkCallback-26338-thread-1-processing-n:127.0.0.1:46633_kx_) [n:127.0.0.1:46633_kx_    ] o.a.s.c.c.ZkStateReader A cluster state change: [WatchedEvent state:SyncConnected type:NodeDataChanged path:/collections/control_collection/state.json] for collection [control_collection] has occurred - updating... (live nodes size: [1])
   [junit4]   2> 774696 INFO  (OverseerCollectionConfigSetProcessor-98412252450258949-127.0.0.1:46633_kx_-n_0000000000) [n:127.0.0.1:46633_kx_    ] o.a.s.c.OverseerTaskQueue Response ZK path: /overseer/collection-queue-work/qnr-0000000000 doesn't exist.  Requestor may have disconnected from ZooKeeper
   [junit4]   2> 775154 INFO  (qtp432671262-98987) [n:127.0.0.1:46633_kx_    ] o.a.s.s.HttpSolrCall [admin] webapp=null path=/admin/collections params={replicationFactor=1&collection.configName=conf1&name=control_collection&nrtReplicas=1&action=CREATE&numShards=1&createNodeSet=127.0.0.1:46633_kx_&wt=javabin&version=2} status=0 QTime=2463
   [junit4]   2> 775161 INFO  (TEST-ChaosMonkeySafeLeaderTest.test-seed#[AD8EFD58D857BCD8]) [    ] o.a.s.c.c.ZkStateReader Updated live nodes from ZooKeeper... (0) -> (1)
   [junit4]   2> 775162 INFO  (TEST-ChaosMonkeySafeLeaderTest.test-seed#[AD8EFD58D857BCD8]) [    ] o.a.s.c.s.i.ZkClientClusterStateProvider Cluster at 127.0.0.1:60226/solr ready
   [junit4]   2> 775162 INFO  (TEST-ChaosMonkeySafeLeaderTest.test-seed#[AD8EFD58D857BCD8]) [    ] o.a.s.c.ChaosMonkey monkey: init - expire sessions:false cause connection loss:false
   [junit4]   2> 775167 INFO  (qtp432671262-98982) [n:127.0.0.1:46633_kx_    ] o.a.s.h.a.CollectionsHandler Invoked Collection Action :create with params replicationFactor=1&collection.configName=conf1&name=collection1&nrtReplicas=1&action=CREATE&numShards=2&createNodeSet=&stateFormat=2&wt=javabin&version=2 and sendToOCPQueue=true
   [junit4]   2> 775168 INFO  (OverseerThreadFactory-7240-thread-2-processing-n:127.0.0.1:46633_kx_) [n:127.0.0.1:46633_kx_    ] o.a.s.c.CreateCollectionCmd Create collection collection1
   [junit4]   2> 775169 WARN  (OverseerThreadFactory-7240-thread-2-processing-n:127.0.0.1:46633_kx_) [n:127.0.0.1:46633_kx_    ] o.a.s.c.CreateCollectionCmd It is unusual to create a collection (collection1) without cores.
   [junit4]   2> 775374 INFO  (qtp432671262-98982) [n:127.0.0.1:46633_kx_    ] o.a.s.h.a.CollectionsHandler Wait for new collection to be active for at most 30 seconds. Check all shard replicas
   [junit4]   2> 775374 INFO  (qtp432671262-98982) [n:127.0.0.1:46633_kx_    ] o.a.s.s.HttpSolrCall [admin] webapp=null path=/admin/collections params={replicationFactor=1&collection.configName=conf1&name=collection1&nrtReplicas=1&action=CREATE&numShards=2&createNodeSet=&stateFormat=2&wt=javabin&version=2} status=0 QTime=207
   [junit4]   2> 775473 INFO  (TEST-ChaosMonkeySafeLeaderTest.test-seed#[AD8EFD58D857BCD8]) [    ] o.a.s.c.AbstractFullDistribZkTestBase create jetty 1 in directory /x1/jenkins/jenkins-slave/workspace/Lucene-Solr-NightlyTests-master/checkout/solr/build/solr-core/test/J1/temp/solr.cloud.ChaosMonkeySafeLeaderTest_AD8EFD58D857BCD8-001/shard-1-001 of type NRT
   [junit4]   2> 775475 INFO  (TEST-ChaosMonkeySafeLeaderTest.test-seed#[AD8EFD58D857BCD8]) [    ] o.e.j.s.Server jetty-9.3.14.v20161028
   [junit4]   2> 775476 INFO  (TEST-ChaosMonkeySafeLeaderTest.test-seed#[AD8EFD58D857BCD8]) [    ] o.e.j.s.h.ContextHandler Started o.e.j.s.ServletContextHandler@7500a22b{/kx_,null,AVAILABLE}
   [junit4]   2> 775477 INFO  (TEST-ChaosMonkeySafeLeaderTest.test-seed#[AD8EFD58D857BCD8]) [    ] o.e.j.s.AbstractConnector Started ServerConnector@ac47270{SSL,[ssl, http/1.1]}{127.0.0.1:48759}
   [junit4]   2> 775477 INFO  (TEST-ChaosMonkeySafeLeaderTest.test-seed#[AD8EFD58D857BCD8]) [    ] o.e.j.s.Server Started @783367ms
   [junit4]   2> 775477 INFO  (TEST-ChaosMonkeySafeLeaderTest.test-seed#[AD8EFD58D857BCD8]) [    ] o.a.s.c.s.e.JettySolrRunner Jetty properties: {solr.data.dir=/x1/jenkins/jenkins-slave/workspace/Lucene-Solr-NightlyTests-master/checkout/solr/build/solr-core/test/J1/temp/solr.cloud.ChaosMonkeySafeLeaderTest_AD8EFD58D857BCD8-001/tempDir-001/jetty1, replicaType=NRT, solrconfig=solrconfig.xml, hostContext=/kx_, hostPort=48759, coreRootDirectory=/x1/jenkins/jenkins-slave/workspace/Lucene-Solr-NightlyTests-master/checkout/solr/build/solr-core/test/J1/temp/solr.cloud.ChaosMonkeySafeLeaderTest_AD8EFD58D857BCD8-001/shard-1-001/cores}
   [junit4]   2> 775479 ERROR (TEST-ChaosMonkeySafeLeaderTest.test-seed#[AD8EFD58D857BCD8]) [    ] o.a.s.s.StartupLoggingUtils Missing Java Option solr.log.dir. Logging may be missing or incomplete.
   [junit4]   2> 775479 INFO  (TEST-ChaosMonkeySafeLeaderTest.test-seed#[AD8EFD58D857BCD8]) [    ] o.a.s.s.SolrDispatchFilter  ___      _       Welcome to Apache Solr? version 8.0.0
   [junit4]   2> 775479 INFO  (TEST-ChaosMonkeySafeLeaderTest.test-seed#[AD8EFD58D857BCD8]) [    ] o.a.s.s.SolrDispatchFilter / __| ___| |_ _   Starting in cloud mode on port null
   [junit4]   2> 775479 INFO  (TEST-ChaosMonkeySafeLeaderTest.test-seed#[AD8EFD58D857BCD8]) [    ] o.a.s.s.SolrDispatchFilter \__ \/ _ \ | '_|  Install dir: null, Default config dir: null
   [junit4]   2> 775479 INFO  (TEST-ChaosMonkeySafeLeaderTest.test-seed#[AD8EFD58D857BCD8]) [    ] o.a.s.s.SolrDispatchFilter |___/\___/_|_|    Start time: 2017-08-02T05:30:04.570Z
   [junit4]   2> 775482 INFO  (TEST-ChaosMonkeySafeLeaderTest.test-seed#[AD8EFD58D857BCD8]) [    ] o.a.s.s.SolrDispatchFilter Loading solr.xml from SolrHome (not found in ZooKeeper)
   [junit4]   2> 775482 INFO  (TEST-ChaosMonkeySafeLeaderTest.test-seed#[AD8EFD58D857BCD8]) [    ] o.a.s.c.SolrXmlConfig Loading container configuration from /x1/jenkins/jenkins-slave/workspace/Lucene-Solr-NightlyTests-master/checkout/solr/build/solr-core/test/J1/temp/solr.cloud.ChaosMonkeySafeLeaderTest_AD8EFD58D857BCD8-001/shard-1-001/solr.xml
   [junit4]   2> 775488 INFO  (TEST-ChaosMonkeySafeLeaderTest.test-seed#[AD8EFD58D857BCD8]) [    ] o.a.s.c.SolrXmlConfig MBean server found: com.sun.jmx.mbeanserver.JmxMBeanServer@7795d894, but no JMX reporters were configured - adding default JMX reporter.
   [junit4]   2> 775493 INFO  (TEST-ChaosMonkeySafeLeaderTest.test-seed#[AD8EFD58D857BCD8]) [    ] o.a.s.c.ZkContainer Zookeeper client=127.0.0.1:60226/solr
   [junit4]   2> 775504 INFO  (TEST-ChaosMonkeySafeLeaderTest.test-seed#[AD8EFD58D857BCD8]) [n:127.0.0.1:48759_kx_    ] o.a.s.c.c.ZkStateReader Updated live nodes from ZooKeeper... (0) -> (1)
   [junit4]   2> 775506 INFO  (TEST-ChaosMonkeySafeLeaderTest.test-seed#[AD8EFD58D857BCD8]) [n:127.0.0.1:48759_kx_    ] o.a.s.c.Overseer Overseer (id=null) closing
   [junit4]   2> 775508 INFO  (TEST-ChaosMonkeySafeLeaderTest.test-seed#[AD8EFD58D857BCD8]) [n:127.0.0.1:48759_kx_    ] o.a.s.c.ZkController Register node as live in ZooKeeper:/live_nodes/127.0.0.1:48759_kx_
   [junit4]   2> 775509 INFO  (zkCallback-26338-thread-1-processing-n:127.0.0.1:46633_kx_) [n:127.0.0.1:46633_kx_    ] o.a.s.c.c.ZkStateReader Updated live nodes from ZooKeeper... (1) -> (2)
   [junit4]   2> 775515 INFO  (zkCallback-26345-thread-1) [    ] o.a.s.c.c.ZkStateReader Updated live nodes from ZooKeeper... (1) -> (2)
   [junit4]   2> 775519 INFO  (zkCallback-26350-thread-1-processing-n:127.0.0.1:48759_kx_) [n:127.0.0.1:48759_kx_    ] o.a.s.c.c.ZkStateReader Updated live nodes from ZooKeeper... (1) -> (2)
   [junit4]   2> 775601 INFO  (TEST-ChaosMonkeySafeLeaderTest.test-seed#[AD8EFD58D857BCD8]) [n:127.0.0.1:48759_kx_    ] o.a.s.m.r.SolrJmxReporter JMX monitoring for 'solr.node' (registry 'solr.node') enabled at server: com.sun.jmx.mbeanserver.JmxMBeanServer@7795d894
   [junit4]   2> 775609 INFO  (TEST-ChaosMonkeySafeLeaderTest.test-seed#[AD8EFD58D857BCD8]) [n:127.0.0.1:48759_kx_    ] o.a.s.m.r.SolrJmxReporter JMX monitoring for 'solr.jvm' (registry 'solr.jvm') enabled at server: com.sun.jmx.mbeanserver.JmxMBeanServer@7795d894
   [junit4]   2> 775609 INFO  (TEST-ChaosMonkeySafeLeaderTest.test-seed#[AD8EFD58D857BCD8]) [n:127.0.0.1:48759_kx_    ] o.a.s.m.r.SolrJmxReporter JMX monitoring for 'solr.jetty' (registry 'solr.jetty') enabled at server: com.sun.jmx.mbeanserver.JmxMBeanServer@7795d894
   [junit4]   2> 775612 INFO  (TEST-ChaosMonkeySafeLeaderTest.test-seed#[AD8EFD58D857BCD8]) [n:127.0.0.1:48759_kx_    ] o.a.s.c.CorePropertiesLocator Found 0 core definitions underneath /x1/jenkins/jenkins-slave/workspace/Lucene-Solr-NightlyTests-master/checkout/solr/build/solr-core/test/J1/temp/solr.cloud.ChaosMonkeySafeLeaderTest_AD8EFD58D857BCD8-001/shard-1-001/cores
   [junit4]   2> 775635 INFO  (qtp432671262-98984) [n:127.0.0.1:46633_kx_    ] o.a.s.h.a.CollectionsHandler Invoked Collection Action :addreplica with params node=127.0.0.1:48759_kx_&action=ADDREPLICA&collection=collection1&shard=shard2&type=NRT&wt=javabin&version=2 and sendToOCPQueue=true
   [junit4]   2> 775637 INFO  (OverseerCollectionConfigSetProcessor-98412252450258949-127.0.0.1:46633_kx_-n_0000000000) [n:127.0.0.1:46633_kx_    ] o.a.s.c.OverseerTaskQueue Response ZK path: /overseer/collection-queue-work/qnr-0000000002 doesn't exist.  Requestor may have disconnected from ZooKeeper
   [junit4]   2> 775638 INFO  (OverseerThreadFactory-7240-thread-3-processing-n:127.0.0.1:46633_kx_) [n:127.0.0.1:46633_kx_    ] o.a.s.c.AddReplicaCmd Node Identified 127.0.0.1:48759_kx_ for creating new replica
   [junit4]   2> 775674 INFO  (qtp127614899-99027) [n:127.0.0.1:48759_kx_    ] o.a.s.h.a.CoreAdminOperation core create command qt=/admin/cores&collection.configName=conf1&name=collection1_shard2_replica_n1&action=CREATE&collection=collection1&shard=shard2&wt=javabin&version=2&replicaType=NRT
   [junit4]   2> 775675 INFO  (qtp127614899-99027) [n:127.0.0.1:48759_kx_    ] o.a.s.c.TransientSolrCoreCacheDefault Allocating transient cache for 4 transient cores
   [junit4]   2> 775786 INFO  (zkCallback-26350-thread-1-processing-n:127.0.0.1:48759_kx_) [n:127.0.0.1:48759_kx_    ] o.a.s.c.c.ZkStateReader A cluster state change: [WatchedEvent state:SyncConnected type:NodeDataChanged path:/collections/collection1/state.json] for collection [collection1] has occurred - updating... (live nodes size: [2])
   [junit4]   2> 776693 INFO  (qtp127614899-99027) [n:127.0.0.1:48759_kx_ c:collection1 s:shard2  x:collection1_shard2_replica_n1] o.a.s.c.SolrConfig Using Lucene MatchVersion: 8.0.0
   [junit4]   2> 776705 INFO  (qtp127614899-99027) [n:127.0.0.1:48759_kx_ c:collection1 s:shard2  x:collection1_shard2_replica_n1] o.a.s.s.IndexSchema [collection1_shard2_replica_n1] Schema name=test
   [junit4]   2> 776775 INFO  (qtp127614899-99027) [n:127.0.0.1:48759_kx_ c:collection1 s:shard2  x:collection1_shard2_replica_n1] o.a.s.s.IndexSchema Loaded schema test/1.6 with uniqueid field id
   [junit4]   2> 776785 INFO  (qtp127614899-99027) [n:127.0.0.1:48759_kx_ c:collection1 s:shard2  x:collection1_shard2_replica_n1] o.a.s.c.CoreContainer Creating SolrCore 'collection1_shard2_replica_n1' using configuration from collection collection1, trusted=true
   [junit4]   2> 776785 INFO  (qtp127614899-99027) [n:127.0.0.1:48759_kx_ c:collection1 s:shard2  x:collection1_shard2_replica_n1] o.a.s.m.r.SolrJmxReporter JMX monitoring for 'solr.core.collection1.shard2.replica_n1' (registry 'solr.core.collection1.shard2.replica_n1') enabled at server: com.sun.jmx.mbeanserver.JmxMBeanServer@7795d894
   [junit4]   2> 776786 INFO  (qtp127614899-99027) [n:127.0.0.1:48759_kx_ c:collection1 s:shard2  x:collection1_shard2_replica_n1] o.a.s.c.SolrCore solr.RecoveryStrategy.Builder
   [junit4]   2> 776786 INFO  (qtp127614899-99027) [n:127.0.0.1:48759_kx_ c:collection1 s:shard2  x:collection1_shard2_replica_n1] o.a.s.c.SolrCore [[collection1_shard2_replica_n1] ] Opening new SolrCore at [/x1/jenkins/jenkins-slave/workspace/Lucene-Solr-NightlyTests-master/checkout/solr/build/solr-core/test/J1/temp/solr.cloud.ChaosMonkeySafeLeaderTest_AD8EFD58D857BCD8-001/shard-1-001/cores/collection1_shard2_replica_n1], dataDir=[/x1/jenkins/jenkins-slave/workspace/Lucene-Solr-NightlyTests-master/checkout/solr/build/solr-core/test/J1/temp/solr.cloud.ChaosMonkeySafeLeaderTest_AD8EFD58D857BCD8-001/shard-1-001/cores/collection1_shard2_replica_n1/data/]
   [junit4]   2> 776788 INFO  (qtp127614899-99027) [n:127.0.0.1:48759_kx_ c:collection1 s:shard2  x:collection1_shard2_replica_n1] o.a.s.u.RandomMergePolicy RandomMergePolicy wrapping class org.apache.lucene.index.MockRandomMergePolicy: org.apache.lucene.index.MockRandomMergePolicy@cec52e3
   [junit4]   2> 776798 WARN  (qtp127614899-99027) [n:127.0.0.1:48759_kx_ c:collection1 s:shard2  x:collection1_shard2_replica_n1] o.a.s.c.RequestHandlers INVALID paramSet a in requestHandler {type = requestHandler,name = /dump,class = DumpRequestHandler,attributes = {initParams=a, name=/dump, class=DumpRequestHandler},args = {defaults={a=A,b=B}}}
   [junit4]   2> 776834 INFO  (qtp127614899-99027) [n:127.0.0.1:48759_kx_ c:collection1 s:shard2  x:collection1_shard2_replica_n1] o.a.s.u.UpdateHandler Using UpdateLog implementation: org.apache.solr.update.UpdateLog
   [junit4]   2> 776834 INFO  (qtp127614899-99027) [n:127.0.0.1:48759_kx_ c:collection1 s:shard2  x:collection1_shard2_replica_n1] o.a.s.u.UpdateLog Initializing UpdateLog: dataDir= defaultSyncLevel=FLUSH numRecordsToKeep=100 maxNumLogsToKeep=10 numVersionBuckets=65536
   [junit4]   2> 776835 INFO  (qtp127614899-99027) [n:127.0.0.1:48759_kx_ c:collection1 s:shard2  x:collection1_shard2_replica_n1] o.a.s.u.CommitTracker Hard AutoCommit: if uncommited for 15000ms; 
   [junit4]   2> 776835 INFO  (qtp127614899-99027) [n:127.0.0.1:48759_kx_ c:collection1 s:shard2  x:collection1_shard2_replica_n1] o.a.s.u.CommitTracker Soft AutoCommit: disabled
   [junit4]   2> 776836 INFO  (qtp127614899-99027) [n:127.0.0.1:48759_kx_ c:collection1 s:shard2  x:collection1_shard2_replica_n1] o.a.s.u.RandomMergePolicy RandomMergePolicy wrapping class org.apache.lucene.index.LogByteSizeMergePolicy: [LogByteSizeMergePolicy: minMergeSize=1677721, mergeFactor=47, maxMergeSize=2147483648, maxMergeSizeForForcedMerge=9223372036854775807, calibrateSizeByDeletes=false, maxMergeDocs=2147483647, maxCFSSegmentSizeMB=8.796093022207999E12, noCFSRatio=0.24462359847687198]
   [junit4]   2> 776836 INFO  (qtp127614899-99027) [n:127.0.0.1:48759_kx_ c:collection1 s:shard2  x:collection1_shard2_replica_n1] o.a.s.s.SolrIndexSearcher Opening [Searcher@47a383b1[collection1_shard2_replica_n1] main]
   [junit4]   2> 776837 INFO  (qtp127614899-99027) [n:127.0.0.1:48759_kx_ c:collection1 s:shard2  x:collection1_shard2_replica_n1] o.a.s.r.ManagedResourceStorage Configured ZooKeeperStorageIO with znodeBase: /configs/conf1
   [junit4]   2> 776837 INFO  (qtp127614899-99027) [n:127.0.0.1:48759_kx_ c:collection1 s:shard2  x:collection1_shard2_replica_n1] o.a.s.r.ManagedResourceStorage Loaded null at path _rest_managed.json using ZooKeeperStorageIO:path=/configs/conf1
   [junit4]   2> 776838 INFO  (qtp127614899-99027) [n:127.0.0.1:48759_kx_ c:collection1 s:shard2  x:collection1_shard2_replica_n1] o.a.s.h.ReplicationHandler Commits will be reserved for  10000
   [junit4]   2> 776839 INFO  (searcherExecutor-7254-thread-1-processing-n:127.0.0.1:48759_kx_ x:collection1_shard2_replica_n1 s:shard2 c:collection1) [n:127.0.0.1:48759_kx_ c:collection1 s:shard2  x:collection1_shard2_replica_n1] o.a.s.c.SolrCore [collection1_shard2_replica_n1] Registered new searcher Searcher@47a383b1[collection1_shard2_replica_n1] main{ExitableDirectoryReader(UninvertingDirectoryReader())}
   [junit4]   2> 776839 INFO  (qtp127614899-99027) [n:127.0.0.1:48759_kx_ c:collection1 s:shard2  x:collection1_shard2_replica_n1] o.a.s.u.UpdateLog Could not find max version in index or recent updates, using new clock 1574596044054855680
   [junit4]   2> 776843 INFO  (qtp127614899-99027) [n:127.0.0.1:48759_kx_ c:collection1 s:shard2  x:collection1_shard2_replica_n1] o.a.s.c.ShardLeaderElectionContext Enough replicas found to continue.
   [junit4]   2> 776843 INFO  (qtp127614899-99027) [n:127.0.0.1:48759_kx_ c:collection1 s:shard2  x:collection1_shard2_replica_n1] o.a.s.c.ShardLeaderElectionContext I may be the new leader - try and sync
   [junit4]   2> 776844 INFO  (qtp127614899-99027) [n:127.0.0.1:48759_kx_ c:collection1 s:shard2  x:collection1_shard2_replica_n1] o.a.s.c.SyncStrategy Sync replicas to https://127.0.0.1:48759/kx_/collection1_shard2_replica_n1/
   [junit4]   2> 776844 INFO  (qtp127614899-99027) [n:127.0.0.1:48759_kx_ c:collection1 s:shard2  x:collection1_shard2_replica_n1] o.a.s.c.SyncStrategy Sync Success - now sync replicas to me
   [junit4]   2> 776844 INFO  (qtp127614899-99027) [n:127.0.0.1:48759_kx_ c:collection1 s:shard2  x:collection1_shard2_replica_n1] o.a.s.c.SyncStrategy https://127.0.0.1:48759/kx_/collection1_shard2_replica_n1/ has no replicas
   [junit4]   2> 776844 INFO  (qtp127614899-99027) [n:127.0.0.1:48759_kx_ c:collection1 s:shard2  x:collection1_shard2_replica_n1] o.a.s.c.ShardLeaderElectionContext Found all replicas participating in election, clear LIR
   [junit4]   2> 776849 INFO  (qtp127614899-99027) [n:127.0.0.1:48759_kx_ c:collection1 s:shard2  x:collection1_shard2_replica_n1] o.a.s.c.ShardLeaderElectionContext I am the new leader: https://127.0.0.1:48759/kx_/collection1_shard2_replica_n1/ shard2
   [junit4]   2> 776951 INFO  (zkCallback-26350-thread-1-processing-n:127.0.0.1:48759_kx_) [n:127.0.0.1:48759_kx_    ] o.a.s.c.c.ZkStateReader A cluster state change: [WatchedEvent state:SyncConnected type:NodeDataChanged path:/collections/collection1/state.json] for collection [collection1] has occurred - updating... (live nodes size: [2])
   [junit4]   2> 777000 INFO  (qtp127614899-99027) [n:127.0.0.1:48759_kx_ c:collection1 s:shard2  x:collection1_shard2_replica_n1] o.a.s.c.ZkController I am the leader, no recovery necessary
   [junit4]   2> 777001 INFO  (qtp127614899-99027) [n:127.0.0.1:48759_kx_ c:collection1 s:shard2  x:collection1_shard2_replica_n1] o.a.s.s.HttpSolrCall [admin] webapp=null path=/admin/cores params={qt=/admin/cores&collection.configName=conf1&name=collection1_shard2_replica_n1&action=CREATE&collection=collection1&shard=shard2&wt=javabin&version=2&replicaType=NRT} status=0 QTime=1326
   [junit4]   2> 777003 INFO  (qtp432671262-98984) [n:127.0.0.1:46633_kx_    ] o.a.s.s.HttpSolrCall [admin] webapp=null path=/admin/collections params={node=127.0.0.1:48759_kx_&action=ADDREPLICA&collection=collection1&shard=shard2&type=NRT&wt=javabin&version=2} status=0 QTime=1367
   [junit4]   2> 777102 INFO  (TEST-ChaosMonkeySafeLeaderTest.test-seed#[AD8EFD58D857BCD8]) [    ] o.a.s.c.AbstractFullDistribZkTestBase create jetty 2 in directory /x1/jenkins/jenkins-slave/workspace/Lucene-Solr-NightlyTests-master/checkout/solr/build/solr-core/test/J1/temp/solr.cloud.ChaosMonkeySafeLeaderTest_AD8EFD58D857BCD8-001/shard-2-001 of type NRT
   [junit4]   2> 777102 INFO  (zkCallback-26350-thread-1-processing-n:127.0.0.1:48759_kx_) [n:127.0.0.1:48759_kx_    ] o.a.s.c.c.ZkStateReader A cluster state change: [WatchedEvent state:SyncConnected type:NodeDataChanged path:/collections/collection1/state.json] for collection [collection1] has occurred - updating... (live nodes size: [2])
   [junit4]   2> 777104 INFO  (TEST-ChaosMonkeySafeLeaderTest.test-seed#[AD8EFD58D857BCD8]) [    ] o.e.j.s.Server jetty-9.3.14.v20161028
   [junit4]   2> 777110 INFO  (TEST-ChaosMonkeySafeLeaderTest.test-seed#[AD8EFD58D857BCD8]) [    ] o.e.j.s.h.ContextHandler Started o.e.j.s.ServletContextHandler@3def1cc7{/kx_,null,AVAILABLE}
   [junit4]   2> 777110 INFO  (TEST-ChaosMonkeySafeLeaderTest.test-seed#[AD8EFD58D857BCD8]) [    ] o.e.j.s.AbstractConnector Started ServerConnector@38ddcae5{SSL,[ssl, http/1.1]}{127.0.0.1:42458}
   [junit4]   2> 777110 INFO  (TEST-ChaosMonkeySafeLeaderTest.test-seed#[AD8EFD58D857BCD8]) [    ] o.e.j.s.Server Started @785001ms
   [junit4]   2> 777110 INFO  (TEST-ChaosMonkeySafeLeaderTest.test-seed#[AD8EFD58D857BCD8]) [    ] o.a.s.c.s.e.JettySolrRunner Jetty properties: {solr.data.dir=/x1/jenkins/jenkins-slave/workspace/Lucene-Solr-NightlyTests-master/checkout/solr/build/solr-core/test/J1/temp/solr.cloud.ChaosMonkeySafeLeaderTest_AD8EFD58D857BCD8-001/tempDir-001/jetty2, solrconfig=solrconfig.xml, hostContext=/kx_, hostPort=42458, coreRootDirectory=/x1/jenkins/jenkins-slave/workspace/Lucene-Solr-NightlyTests-master/checkout/solr/build/solr-core/test/J1/../../../../../../../../../../../x1/jenkins/jenkins-slave/workspace/Lucene-Solr-NightlyTests-master/checkout/solr/build/solr-core/test/J1/temp/solr.cloud.ChaosMonkeySafeLeaderTest_AD8EFD58D857BCD8-001/shard-2-001/cores}
   [junit4]   2> 777111 ERROR (TEST-ChaosMonkeySafeLeaderTest.test-seed#[AD8EFD58D857BCD8]) [    ] o.a.s.s.StartupLoggingUtils Missing Java Option solr.log.dir. Logging may be missing or incomplete.
   [junit4]   2> 777111 INFO  (TEST-ChaosMonkeySafeLeaderTest.test-seed#[AD8EFD58D857BCD8]) [    ] o.a.s.s.SolrDispatchFilter  ___      _       Welcome to Apache Solr? version 8.0.0
   [junit4]   2> 777111 INFO  (TEST-ChaosMonkeySafeLeaderTest.test-seed#[AD8EFD58D857BCD8]) [    ] o.a.s.s.SolrDispatchFilter / __| ___| |_ _   Starting in cloud mode on port null
   [junit4]   2> 777111 INFO  (TEST-ChaosMonkeySafeLeaderTest.test-seed#[AD8EFD58D857BCD8]) [    ] o.a.s.s.SolrDispatchFilter \__ \/ _ \ | '_|  Install dir: null, Default config dir: null
   [junit4]   2> 777111 INFO  (TEST-ChaosMonkeySafeLeaderTest.test-seed#[AD8EFD58D857BCD8]) [    ] o.a.s.s.SolrDispatchFilter |___/\___/_|_|    Start time: 2017-08-02T05:30:06.202Z
   [junit4]   2> 777117 INFO  (TEST-ChaosMonkeySafeLeaderTest.test-seed#[AD8EFD58D857BCD8]) [    ] o.a.s.s.SolrDispatchFilter Loading solr.xml from SolrHome (not found in ZooKeeper)
   [junit4]   2> 777117 INFO  (TEST-ChaosMonkeySafeLeaderTest.test-seed#[AD8EFD58D857BCD8]) [    ] o.a.s.c.SolrXmlConfig Loading container configuration from /x1/jenkins/jenkins-slave/workspace/Lucene-Solr-NightlyTests-master/checkout/solr/build/solr-core/test/J1/temp/solr.cloud.ChaosMonkeySafeLeaderTest_AD8EFD58D857BCD8-001/shard-2-001/solr.xml
   [junit4]   2> 777122 INFO  (TEST-ChaosMonkeySafeLeaderTest.test-seed#[AD8EFD58D857BCD8]) [    ] o.a.s.c.SolrXmlConfig MBean server found: com.sun.jmx.mbeanserver.JmxMBeanServer@7795d894, but no JMX reporters were configured - adding default JMX reporter.
   [junit4]   2> 777124 INFO  (TEST-ChaosMonkeySafeLeaderTest.test-seed#[AD8EFD58D857BCD8]) [    ] o.a.s.c.ZkContainer Zookeeper client=127.0.0.1:60226/solr
   [junit4]   2> 777134 INFO  (TEST-ChaosMonkeySafeLeaderTest.test-seed#[AD8EFD58D857BCD8]) [n:127.0.0.1:42458_kx_    ] o.a.s.c.c.ZkStateReader Updated live nodes from ZooKeeper... (0) -> (2)
   [junit4]   2> 777136 INFO  (TEST-ChaosMonkeySafeLeaderTest.test-seed#[AD8EFD58D857BCD8]) [n:127.0.0.1:42458_kx_    ] o.a.s.c.Overseer Overseer (id=null) closing
   [junit4]   2> 777137 INFO  (TEST-ChaosMonkeySafeLeaderTest.test-seed#[AD8EFD58D857BCD8]) [n:127.0.0.1:42458_kx_    ] o.a.s.c.ZkController Register node as live in ZooKeeper:/live_nodes/127.0.0.1:42458_kx_
   [junit4]   2> 777138 INFO  (zkCallback-26350-thread-1-processing-n:127.0.0.1:48759_kx_) [n:127.0.0.1:48759_kx_    ] o.a.s.c.c.ZkStateReader Updated live nodes from ZooKeeper... (2) -> (3)
   [junit4]   2> 777138 INFO  (zkCallback-26345-thread-1) [    ] o.a.s.c.c.ZkStateReader Updated live nodes from ZooKeeper... (2) -> (3)
   [junit4]   2> 777138 INFO  (zkCallback-26338-thread-2-processing-n:127.0.0.1:46633_kx_) [n:127.0.0.1:46633_kx_    ] o.a.s.c.c.ZkStateReader Updated live nodes from ZooKeeper... (2) -> (3)
   [junit4]   2> 777156 INFO  (zkCallback-26356-thread-1-processing-n:127.0.0.1:42458_kx_) [n:127.0.0.1:42458_kx_    ] o.a.s.c.c.ZkStateReader Updated live nodes from ZooKeeper... (2) -> (3)
   [junit4]   2> 777205 INFO  (TEST-ChaosMonkeySafeLeaderTest.test-seed#[AD8EFD58D857BCD8]) [n:127.0.0.1:42458_kx_    ] o.a.s.m.r.SolrJmxReporter JMX monitoring for 'solr.node' (registry 'solr.node') enabled at server: com.sun.jmx.mbeanserver.JmxMBeanServer@7795d894
   [junit4]   2> 777210 INFO  (TEST-ChaosMonkeySafeLeaderTest.test-seed#[AD8EFD58D857BCD8]) [n:127.0.0.1:42458_kx_    ] o.a.s.m.r.SolrJmxReporter JMX monitoring for 'solr.jvm' (registry 'solr.jvm') enabled at server: com.sun.jmx.mbeanserver.JmxMBeanServer@7795d894
   [junit4]   2> 777210 INFO  (TEST-ChaosMonkeySafeLeaderTest.test-seed#[AD8EFD58D857BCD8]) [n:127.0.0.1:42458_kx_    ] o.a.s.m.r.SolrJmxReporter JMX monitoring for 'solr.jetty' (registry 'solr.jetty') enabled at server: com.sun.jmx.mbeanserver.JmxMBeanServer@7795d894
   [junit4]   2> 777211 INFO  (TEST-ChaosMonkeySafeLeaderTest.test-seed#[AD8EFD58D857BCD8]) [n:127.0.0.1:42458_kx_    ] o.a.s.c.CorePropertiesLocator Found 0 core definitions underneath /x1/jenkins/jenkins-slave/workspace/Lucene-Solr-NightlyTests-master/checkout/solr/build/solr-core/test/J1/../../../../../../../../../../../x1/jenkins/jenkins-slave/workspace/Lucene-Solr-NightlyTests-master/checkout/solr/build/solr-core/test/J1/temp/solr.cloud.ChaosMonkeySafeLeaderTest_AD8EFD58D857BCD8-001/shard-2-001/cores
   [junit4]   2> 777276 INFO  (qtp461065706-99055) [n:127.0.0.1:42458_kx_    ] o.a.s.h.a.CollectionsHandler Invoked Collection Action :addreplica with params node=127.0.0.1:42458_kx_&action=ADDREPLICA&collection=collection1&shard=shard1&type=NRT&wt=javabin&version=2 and sendToOCPQueue=true
   [junit4]   2> 777283 INFO  (OverseerCollectionConfigSetProcessor-98412252450258949-127.0.0.1:46633_kx_-n_0000000000) [n:127.0.0.1:46633_kx_    ] o.a.s.c.OverseerTaskQueue Response ZK path: /overseer/collection-queue-work/qnr-0000000004 doesn't exist.  Requestor may have disconnected from ZooKeeper
   [junit4]   2> 777284 INFO  (OverseerThreadFactory-7240-thread-4-processing-n:127.0.0.1:46633_kx_) [n:127.0.0.1:46633_kx_    ] o.a.s.c.AddReplicaCmd Node Identified 127.0.0.1:42458_kx_ for creating new replica
   [junit4]   2> 777306 INFO  (qtp461065706-99057) [n:127.0.0.1:42458_kx_    ] o.a.s.h.a.CoreAdminOperation core create command qt=/admin/cores&collection.configName=conf1&name=collection1_shard1_replica_n3&action=CREATE&collection=collection1&shard=shard1&wt=javabin&version=2&replicaType=NRT
   [junit4]   2> 777306 INFO  (qtp461065706-99057) [n:127.0.0.1:42458_kx_    ] o.a.s.c.TransientSolrCoreCacheDefault Allocating transient cache for 4 transient cores
   [junit4]   2> 777410 INFO  (zkCallback-26356-thread-1-processing-n:127.0.0.1:42458_kx_) [n:127.0.0.1:42458_kx_    ] o.a.s.c.c.ZkStateReader A cluster state change: [WatchedEvent state:SyncConnected type:NodeDataChanged path:/collections/collection1/state.json] for collection [collection1] has occurred - updating... (live nodes size: [3])
   [junit4]   2> 777410 INFO  (zkCallback-26350-thread-1-processing-n:127.0.0.1:48759_kx_) [n:127.0.0.1:48759_kx_    ] o.a.s.c.c.ZkStateReader A cluster state change: [WatchedEvent state:SyncConnected type:NodeDataChanged path:/collections/collection1/state.json] for collection [collection1] has occurred - updating... (live nodes size: [3])
   [junit4]   2> 778321 INFO  (qtp461065706-99057) [n:127.0.0.1:42458_kx_ c:collection1 s:shard1  x:collection1_shard1_replica_n3] o.a.s.c.SolrConfig Using Lucene MatchVersion: 8.0.0
   [junit4]   2> 778331 INFO  (qtp461065706-99057) [n:127.0.0.1:42458_kx_ c:collection1 s:shard1  x:collection1_shard1_replica_n3] o.a.s.s.IndexSchema [collection1_shard1_replica_n3] Schema name=test
   [junit4]   2> 778395 INFO  (qtp461065706-99057) [n:127.0.0.1:42458_kx_ c:collection1 s:shard1  x:collection1_shard1_replica_n3] o.a.s.s.IndexSchema Loaded schema test/1.6 with uniqueid field id
   [junit4]   2> 778409 INFO  (qtp461065706-99057) [n:127.0.0.1:42458_kx_ c:collection1 s:shard1  x:collection1_shard1_replica_n3] o.a.s.c.CoreContainer Creating SolrCore 'collection1_shard1_replica_n3' using configuration from collection collection1, trusted=true
   [junit4]   2> 778409 INFO  (qtp461065706-99057) [n:127.0.0.1:42458_kx_ c:collection1 s:shard1  x:collection1_shard1_replica_n3] o.a.s.m.r.SolrJmxReporter JMX monitoring for 'solr.core.collection1.shard1.replica_n3' (registry 'solr.core.collection1.shard1.replica_n3') enabled at server: com.sun.jmx.mbeanserver.JmxMBeanServer@7795d894
   [junit4]   2> 778409 INFO  (qtp461065706-99057) [n:127.0.0.1:42458_kx_ c:collection1 s:shard1  x:collection1_shard1_replica_n3] o.a.s.c.SolrCore solr.RecoveryStrategy.Builder
   [junit4]   2> 778409 INFO  (qtp461065706-99057) [n:127.0.0.1:42458_kx_ c:collection1 s:shard1  x:collection1_shard1_replica_n3] o.a.s.c.SolrCore [[collection1_shard1_replica_n3] ] Opening new SolrCore at [/x1/jenkins/jenkins-slave/workspace/Lucene-Solr-NightlyTests-master/checkout/solr/build/solr-core/test/J1/temp/solr.cloud.ChaosMonkeySafeLeaderTest_AD8EFD58D857BCD8-001/shard-2-001/cores/collection1_shard1_replica_n3], dataDir=[/x1/jenkins/jenkins-slave/workspace/Lucene-Solr-NightlyTests-master/checkout/solr/build/solr-core/test/J1/../../../../../../../../../../../x1/jenkins/jenkins-slave/workspace/Lucene-Solr-NightlyTests-master/checkout/solr/build/solr-core/test/J1/temp/solr.cloud.ChaosMonkeySafeLeaderTest_AD8EFD58D857BCD8-001/shard-2-001/cores/collection1_shard1_replica_n3/data/]
   [junit4]   2> 778412 INFO  (qtp461065706-99057) [n:127.0.0.1:42458_kx_ c:collection1 s:shard1  x:collection1_shard1_replica_n3] o.a.s.u.RandomMergePolicy RandomMergePolicy wrapping class org.apache.lucene.index.MockRandomMergePolicy: org.apache.lucene.index.MockRandomMergePolicy@598a02e0
   [junit4]   2> 778423 WARN  (qtp461065706-99057) [n:127.0.0.1:42458_kx_ c:collection1 s:shard1  x:collection1_shard1_replica_n3] o.a.s.c.RequestHandlers INVALID paramSet a in requestHandler {type = requestHandler,name = /dump,class = DumpRequestHandler,attributes = {initParams=a, name=/dump, class=DumpRequestHandler},args = {defaults={a=A,b=B}}}
   [junit4]   2> 778471 INFO  (qtp461065706-99057) [n:127.0.0.1:42458_kx_ c:collection1 s:shard1  x:collection1_shard1_replica_n3] o.a.s.u.UpdateHandler Using UpdateLog implementation: org.apache.solr.update.UpdateLog
   [junit4]   2> 778471 INFO  (qtp461065706-99057) [n:127.0.0.1:42458_kx_ c:collection1 s:shard1  x:collection1_shard1_replica_n3] o.a.s.u.UpdateLog Initializing UpdateLog: dataDir= defaultSyncLevel=FLUSH numRecordsToKeep=100 maxNumLogsToKeep=10 numVersionBuckets=65536
   [junit4]   2> 778472 INFO  (qtp461065706-99057) [n:127.0.0.1:42458_kx_ c:collection1 s:shard1  x:collection1_shard1_replica_n3] o.a.s.u.CommitTracker Hard AutoCommit: if uncommited for 15000ms; 
   [junit4]   2> 778472 INFO  (qtp461065706-99057) [n:127.0.0.1:42458_kx_ c:collection1 s:shard1  x:collection1_shard1_replica_n3] o.a.s.u.CommitTracker Soft AutoCommit: disabled
   [junit4]   2> 778473 INFO  (qtp461065706-99057) [n:127.0.0.1:42458_kx_ c:collection1 s:shard1  x:collection1_shard1_replica_n3] o.a.s.u.RandomMergePolicy RandomMergePolicy wrapping class org.apache.lucene.index.LogByteSizeMergePolicy: [LogByteSizeMergePolicy: minMergeSize=1677721, mergeFactor=47, maxMergeSize=2147483648, maxMergeSizeForForcedMerge=9223372036854775807, calibrateSizeByDeletes=false, maxMergeDocs=2147483647, maxCFSSegmentSizeMB=8.796093022207999E12, noCFSRatio=0.24462359847687198]
   [junit4]   2> 778473 INFO  (qtp461065706-99057) [n:127.0.0.1:42458_kx_ c:collection1 s:shard1  x:collection1_shard1_replica_n3] o.a.s.s.SolrIndexSearcher Opening [Searcher@49ad471[collection1_shard1_replica_n3] main]
   [junit4]   2> 778474 INFO  (qtp461065706-99057) [n:127.0.0.1:42458_kx_ c:collection1 s:shard1  x:collection1_shard1_replica_n3] o.a.s.r.ManagedResourceStorage Configured ZooKeeperStorageIO with znodeBase: /configs/conf1
   [junit4]   2> 778475 INFO  (qtp461065706-99057) [n:127.0.0.1:42458_kx_ c:collection1 s:shard1  x:collection1_shard1_replica_n3] o.a.s.r.ManagedResourceStorage Loaded null at path _rest_managed.json using ZooKeeperStorageIO:path=/configs/conf1
   [junit4]   2> 778475 INFO  (qtp461065706-99057) [n:127.0.0.1:42458_kx_ c:collection1 s:shard1  x:collection1_shard1_replica_n3] o.a.s.h.ReplicationHandler Commits will be reserved for  10000
   [junit4]   2> 778475 INFO  (qtp461065706-99057) [n:127.0.0.1:42458_kx_ c:collection1 s:shard1  x:collection1_shard1_replica_n3] o.a.s.u.UpdateLog Could not find max version in index or recent updates, using new clock 1574596045770326016
   [junit4]   2> 778476 INFO  (searcherExecutor-7265-thread-1-processing-n:127.0.0.1:42458_kx_ x:collection1_shard1_replica_n3 s:shard1 c:collection1) [n:127.0.0.1:42458_kx_ c:collection1 s:shard1  x:collection1_shard1_replica_n3] o.a.s.c.SolrCore [collection1_shard1_replica_n3] Registered new searcher Searcher@49ad471[collection1_shard1_replica_n3] main{ExitableDirectoryReader(UninvertingDirectoryReader())}
   [junit4]   2> 778481 INFO  (qtp461065706-99057) [n:127.0.0.1:42458_kx_ c:collection1 s:shard1  x:collection1_shard1_replica_n3] o.a.s.c.ShardLeaderElectionContext Enough replicas found to continue.
   [junit4]   2> 778481 INFO  (qtp461065706-99057) [n:127.0.0.1:42458_kx_ c:collection1 s:shard1  x:collection1_shard1_replica_n3] o.a.s.c.ShardLeaderElectionContext I may be the new leader - try and sync
   [junit4]   2> 778481 INFO  (qtp461065706-99057) [n:127.0.0.1:42458_kx_ c:collection1 s:shard1  x:collection1_shard1_replica_n3] o.a.s.c.SyncStrategy Sync replicas to https://127.0.0.1:42458/kx_/collection1_shard1_replica_n3/
   [junit4]   2> 778482 INFO  (qtp461065706-99057) [n:127.0.0.1:42458_kx_ c:collection1 s:shard1  x:collection1_shard1_replica_n3] o.a.s.c.SyncStrategy Sync Success - now sync replicas to me
   [junit4]   2> 778482 INFO  (qtp461065706-99057) [n:127.0.0.1:42458_kx_ c:collection1 s:shard1  x:collection1_shard1_replica_n3] o.a.s.c.SyncStrategy https://127.0.0.1:42458/kx_/collection1_shard1_replica_n3/ has no replicas
   [junit4]   2> 778482 INFO  (qtp461065706-99057) [n:127.0.0.1:42458_kx_ c:collection1 s:shard1  x:collection1_shard1_replica_n3] o.a.s.c.ShardLeaderElectionContext Found all replicas participating in election, clear LIR
   [junit4]   2> 778484 INFO  (qtp461065706-99057) [n:127.0.0.1:42458_kx_ c:collection1 s:shard1  x:collection1_shard1_replica_n3] o.a.s.c.ShardLeaderElectionContext I am the new leader: https://127.0.0.1:42458/kx_/collection1_shard1_replica_n3/ shard1
   [junit4]   2> 778586 INFO  (zkCallback-26350-thread-1-processing-n:127.0.0.1:48759_kx_) [n:127.0.0.1:48759_kx_    ] o.a.s.c.c.ZkStateReader A cluster state change: [WatchedEvent state:SyncConnected type:NodeDataChanged path:/collections/collection1/state.json] for collection [collection1] has occurred - updating... (live nodes size: [3])
   [junit4]   2> 778586 INFO  (zkCallback-26356-thread-1-processing-n:127.0.0.1:42458_kx_) [n:127.0.0.1:42458_kx_    ] o.a.s.c.c.ZkStateReader A cluster state change: [WatchedEvent state:SyncConnected type:NodeDataChanged path:/collections/collection1/state.json] for collection [collection1] has occurred - updating... (live nodes size: [3])
   [junit4]   2> 778634 INFO  (qtp461065706-99057) [n:127.0.0.1:42458_kx_ c:collection1 s:shard1  x:collection1_shard1_replica_n3] o.a.s.c.ZkController I am the leader, no recovery necessary
   [junit4]   2> 778636 INFO  (qtp461065706-99057) [n:127.0.0.1:42458_kx_ c:collection1 s:shard1  x:collection1_shard1_replica_n3] o.a.s.s.HttpSolrCall [admin] webapp=null path=/admin/cores params={qt=/admin/cores&collection.configName=conf1&name=collection1_shard1_replica_n3&action=CREATE&collection=collection1&shard=shard1&wt=javabin&version=2&replicaType=NRT} status=0 QTime=1330
   [junit4]   2> 778639 INFO  (qtp461065706-99055) [n:127.0.0.1:42458_kx_    ] o.a.s.s.HttpSolrCall [admin] webapp=null path=/admin/collections params={node=127.0.0.1:42458_kx_&action=ADDREPLICA&collection=collection1&shard=shard1&type=NRT&wt=javabin&version=2} status=0 QTime=1362
   [junit4]   2> 778738 INFO  (zkCallback-26356-thread-1-processing-n:127.0.0.1:42458_kx_) [n:127.0.0.1:42458_kx_    ] o.a.s.c.c.ZkStateReader A cluster state change: [WatchedEvent state:SyncConnected type:NodeDataChanged path:/collections/collection1/state.json] for collection [collection1] has occurred - updating... (live nodes size: [3])
   [junit4]   2> 778738 INFO  (zkCallback-26350-thread-1-processing-n:127.0.0.1:48759_kx_) [n:127.0.0.1:48759_kx_    ] o.a.s.c.c.ZkStateReader A cluster state change: [WatchedEvent state:SyncConnected type:NodeDataChanged path:/collections/collection1/state.json] for collection [collection1] has occurred - updating... (live nodes size: [3])
   [junit4]   2> 778740 INFO  (TEST-ChaosMonkeySafeLeaderTest.test-seed#[AD8EFD58D857BCD8]) [    ] o.a.s.c.AbstractFullDistribZkTestBase create jetty 3 in directory /x1/jenkins/jenkins-slave/workspace/Lucene-Solr-NightlyTests-master/checkout/solr/build/solr-core/test/J1/temp/solr.cloud.ChaosMonkeySafeLeaderTest_AD8EFD58D857BCD8-001/shard-3-001 of type NRT
   [junit4]   2> 778742 INFO  (TEST-ChaosMonkeySafeLeaderTest.test-seed#[AD8EFD58D857BCD8]) [    ] o.e.j.s.Server jetty-9.3.14.v20161028
   [junit4]   2> 778744 INFO  (TEST-ChaosMonkeySafeLeaderTes

[...truncated too long message...]

doop.hdfs.MiniDFSCluster.shutdown(MiniDFSCluster.java:1726)
   [junit4]   2> 	at org.apache.hadoop.hdfs.MiniDFSCluster.shutdown(MiniDFSCluster.java:1705)
   [junit4]   2> 	at org.apache.solr.cloud.hdfs.HdfsTestUtil.teardownClass(HdfsTestUtil.java:204)
   [junit4]   2> 	at org.apache.solr.cloud.hdfs.StressHdfsTest.teardownClass(StressHdfsTest.java:78)
   [junit4]   2> 	at sun.reflect.NativeMethodAccessorImpl.invoke0(Native Method)
   [junit4]   2> 	at sun.reflect.NativeMethodAccessorImpl.invoke(NativeMethodAccessorImpl.java:62)
   [junit4]   2> 	at sun.reflect.DelegatingMethodAccessorImpl.invoke(DelegatingMethodAccessorImpl.java:43)
   [junit4]   2> 	at java.lang.reflect.Method.invoke(Method.java:498)
   [junit4]   2> 	at com.carrotsearch.randomizedtesting.RandomizedRunner.invoke(RandomizedRunner.java:1713)
   [junit4]   2> 	at com.carrotsearch.randomizedtesting.RandomizedRunner$7.evaluate(RandomizedRunner.java:870)
   [junit4]   2> 	at com.carrotsearch.randomizedtesting.rules.StatementAdapter.evaluate(StatementAdapter.java:36)
   [junit4]   2> 	at com.carrotsearch.randomizedtesting.rules.SystemPropertiesRestoreRule$1.evaluate(SystemPropertiesRestoreRule.java:57)
   [junit4]   2> 	at org.apache.lucene.util.AbstractBeforeAfterRule$1.evaluate(AbstractBeforeAfterRule.java:45)
   [junit4]   2> 	at com.carrotsearch.randomizedtesting.rules.StatementAdapter.evaluate(StatementAdapter.java:36)
   [junit4]   2> 	at org.apache.lucene.util.TestRuleStoreClassName$1.evaluate(TestRuleStoreClassName.java:41)
   [junit4]   2> 	at com.carrotsearch.randomizedtesting.rules.NoShadowingOrOverridesOnMethodsRule$1.evaluate(NoShadowingOrOverridesOnMethodsRule.java:40)
   [junit4]   2> 	at com.carrotsearch.randomizedtesting.rules.NoShadowingOrOverridesOnMethodsRule$1.evaluate(NoShadowingOrOverridesOnMethodsRule.java:40)
   [junit4]   2> 	at com.carrotsearch.randomizedtesting.rules.StatementAdapter.evaluate(StatementAdapter.java:36)
   [junit4]   2> 	at com.carrotsearch.randomizedtesting.rules.StatementAdapter.evaluate(StatementAdapter.java:36)
   [junit4]   2> 	at com.carrotsearch.randomizedtesting.rules.StatementAdapter.evaluate(StatementAdapter.java:36)
   [junit4]   2> 	at org.apache.lucene.util.TestRuleAssertionsRequired$1.evaluate(TestRuleAssertionsRequired.java:53)
   [junit4]   2> 	at org.apache.lucene.util.TestRuleMarkFailure$1.evaluate(TestRuleMarkFailure.java:47)
   [junit4]   2> 	at org.apache.lucene.util.TestRuleIgnoreAfterMaxFailures$1.evaluate(TestRuleIgnoreAfterMaxFailures.java:64)
   [junit4]   2> 	at org.apache.lucene.util.TestRuleIgnoreTestSuites$1.evaluate(TestRuleIgnoreTestSuites.java:54)
   [junit4]   2> 	at com.carrotsearch.randomizedtesting.rules.StatementAdapter.evaluate(StatementAdapter.java:36)
   [junit4]   2> 	at com.carrotsearch.randomizedtesting.ThreadLeakControl$StatementRunner.run(ThreadLeakControl.java:368)
   [junit4]   2> 	at java.lang.Thread.run(Thread.java:748)
   [junit4]   2> Caused by: java.lang.NullPointerException
   [junit4]   2> 	at org.apache.hadoop.hdfs.server.blockmanagement.BlocksMap.size(BlocksMap.java:203)
   [junit4]   2> 	at org.apache.hadoop.hdfs.server.blockmanagement.BlockManager.getTotalBlocks(BlockManager.java:3370)
   [junit4]   2> 	at org.apache.hadoop.hdfs.server.namenode.FSNamesystem.getBlocksTotal(FSNamesystem.java:5729)
   [junit4]   2> 	... 54 more
   [junit4]   2> NOTE: leaving temporary files on disk at: /x1/jenkins/jenkins-slave/workspace/Lucene-Solr-NightlyTests-master/checkout/solr/build/solr-core/test/J1/temp/solr.cloud.hdfs.StressHdfsTest_AD8EFD58D857BCD8-001
   [junit4]   2> Aug 02, 2017 6:20:25 AM com.carrotsearch.randomizedtesting.ThreadLeakControl checkThreadLeaks
   [junit4]   2> WARNING: Will linger awaiting termination of 34 leaked thread(s).
   [junit4]   2> NOTE: test params are: codec=Lucene70, sim=RandomSimilarity(queryNorm=true): {}, locale=sv-SE, timezone=America/Puerto_Rico
   [junit4]   2> NOTE: Linux 3.13.0-88-generic amd64/Oracle Corporation 1.8.0_144 (64-bit)/cpus=4,threads=2,free=202881344,total=524288000
   [junit4]   2> NOTE: All tests run in this JVM: [TestMacroExpander, BlockCacheTest, IndexSchemaTest, TestClusterStateMutator, JsonLoaderTest, TestFiltering, TestPartialUpdateDeduplication, TestUpdate, CoreMergeIndexesAdminHandlerTest, SolrMetricReporterTest, ChaosMonkeySafeLeaderWithPullReplicasTest, FileUtilsTest, TestStandardQParsers, TestSolrCoreSnapshots, TestInfoStreamLogging, TestSchemaResource, HighlighterTest, TestJavabinTupleStreamParser, TestExpandComponent, TestManagedSynonymFilterFactory, TestXmlQParser, TestStressLiveNodes, SSLMigrationTest, ActionThrottleTest, DisMaxRequestHandlerTest, TestManagedSchema, TestSearcherReuse, TestDefaultStatsCache, MetricsConfigTest, DistributedExpandComponentTest, DistributedMLTComponentTest, SpatialFilterTest, DocExpirationUpdateProcessorFactoryTest, CdcrUpdateLogTest, CreateCollectionCleanupTest, TestExclusionRuleCollectionAccess, DocValuesTest, TestComplexPhraseQParserPlugin, BooleanFieldTest, DocValuesMultiTest, TestBackupRepositoryFactory, ConvertedLegacyTest, TestExactStatsCache, TestCloudRecovery, TestReloadAndDeleteDocs, TestCollectionAPI, HdfsRecoverLeaseTest, TestUnifiedSolrHighlighter, ImplicitSnitchTest, TermVectorComponentTest, CdcrBootstrapTest, OverseerStatusTest, DirectSolrConnectionTest, SolrCmdDistributorTest, DOMUtilTest, ZkSolrClientTest, TestMissingGroups, DistanceUnitsTest, PreAnalyzedUpdateProcessorTest, DistributedFacetPivotLongTailTest, CoreAdminHandlerTest, ScriptEngineTest, TestDeleteCollectionOnDownNodes, SparseHLLTest, TestOverriddenPrefixQueryForCustomFieldType, AtomicUpdateProcessorFactoryTest, TestPointFields, FullHLLTest, ReplicationFactorTest, TestEmbeddedSolrServerSchemaAPI, AssignTest, DistributedTermsComponentTest, VMParamsZkACLAndCredentialsProvidersTest, TestCloudSchemaless, TestCustomStream, TestFieldTypeCollectionResource, TestInitQParser, SmileWriterTest, TestSolr4Spatial2, TestLRUCache, TestFilteredDocIdSet, SolrIndexMetricsTest, ChaosMonkeySafeLeaderTest, TestValueSourceCache, TestSSLRandomization, TestAtomicUpdateErrorCases, TestSolrCloudWithSecureImpersonation, ConfigureRecoveryStrategyTest, TestConfigSetsAPIExclusivity, HttpSolrCallGetCoreTest, BlockJoinFacetRandomTest, ReplicaListTransformerTest, TestLeaderElectionZkExpiry, LoggingHandlerTest, TestNonDefinedSimilarityFactory, DistributedIntervalFacetingTest, TestHdfsUpdateLog, TestTrackingShardHandlerFactory, StatelessScriptUpdateProcessorFactoryTest, WrapperMergePolicyFactoryTest, AnalyticsQueryTest, TestXIncludeConfig, TestBM25SimilarityFactory, ClusterStateUpdateTest, TestFileDictionaryLookup, TestPKIAuthenticationPlugin, BlobRepositoryCloudTest, DeleteLastCustomShardedReplicaTest, TestLockTree, TestDynamicFieldResource, BadComponentTest, TestRandomFlRTGCloud, TestLegacyFieldReuse, TestPerFieldSimilarity, TestSizeLimitedDistributedMap, HdfsUnloadDistributedZkTest, CollectionTooManyReplicasTest, TestSolrIndexConfig, SharedFSAutoReplicaFailoverTest, ResourceLoaderTest, BasicDistributedZk2Test, UnloadDistributedZkTest, CollectionsAPIDistributedZkTest, SyncSliceTest, OverseerTest, LeaderElectionIntegrationTest, ShardRoutingTest, BasicZkTest, RecoveryZkTest, FullSolrCloudDistribCmdsTest, TestReplicationHandler, TestCoreContainer, SimpleFacetsTest, TestSolr4Spatial, TestGroupingSearch, DirectUpdateHandlerTest, ShowFileRequestHandlerTest, DistributedQueryElevationComponentTest, TestCoreDiscovery, AnalysisAfterCoreReloadTest, SpellCheckCollatorTest, SuggesterFSTTest, SolrRequestParserTest, TestFoldingMultitermQuery, SuggesterTSTTest, TestCSVLoader, NoCacheHeaderTest, SchemaVersionSpecificBehaviorTest, SolrCoreCheckLockOnStartupTest, TestPseudoReturnFields, FieldMutatingUpdateProcessorTest, DirectUpdateHandlerOptimizeTest, DefaultValueUpdateProcessorTest, SortByFunctionTest, DistanceFunctionTest, SolrInfoBeanTest, CacheHeaderTest, IndexBasedSpellCheckerTest, TestSurroundQueryParser, LukeRequestHandlerTest, DirectSolrSpellCheckerTest, TestQueryTypes, PrimitiveFieldTypeTest, TermsComponentTest, RequestHandlersTest, MoreLikeThisHandlerTest, TestSolrQueryParser, IndexSchemaRuntimeFieldTest, TestCollationField, TestCSVResponseWriter, UniqFieldsUpdateProcessorFactoryTest, PingRequestHandlerTest, TestMergePolicyConfig, TestSolrDeletionPolicy2, SampleTest, TestDocSet, TestBinaryField, TestSearchPerf, NumericFieldsTest, MinimalSchemaTest, TestElisionMultitermQuery, OutputWriterTest, TestFuzzyAnalyzedSuggestions, TestSolrCoreProperties, TestPostingsSolrHighlighter, SpellPossibilityIteratorTest, TestCharFilters, SynonymTokenizerTest, EchoParamsTest, TestSweetSpotSimilarityFactory, TestLMJelinekMercerSimilarityFactory, TestFastOutputStream, PluginInfoTest, DateMathParserTest, TestSystemIdResolver, PrimUtilsTest, TestSuggestSpellingConverter, RAMDirectoryFactoryTest, ClusterStateTest, TestSolrJ, TestUtils, TestDocumentBuilder, ZkNodePropsTest, SliceStateTest, SystemInfoHandlerTest, CircularListTest, TestRTGBase, CursorPagingTest, SolrTestCaseJ4Test, TestCursorMarkWithoutUniqueKey, TestSimpleTrackingShardHandler, TestEmbeddedSolrServerConstructors, ConnectionReuseTest, AssignBackwardCompatibilityTest, CloudExitableDirectoryReaderTest, CollectionsAPIAsyncDistributedZkTest, DeleteInactiveReplicaTest, DeleteReplicaTest, DistributedVersionInfoTest, LeaderFailoverAfterPartitionTest, MissingSegmentRecoveryTest, MoveReplicaHDFSUlogDirTest, NodeMutatorTest, OutOfBoxZkACLAndCredentialsProvidersTest, OverseerCollectionConfigSetProcessorTest, RecoveryAfterSoftCommitTest, TestAuthenticationFramework, TestCloudPivotFacet, TestConfigSetsAPI, TestOnReconnectListenerSupport, TestPrepRecovery, TestRequestStatusCollectionAPI, TestSolrCloudWithDelegationTokens, TestStressInPlaceUpdates, HdfsBasicDistributedZk2Test, HdfsChaosMonkeySafeLeaderTest, HdfsRestartWhileUpdatingTest, HdfsWriteToMultipleCollectionsTest, StressHdfsTest]
   [junit4] Completed [573/727 (6!)] on J1 in 92.80s, 1 test, 1 failure <<< FAILURES!

[...truncated 43713 lines...]

Mime
View raw message