lucene-dev mailing list archives

Site index · List index
Message view « Date » · « Thread »
Top « Date » · « Thread »
From Policeman Jenkins Server <jenk...@thetaphi.de>
Subject [JENKINS-EA] Lucene-Solr-master-Linux (64bit/jdk-9-ea+181) - Build # 20289 - Unstable!
Date Wed, 09 Aug 2017 22:52:45 GMT
Build: https://jenkins.thetaphi.de/job/Lucene-Solr-master-Linux/20289/
Java: 64bit/jdk-9-ea+181 -XX:-UseCompressedOops -XX:+UseG1GC --illegal-access=deny

3 tests failed.
FAILED:  org.apache.solr.cloud.ForceLeaderTest.testReplicasInLIRNoLeader

Error Message:
Doc with id=1 not found in http://127.0.0.1:33327/forceleader_test_collection due to: Path not found: /id; rsp={doc=null}

Stack Trace:
java.lang.AssertionError: Doc with id=1 not found in http://127.0.0.1:33327/forceleader_test_collection due to: Path not found: /id; rsp={doc=null}
	at __randomizedtesting.SeedInfo.seed([2F88C645175B3E58:C91FF2852ED9C739]:0)
	at org.junit.Assert.fail(Assert.java:93)
	at org.junit.Assert.assertTrue(Assert.java:43)
	at org.apache.solr.cloud.HttpPartitionTest.assertDocExists(HttpPartitionTest.java:603)
	at org.apache.solr.cloud.HttpPartitionTest.assertDocsExistInAllReplicas(HttpPartitionTest.java:556)
	at org.apache.solr.cloud.ForceLeaderTest.testReplicasInLIRNoLeader(ForceLeaderTest.java:142)
	at java.base/jdk.internal.reflect.NativeMethodAccessorImpl.invoke0(Native Method)
	at java.base/jdk.internal.reflect.NativeMethodAccessorImpl.invoke(NativeMethodAccessorImpl.java:62)
	at java.base/jdk.internal.reflect.DelegatingMethodAccessorImpl.invoke(DelegatingMethodAccessorImpl.java:43)
	at java.base/java.lang.reflect.Method.invoke(Method.java:564)
	at com.carrotsearch.randomizedtesting.RandomizedRunner.invoke(RandomizedRunner.java:1713)
	at com.carrotsearch.randomizedtesting.RandomizedRunner$8.evaluate(RandomizedRunner.java:907)
	at com.carrotsearch.randomizedtesting.RandomizedRunner$9.evaluate(RandomizedRunner.java:943)
	at com.carrotsearch.randomizedtesting.RandomizedRunner$10.evaluate(RandomizedRunner.java:957)
	at org.apache.solr.BaseDistributedSearchTestCase$ShardsRepeatRule$ShardsFixedStatement.callStatement(BaseDistributedSearchTestCase.java:993)
	at org.apache.solr.BaseDistributedSearchTestCase$ShardsRepeatRule$ShardsStatement.evaluate(BaseDistributedSearchTestCase.java:968)
	at com.carrotsearch.randomizedtesting.rules.SystemPropertiesRestoreRule$1.evaluate(SystemPropertiesRestoreRule.java:57)
	at org.apache.lucene.util.TestRuleSetupTeardownChained$1.evaluate(TestRuleSetupTeardownChained.java:49)
	at org.apache.lucene.util.AbstractBeforeAfterRule$1.evaluate(AbstractBeforeAfterRule.java:45)
	at org.apache.lucene.util.TestRuleThreadAndTestName$1.evaluate(TestRuleThreadAndTestName.java:48)
	at org.apache.lucene.util.TestRuleIgnoreAfterMaxFailures$1.evaluate(TestRuleIgnoreAfterMaxFailures.java:64)
	at org.apache.lucene.util.TestRuleMarkFailure$1.evaluate(TestRuleMarkFailure.java:47)
	at com.carrotsearch.randomizedtesting.rules.StatementAdapter.evaluate(StatementAdapter.java:36)
	at com.carrotsearch.randomizedtesting.ThreadLeakControl$StatementRunner.run(ThreadLeakControl.java:368)
	at com.carrotsearch.randomizedtesting.ThreadLeakControl.forkTimeoutingTask(ThreadLeakControl.java:817)
	at com.carrotsearch.randomizedtesting.ThreadLeakControl$3.evaluate(ThreadLeakControl.java:468)
	at com.carrotsearch.randomizedtesting.RandomizedRunner.runSingleTest(RandomizedRunner.java:916)
	at com.carrotsearch.randomizedtesting.RandomizedRunner$5.evaluate(RandomizedRunner.java:802)
	at com.carrotsearch.randomizedtesting.RandomizedRunner$6.evaluate(RandomizedRunner.java:852)
	at com.carrotsearch.randomizedtesting.RandomizedRunner$7.evaluate(RandomizedRunner.java:863)
	at com.carrotsearch.randomizedtesting.rules.StatementAdapter.evaluate(StatementAdapter.java:36)
	at com.carrotsearch.randomizedtesting.rules.SystemPropertiesRestoreRule$1.evaluate(SystemPropertiesRestoreRule.java:57)
	at org.apache.lucene.util.AbstractBeforeAfterRule$1.evaluate(AbstractBeforeAfterRule.java:45)
	at com.carrotsearch.randomizedtesting.rules.StatementAdapter.evaluate(StatementAdapter.java:36)
	at org.apache.lucene.util.TestRuleStoreClassName$1.evaluate(TestRuleStoreClassName.java:41)
	at com.carrotsearch.randomizedtesting.rules.NoShadowingOrOverridesOnMethodsRule$1.evaluate(NoShadowingOrOverridesOnMethodsRule.java:40)
	at com.carrotsearch.randomizedtesting.rules.NoShadowingOrOverridesOnMethodsRule$1.evaluate(NoShadowingOrOverridesOnMethodsRule.java:40)
	at com.carrotsearch.randomizedtesting.rules.StatementAdapter.evaluate(StatementAdapter.java:36)
	at com.carrotsearch.randomizedtesting.rules.StatementAdapter.evaluate(StatementAdapter.java:36)
	at org.apache.lucene.util.TestRuleAssertionsRequired$1.evaluate(TestRuleAssertionsRequired.java:53)
	at org.apache.lucene.util.TestRuleMarkFailure$1.evaluate(TestRuleMarkFailure.java:47)
	at org.apache.lucene.util.TestRuleIgnoreAfterMaxFailures$1.evaluate(TestRuleIgnoreAfterMaxFailures.java:64)
	at org.apache.lucene.util.TestRuleIgnoreTestSuites$1.evaluate(TestRuleIgnoreTestSuites.java:54)
	at com.carrotsearch.randomizedtesting.rules.StatementAdapter.evaluate(StatementAdapter.java:36)
	at com.carrotsearch.randomizedtesting.ThreadLeakControl$StatementRunner.run(ThreadLeakControl.java:368)
	at java.base/java.lang.Thread.run(Thread.java:844)


FAILED:  org.apache.solr.cloud.HttpPartitionTest.test

Error Message:
Doc with id=1 not found in http://127.0.0.1:43189/ydogu/collMinRf_1x3 due to: Path not found: /id; rsp={doc=null}

Stack Trace:
java.lang.AssertionError: Doc with id=1 not found in http://127.0.0.1:43189/ydogu/collMinRf_1x3 due to: Path not found: /id; rsp={doc=null}
	at __randomizedtesting.SeedInfo.seed([2F88C645175B3E58:A7DCF99FB9A753A0]:0)
	at org.junit.Assert.fail(Assert.java:93)
	at org.junit.Assert.assertTrue(Assert.java:43)
	at org.apache.solr.cloud.HttpPartitionTest.assertDocExists(HttpPartitionTest.java:603)
	at org.apache.solr.cloud.HttpPartitionTest.assertDocsExistInAllReplicas(HttpPartitionTest.java:558)
	at org.apache.solr.cloud.HttpPartitionTest.testMinRf(HttpPartitionTest.java:249)
	at org.apache.solr.cloud.HttpPartitionTest.test(HttpPartitionTest.java:127)
	at java.base/jdk.internal.reflect.NativeMethodAccessorImpl.invoke0(Native Method)
	at java.base/jdk.internal.reflect.NativeMethodAccessorImpl.invoke(NativeMethodAccessorImpl.java:62)
	at java.base/jdk.internal.reflect.DelegatingMethodAccessorImpl.invoke(DelegatingMethodAccessorImpl.java:43)
	at java.base/java.lang.reflect.Method.invoke(Method.java:564)
	at com.carrotsearch.randomizedtesting.RandomizedRunner.invoke(RandomizedRunner.java:1713)
	at com.carrotsearch.randomizedtesting.RandomizedRunner$8.evaluate(RandomizedRunner.java:907)
	at com.carrotsearch.randomizedtesting.RandomizedRunner$9.evaluate(RandomizedRunner.java:943)
	at com.carrotsearch.randomizedtesting.RandomizedRunner$10.evaluate(RandomizedRunner.java:957)
	at org.apache.solr.BaseDistributedSearchTestCase$ShardsRepeatRule$ShardsFixedStatement.callStatement(BaseDistributedSearchTestCase.java:993)
	at org.apache.solr.BaseDistributedSearchTestCase$ShardsRepeatRule$ShardsStatement.evaluate(BaseDistributedSearchTestCase.java:968)
	at com.carrotsearch.randomizedtesting.rules.SystemPropertiesRestoreRule$1.evaluate(SystemPropertiesRestoreRule.java:57)
	at org.apache.lucene.util.TestRuleSetupTeardownChained$1.evaluate(TestRuleSetupTeardownChained.java:49)
	at org.apache.lucene.util.AbstractBeforeAfterRule$1.evaluate(AbstractBeforeAfterRule.java:45)
	at org.apache.lucene.util.TestRuleThreadAndTestName$1.evaluate(TestRuleThreadAndTestName.java:48)
	at org.apache.lucene.util.TestRuleIgnoreAfterMaxFailures$1.evaluate(TestRuleIgnoreAfterMaxFailures.java:64)
	at org.apache.lucene.util.TestRuleMarkFailure$1.evaluate(TestRuleMarkFailure.java:47)
	at com.carrotsearch.randomizedtesting.rules.StatementAdapter.evaluate(StatementAdapter.java:36)
	at com.carrotsearch.randomizedtesting.ThreadLeakControl$StatementRunner.run(ThreadLeakControl.java:368)
	at com.carrotsearch.randomizedtesting.ThreadLeakControl.forkTimeoutingTask(ThreadLeakControl.java:817)
	at com.carrotsearch.randomizedtesting.ThreadLeakControl$3.evaluate(ThreadLeakControl.java:468)
	at com.carrotsearch.randomizedtesting.RandomizedRunner.runSingleTest(RandomizedRunner.java:916)
	at com.carrotsearch.randomizedtesting.RandomizedRunner$5.evaluate(RandomizedRunner.java:802)
	at com.carrotsearch.randomizedtesting.RandomizedRunner$6.evaluate(RandomizedRunner.java:852)
	at com.carrotsearch.randomizedtesting.RandomizedRunner$7.evaluate(RandomizedRunner.java:863)
	at com.carrotsearch.randomizedtesting.rules.StatementAdapter.evaluate(StatementAdapter.java:36)
	at com.carrotsearch.randomizedtesting.rules.SystemPropertiesRestoreRule$1.evaluate(SystemPropertiesRestoreRule.java:57)
	at org.apache.lucene.util.AbstractBeforeAfterRule$1.evaluate(AbstractBeforeAfterRule.java:45)
	at com.carrotsearch.randomizedtesting.rules.StatementAdapter.evaluate(StatementAdapter.java:36)
	at org.apache.lucene.util.TestRuleStoreClassName$1.evaluate(TestRuleStoreClassName.java:41)
	at com.carrotsearch.randomizedtesting.rules.NoShadowingOrOverridesOnMethodsRule$1.evaluate(NoShadowingOrOverridesOnMethodsRule.java:40)
	at com.carrotsearch.randomizedtesting.rules.NoShadowingOrOverridesOnMethodsRule$1.evaluate(NoShadowingOrOverridesOnMethodsRule.java:40)
	at com.carrotsearch.randomizedtesting.rules.StatementAdapter.evaluate(StatementAdapter.java:36)
	at com.carrotsearch.randomizedtesting.rules.StatementAdapter.evaluate(StatementAdapter.java:36)
	at org.apache.lucene.util.TestRuleAssertionsRequired$1.evaluate(TestRuleAssertionsRequired.java:53)
	at org.apache.lucene.util.TestRuleMarkFailure$1.evaluate(TestRuleMarkFailure.java:47)
	at org.apache.lucene.util.TestRuleIgnoreAfterMaxFailures$1.evaluate(TestRuleIgnoreAfterMaxFailures.java:64)
	at org.apache.lucene.util.TestRuleIgnoreTestSuites$1.evaluate(TestRuleIgnoreTestSuites.java:54)
	at com.carrotsearch.randomizedtesting.rules.StatementAdapter.evaluate(StatementAdapter.java:36)
	at com.carrotsearch.randomizedtesting.ThreadLeakControl$StatementRunner.run(ThreadLeakControl.java:368)
	at java.base/java.lang.Thread.run(Thread.java:844)


FAILED:  org.apache.solr.cloud.LeaderElectionContextKeyTest.test

Error Message:


Stack Trace:
java.lang.AssertionError
	at __randomizedtesting.SeedInfo.seed([2F88C645175B3E58:A7DCF99FB9A753A0]:0)
	at org.junit.Assert.fail(Assert.java:92)
	at org.junit.Assert.assertTrue(Assert.java:43)
	at org.junit.Assert.assertTrue(Assert.java:54)
	at org.apache.solr.cloud.LeaderElectionContextKeyTest.test(LeaderElectionContextKeyTest.java:88)
	at java.base/jdk.internal.reflect.NativeMethodAccessorImpl.invoke0(Native Method)
	at java.base/jdk.internal.reflect.NativeMethodAccessorImpl.invoke(NativeMethodAccessorImpl.java:62)
	at java.base/jdk.internal.reflect.DelegatingMethodAccessorImpl.invoke(DelegatingMethodAccessorImpl.java:43)
	at java.base/java.lang.reflect.Method.invoke(Method.java:564)
	at com.carrotsearch.randomizedtesting.RandomizedRunner.invoke(RandomizedRunner.java:1713)
	at com.carrotsearch.randomizedtesting.RandomizedRunner$8.evaluate(RandomizedRunner.java:907)
	at com.carrotsearch.randomizedtesting.RandomizedRunner$9.evaluate(RandomizedRunner.java:943)
	at com.carrotsearch.randomizedtesting.RandomizedRunner$10.evaluate(RandomizedRunner.java:957)
	at com.carrotsearch.randomizedtesting.rules.SystemPropertiesRestoreRule$1.evaluate(SystemPropertiesRestoreRule.java:57)
	at org.apache.lucene.util.TestRuleSetupTeardownChained$1.evaluate(TestRuleSetupTeardownChained.java:49)
	at org.apache.lucene.util.AbstractBeforeAfterRule$1.evaluate(AbstractBeforeAfterRule.java:45)
	at org.apache.lucene.util.TestRuleThreadAndTestName$1.evaluate(TestRuleThreadAndTestName.java:48)
	at org.apache.lucene.util.TestRuleIgnoreAfterMaxFailures$1.evaluate(TestRuleIgnoreAfterMaxFailures.java:64)
	at org.apache.lucene.util.TestRuleMarkFailure$1.evaluate(TestRuleMarkFailure.java:47)
	at com.carrotsearch.randomizedtesting.rules.StatementAdapter.evaluate(StatementAdapter.java:36)
	at com.carrotsearch.randomizedtesting.ThreadLeakControl$StatementRunner.run(ThreadLeakControl.java:368)
	at com.carrotsearch.randomizedtesting.ThreadLeakControl.forkTimeoutingTask(ThreadLeakControl.java:817)
	at com.carrotsearch.randomizedtesting.ThreadLeakControl$3.evaluate(ThreadLeakControl.java:468)
	at com.carrotsearch.randomizedtesting.RandomizedRunner.runSingleTest(RandomizedRunner.java:916)
	at com.carrotsearch.randomizedtesting.RandomizedRunner$5.evaluate(RandomizedRunner.java:802)
	at com.carrotsearch.randomizedtesting.RandomizedRunner$6.evaluate(RandomizedRunner.java:852)
	at com.carrotsearch.randomizedtesting.RandomizedRunner$7.evaluate(RandomizedRunner.java:863)
	at com.carrotsearch.randomizedtesting.rules.StatementAdapter.evaluate(StatementAdapter.java:36)
	at com.carrotsearch.randomizedtesting.rules.SystemPropertiesRestoreRule$1.evaluate(SystemPropertiesRestoreRule.java:57)
	at org.apache.lucene.util.AbstractBeforeAfterRule$1.evaluate(AbstractBeforeAfterRule.java:45)
	at com.carrotsearch.randomizedtesting.rules.StatementAdapter.evaluate(StatementAdapter.java:36)
	at org.apache.lucene.util.TestRuleStoreClassName$1.evaluate(TestRuleStoreClassName.java:41)
	at com.carrotsearch.randomizedtesting.rules.NoShadowingOrOverridesOnMethodsRule$1.evaluate(NoShadowingOrOverridesOnMethodsRule.java:40)
	at com.carrotsearch.randomizedtesting.rules.NoShadowingOrOverridesOnMethodsRule$1.evaluate(NoShadowingOrOverridesOnMethodsRule.java:40)
	at com.carrotsearch.randomizedtesting.rules.StatementAdapter.evaluate(StatementAdapter.java:36)
	at com.carrotsearch.randomizedtesting.rules.StatementAdapter.evaluate(StatementAdapter.java:36)
	at org.apache.lucene.util.TestRuleAssertionsRequired$1.evaluate(TestRuleAssertionsRequired.java:53)
	at org.apache.lucene.util.TestRuleMarkFailure$1.evaluate(TestRuleMarkFailure.java:47)
	at org.apache.lucene.util.TestRuleIgnoreAfterMaxFailures$1.evaluate(TestRuleIgnoreAfterMaxFailures.java:64)
	at org.apache.lucene.util.TestRuleIgnoreTestSuites$1.evaluate(TestRuleIgnoreTestSuites.java:54)
	at com.carrotsearch.randomizedtesting.rules.StatementAdapter.evaluate(StatementAdapter.java:36)
	at com.carrotsearch.randomizedtesting.ThreadLeakControl$StatementRunner.run(ThreadLeakControl.java:368)
	at java.base/java.lang.Thread.run(Thread.java:844)




Build Log:
[...truncated 11155 lines...]
   [junit4] Suite: org.apache.solr.cloud.LeaderElectionContextKeyTest
   [junit4]   2> 374215 INFO  (SUITE-LeaderElectionContextKeyTest-seed#[2F88C645175B3E58]-worker) [    ] o.a.s.SolrTestCaseJ4 SecureRandom sanity checks: test.solr.allowed.securerandom=null & java.security.egd=file:/dev/./urandom
   [junit4]   2> Creating dataDir: /home/jenkins/workspace/Lucene-Solr-master-Linux/solr/build/solr-core/test/J0/temp/solr.cloud.LeaderElectionContextKeyTest_2F88C645175B3E58-001/init-core-data-001
   [junit4]   2> 374215 WARN  (SUITE-LeaderElectionContextKeyTest-seed#[2F88C645175B3E58]-worker) [    ] o.a.s.SolrTestCaseJ4 startTrackingSearchers: numOpens=11 numCloses=11
   [junit4]   2> 374216 INFO  (SUITE-LeaderElectionContextKeyTest-seed#[2F88C645175B3E58]-worker) [    ] o.a.s.SolrTestCaseJ4 Using PointFields (NUMERIC_POINTS_SYSPROP=true) w/NUMERIC_DOCVALUES_SYSPROP=true
   [junit4]   2> 374216 INFO  (SUITE-LeaderElectionContextKeyTest-seed#[2F88C645175B3E58]-worker) [    ] o.a.s.SolrTestCaseJ4 Randomized ssl (true) and clientAuth (true) via: @org.apache.solr.util.RandomizeSSL(reason="", ssl=0.0/0.0, value=0.0/0.0, clientAuth=0.0/0.0)
   [junit4]   2> 374217 INFO  (SUITE-LeaderElectionContextKeyTest-seed#[2F88C645175B3E58]-worker) [    ] o.a.s.c.MiniSolrCloudCluster Starting cluster of 1 servers in /home/jenkins/workspace/Lucene-Solr-master-Linux/solr/build/solr-core/test/J0/temp/solr.cloud.LeaderElectionContextKeyTest_2F88C645175B3E58-001/tempDir-001
   [junit4]   2> 374218 INFO  (SUITE-LeaderElectionContextKeyTest-seed#[2F88C645175B3E58]-worker) [    ] o.a.s.c.ZkTestServer STARTING ZK TEST SERVER
   [junit4]   2> 374230 INFO  (Thread-999) [    ] o.a.s.c.ZkTestServer client port:0.0.0.0/0.0.0.0:0
   [junit4]   2> 374230 INFO  (Thread-999) [    ] o.a.s.c.ZkTestServer Starting server
   [junit4]   2> 374311 ERROR (Thread-999) [    ] o.a.z.s.ZooKeeperServer ZKShutdownHandler is not registered, so ZooKeeper server won't take any action on ERROR or SHUTDOWN server state changes
   [junit4]   2> 374330 INFO  (SUITE-LeaderElectionContextKeyTest-seed#[2F88C645175B3E58]-worker) [    ] o.a.s.c.ZkTestServer start zk server on port:39287
   [junit4]   2> 374410 INFO  (jetty-launcher-440-thread-1) [    ] o.e.j.s.Server jetty-9.3.14.v20161028
   [junit4]   2> 374461 INFO  (jetty-launcher-440-thread-1) [    ] o.e.j.s.h.ContextHandler Started o.e.j.s.ServletContextHandler@734251ec{/solr,null,AVAILABLE}
   [junit4]   2> 374463 INFO  (jetty-launcher-440-thread-1) [    ] o.e.j.s.AbstractConnector Started ServerConnector@2d3f90f2{SSL,[ssl, http/1.1]}{127.0.0.1:?????}
   [junit4]   2> 374463 INFO  (jetty-launcher-440-thread-1) [    ] o.e.j.s.Server Started @??????ms
   [junit4]   2> 374463 INFO  (jetty-launcher-440-thread-1) [    ] o.a.s.c.s.e.JettySolrRunner Jetty properties: {hostContext=/solr, hostPort=42611}
   [junit4]   2> 374463 ERROR (jetty-launcher-440-thread-1) [    ] o.a.s.s.StartupLoggingUtils Missing Java Option solr.log.dir. Logging may be missing or incomplete.
   [junit4]   2> 374463 INFO  (jetty-launcher-440-thread-1) [    ] o.a.s.s.SolrDispatchFilter  ___      _       Welcome to Apache Solr? version 8.0.0
   [junit4]   2> 374463 INFO  (jetty-launcher-440-thread-1) [    ] o.a.s.s.SolrDispatchFilter / __| ___| |_ _   Starting in cloud mode on port null
   [junit4]   2> 374463 INFO  (jetty-launcher-440-thread-1) [    ] o.a.s.s.SolrDispatchFilter \__ \/ _ \ | '_|  Install dir: null, Default config dir: null
   [junit4]   2> 374463 INFO  (jetty-launcher-440-thread-1) [    ] o.a.s.s.SolrDispatchFilter |___/\___/_|_|    Start time: 2017-08-09T22:00:07.193907Z
   [junit4]   2> 374490 INFO  (jetty-launcher-440-thread-1) [    ] o.a.s.s.SolrDispatchFilter solr.xml found in ZooKeeper. Loading...
   [junit4]   2> 374526 INFO  (jetty-launcher-440-thread-1) [    ] o.a.s.c.ZkContainer Zookeeper client=127.0.0.1:39287/solr
   [junit4]   2> 374614 INFO  (jetty-launcher-440-thread-1) [    ] o.a.s.c.Overseer Overseer (id=null) closing
   [junit4]   2> 374615 INFO  (jetty-launcher-440-thread-1) [    ] o.a.s.c.OverseerElectionContext I am going to be the leader 127.0.0.1:42611_solr
   [junit4]   2> 374615 INFO  (jetty-launcher-440-thread-1) [    ] o.a.s.c.Overseer Overseer (id=98455781832916995-127.0.0.1:42611_solr-n_0000000000) starting
   [junit4]   2> 374651 INFO  (jetty-launcher-440-thread-1) [    ] o.a.s.c.ZkController Register node as live in ZooKeeper:/live_nodes/127.0.0.1:42611_solr
   [junit4]   2> 374661 INFO  (zkCallback-447-thread-1) [    ] o.a.s.c.c.ZkStateReader Updated live nodes from ZooKeeper... (0) -> (1)
   [junit4]   2> 374698 INFO  (jetty-launcher-440-thread-1) [    ] o.a.s.m.r.SolrJmxReporter JMX monitoring for 'solr_42611.solr.node' (registry 'solr.node') enabled at server: com.sun.jmx.mbeanserver.JmxMBeanServer@38c3b527
   [junit4]   2> 374701 INFO  (jetty-launcher-440-thread-1) [    ] o.a.s.m.r.SolrJmxReporter JMX monitoring for 'solr_42611.solr.jvm' (registry 'solr.jvm') enabled at server: com.sun.jmx.mbeanserver.JmxMBeanServer@38c3b527
   [junit4]   2> 374701 INFO  (jetty-launcher-440-thread-1) [    ] o.a.s.m.r.SolrJmxReporter JMX monitoring for 'solr_42611.solr.jetty' (registry 'solr.jetty') enabled at server: com.sun.jmx.mbeanserver.JmxMBeanServer@38c3b527
   [junit4]   2> 374702 INFO  (jetty-launcher-440-thread-1) [    ] o.a.s.c.CorePropertiesLocator Found 0 core definitions underneath /home/jenkins/workspace/Lucene-Solr-master-Linux/solr/build/solr-core/test/J0/temp/solr.cloud.LeaderElectionContextKeyTest_2F88C645175B3E58-001/tempDir-001/node1/.
   [junit4]   2> 374822 INFO  (SUITE-LeaderElectionContextKeyTest-seed#[2F88C645175B3E58]-worker) [    ] o.a.s.c.c.ZkStateReader Updated live nodes from ZooKeeper... (0) -> (1)
   [junit4]   2> 374822 INFO  (SUITE-LeaderElectionContextKeyTest-seed#[2F88C645175B3E58]-worker) [    ] o.a.s.c.s.i.ZkClientClusterStateProvider Cluster at 127.0.0.1:39287/solr ready
   [junit4]   2> 374861 INFO  (qtp746083152-3514) [    ] o.a.s.h.a.CollectionsHandler Invoked Collection Action :create with params replicationFactor=1&collection.configName=config&maxShardsPerNode=1000&name=testCollection1&nrtReplicas=1&action=CREATE&numShards=2&wt=javabin&version=2 and sendToOCPQueue=true
   [junit4]   2> 374882 INFO  (OverseerThreadFactory-2061-thread-1) [    ] o.a.s.c.CreateCollectionCmd Create collection testCollection1
   [junit4]   2> 375015 INFO  (OverseerStateUpdate-98455781832916995-127.0.0.1:42611_solr-n_0000000000) [    ] o.a.s.c.o.SliceMutator createReplica() {
   [junit4]   2>   "operation":"ADDREPLICA",
   [junit4]   2>   "collection":"testCollection1",
   [junit4]   2>   "shard":"shard1",
   [junit4]   2>   "core":"testCollection1_shard1_replica_n1",
   [junit4]   2>   "state":"down",
   [junit4]   2>   "base_url":"https://127.0.0.1:42611/solr",
   [junit4]   2>   "type":"NRT"} 
   [junit4]   2> 375016 INFO  (OverseerStateUpdate-98455781832916995-127.0.0.1:42611_solr-n_0000000000) [    ] o.a.s.c.o.SliceMutator createReplica() {
   [junit4]   2>   "operation":"ADDREPLICA",
   [junit4]   2>   "collection":"testCollection1",
   [junit4]   2>   "shard":"shard2",
   [junit4]   2>   "core":"testCollection1_shard2_replica_n2",
   [junit4]   2>   "state":"down",
   [junit4]   2>   "base_url":"https://127.0.0.1:42611/solr",
   [junit4]   2>   "type":"NRT"} 
   [junit4]   2> 375266 INFO  (qtp746083152-3515) [    ] o.a.s.h.a.CoreAdminOperation core create command qt=/admin/cores&coreNodeName=core_node3&collection.configName=config&newCollection=true&name=testCollection1_shard1_replica_n1&action=CREATE&numShards=2&collection=testCollection1&shard=shard1&wt=javabin&version=2&replicaType=NRT
   [junit4]   2> 375267 INFO  (qtp746083152-3515) [    ] o.a.s.c.TransientSolrCoreCacheDefault Allocating transient cache for 2147483647 transient cores
   [junit4]   2> 375303 INFO  (qtp746083152-3520) [    ] o.a.s.h.a.CoreAdminOperation core create command qt=/admin/cores&coreNodeName=core_node4&collection.configName=config&newCollection=true&name=testCollection1_shard2_replica_n2&action=CREATE&numShards=2&collection=testCollection1&shard=shard2&wt=javabin&version=2&replicaType=NRT
   [junit4]   2> 375407 INFO  (zkCallback-447-thread-1) [    ] o.a.s.c.c.ZkStateReader A cluster state change: [WatchedEvent state:SyncConnected type:NodeDataChanged path:/collections/testCollection1/state.json] for collection [testCollection1] has occurred - updating... (live nodes size: [1])
   [junit4]   2> 375422 INFO  (zkCallback-447-thread-2) [    ] o.a.s.c.c.ZkStateReader A cluster state change: [WatchedEvent state:SyncConnected type:NodeDataChanged path:/collections/testCollection1/state.json] for collection [testCollection1] has occurred - updating... (live nodes size: [1])
   [junit4]   2> 376328 INFO  (qtp746083152-3520) [    ] o.a.s.c.SolrConfig Using Lucene MatchVersion: 8.0.0
   [junit4]   2> 376333 INFO  (qtp746083152-3515) [    ] o.a.s.c.SolrConfig Using Lucene MatchVersion: 8.0.0
   [junit4]   2> 376350 INFO  (qtp746083152-3515) [    ] o.a.s.s.IndexSchema [testCollection1_shard1_replica_n1] Schema name=minimal
   [junit4]   2> 376352 INFO  (qtp746083152-3515) [    ] o.a.s.s.IndexSchema Loaded schema minimal/1.1 with uniqueid field id
   [junit4]   2> 376352 INFO  (qtp746083152-3515) [    ] o.a.s.c.CoreContainer Creating SolrCore 'testCollection1_shard1_replica_n1' using configuration from collection testCollection1, trusted=true
   [junit4]   2> 376356 INFO  (qtp746083152-3520) [    ] o.a.s.s.IndexSchema [testCollection1_shard2_replica_n2] Schema name=minimal
   [junit4]   2> 376360 INFO  (qtp746083152-3520) [    ] o.a.s.s.IndexSchema Loaded schema minimal/1.1 with uniqueid field id
   [junit4]   2> 376360 INFO  (qtp746083152-3520) [    ] o.a.s.c.CoreContainer Creating SolrCore 'testCollection1_shard2_replica_n2' using configuration from collection testCollection1, trusted=true
   [junit4]   2> 376361 INFO  (qtp746083152-3515) [    ] o.a.s.m.r.SolrJmxReporter JMX monitoring for 'solr_42611.solr.core.testCollection1.shard1.replica_n1' (registry 'solr.core.testCollection1.shard1.replica_n1') enabled at server: com.sun.jmx.mbeanserver.JmxMBeanServer@38c3b527
   [junit4]   2> 376361 INFO  (qtp746083152-3520) [    ] o.a.s.m.r.SolrJmxReporter JMX monitoring for 'solr_42611.solr.core.testCollection1.shard2.replica_n2' (registry 'solr.core.testCollection1.shard2.replica_n2') enabled at server: com.sun.jmx.mbeanserver.JmxMBeanServer@38c3b527
   [junit4]   2> 376361 INFO  (qtp746083152-3520) [    ] o.a.s.c.SolrCore solr.RecoveryStrategy.Builder
   [junit4]   2> 376361 INFO  (qtp746083152-3520) [    ] o.a.s.c.SolrCore [[testCollection1_shard2_replica_n2] ] Opening new SolrCore at [/home/jenkins/workspace/Lucene-Solr-master-Linux/solr/build/solr-core/test/J0/temp/solr.cloud.LeaderElectionContextKeyTest_2F88C645175B3E58-001/tempDir-001/node1/testCollection1_shard2_replica_n2], dataDir=[/home/jenkins/workspace/Lucene-Solr-master-Linux/solr/build/solr-core/test/J0/temp/solr.cloud.LeaderElectionContextKeyTest_2F88C645175B3E58-001/tempDir-001/node1/./testCollection1_shard2_replica_n2/data/]
   [junit4]   2> 376362 INFO  (qtp746083152-3515) [    ] o.a.s.c.SolrCore solr.RecoveryStrategy.Builder
   [junit4]   2> 376362 INFO  (qtp746083152-3515) [    ] o.a.s.c.SolrCore [[testCollection1_shard1_replica_n1] ] Opening new SolrCore at [/home/jenkins/workspace/Lucene-Solr-master-Linux/solr/build/solr-core/test/J0/temp/solr.cloud.LeaderElectionContextKeyTest_2F88C645175B3E58-001/tempDir-001/node1/testCollection1_shard1_replica_n1], dataDir=[/home/jenkins/workspace/Lucene-Solr-master-Linux/solr/build/solr-core/test/J0/temp/solr.cloud.LeaderElectionContextKeyTest_2F88C645175B3E58-001/tempDir-001/node1/./testCollection1_shard1_replica_n1/data/]
   [junit4]   2> 376426 INFO  (qtp746083152-3520) [    ] o.a.s.u.UpdateHandler Using UpdateLog implementation: org.apache.solr.update.UpdateLog
   [junit4]   2> 376426 INFO  (qtp746083152-3520) [    ] o.a.s.u.UpdateLog Initializing UpdateLog: dataDir=null defaultSyncLevel=FLUSH numRecordsToKeep=100 maxNumLogsToKeep=10 numVersionBuckets=65536
   [junit4]   2> 376428 INFO  (qtp746083152-3520) [    ] o.a.s.u.CommitTracker Hard AutoCommit: disabled
   [junit4]   2> 376428 INFO  (qtp746083152-3520) [    ] o.a.s.u.CommitTracker Soft AutoCommit: disabled
   [junit4]   2> 376442 INFO  (qtp746083152-3520) [    ] o.a.s.s.SolrIndexSearcher Opening [Searcher@4ef9438b[testCollection1_shard2_replica_n2] main]
   [junit4]   2> 376443 INFO  (qtp746083152-3520) [    ] o.a.s.r.ManagedResourceStorage Configured ZooKeeperStorageIO with znodeBase: /configs/config
   [junit4]   2> 376444 INFO  (qtp746083152-3520) [    ] o.a.s.r.ManagedResourceStorage Loaded null at path _rest_managed.json using ZooKeeperStorageIO:path=/configs/config
   [junit4]   2> 376444 INFO  (qtp746083152-3520) [    ] o.a.s.h.ReplicationHandler Commits will be reserved for  10000
   [junit4]   2> 376445 INFO  (qtp746083152-3520) [    ] o.a.s.u.UpdateLog Could not find max version in index or recent updates, using new clock 1575292511636684800
   [junit4]   2> 376446 INFO  (searcherExecutor-2065-thread-1) [    ] o.a.s.c.SolrCore [testCollection1_shard2_replica_n2] Registered new searcher Searcher@4ef9438b[testCollection1_shard2_replica_n2] main{ExitableDirectoryReader(UninvertingDirectoryReader())}
   [junit4]   2> 376449 INFO  (qtp746083152-3520) [    ] o.a.s.c.ShardLeaderElectionContext Enough replicas found to continue.
   [junit4]   2> 376449 INFO  (qtp746083152-3520) [    ] o.a.s.c.ShardLeaderElectionContext I may be the new leader - try and sync
   [junit4]   2> 376449 INFO  (qtp746083152-3520) [    ] o.a.s.c.SyncStrategy Sync replicas to https://127.0.0.1:42611/solr/testCollection1_shard2_replica_n2/
   [junit4]   2> 376449 INFO  (qtp746083152-3520) [    ] o.a.s.c.SyncStrategy Sync Success - now sync replicas to me
   [junit4]   2> 376449 INFO  (qtp746083152-3520) [    ] o.a.s.c.SyncStrategy https://127.0.0.1:42611/solr/testCollection1_shard2_replica_n2/ has no replicas
   [junit4]   2> 376449 INFO  (qtp746083152-3520) [    ] o.a.s.c.ShardLeaderElectionContext Found all replicas participating in election, clear LIR
   [junit4]   2> 376452 INFO  (qtp746083152-3520) [    ] o.a.s.c.ShardLeaderElectionContext I am the new leader: https://127.0.0.1:42611/solr/testCollection1_shard2_replica_n2/ shard2
   [junit4]   2> 376463 INFO  (qtp746083152-3515) [    ] o.a.s.u.UpdateHandler Using UpdateLog implementation: org.apache.solr.update.UpdateLog
   [junit4]   2> 376463 INFO  (qtp746083152-3515) [    ] o.a.s.u.UpdateLog Initializing UpdateLog: dataDir=null defaultSyncLevel=FLUSH numRecordsToKeep=100 maxNumLogsToKeep=10 numVersionBuckets=65536
   [junit4]   2> 376465 INFO  (qtp746083152-3515) [    ] o.a.s.u.CommitTracker Hard AutoCommit: disabled
   [junit4]   2> 376465 INFO  (qtp746083152-3515) [    ] o.a.s.u.CommitTracker Soft AutoCommit: disabled
   [junit4]   2> 376466 INFO  (qtp746083152-3515) [    ] o.a.s.s.SolrIndexSearcher Opening [Searcher@7fe5c022[testCollection1_shard1_replica_n1] main]
   [junit4]   2> 376466 INFO  (qtp746083152-3515) [    ] o.a.s.r.ManagedResourceStorage Configured ZooKeeperStorageIO with znodeBase: /configs/config
   [junit4]   2> 376467 INFO  (qtp746083152-3515) [    ] o.a.s.r.ManagedResourceStorage Loaded null at path _rest_managed.json using ZooKeeperStorageIO:path=/configs/config
   [junit4]   2> 376467 INFO  (qtp746083152-3515) [    ] o.a.s.h.ReplicationHandler Commits will be reserved for  10000
   [junit4]   2> 376467 INFO  (qtp746083152-3515) [    ] o.a.s.u.UpdateLog Could not find max version in index or recent updates, using new clock 1575292511659753472
   [junit4]   2> 376468 INFO  (searcherExecutor-2064-thread-1) [    ] o.a.s.c.SolrCore [testCollection1_shard1_replica_n1] Registered new searcher Searcher@7fe5c022[testCollection1_shard1_replica_n1] main{ExitableDirectoryReader(UninvertingDirectoryReader())}
   [junit4]   2> 376470 INFO  (qtp746083152-3515) [    ] o.a.s.c.ShardLeaderElectionContext Enough replicas found to continue.
   [junit4]   2> 376470 INFO  (qtp746083152-3515) [    ] o.a.s.c.ShardLeaderElectionContext I may be the new leader - try and sync
   [junit4]   2> 376470 INFO  (qtp746083152-3515) [    ] o.a.s.c.SyncStrategy Sync replicas to https://127.0.0.1:42611/solr/testCollection1_shard1_replica_n1/
   [junit4]   2> 376470 INFO  (qtp746083152-3515) [    ] o.a.s.c.SyncStrategy Sync Success - now sync replicas to me
   [junit4]   2> 376470 INFO  (qtp746083152-3515) [    ] o.a.s.c.SyncStrategy https://127.0.0.1:42611/solr/testCollection1_shard1_replica_n1/ has no replicas
   [junit4]   2> 376470 INFO  (qtp746083152-3515) [    ] o.a.s.c.ShardLeaderElectionContext Found all replicas participating in election, clear LIR
   [junit4]   2> 376471 INFO  (qtp746083152-3515) [    ] o.a.s.c.ShardLeaderElectionContext I am the new leader: https://127.0.0.1:42611/solr/testCollection1_shard1_replica_n1/ shard1
   [junit4]   2> 376573 INFO  (zkCallback-447-thread-2) [    ] o.a.s.c.c.ZkStateReader A cluster state change: [WatchedEvent state:SyncConnected type:NodeDataChanged path:/collections/testCollection1/state.json] for collection [testCollection1] has occurred - updating... (live nodes size: [1])
   [junit4]   2> 376573 INFO  (zkCallback-447-thread-1) [    ] o.a.s.c.c.ZkStateReader A cluster state change: [WatchedEvent state:SyncConnected type:NodeDataChanged path:/collections/testCollection1/state.json] for collection [testCollection1] has occurred - updating... (live nodes size: [1])
   [junit4]   2> 376602 INFO  (qtp746083152-3520) [    ] o.a.s.c.ZkController I am the leader, no recovery necessary
   [junit4]   2> 376603 INFO  (qtp746083152-3520) [    ] o.a.s.s.HttpSolrCall [admin] webapp=null path=/admin/cores params={qt=/admin/cores&coreNodeName=core_node4&collection.configName=config&newCollection=true&name=testCollection1_shard2_replica_n2&action=CREATE&numShards=2&collection=testCollection1&shard=shard2&wt=javabin&version=2&replicaType=NRT} status=0 QTime=1300
   [junit4]   2> 376622 INFO  (qtp746083152-3515) [    ] o.a.s.c.ZkController I am the leader, no recovery necessary
   [junit4]   2> 376623 INFO  (qtp746083152-3515) [    ] o.a.s.s.HttpSolrCall [admin] webapp=null path=/admin/cores params={qt=/admin/cores&coreNodeName=core_node3&collection.configName=config&newCollection=true&name=testCollection1_shard1_replica_n1&action=CREATE&numShards=2&collection=testCollection1&shard=shard1&wt=javabin&version=2&replicaType=NRT} status=0 QTime=1357
   [junit4]   2> 376627 INFO  (qtp746083152-3514) [    ] o.a.s.h.a.CollectionsHandler Wait for new collection to be active for at most 30 seconds. Check all shard replicas
   [junit4]   2> 376725 INFO  (zkCallback-447-thread-2) [    ] o.a.s.c.c.ZkStateReader A cluster state change: [WatchedEvent state:SyncConnected type:NodeDataChanged path:/collections/testCollection1/state.json] for collection [testCollection1] has occurred - updating... (live nodes size: [1])
   [junit4]   2> 376725 INFO  (zkCallback-447-thread-1) [    ] o.a.s.c.c.ZkStateReader A cluster state change: [WatchedEvent state:SyncConnected type:NodeDataChanged path:/collections/testCollection1/state.json] for collection [testCollection1] has occurred - updating... (live nodes size: [1])
   [junit4]   2> 376890 INFO  (OverseerCollectionConfigSetProcessor-98455781832916995-127.0.0.1:42611_solr-n_0000000000) [    ] o.a.s.c.OverseerTaskQueue Response ZK path: /overseer/collection-queue-work/qnr-0000000000 doesn't exist.  Requestor may have disconnected from ZooKeeper
   [junit4]   2> 377627 INFO  (qtp746083152-3514) [    ] o.a.s.s.HttpSolrCall [admin] webapp=null path=/admin/collections params={replicationFactor=1&collection.configName=config&maxShardsPerNode=1000&name=testCollection1&nrtReplicas=1&action=CREATE&numShards=2&wt=javabin&version=2} status=0 QTime=2766
   [junit4]   2> 377628 INFO  (qtp746083152-3518) [    ] o.a.s.h.a.CollectionsHandler Invoked Collection Action :create with params replicationFactor=1&collection.configName=config&maxShardsPerNode=1000&name=testCollection2&nrtReplicas=1&action=CREATE&numShards=2&wt=javabin&version=2 and sendToOCPQueue=true
   [junit4]   2> 377638 INFO  (OverseerThreadFactory-2061-thread-2) [    ] o.a.s.c.CreateCollectionCmd Create collection testCollection2
   [junit4]   2> 377843 INFO  (OverseerStateUpdate-98455781832916995-127.0.0.1:42611_solr-n_0000000000) [    ] o.a.s.c.o.SliceMutator createReplica() {
   [junit4]   2>   "operation":"ADDREPLICA",
   [junit4]   2>   "collection":"testCollection2",
   [junit4]   2>   "shard":"shard1",
   [junit4]   2>   "core":"testCollection2_shard1_replica_n1",
   [junit4]   2>   "state":"down",
   [junit4]   2>   "base_url":"https://127.0.0.1:42611/solr",
   [junit4]   2>   "type":"NRT"} 
   [junit4]   2> 377848 INFO  (OverseerStateUpdate-98455781832916995-127.0.0.1:42611_solr-n_0000000000) [    ] o.a.s.c.o.SliceMutator createReplica() {
   [junit4]   2>   "operation":"ADDREPLICA",
   [junit4]   2>   "collection":"testCollection2",
   [junit4]   2>   "shard":"shard2",
   [junit4]   2>   "core":"testCollection2_shard2_replica_n3",
   [junit4]   2>   "state":"down",
   [junit4]   2>   "base_url":"https://127.0.0.1:42611/solr",
   [junit4]   2>   "type":"NRT"} 
   [junit4]   2> 378054 INFO  (qtp746083152-3551) [    ] o.a.s.h.a.CoreAdminOperation core create command qt=/admin/cores&coreNodeName=core_node2&collection.configName=config&newCollection=true&name=testCollection2_shard1_replica_n1&action=CREATE&numShards=2&collection=testCollection2&shard=shard1&wt=javabin&version=2&replicaType=NRT
   [junit4]   2> 378055 INFO  (qtp746083152-3552) [    ] o.a.s.h.a.CoreAdminOperation core create command qt=/admin/cores&coreNodeName=core_node4&collection.configName=config&newCollection=true&name=testCollection2_shard2_replica_n3&action=CREATE&numShards=2&collection=testCollection2&shard=shard2&wt=javabin&version=2&replicaType=NRT
   [junit4]   2> 378161 INFO  (zkCallback-447-thread-2) [    ] o.a.s.c.c.ZkStateReader A cluster state change: [WatchedEvent state:SyncConnected type:NodeDataChanged path:/collections/testCollection2/state.json] for collection [testCollection2] has occurred - updating... (live nodes size: [1])
   [junit4]   2> 378161 INFO  (zkCallback-447-thread-1) [    ] o.a.s.c.c.ZkStateReader A cluster state change: [WatchedEvent state:SyncConnected type:NodeDataChanged path:/collections/testCollection2/state.json] for collection [testCollection2] has occurred - updating... (live nodes size: [1])
   [junit4]   2> 379064 INFO  (qtp746083152-3551) [    ] o.a.s.c.SolrConfig Using Lucene MatchVersion: 8.0.0
   [junit4]   2> 379092 INFO  (qtp746083152-3552) [    ] o.a.s.c.SolrConfig Using Lucene MatchVersion: 8.0.0
   [junit4]   2> 379101 INFO  (qtp746083152-3552) [    ] o.a.s.s.IndexSchema [testCollection2_shard2_replica_n3] Schema name=minimal
   [junit4]   2> 379102 INFO  (qtp746083152-3551) [    ] o.a.s.s.IndexSchema [testCollection2_shard1_replica_n1] Schema name=minimal
   [junit4]   2> 379104 INFO  (qtp746083152-3552) [    ] o.a.s.s.IndexSchema Loaded schema minimal/1.1 with uniqueid field id
   [junit4]   2> 379104 INFO  (qtp746083152-3552) [    ] o.a.s.c.CoreContainer Creating SolrCore 'testCollection2_shard2_replica_n3' using configuration from collection testCollection2, trusted=true
   [junit4]   2> 379104 INFO  (qtp746083152-3551) [    ] o.a.s.s.IndexSchema Loaded schema minimal/1.1 with uniqueid field id
   [junit4]   2> 379104 INFO  (qtp746083152-3551) [    ] o.a.s.c.CoreContainer Creating SolrCore 'testCollection2_shard1_replica_n1' using configuration from collection testCollection2, trusted=true
   [junit4]   2> 379105 INFO  (qtp746083152-3551) [    ] o.a.s.m.r.SolrJmxReporter JMX monitoring for 'solr_42611.solr.core.testCollection2.shard1.replica_n1' (registry 'solr.core.testCollection2.shard1.replica_n1') enabled at server: com.sun.jmx.mbeanserver.JmxMBeanServer@38c3b527
   [junit4]   2> 379105 INFO  (qtp746083152-3551) [    ] o.a.s.c.SolrCore solr.RecoveryStrategy.Builder
   [junit4]   2> 379105 INFO  (qtp746083152-3551) [    ] o.a.s.c.SolrCore [[testCollection2_shard1_replica_n1] ] Opening new SolrCore at [/home/jenkins/workspace/Lucene-Solr-master-Linux/solr/build/solr-core/test/J0/temp/solr.cloud.LeaderElectionContextKeyTest_2F88C645175B3E58-001/tempDir-001/node1/testCollection2_shard1_replica_n1], dataDir=[/home/jenkins/workspace/Lucene-Solr-master-Linux/solr/build/solr-core/test/J0/temp/solr.cloud.LeaderElectionContextKeyTest_2F88C645175B3E58-001/tempDir-001/node1/./testCollection2_shard1_replica_n1/data/]
   [junit4]   2> 379106 INFO  (qtp746083152-3552) [    ] o.a.s.m.r.SolrJmxReporter JMX monitoring for 'solr_42611.solr.core.testCollection2.shard2.replica_n3' (registry 'solr.core.testCollection2.shard2.replica_n3') enabled at server: com.sun.jmx.mbeanserver.JmxMBeanServer@38c3b527
   [junit4]   2> 379106 INFO  (qtp746083152-3552) [    ] o.a.s.c.SolrCore solr.RecoveryStrategy.Builder
   [junit4]   2> 379106 INFO  (qtp746083152-3552) [    ] o.a.s.c.SolrCore [[testCollection2_shard2_replica_n3] ] Opening new SolrCore at [/home/jenkins/workspace/Lucene-Solr-master-Linux/solr/build/solr-core/test/J0/temp/solr.cloud.LeaderElectionContextKeyTest_2F88C645175B3E58-001/tempDir-001/node1/testCollection2_shard2_replica_n3], dataDir=[/home/jenkins/workspace/Lucene-Solr-master-Linux/solr/build/solr-core/test/J0/temp/solr.cloud.LeaderElectionContextKeyTest_2F88C645175B3E58-001/tempDir-001/node1/./testCollection2_shard2_replica_n3/data/]
   [junit4]   2> 379169 INFO  (qtp746083152-3551) [    ] o.a.s.u.UpdateHandler Using UpdateLog implementation: org.apache.solr.update.UpdateLog
   [junit4]   2> 379169 INFO  (qtp746083152-3551) [    ] o.a.s.u.UpdateLog Initializing UpdateLog: dataDir=null defaultSyncLevel=FLUSH numRecordsToKeep=100 maxNumLogsToKeep=10 numVersionBuckets=65536
   [junit4]   2> 379191 INFO  (qtp746083152-3551) [    ] o.a.s.u.CommitTracker Hard AutoCommit: disabled
   [junit4]   2> 379191 INFO  (qtp746083152-3551) [    ] o.a.s.u.CommitTracker Soft AutoCommit: disabled
   [junit4]   2> 379193 INFO  (qtp746083152-3551) [    ] o.a.s.s.SolrIndexSearcher Opening [Searcher@63afd30b[testCollection2_shard1_replica_n1] main]
   [junit4]   2> 379196 INFO  (qtp746083152-3551) [    ] o.a.s.r.ManagedResourceStorage Configured ZooKeeperStorageIO with znodeBase: /configs/config
   [junit4]   2> 379197 INFO  (qtp746083152-3551) [    ] o.a.s.r.ManagedResourceStorage Loaded null at path _rest_managed.json using ZooKeeperStorageIO:path=/configs/config
   [junit4]   2> 379197 INFO  (qtp746083152-3551) [    ] o.a.s.h.ReplicationHandler Commits will be reserved for  10000
   [junit4]   2> 379198 INFO  (qtp746083152-3551) [    ] o.a.s.u.UpdateLog Could not find max version in index or recent updates, using new clock 1575292514523414528
   [junit4]   2> 379199 INFO  (searcherExecutor-2075-thread-1) [    ] o.a.s.c.SolrCore [testCollection2_shard1_replica_n1] Registered new searcher Searcher@63afd30b[testCollection2_shard1_replica_n1] main{ExitableDirectoryReader(UninvertingDirectoryReader())}
   [junit4]   2> 379207 INFO  (qtp746083152-3551) [    ] o.a.s.c.ShardLeaderElectionContext Enough replicas found to continue.
   [junit4]   2> 379207 INFO  (qtp746083152-3551) [    ] o.a.s.c.ShardLeaderElectionContext I may be the new leader - try and sync
   [junit4]   2> 379207 INFO  (qtp746083152-3551) [    ] o.a.s.c.SyncStrategy Sync replicas to https://127.0.0.1:42611/solr/testCollection2_shard1_replica_n1/
   [junit4]   2> 379207 INFO  (qtp746083152-3551) [    ] o.a.s.c.SyncStrategy Sync Success - now sync replicas to me
   [junit4]   2> 379207 INFO  (qtp746083152-3551) [    ] o.a.s.c.SyncStrategy https://127.0.0.1:42611/solr/testCollection2_shard1_replica_n1/ has no replicas
   [junit4]   2> 379207 INFO  (qtp746083152-3551) [    ] o.a.s.c.ShardLeaderElectionContext Found all replicas participating in election, clear LIR
   [junit4]   2> 379225 INFO  (qtp746083152-3551) [    ] o.a.s.c.ShardLeaderElectionContext I am the new leader: https://127.0.0.1:42611/solr/testCollection2_shard1_replica_n1/ shard1
   [junit4]   2> 379235 INFO  (qtp746083152-3552) [    ] o.a.s.u.UpdateHandler Using UpdateLog implementation: org.apache.solr.update.UpdateLog
   [junit4]   2> 379235 INFO  (qtp746083152-3552) [    ] o.a.s.u.UpdateLog Initializing UpdateLog: dataDir=null defaultSyncLevel=FLUSH numRecordsToKeep=100 maxNumLogsToKeep=10 numVersionBuckets=65536
   [junit4]   2> 379237 INFO  (qtp746083152-3552) [    ] o.a.s.u.CommitTracker Hard AutoCommit: disabled
   [junit4]   2> 379237 INFO  (qtp746083152-3552) [    ] o.a.s.u.CommitTracker Soft AutoCommit: disabled
   [junit4]   2> 379244 INFO  (qtp746083152-3552) [    ] o.a.s.s.SolrIndexSearcher Opening [Searcher@4660fc78[testCollection2_shard2_replica_n3] main]
   [junit4]   2> 379246 INFO  (qtp746083152-3552) [    ] o.a.s.r.ManagedResourceStorage Configured ZooKeeperStorageIO with znodeBase: /configs/config
   [junit4]   2> 379247 INFO  (qtp746083152-3552) [    ] o.a.s.r.ManagedResourceStorage Loaded null at path _rest_managed.json using ZooKeeperStorageIO:path=/configs/config
   [junit4]   2> 379248 INFO  (qtp746083152-3552) [    ] o.a.s.h.ReplicationHandler Commits will be reserved for  10000
   [junit4]   2> 379249 INFO  (searcherExecutor-2074-thread-1) [    ] o.a.s.c.SolrCore [testCollection2_shard2_replica_n3] Registered new searcher Searcher@4660fc78[testCollection2_shard2_replica_n3] main{ExitableDirectoryReader(UninvertingDirectoryReader())}
   [junit4]   2> 379249 INFO  (qtp746083152-3552) [    ] o.a.s.u.UpdateLog Could not find max version in index or recent updates, using new clock 1575292514576891904
   [junit4]   2> 379259 INFO  (qtp746083152-3552) [    ] o.a.s.c.ShardLeaderElectionContext Enough replicas found to continue.
   [junit4]   2> 379259 INFO  (qtp746083152-3552) [    ] o.a.s.c.ShardLeaderElectionContext I may be the new leader - try and sync
   [junit4]   2> 379259 INFO  (qtp746083152-3552) [    ] o.a.s.c.SyncStrategy Sync replicas to https://127.0.0.1:42611/solr/testCollection2_shard2_replica_n3/
   [junit4]   2> 379259 INFO  (qtp746083152-3552) [    ] o.a.s.c.SyncStrategy Sync Success - now sync replicas to me
   [junit4]   2> 379259 INFO  (qtp746083152-3552) [    ] o.a.s.c.SyncStrategy https://127.0.0.1:42611/solr/testCollection2_shard2_replica_n3/ has no replicas
   [junit4]   2> 379259 INFO  (qtp746083152-3552) [    ] o.a.s.c.ShardLeaderElectionContext Found all replicas participating in election, clear LIR
   [junit4]   2> 379263 INFO  (qtp746083152-3552) [    ] o.a.s.c.ShardLeaderElectionContext I am the new leader: https://127.0.0.1:42611/solr/testCollection2_shard2_replica_n3/ shard2
   [junit4]   2> 379364 INFO  (zkCallback-447-thread-1) [    ] o.a.s.c.c.ZkStateReader A cluster state change: [WatchedEvent state:SyncConnected type:NodeDataChanged path:/collections/testCollection2/state.json] for collection [testCollection2] has occurred - updating... (live nodes size: [1])
   [junit4]   2> 379364 INFO  (zkCallback-447-thread-2) [    ] o.a.s.c.c.ZkStateReader A cluster state change: [WatchedEvent state:SyncConnected type:NodeDataChanged path:/collections/testCollection2/state.json] for collection [testCollection2] has occurred - updating... (live nodes size: [1])
   [junit4]   2> 379397 INFO  (qtp746083152-3551) [    ] o.a.s.c.ZkController I am the leader, no recovery necessary
   [junit4]   2> 379397 INFO  (qtp746083152-3552) [    ] o.a.s.c.ZkController I am the leader, no recovery necessary
   [junit4]   2> 379398 INFO  (qtp746083152-3551) [    ] o.a.s.s.HttpSolrCall [admin] webapp=null path=/admin/cores params={qt=/admin/cores&coreNodeName=core_node2&collection.configName=config&newCollection=true&name=testCollection2_shard1_replica_n1&action=CREATE&numShards=2&collection=testCollection2&shard=shard1&wt=javabin&version=2&replicaType=NRT} status=0 QTime=1343
   [junit4]   2> 379398 INFO  (qtp746083152-3552) [    ] o.a.s.s.HttpSolrCall [admin] webapp=null path=/admin/cores params={qt=/admin/cores&coreNodeName=core_node4&collection.configName=config&newCollection=true&name=testCollection2_shard2_replica_n3&action=CREATE&numShards=2&collection=testCollection2&shard=shard2&wt=javabin&version=2&replicaType=NRT} status=0 QTime=1343
   [junit4]   2> 379407 INFO  (qtp746083152-3518) [    ] o.a.s.h.a.CollectionsHandler Wait for new collection to be active for at most 30 seconds. Check all shard replicas
   [junit4]   2> 379501 INFO  (zkCallback-447-thread-1) [    ] o.a.s.c.c.ZkStateReader A cluster state change: [WatchedEvent state:SyncConnected type:NodeDataChanged path:/collections/testCollection2/state.json] for collection [testCollection2] has occurred - updating... (live nodes size: [1])
   [junit4]   2> 379501 INFO  (zkCallback-447-thread-2) [    ] o.a.s.c.c.ZkStateReader A cluster state change: [WatchedEvent state:SyncConnected type:NodeDataChanged path:/collections/testCollection2/state.json] for collection [testCollection2] has occurred - updating... (live nodes size: [1])
   [junit4]   2> 379639 INFO  (OverseerCollectionConfigSetProcessor-98455781832916995-127.0.0.1:42611_solr-n_0000000000) [    ] o.a.s.c.OverseerTaskQueue Response ZK path: /overseer/collection-queue-work/qnr-0000000002 doesn't exist.  Requestor may have disconnected from ZooKeeper
   [junit4]   2> 380410 INFO  (qtp746083152-3518) [    ] o.a.s.s.HttpSolrCall [admin] webapp=null path=/admin/collections params={replicationFactor=1&collection.configName=config&maxShardsPerNode=1000&name=testCollection2&nrtReplicas=1&action=CREATE&numShards=2&wt=javabin&version=2} status=0 QTime=2781
   [junit4]   2> 380412 INFO  (SUITE-LeaderElectionContextKeyTest-seed#[2F88C645175B3E58]-worker) [    ] o.a.s.c.AbstractDistribZkTestBase Wait for recoveries to finish - collection: testCollection1 failOnTimeout:true timeout (sec):30
   [junit4]   2> 380413 INFO  (SUITE-LeaderElectionContextKeyTest-seed#[2F88C645175B3E58]-worker) [    ] o.a.s.c.AbstractDistribZkTestBase Recoveries finished - collection: testCollection1
   [junit4]   2> 380413 INFO  (SUITE-LeaderElectionContextKeyTest-seed#[2F88C645175B3E58]-worker) [    ] o.a.s.c.AbstractDistribZkTestBase Wait for recoveries to finish - collection: testCollection2 failOnTimeout:true timeout (sec):30
   [junit4]   2> 380414 INFO  (SUITE-LeaderElectionContextKeyTest-seed#[2F88C645175B3E58]-worker) [    ] o.a.s.c.AbstractDistribZkTestBase Recoveries finished - collection: testCollection2
   [junit4]   2> 380420 INFO  (TEST-LeaderElectionContextKeyTest.test-seed#[2F88C645175B3E58]) [    ] o.a.s.SolrTestCaseJ4 ###Starting test
   [junit4]   2> 380430 INFO  (qtp746083152-3517) [    ] o.a.s.m.SolrMetricManager Closing metric reporters for registry=solr.core.testCollection1.shard2.replica_n2, tag=null
   [junit4]   2> 380435 INFO  (qtp746083152-3517) [    ] o.a.s.c.SolrCore [testCollection1_shard2_replica_n2]  CLOSING SolrCore org.apache.solr.core.SolrCore@64e6730b
   [junit4]   2> 380454 INFO  (qtp746083152-3517) [    ] o.a.s.m.SolrMetricManager Closing metric reporters for registry=solr.core.testCollection1.shard2.replica_n2, tag=1692824331
   [junit4]   2> 380454 INFO  (qtp746083152-3517) [    ] o.a.s.m.SolrMetricManager Closing metric reporters for registry=solr.collection.testCollection1.shard2.leader, tag=1692824331
   [junit4]   2> 380457 INFO  (qtp746083152-3517) [    ] o.a.s.s.HttpSolrCall [admin] webapp=null path=/admin/cores params={deleteInstanceDir=false&core=testCollection1_shard2_replica_n2&deleteDataDir=false&action=UNLOAD&indexInfo=true&wt=javabin&version=2&deleteIndex=false} status=0 QTime=27
   [junit4]   2> 380459 INFO  (TEST-LeaderElectionContextKeyTest.test-seed#[2F88C645175B3E58]) [    ] o.a.s.SolrTestCaseJ4 ###Ending test
   [junit4]   2> NOTE: reproduce with: ant test  -Dtestcase=LeaderElectionContextKeyTest -Dtests.method=test -Dtests.seed=2F88C645175B3E58 -Dtests.multiplier=3 -Dtests.slow=true -Dtests.locale=ne-NP -Dtests.timezone=Eire -Dtests.asserts=true -Dtests.file.encoding=US-ASCII
   [junit4] FAILURE 0.05s J0 | LeaderElectionContextKeyTest.test <<<
   [junit4]    > Throwable #1: java.lang.AssertionError
   [junit4]    > 	at __randomizedtesting.SeedInfo.seed([2F88C645175B3E58:A7DCF99FB9A753A0]:0)
   [junit4]    > 	at org.apache.solr.cloud.LeaderElectionContextKeyTest.test(LeaderElectionContextKeyTest.java:88)
   [junit4]    > 	at java.base/jdk.internal.reflect.NativeMethodAccessorImpl.invoke0(Native Method)
   [junit4]    > 	at java.base/jdk.internal.reflect.NativeMethodAccessorImpl.invoke(NativeMethodAccessorImpl.java:62)
   [junit4]    > 	at java.base/jdk.internal.reflect.DelegatingMethodAccessorImpl.invoke(DelegatingMethodAccessorImpl.java:43)
   [junit4]    > 	at java.base/java.lang.reflect.Method.invoke(Method.java:564)
   [junit4]    > 	at java.base/java.lang.Thread.run(Thread.java:844)
   [junit4]   2> 380474 INFO  (jetty-closer-441-thread-1) [    ] o.e.j.s.AbstractConnector Stopped ServerConnector@2d3f90f2{SSL,[ssl, http/1.1]}{127.0.0.1:?}
   [junit4]   2> 380474 INFO  (jetty-closer-441-thread-1) [    ] o.a.s.c.CoreContainer Shutting down CoreContainer instance=353962100
   [junit4]   2> 380475 INFO  (jetty-closer-441-thread-1) [    ] o.a.s.m.SolrMetricManager Closing metric reporters for registry=solr.node, tag=null
   [junit4]   2> 380476 INFO  (jetty-closer-441-thread-1) [    ] o.a.s.m.SolrMetricManager Closing metric reporters for registry=solr.jvm, tag=null
   [junit4]   2> 380477 INFO  (jetty-closer-441-thread-1) [    ] o.a.s.m.SolrMetricManager Closing metric reporters for registry=solr.jetty, tag=null
   [junit4]   2> 380477 INFO  (jetty-closer-441-thread-1) [    ] o.a.s.m.SolrMetricManager Closing metric reporters for registry=solr.cluster, tag=null
   [junit4]   2> 380482 INFO  (coreCloseExecutor-2084-thread-2) [    ] o.a.s.c.SolrCore [testCollection2_shard1_replica_n1]  CLOSING SolrCore org.apache.solr.core.SolrCore@a23276
   [junit4]   2> 380482 INFO  (coreCloseExecutor-2084-thread-1) [    ] o.a.s.c.SolrCore [testCollection1_shard1_replica_n1]  CLOSING SolrCore org.apache.solr.core.SolrCore@4dccbf4d
   [junit4]   2> 380485 INFO  (coreCloseExecutor-2084-thread-3) [    ] o.a.s.c.SolrCore [testCollection2_shard2_replica_n3]  CLOSING SolrCore org.apache.solr.core.SolrCore@4f509996
   [junit4]   2> 380487 INFO  (coreCloseExecutor-2084-thread-1) [    ] o.a.s.m.SolrMetricManager Closing metric reporters for registry=solr.core.testCollection1.shard1.replica_n1, tag=1305263949
   [junit4]   2> 380489 INFO  (coreCloseExecutor-2084-thread-1) [    ] o.a.s.m.SolrMetricManager Closing metric reporters for registry=solr.collection.testCollection1.shard1.leader, tag=1305263949
   [junit4]   2> 380490 INFO  (coreCloseExecutor-2084-thread-3) [    ] o.a.s.m.SolrMetricManager Closing metric reporters for registry=solr.core.testCollection2.shard2.replica_n3, tag=1330682262
   [junit4]   2> 380493 INFO  (coreCloseExecutor-2084-thread-3) [    ] o.a.s.m.SolrMetricManager Closing metric reporters for registry=solr.collection.testCollection2.shard2.leader, tag=1330682262
   [junit4]   2> 380494 INFO  (coreCloseExecutor-2084-thread-2) [    ] o.a.s.m.SolrMetricManager Closing metric reporters for registry=solr.core.testCollection2.shard1.replica_n1, tag=10629750
   [junit4]   2> 380497 INFO  (coreCloseExecutor-2084-thread-2) [    ] o.a.s.m.SolrMetricManager Closing metric reporters for registry=solr.collection.testCollection2.shard1.leader, tag=10629750
   [junit4]   2> 380498 INFO  (jetty-closer-441-thread-1) [    ] o.a.s.c.Overseer Overseer (id=98455781832916995-127.0.0.1:42611_solr-n_0000000000) closing
   [junit4]   2> 380498 INFO  (OverseerStateUpdate-98455781832916995-127.0.0.1:42611_solr-n_0000000000) [    ] o.a.s.c.Overseer Overseer Loop exiting : 127.0.0.1:42611_solr
   [junit4]   2> 382000 WARN  (zkCallback-447-thread-1) [    ] o.a.s.c.c.ZkStateReader ZooKeeper watch triggered, but Solr cannot talk to ZK: [KeeperErrorCode = Session expired for /live_nodes]
   [junit4]   2> 382001 INFO  (jetty-closer-441-thread-1) [    ] o.e.j.s.h.ContextHandler Stopped o.e.j.s.ServletContextHandler@734251ec{/solr,null,UNAVAILABLE}
   [junit4]   2> 382002 ERROR (SUITE-LeaderElectionContextKeyTest-seed#[2F88C645175B3E58]-worker) [    ] o.a.z.s.ZooKeeperServer ZKShutdownHandler is not registered, so ZooKeeper server won't take any action on ERROR or SHUTDOWN server state changes
   [junit4]   2> 382002 INFO  (SUITE-LeaderElectionContextKeyTest-seed#[2F88C645175B3E58]-worker) [    ] o.a.s.c.ZkTestServer connecting to 127.0.0.1:39287 39287
   [junit4]   2> 387776 INFO  (Thread-999) [    ] o.a.s.c.ZkTestServer connecting to 127.0.0.1:39287 39287
   [junit4]   2> 387776 WARN  (Thread-999) [    ] o.a.s.c.ZkTestServer Watch limit violations: 
   [junit4]   2> Maximum concurrent create/delete watches above limit:
   [junit4]   2> 
   [junit4]   2> 	2	/solr/aliases.json
   [junit4]   2> 
   [junit4]   2> Maximum concurrent data watches above limit:
   [junit4]   2> 
   [junit4]   2> 	5	/solr/collections/testCollection2/state.json
   [junit4]   2> 	5	/solr/collections/testCollection1/state.json
   [junit4]   2> 	2	/solr/clusterstate.json
   [junit4]   2> 	2	/solr/clusterprops.json
   [junit4]   2> 
   [junit4]   2> Maximum concurrent children watches above limit:
   [junit4]   2> 
   [junit4]   2> 	2	/solr/live_nodes
   [junit4]   2> 	2	/solr/collections
   [junit4]   2> 
   [junit4]   2> NOTE: leaving temporary files on disk at: /home/jenkins/workspace/Lucene-Solr-master-Linux/solr/build/solr-core/test/J0/temp/solr.cloud.LeaderElectionContextKeyTest_2F88C645175B3E58-001
   [junit4]   2> NOTE: test params are: codec=Asserting(Lucene70): {}, docValues:{}, maxPointsInLeafNode=249, maxMBSortInHeap=6.957051259619265, sim=RandomSimilarity(queryNorm=false): {}, locale=ne-NP, timezone=Eire
   [junit4]   2> NOTE: Linux 4.10.0-27-generic amd64/Oracle Corporation 9 (64-bit)/cpus=8,threads=1,free=398076032,total=536870912
   [junit4]   2> NOTE: All tests run in this JVM: [UUIDFieldTest, TestSimpleQParserPlugin, TestNumericRangeQuery32, FullHLLTest, TestSolrCoreParser, SpellCheckCollatorTest, RuleEngineTest, TestApiFramework, TestTlogReplica, UtilsToolTest, PluginInfoTest, TestSlowCompositeReaderWrapper, RemoteQueryErrorTest, TestSolrXml, TestHttpShardHandlerFactory, RequestLoggingTest, SuggestComponentTest, TestComponentsName, TestFunctionQuery, HttpSolrCallGetCoreTest, DocExpirationUpdateProcessorFactoryTest, TestPushWriter, TestReplicationHandler, ShufflingReplicaListTransformerTest, LeaderElectionIntegrationTest, SpellingQueryConverterTest, OverseerModifyCollectionTest, TestCollationField, TestGeoJSONResponseWriter, TestSchemaSimilarityResource, ZkNodePropsTest, TestUniqueKeyFieldResource, TestJsonRequest, MBeansHandlerTest, TestEmbeddedSolrServerConstructors, RAMDirectoryFactoryTest, DebugComponentTest, TlogReplayBufferedWhileIndexingTest, HdfsWriteToMultipleCollectionsTest, TestRemoteStreaming, TestRandomCollapseQParserPlugin, TestLeaderInitiatedRecoveryThread, DefaultValueUpdateProcessorTest, ClassificationUpdateProcessorIntegrationTest, MoveReplicaTest, TestCollationFieldDocValues, TestShardHandlerFactory, FacetPivotSmallTest, TestHighlightDedupGrouping, LeaderElectionContextKeyTest]
   [junit4] Completed [118/729 (1!)] on J0 in 13.65s, 1 test, 1 failure <<< FAILURES!

[...truncated 142 lines...]
   [junit4] Suite: org.apache.solr.cloud.HttpPartitionTest
   [junit4]   2> Creating dataDir: /home/jenkins/workspace/Lucene-Solr-master-Linux/solr/build/solr-core/test/J2/temp/solr.cloud.HttpPartitionTest_2F88C645175B3E58-001/init-core-data-001
   [junit4]   2> 461981 WARN  (SUITE-HttpPartitionTest-seed#[2F88C645175B3E58]-worker) [    ] o.a.s.SolrTestCaseJ4 startTrackingSearchers: numOpens=20 numCloses=20
   [junit4]   2> 461981 INFO  (SUITE-HttpPartitionTest-seed#[2F88C645175B3E58]-worker) [    ] o.a.s.SolrTestCaseJ4 Using PointFields (NUMERIC_POINTS_SYSPROP=true) w/NUMERIC_DOCVALUES_SYSPROP=false
   [junit4]   2> 461982 INFO  (SUITE-HttpPartitionTest-seed#[2F88C645175B3E58]-worker) [    ] o.a.s.SolrTestCaseJ4 Randomized ssl (false) and clientAuth (false) via: @org.apache.solr.SolrTestCaseJ4$SuppressSSL(bugUrl="https://issues.apache.org/jira/browse/SOLR-5776")
   [junit4]   2> 461982 INFO  (SUITE-HttpPartitionTest-seed#[2F88C645175B3E58]-worker) [    ] o.a.s.SolrTestCaseJ4 SecureRandom sanity checks: test.solr.allowed.securerandom=null & java.security.egd=file:/dev/./urandom
   [junit4]   2> 461982 INFO  (SUITE-HttpPartitionTest-seed#[2F88C645175B3E58]-worker) [    ] o.a.s.BaseDistributedSearchTestCase Setting hostContext system property: /ydogu/
   [junit4]   2> 461983 INFO  (TEST-HttpPartitionTest.test-seed#[2F88C645175B3E58]) [    ] o.a.s.c.ZkTestServer STARTING ZK TEST SERVER
   [junit4]   2> 461983 INFO  (Thread-1087) [    ] o.a.s.c.ZkTestServer client port:0.0.0.0/0.0.0.0:0
   [junit4]   2> 461983 INFO  (Thread-1087) [    ] o.a.s.c.ZkTestServer Starting server
   [junit4]   2> 461985 ERROR (Thread-1087) [    ] o.a.z.s.ZooKeeperServer ZKShutdownHandler is not registered, so ZooKeeper server won't take any action on ERROR or SHUTDOWN server state changes
   [junit4]   2> 462083 INFO  (TEST-HttpPartitionTest.test-seed#[2F88C645175B3E58]) [    ] o.a.s.c.ZkTestServer start zk server on port:43763
   [junit4]   2> 462092 INFO  (TEST-HttpPartitionTest.test-seed#[2F88C645175B3E58]) [    ] o.a.s.c.AbstractZkTestCase put /home/jenkins/workspace/Lucene-Solr-master-Linux/solr/core/src/test-files/solr/collection1/conf/solrconfig-tlog.xml to /configs/conf1/solrconfig.xml
   [junit4]   2> 462093 INFO  (TEST-HttpPartitionTest.test-seed#[2F88C645175B3E58]) [    ] o.a.s.c.AbstractZkTestCase put /home/jenkins/workspace/Lucene-Solr-master-Linux/solr/core/src/test-files/solr/collection1/conf/schema.xml to /configs/conf1/schema.xml
   [junit4]   2> 462094 INFO  (TEST-HttpPartitionTest.test-seed#[2F88C645175B3E58]) [    ] o.a.s.c.AbstractZkTestCase put /home/jenkins/workspace/Lucene-Solr-master-Linux/solr/core/src/test-files/solr/collection1/conf/solrconfig.snippet.randomindexconfig.xml to /configs/conf1/solrconfig.snippet.randomindexconfig.xml
   [junit4]   2> 462094 INFO  (TEST-HttpPartitionTest.test-seed#[2F88C645175B3E58]) [    ] o.a.s.c.AbstractZkTestCase put /home/jenkins/workspace/Lucene-Solr-master-Linux/solr/core/src/test-files/solr/collection1/conf/stopwords.txt to /configs/conf1/stopwords.txt
   [junit4]   2> 462095 INFO  (TEST-HttpPartitionTest.test-seed#[2F88C645175B3E58]) [    ] o.a.s.c.AbstractZkTestCase put /home/jenkins/workspace/Lucene-Solr-master-Linux/solr/core/src/test-files/solr/collection1/conf/protwords.txt to /configs/conf1/protwords.txt
   [junit4]   2> 462095 INFO  (TEST-HttpPartitionTest.test-seed#[2F88C645175B3E58]) [    ] o.a.s.c.AbstractZkTestCase put /home/jenkins/workspace/Lucene-Solr-master-Linux/solr/core/src/test-files/solr/collection1/conf/currency.xml to /configs/conf1/currency.xml
   [junit4]   2> 462096 INFO  (TEST-HttpPartitionTest.test-seed#[2F88C645175B3E58]) [    ] o.a.s.c.AbstractZkTestCase put /home/jenkins/workspace/Lucene-Solr-master-Linux/solr/core/src/test-files/solr/collection1/conf/enumsConfig.xml to /configs/conf1/enumsConfig.xml
   [junit4]   2> 462096 INFO  (TEST-HttpPartitionTest.test-seed#[2F88C645175B3E58]) [    ] o.a.s.c.AbstractZkTestCase put /home/jenkins/workspace/Lucene-Solr-master-Linux/solr/core/src/test-files/solr/collection1/conf/open-exchange-rates.json to /configs/conf1/open-exchange-rates.json
   [junit4]   2> 462097 INFO  (TEST-HttpPartitionTest.test-seed#[2F88C645175B3E58]) [    ] o.a.s.c.AbstractZkTestCase put /home/jenkins/workspace/Lucene-Solr-master-Linux/solr/core/src/test-files/solr/collection1/conf/mapping-ISOLatin1Accent.txt to /configs/conf1/mapping-ISOLatin1Accent.txt
   [junit4]   2> 462098 INFO  (TEST-HttpPartitionTest.test-seed#[2F88C645175B3E58]) [    ] o.a.s.c.AbstractZkTestCase put /home/jenkins/workspace/Lucene-Solr-master-Linux/solr/core/src/test-files/solr/collection1/conf/old_synonyms.txt to /configs/conf1/old_synonyms.txt
   [junit4]   2> 462098 INFO  (TEST-HttpPartitionTest.test-seed#[2F88C645175B3E58]) [    ] o.a.s.c.AbstractZkTestCase put /home/jenkins/workspace/Lucene-Solr-master-Linux/solr/core/src/test-files/solr/collection1/conf/synonyms.txt to /configs/conf1/synonyms.txt
   [junit4]   2> 462099 INFO  (TEST-HttpPartitionTest.test-seed#[2F88C645175B3E58]) [    ] o.a.s.c.AbstractFullDistribZkTestBase Will use TLOG replicas unless explicitly asked otherwise
   [junit4]   2> 462179 INFO  (TEST-HttpPartitionTest.test-seed#[2F88C645175B3E58]) [    ] o.e.j.s.Server jetty-9.3.14.v20161028
   [junit4]   2> 462179 INFO  (TEST-HttpPartitionTest.test-seed#[2F88C645175B3E58]) [    ] o.e.j.s.h.ContextHandler Started o.e.j.s.ServletContextHandler@3a75e787{/ydogu,null,AVAILABLE}
   [junit4]   2> 462181 INFO  (TEST-HttpPartitionTest.test-seed#[2F88C645175B3E58]) [    ] o.e.j.s.AbstractConnector Started ServerConnector@161400d1{HTTP/1.1,[http/1.1]}{127.0.0.1:38099}
   [junit4]   2> 462181 INFO  (TEST-HttpPartitionTest.test-seed#[2F88C645175B3E58]) [    ] o.e.j.s.Server Started @463314ms
   [junit4]   2> 462181 INFO  (TEST-HttpPartitionTest.test-seed#[2F88C645175B3E58]) [    ] o.a.s.c.s.e.JettySolrRunner Jetty properties: {hostContext=/ydogu, solr.data.dir=/home/jenkins/workspace/Lucene-Solr-master-Linux/solr/build/solr-core/test/J2/temp/solr.cloud.HttpPartitionTest_2F88C645175B3E58-001/tempDir-001/control/data, hostPort=35319, coreRootDirectory=/home/jenkins/workspace/Lucene-Solr-master-Linux/solr/build/solr-core/test/J2/temp/solr.cloud.HttpPartitionTest_2F88C645175B3E58-001/control-001/cores}
   [junit4]   2> 462181 ERROR (TEST-HttpPartitionTest.test-seed#[2F88C645175B3E58]) [    ] o.a.s.s.StartupLoggingUtils Missing Java Option solr.log.dir. Logging may be missing or incomplete.
   [junit4]   2> 462181 INFO  (TEST-HttpPartitionTest.test-seed#[2F88C645175B3E58]) [    ] o.a.s.s.SolrDispatchFilter  ___      _       Welcome to Apache Solr? version 8.0.0
   [junit4]   2> 462181 INFO  (TEST-HttpPartitionTest.test-seed#[2F88C645175B3E58]) [    ] o.a.s.s.SolrDispatchFilter / __| ___| |_ _   Starting in cloud mode on port null
   [junit4]   2> 462181 INFO  (TEST-HttpPartitionTest.test-seed#[2F88C645175B3E58]) [    ] o.a.s.s.SolrDispatchFilter \__ \/ _ \ | '_|  Install dir: null, Default config dir: null
   [junit4]   2> 462181 INFO  (TEST-HttpPartitionTest.test-seed#[2F88C645175B3E58]) [    ] o.a.s.s.SolrDispatchFilter |___/\___/_|_|    Start time: 2017-08-09T22:01:34.471734Z
   [junit4]   2> 462183 INFO  (TEST-HttpPartitionTest.test-seed#[2F88C645175B3E58]) [    ] o.a.s.s.SolrDispatchFilter Loading solr.xml from SolrHome (not found in ZooKeeper)
   [junit4]   2> 462183 INFO  (TEST-HttpPartitionTest.test-seed#[2F88C645175B3E58]) [    ] o.a.s.c.SolrXmlConfig Loading container configuration from /home/jenkins/workspace/Lucene-Solr-master-Linux/solr/build/solr-core/test/J2/temp/solr.cloud.HttpPartitionTest_2F88C645175B3E58-001/control-001/solr.xml
   [junit4]   2> 462185 INFO  (TEST-HttpPartitionTest.test-seed#[2F88C645175B3E58]) [    ] o.a.s.c.SolrXmlConfig MBean server found: com.sun.jmx.mbeanserver.JmxMBeanServer@5c8d93a, but no JMX reporters were configured - adding default JMX reporter.
   [junit4]   2> 462187 INFO  (TEST-HttpPartitionTest.test-seed#[2F88C645175B3E58]) [    ] o.a.s.c.ZkContainer Zookeeper client=127.0.0.1:43763/solr
   [junit4]   2> 462220 INFO  (TEST-HttpPartitionTest.test-seed#[2F88C645175B3E58]) [    ] o.a.s.c.Overseer Overseer (id=null) closing
   [junit4]   2> 462220 INFO  (TEST-HttpPartitionTest.test-seed#[2F88C645175B3E58]) [    ] o.a.s.c.OverseerElectionContext I am going to be the leader 127.0.0.1:35319_ydogu
   [junit4]   2> 462220 INFO  (TEST-HttpPartitionTest.test-seed#[2F88C645175B3E58]) [    ] o.a.s.c.Overseer Overseer (id=98455787554340868-127.0.0.1:35319_ydogu-n_0000000000) starting
   [junit4]   2> 462223 INFO  (TEST-HttpPartitionTest.test-seed#[2F88C645175B3E58]) [    ] o.a.s.c.ZkController Register node as live in ZooKeeper:/live_nodes/127.0.0.1:35319_ydogu
   [junit4]   2> 462223 INFO  (zkCallback-584-thread-1) [    ] o.a.s.c.c.ZkStateReader Updated live nodes from ZooKeeper... (0) -> (1)
   [junit4]   2> 462244 INFO  (TEST-HttpPartitionTest.test-seed#[2F88C645175B3E58]) [    ] o.a.s.m.r.SolrJmxReporter JMX monitoring for 'solr.node' (registry 'solr.node') enabled at server: com.sun.jmx.mbeanserver.JmxMBeanServer@5c8d93a
   [junit4]   2> 462247 INFO  (TEST-HttpPartitionTest.test-seed#[2F88C645175B3E58]) [    ] o.a.s.m.r.SolrJmxReporter JMX monitoring for 'solr.jvm' (registry 'solr.jvm') enabled at server: com.sun.jmx.mbeanserver.JmxMBeanServer@5c8d93a
   [junit4]   2> 462247 INFO  (TEST-HttpPartitionTest.test-seed#[2F88C645175B3E58]) [    ] o.a.s.m.r.SolrJmxReporter JMX monitoring for 'solr.jetty' (registry 'solr.jetty') enabled at server: com.sun.jmx.mbeanserver.JmxMBeanServer@5c8d93a
   [junit4]   2> 462248 INFO  (TEST-HttpPartitionTest.test-seed#[2F88C645175B3E58]) [    ] o.a.s.c.CorePropertiesLocator Found 0 core definitions underneath /home/jenkins/workspace/Lucene-Solr-master-Linux/solr/build/solr-core/test/J2/temp/solr.cloud.HttpPartitionTest_2F88C645175B3E58-001/control-001/cores
   [junit4]   2> 462255 INFO  (TEST-HttpPartitionTest.test-seed#[2F88C645175B3E58]) [    ] o.a.s.c.c.ZkStateReader Updated live nodes from ZooKeeper... (0) -> (1)
   [junit4]   2> 462255 INFO  (TEST-HttpPartitionTest.test-seed#[2F88C645175B3E58]) [    ] o.a.s.c.s.i.ZkClientClusterStateProvider Cluster at 127.0.0.1:43763/solr ready
   [junit4]   2> 462256 INFO  (SocketProxy-Acceptor-35319) [    ] o.a.s.c.SocketProxy accepted Socket[addr=/127.0.0.1,port=49078,localport=35319], receiveBufferSize:531000
   [junit4]   2> 462256 INFO  (SocketProxy-Acceptor-35319) [    ] o.a.s.c.SocketProxy proxy connection Socket[addr=/127.0.0.1,port=38099,localport=37510], receiveBufferSize=530904
   [junit4]   2> 462257 INFO  (qtp998286750-4126) [    ] o.a.s.h.a.CollectionsHandler Invoked Collection Action :create with params replicationFactor=1&collection.configName=conf1&name=control_collection&nrtReplicas=1&action=CREATE&numShards=1&createNodeSet=127.0.0.1:35319_ydogu&wt=javabin&version=2 and sendToOCPQueue=true
   [junit4]   2> 462259 INFO  (OverseerThreadFactory-1904-thread-1) [    ] o.a.s.c.CreateCollectionCmd Create collection control_collection
   [junit4]   2> 462362 INFO  (SocketProxy-Acceptor-35319) [    ] o.a.s.c.SocketProxy accepted Socket[addr=/127.0.0.1,port=49082,localport=35319], receiveBufferSize:531000
   [junit4]   2> 462362 INFO  (SocketProxy-Acceptor-35319) [    ] o.a.s.c.SocketProxy proxy connection Socket[addr=/127.0.0.1,port=38099,localport=37514], receiveBufferSize=530904
   [junit4]   2> 462362 INFO  (qtp998286750-4128) [    ] o.a.s.h.a.CoreAdminOperation core create command qt=/admin/cores&collection.configName=conf1&newCollection=true&name=control_collection_shard1_replica_n1&action=CREATE&numShards=1&collection=control_collection&shard=shard1&wt=javabin&version=2&replicaType=NRT
   [junit4]   2> 462363 INFO  (qtp998286750-4128) [    ] o.a.s.c.TransientSolrCoreCacheDefault Allocating transient cache for 4 transient cores
   [junit4]   2> 462465 INFO  (zkCallback-584-thread-1) [    ] o.a.s.c.c.ZkStateReader A cluster state change: [WatchedEvent state:SyncConnected type:NodeDataChanged path:/collections/control_collection/state.json] for collection [control_collection] has occurred - updating... (live nodes size: [1])
   [junit4]   2> 463377 INFO  (qtp998286750-4128) [    ] o.a.s.c.SolrConfig Using Lucene MatchVersion: 8.0.0
   [junit4]   2> 463391 INFO  (qtp998286750-4128) [    ] o.a.s.s.IndexSchema [control_collection_shard1_replica_n1] Schema name=test
   [junit4]   2> 463484 INFO  (qtp998286750-4128) [    ] o.a.s.s.IndexSchema Loaded schema test/1.0 with uniqueid field id
   [junit4]   2> 463491 INFO  (qtp998286750-4128) [    ] o.a.s.c.CoreContainer Creating SolrCore 'control_collection_shard1_replica_n1' using configuration from collection control_collection, trusted=true
   [junit4]   2> 463491 INFO  (qtp998286750-4128) [    ] o.a.s.m.r.SolrJmxReporter JMX monitoring for 'solr.core.control_collection.shard1.replica_n1' (registry 'solr.core.control_collection.shard1.replica_n1') enabled at server: com.sun.jmx.mbeanserver.JmxMBeanServer@5c8d93a
   [junit4]   2> 463491 INFO  (qtp998286750-4128) [    ] o.a.s.c.SolrCore solr.RecoveryStrategy.Builder
   [junit4]   2> 463491 INFO  (qtp998286750-4128) [    ] o.a.s.c.SolrCore [[control_collection_shard1_replica_n1] ] Opening new SolrCore at [/home/jenkins/workspace/Lucene-Solr-master-Linux/solr/build/solr-core/test/J2/temp/solr.cloud.HttpPartitionTest_2F88C645175B3E58-001/control-001/cores/control_collection_shard1_replica_n1], dataDir=[/home/jenkins/workspace/Lucene-Solr-master-Linux/solr/build/solr-core/test/J2/temp/solr.cloud.HttpPartitionTest_2F88C645175B3E58-001/control-001/cores/control_collection_shard1_replica_n1/data/]
   [junit4]   2> 463493 INFO  (qtp998286750-4128) [    ] o.a.s.u.RandomMergePolicy RandomMergePolicy wrapping class org.apache.lucene.index.TieredMergePolicy: [TieredMergePolicy: maxMergeAtOnce=13, maxMergeAtOnceExplicit=41, maxMergedSegmentMB=14.9716796875, floorSegmentMB=0.947265625, forceMergeDeletesPctAllowed=5.071593979084399, segmentsPerTier=19.0, maxCFSSegmentSizeMB=8.796093022207999E12, noCFSRatio=0.0
   [junit4]   2> 463494 WARN  (qtp998286750-4128) [    ] o.a.s.c.RequestHandlers INVALID paramSet a in requestHandler {type = requestHandler,name = /dump,class = DumpRequestHandler,attributes = {initParams=a, name=/dump, class=DumpRequestHandler},args = {defaults={a=A,b=B}}}
   [junit4]   2> 463518 INFO  (qtp998286750-4128) [    ] o.a.s.u.UpdateHandler Using UpdateLog implementation: org.apache.solr.update.UpdateLog
   [junit4]   2> 463519 INFO  (qtp998286750-4128) [    ] o.a.s.u.UpdateLog Initializing UpdateLog: dataDir= defaultSyncLevel=FLUSH numRecordsToKeep=100 maxNumLogsToKeep=10 numVersionBuckets=65536
   [junit4]   2> 463520 INFO  (qtp998286750-4128) [    ] o.a.s.u.CommitTracker Hard AutoCommit: disabled
   [junit4]   2> 463520 INFO  (qtp998286750-4128) [    ] o.a.s.u.CommitTracker Soft AutoCommit: disabled
   [junit4]   2> 463520 INFO  (qtp998286750-4128) [    ] o.a.s.u.RandomMergePolicy RandomMergePolicy wrapping class org.apache.lucene.index.TieredMergePolicy: [TieredMergePolicy: maxMergeAtOnce=29, maxMergeAtOnceExplicit=36, maxMergedSegmentMB=19.3046875, floorSegmentMB=1.693359375, forceMergeDeletesPctAllowed=29.280748338090326, segmentsPerTier=16.0, maxCFSSegmentSizeMB=8.796093022207999E12, noCFSRatio=0.8158020065928265
   [junit4]   2> 463521 INFO  (qtp998286750-4128) [    ] o.a.s.s.SolrIndexSearcher Opening [Searcher@1bbaf105[control_collection_shard1_replica_n1] main]
   [junit4]   2> 463521 INFO  (qtp998286750-4128) [    ] o.a.s.r.ManagedResourceStorage Configured ZooKeeperStorageIO with znodeBase: /configs/conf1
   [junit4]   2> 463522 INFO  (qtp998286750-4128) [    ] o.a.s.r.ManagedResourceStorage Loaded null at path _rest_managed.json using ZooKeeperStorageIO:path=/configs/conf1
   [junit4]   2> 463522 INFO  (qtp998286750-4128) [    ] o.a.s.h.ReplicationHandler Commits will be reserved for  10000
   [junit4]   2> 463523 INFO  (searcherExecutor-1907-thread-1) [    ] o.a.s.c.SolrCore [control_collection_shard1_replica_n1] Registered new searcher Searcher@1bbaf105[control_collection_shard1_replica_n1] main{ExitableDirectoryReader(UninvertingDirectoryReader())}
   [junit4]   2> 463523 INFO  (qtp998286750-4128) [    ] o.a.s.u.UpdateLog Could not find max version in index or recent updates, using new clock 1575292602483212288
   [junit4]   2> 463525 INFO  (qtp998286750-4128) [    ] o.a.s.c.ShardLeaderElectionContext Enough replicas found to continue.
   [junit4]   2> 463525 INFO  (qtp998286750-4128) [    ] o.a.s.c.ShardLeaderElectionContext I may be the new leader - try and sync
   [junit4]   2> 463525 INFO  (qtp998286750-4128) [    ] o.a.s.c.SyncStrategy Sync replicas to http://127.0.0.1:35319/ydogu/control_collection_shard1_replica_n1/
   [junit4]   2> 463525 INFO  (qtp998286750-4128) [    ] o.a.s.c.SyncStrategy Sync Success - now sync replicas to me
   [junit4]   2> 463525 INFO  (qtp998286750-4128) [    ] o.a.s.c.SyncStrategy http://127.0.0.1:35319/ydogu/control_collection_shard1_replica_n1/ has no replicas
   [junit4]   2> 463525 INFO  (qtp998286750-4128) [    ] o.a.s.c.ShardLeaderElectionContext Found all replicas participating in election, clear LIR
   [junit4]   2> 463527 INFO  (qtp998286750-4128) [    ] o.a.s.c.ShardLeaderElectionContext I am the new leader: http://127.0.0.1:35319/ydogu/control_collection_shard1_replica_n1/ shard1
   [junit4]   2> 463628 INFO  (zkCallback-584-thread-1) [    ] o.a.s.c.c.ZkStateReader A cluster state change: [WatchedEvent state:SyncConnected type:NodeDataChanged path:/collections/control_collection/state.json] for collection [control_collection] has occurred - updating... (live nodes size: [1])
   [junit4]   2> 463677 INFO  (qtp998286750-4128) [    ] o.a.s.c.ZkController I am the leader, no recovery necessary
   [junit4]   2> 463679 INFO  (qtp998286750-4128) [    ] o.a.s.s.HttpSolrCall [admin] webapp=null path=/admin/cores params={qt=/admin/cores&collection.configName=conf1&newCollection=true&name=control_collection_shard1_replica_n1&action=CREATE&numShards=1&collection=control_collection&shard=shard1&wt=javabin&version=2&replicaType=NRT} status=0 QTime=1316
   [junit4]   2> 463683 INFO  (qtp998286750-4126) [    ] o.a.s.h.a.CollectionsHandler Wait for new collection to be active for at most 30 seconds. Check all shard replicas
   [junit4]   2> 463783 INFO  (zkCallback-584-thread-1) [    ] o.a.s.c.c.ZkStateReader A cluster state change: [WatchedEvent state:SyncConnected type:NodeDataChanged path:/collections/control_collection/state.json] for collection [control_collection] has occurred - updating... (live nodes size: [1])
   [junit4]   2> 464260 INFO  (OverseerCollectionConfigSetProcessor-98455787554340868-127.0.0.1:35319_ydogu-n_0000000000) [    ] o.a.s.c.OverseerTaskQueue Response ZK path: /overseer/collection-queue-work/qnr-0000000000 doesn't exist.  Requestor may have disconnected from ZooKeeper
   [junit4]   2> 464683 INFO  (qtp998286750-4126) [    ] o.a.s.s.HttpSolrCall [admin] webapp=null path=/admin/collections params={replicationFactor=1&collection.configName=conf1&name=control_collection&nrtReplicas=1&action=CREATE&numShards=1&createNodeSet=127.0.0.1:35319_ydogu&wt=javabin&version=2} status=0 QTime=2425
   [junit4]   2> 464689 INFO  (TEST-HttpPartitionTest.test-seed#[2F88C645175B3E58]) [    ] o.a.s.c.c.ZkStateReader Updated live nodes from ZooKeeper... (0) -> (1)
   [junit4]   2> 464690 INFO  (TEST-HttpPartitionTest.test-seed#[2F88C645175B3E58]) [    ] o.a.s.c.s.i.ZkClientClusterStateProvider Cluster at 127.0.0.1:43763/solr ready
   [junit4]   2> 464690 INFO  (TEST-HttpPartitionTest.test-seed#[2F88C645175B3E58]) [    ] o.a.s.c.ChaosMonkey monkey: init - expire sessions:false cause connection loss:false
   [junit4]   2> 464691 INFO  (SocketProxy-Acceptor-35319) [    ] o.a.s.c.SocketProxy accepted Socket[addr=/127.0.0.1,port=49088,localport=35319], receiveBufferSize:531000
   [junit4]   2> 464691 INFO  (SocketProxy-Acceptor-35319) [    ] o.a.s.c.SocketProxy proxy connection Socket[addr=/127.0.0.1,port=38099,localport=37520], receiveBufferSize=530904
   [junit4]   2> 464691 INFO  (qtp998286750-4126) [    ] o.a.s.h.a.CollectionsHandler Invoked Collection Action :create with params replicationFactor=1&collection.configName=conf1&name=collection1&nrtReplicas=1&action=CREATE&numShards=2&createNodeSet=&stateFormat=1&wt=javabin&version=2 and sendToOCPQueue=true
   [junit4]   2> 464694 INFO  (OverseerThreadFactory-1904-thread-2) [    ] o.a.s.c.CreateCollectionCmd Create collection collection1
   [junit4]   2> 464694 WARN  (OverseerThreadFactory-1904-thread-2) [    ] o.a.s.c.CreateCollectionCmd It is unusual to create a collection (collection1) without cores.
   [junit4]   2> 464898 INFO  (qtp998286750-4126) [    ] o.a.s.h.a.CollectionsHandler Wait for new collection to be active for at most 30 seconds. Check all shard replicas
   [junit4]   2> 464898 INFO  (qtp998286750-4126) [    ] o.a.s.s.HttpSolrCall [admin] webapp=null path=/admin/collections params={replicationFactor=1&collection.configName=conf1&name=collection1&nrtReplicas=1&action=CREATE&numShards=2&createNodeSet=&stateFormat=1&wt=javabin&version=2} status=0 QTime=206
   [junit4]   2> 464974 INFO  (TEST-HttpPartitionTest.test-seed#[2F88C645175B3E58]) [    ] o.a.s.c.AbstractFullDistribZkTestBase create jetty 1 in directory /home/jenkins/workspace/Lucene-Solr-master-Linux/solr/build/solr-core/test/J2/temp/solr.cloud.HttpPartitionTest_2F88C645175B3E58-001/shard-1-001 of type TLOG
   [junit4]   2> 464974 INFO  (TEST-HttpPartitionTest.test-seed#[2F88C645175B3E58]) [    ] o.e.j.s.Server jetty-9.3.14.v20161028
   [junit4]   2> 464975 INFO  (TEST-HttpPartitionTest.test-seed#[2F88C645175B3E58]) [    ] o.e.j.s.h.ContextHandler Started o.e.j.s.ServletContextHandler@7b750724{/ydogu,null,AVAILABLE}
   [junit4]   2> 464975 INFO  (TEST-HttpPartitionTest.test-seed#[2F88C645175B3E58]) [    ] o.e.j.s.AbstractConnector Started ServerConnector@2418170f{HTTP/1.1,[http/1.1]}{127.0.0.1:38491}
   [junit4]   2> 464975 INFO  (TEST-HttpPartitionTest.test-seed#[2F88C645175B3E58]) [    ] o.e.j.s.Server Started @466109ms
   [junit4]   2> 464976 INFO  (TEST-HttpPartitionTest.test-seed#[2F88C645175B3E58]) [    ] o.a.s.c.s.e.JettySolrRunner Jetty properties: {hostContext=/ydogu, solrconfig=solrconfig.xml, solr.data.dir=/home/jenkins/workspace/Lucene-Solr-master-Linux/solr/build/solr-core/test/J2/temp/solr.cloud.HttpPartitionTest_2F88C645175B3E58-001/tempDir-001/jetty1, hostPort=36143, coreRootDirectory=/home/jenkins/workspace/Lucene-Solr-master-Linux/solr/build/solr-core/test/J2/temp/solr.cloud.HttpPartitionTest_2F88C645175B3E58-001/shard-1-001/cores, replicaType=TLOG}
   [junit4]   2> 464976 ERROR (TEST-HttpPartitionTest.test-seed#[2F88C645175B3E58]) [    ] o.a.s.s.StartupLoggingUtils Missing Java Option solr.log.dir. Logging may be missing or incomplete.
   [junit4]   2> 464976 INFO  (TEST-HttpPartitionTest.test-seed#[2F88C645175B3E58]) [    ] o.a.s.s.SolrDispatchFilter  ___      _       Welcome to Apache Solr? version 8.0.0
   [junit4]   2> 464976 INFO  (TEST-HttpPartitionTest.test-seed#[2F88C645175B3E58]) [    ] o.a.s.s.SolrDispatchFilter / __| ___| |_ _   Starting in cloud mode on port null
   [junit4]   2> 464976 INFO  (TEST-HttpPartitionTest.test-seed#[2F88C645175B3E58]) [    ] o.a.s.s.SolrDispatchFilter \__ \/ _ \ | '_|  Install dir: null, Default config dir: null
   [junit4]   2> 464976 INFO  (TEST-HttpPartitionTest.test-seed#[2F88C645175B3E58]) [    ] o.a.s.s.SolrDispatchFilter |___/\___/_|_|    Start time: 2017-08-09T22:01:37.266347Z
   [junit4]   2> 464977 WARN  (NIOServerCxn.Factory:0.0.0.0/0.0.0.0:0) [    ] o.a.z.s.NIOServerCnxn caught end of stream exception
   [junit4]   2> EndOfStreamException: Unable to read additional data from client sessionid 0x15dc90463420007, likely client has closed socket
   [junit4]   2> 	at org.apache.zookeeper.server.NIOServerCnxn.doIO(NIOServerCnxn.java:239)
   [junit4]   2> 	at org.apache.zookeeper.server.NIOServerCnxnFactory.run(NIOServerCnxnFactory.java:203)
   [junit4]   2> 	at java.base/java.lang.Thread.run(Thread.java:844)
   [junit4]   2> 464978 INFO  (TEST-HttpPartitionTest.test-seed#[2F88C645175B3E58]) [    ] o.a.s.s.SolrDispatchFilter Loading solr.xml from SolrHome (not found in ZooKeeper)
   [junit4]   2> 464978 INFO  (TEST-HttpPartitionTest.test-seed#[2F88C645175B3E58]) [    ] o.a.s.c.SolrXmlConfig Loading container configuration from /home/jenkins/workspace/Lucene-Solr-master-Linux/solr/build/solr-core/test/J2/temp/solr.cloud.HttpPartitionTest_2F88C645175B3E58-001/shard-1-001/solr.xml
   [junit4]   2> 464980 INFO  (TEST-HttpPartitionTest.test-seed#[2F88C645175B3E58]) [    ] o.a.s.c.SolrXmlConfig MBean server found: com.sun.jmx.mbeanserver.JmxMBeanServer@5c8d93a, but no JMX reporters were configured - adding default JMX reporter.
   [junit4]   2> 464981 INFO  (TEST-HttpPartitionTest.test-seed#[2F88C645175B3E58]) [    ] o.a.s.c.ZkContainer Zookeeper client=127.0.0.1:43763/solr
   [junit4]   2> 464985 INFO  (TEST-HttpPartitionTest.test-seed#[2F88C645175B3E58]) [    ] o.a.s.c.c.ZkStateReader Updated live nodes from ZooKeeper... (0) -> (1)
   [junit4]   2> 464986 INFO  (TEST-HttpPartitionTest.test-seed#[2F88C645175B3E58]) [    ] o.a.s.c.Overseer Overseer (id=null) closing
   [junit4]   2> 464986 INFO  (TEST-HttpPartitionTest.test-seed#[2F88C645175B3E58]) [    ] o.a.s.c.ZkController Register node as live in ZooKeeper:/live_nodes/127.0.0.1:36143_ydogu
   [junit4]   2> 464987 INFO  (zkCallback-584-thread-1) [    ] o.a.s.c.c.ZkStateReader Updated live nodes from ZooKeeper... (1) -> (2)
   [junit4]   2> 464987 INFO  (zkCallback-596-thread-1) [    ] o.a.s.c.c.ZkStateReader Updated live nodes from ZooKeeper... (1) -> (2)
   [junit4]   2> 464987 INFO  (zkCallback-591-thread-1) [    ] o.a.s.c.c.ZkStateReader Updated live nodes from ZooKeeper... (1) -> (2)
   [junit4]   2> 465007 INFO  (TEST-HttpPartitionTest.test-seed#[2F88C645175B3E58]) [    ] o.a.s.m.r.SolrJmxReporter JMX monitoring for 'solr.node' (registry 'solr.node') enabled at server: com.sun.jmx.mbeanserver.JmxMBeanServer@5c8d93a
   [junit4]   2> 465010 INFO  (TEST-HttpPartitionTest.test-seed#[2F88C645175B3E58]) [    ] o.a.s.m.r.SolrJmxReporter JMX monitoring for 'solr.jvm' (registry 'solr.jvm') enabled at server: com.sun.jmx.mbeanserver.JmxMBeanServer@5c8d93a
   [junit4]   2> 465010 INFO  (TEST-HttpPartitionTest.test-seed#[2F88C645175B3E58]) [    ] o.a.s.m.r.SolrJmxReporter JMX monitoring for 'solr.jetty' (registry 'solr.jetty') enabled at server: com.sun.jmx.mbeanserver.JmxMBeanServer@5c8d93a
   [junit4]   2> 465010 INFO  (TEST-HttpPartitionTest.test-seed#[2F88C645175B3E58]) [    ] o.a.s.c.CorePropertiesLocator Found 0 core definitions underneath /home/jenkins/workspace/Lucene-Solr-master-Linux/solr/build/solr-core/test/J2/temp/solr.cloud.HttpPartitionTest_2F88C645175B3E58-001/shard-1-001/cores
   [junit4]   2> 465020 INFO  (qtp998286750-4127) [    ] o.a.s.h.a.CollectionsHandler Invoked Collection Action :addreplica with params node=127.0.0.1:36143_ydogu&action=ADDREPLICA&collection=collection1&shard=shard2&type=TLOG&wt=javabin&version=2 and sendToOCPQueue=true
   [junit4]   2> 465022 INFO  (OverseerCollectionConfigSetProcessor-98455787554340868-127.0.0.1:35319_ydogu-n_0000000000) [    ] o.a.s.c.OverseerTaskQueue Response ZK path: /overseer/collection-queue-work/qnr-0000000002 doesn't exist.  Requestor may have disconnected from ZooKeeper
   [junit4]   2> 465022 INFO  (OverseerThreadFactory-1904-thread-3) [    ] o.a.s.c.AddReplicaCmd Node Identified 127.0.0.1:36143_ydogu for creating new replica
   [junit4]   2> 465022 INFO  (SocketProxy-Acceptor-36143) [    ] o.a.s.c.SocketProxy accepted Socket[addr=/127.0.0.1,port=35826,localport=36143], receiveBufferSize:531000
   [junit4]   2> 465023 INFO  (SocketProxy-Acceptor-36143) [    ] o.a.s.c.SocketProxy proxy connection Socket[addr=/127.0.0.1,port=38491,localport=33954], receiveBufferSize=530904
   [junit4]   2> 465023 INFO  (qtp584064172-4174) [    ] o.a.s.h.a.CoreAdminOperation core create command qt=/admin/cores&collection.configName=conf1&name=collection1_shard2_replica_t41&action=CREATE&collection=collection1&shard=shard2&wt=javabin&version=2&replicaType=TLOG
   [junit4]   2> 465023 INFO  (qtp584064172-4174) [    ] o.a.s.c.TransientSolrCoreCacheDefault Allocating transient cache for 4 transient cores
   [junit4]   2> 466049 INFO  (qtp584064172-4174) [    ] o.a.s.c.SolrConfig Using Lucene MatchVersion: 8.0.0
   [junit4]   2> 466078 INFO  (qtp584064172-4174) [    ] o.a.s.s.IndexSchema [collection1_shard2_replica_t41] Schema name=test
   [junit4]   2> 466121 INFO  (qtp584064172-4174) [    ] o.a.s.s.IndexSchema Loaded schema test/1.0 with uniqueid field id
   [junit4]   2> 466127 INFO  (qtp584064172-4174) [    ] o.a.s.c.CoreContainer Creating SolrCore 'collection1_shard2_replica_t41' using configuration from collection collection1, trusted=true
   [junit4]   2> 466127 INFO  (qtp584064172-4174) [    ] o.a.s.m.r.SolrJmxReporter JMX monitoring for 'solr.core.collection1.shard2.replica_t41' (registry 'solr.core.collection1.shard2.replica_t41') enabled at server: com.sun.jmx.mbeanserver.JmxMBeanServer@5c8d93a
   [junit4]   2> 466128 INFO  (qtp584064172-4174) [    ] o.a.s.c.SolrCore solr.RecoveryStrategy.Builder
   [junit4]   2> 466128 INFO  (qtp584064172-4174) [    ] o.a.s.c.SolrCore [[collection1_shard2_replica_t41] ] Opening new SolrCore at [/home/jenkins/workspace/Lucene-Solr-master-Linux/solr/build/solr-core/test/J2/temp/solr.cloud.HttpPartitionTest_2F88C645175B3E58-001/shard-1-001/cores/collection1_shard2_replica_t41], dataDir=[/home/jenkins/workspace/Lucene-Solr-master-Linux/solr/build/solr-core/test/J2/temp/solr.cloud.HttpPartitionTest_2F88C645175B3E58-001/shard-1-001/cores/collection1_shard2_replica_t41/data/]
   [junit4]   2> 466129 INFO  (qtp584064172-4174) [    ] o.a.s.u.RandomMergePolicy RandomMergePolicy wrapping class org.apache.lucene.index.TieredMergePolicy: [TieredMergePolicy: maxMergeAtOnce=13, maxMergeAtOnceExplicit=41, maxMergedSegmentMB=14.9716796875, floorSegmentMB=0.947265625, forceMergeDeletesPctAllowed=5.071593979084399, segmentsPerTier=19.0, maxCFSSegmentSizeMB=8.796093022207999E12, noCFSRatio=0.0
   [junit4]   2> 466130 WARN  (qtp584064172-4174) [    ] o.a.s.c.RequestHandlers INVALID paramSet a in requestHandler {type = requestHandler,name = /dump,class = DumpRequestHandler,attributes = {initParams=a, name=/dump, class=DumpRequestHandler},args = {defaults={a=A,b=B}}}
   [junit4]   2> 466153 INFO  (qtp584064172-4174) [    ] o.a.s.u.UpdateHandler Using UpdateLog implementation: org.apache.solr.update.UpdateLog
   [junit4]   2> 466153 INFO  (qtp584064172-4174) [    ] o.a.s.u.UpdateLog Initializing UpdateLog: dataDir= defaultSyncLevel=FLUSH numRecordsToKeep=100 maxNumLogsToKeep=10 numVersionBuckets=65536
   [junit4]   2> 466161 INFO  (qtp584064172-4174) [    ] o.a.s.u.CommitTracker Hard AutoCommit: disabled
   [junit4]   2> 466161 INFO  (qtp584064172-4174) [    ] o.a.s.u.CommitTracker Soft AutoCommit: disabled
   [junit4]   2> 466162 INFO  (qtp584064172-4174) [    ] o.a.s.u.RandomMergePolicy RandomMergePolicy wrapping class org.apache.lucene.index.TieredMergePolicy: [TieredMergePolicy: maxMergeAtOnce=29, maxMergeAtOnceExplicit=36, maxMergedSegmentMB=19.3046875, floorSegmentMB=1.693359375, forceMergeDeletesPctAllowed=29.280748338090326, segmentsPerTier=16.0, maxCFSSegmentSizeMB=8.796093022207999E12, noCFSRatio=0.8158020065928265
   [junit4]   2> 466162 INFO  (qtp584064172-4174) [    ] o.a.s.s.SolrIndexSearcher Opening [Searcher@13aca5[collection1_shard2_replica_t41] main]
   [junit4]   2> 466162 INFO  (qtp584064172-4174) [    ] o.a.s.r.ManagedResourceStorage Configured ZooKeeperStorageIO with znodeBase: /configs/conf1
   [junit4]   2> 466162 INFO  (qtp584064172-4174) [    ] o.a.s.r.ManagedResourceStorage Loaded null at path _rest_managed.json using ZooKeeperStorageIO:path=/configs/conf1
   [junit4]   2> 466163 INFO  (qtp584064172-4174) [    ] o.a.s.h.ReplicationHandler Commits will be reserved for  10000
   [junit4]   2> 466164 INFO  (searcherExecutor-1918-thread-1) [    ] o.a.s.c.SolrCore [collection1_shard2_replica_t41] Registered new searcher Searcher@13aca5[collection1_shard2_replica_t41] main{ExitableDirectoryReader(UninvertingDirectoryReader())}
   [junit4]   2> 466164 INFO  (qtp584064172-4174) [    ] o.a.s.u.UpdateLog Could not find max version in index or recent updates, using new clock 1575292605252501504
   [junit4]   2> 466167 INFO  (qtp584064172-4174

[...truncated too long message...]

Leader-seed#[2F88C645175B3E58]) [    ] o.e.j.s.AbstractConnector Stopped ServerConnector@35b2b530{HTTP/1.1,[http/1.1]}{127.0.0.1:0}
   [junit4]   2> 2174636 INFO  (TEST-ForceLeaderTest.testReplicasInLIRNoLeader-seed#[2F88C645175B3E58]) [    ] o.e.j.s.h.ContextHandler Stopped o.e.j.s.ServletContextHandler@263ae9a4{/,null,UNAVAILABLE}
   [junit4]   2> 2174636 INFO  (TEST-ForceLeaderTest.testReplicasInLIRNoLeader-seed#[2F88C645175B3E58]) [    ] o.a.s.c.ChaosMonkey monkey: stop jetty! 42073
   [junit4]   2> 2174636 ERROR (TEST-ForceLeaderTest.testReplicasInLIRNoLeader-seed#[2F88C645175B3E58]) [    ] o.a.z.s.ZooKeeperServer ZKShutdownHandler is not registered, so ZooKeeper server won't take any action on ERROR or SHUTDOWN server state changes
   [junit4]   2> 2174637 INFO  (TEST-ForceLeaderTest.testReplicasInLIRNoLeader-seed#[2F88C645175B3E58]) [    ] o.a.s.c.ZkTestServer connecting to 127.0.0.1:43511 43511
   [junit4]   2> 2180268 INFO  (Thread-3435) [    ] o.a.s.c.ZkTestServer connecting to 127.0.0.1:43511 43511
   [junit4]   2> 2180268 WARN  (Thread-3435) [    ] o.a.s.c.ZkTestServer Watch limit violations: 
   [junit4]   2> Maximum concurrent create/delete watches above limit:
   [junit4]   2> 
   [junit4]   2> 	6	/solr/aliases.json
   [junit4]   2> 	4	/solr/security.json
   [junit4]   2> 	4	/solr/configs/conf1
   [junit4]   2> 
   [junit4]   2> Maximum concurrent data watches above limit:
   [junit4]   2> 
   [junit4]   2> 	6	/solr/clusterprops.json
   [junit4]   2> 	6	/solr/clusterstate.json
   [junit4]   2> 	3	/solr/collections/forceleader_test_collection/state.json
   [junit4]   2> 	3	/solr/collections/collection1/state.json
   [junit4]   2> 
   [junit4]   2> Maximum concurrent children watches above limit:
   [junit4]   2> 
   [junit4]   2> 	6	/solr/live_nodes
   [junit4]   2> 	6	/solr/collections
   [junit4]   2> 	2	/solr/overseer/queue
   [junit4]   2> 	2	/solr/overseer/collection-queue-work
   [junit4]   2> 
   [junit4]   2> 2180268 WARN  (TEST-ForceLeaderTest.testReplicasInLIRNoLeader-seed#[2F88C645175B3E58]) [    ] o.a.s.c.SocketProxy Closing 11 connections to: http://127.0.0.1:33327/, target: http://127.0.0.1:33871/
   [junit4]   2> 2180269 WARN  (TEST-ForceLeaderTest.testReplicasInLIRNoLeader-seed#[2F88C645175B3E58]) [    ] o.a.s.c.SocketProxy Closing 0 connections to: http://127.0.0.1:42073/, target: http://127.0.0.1:36197/
   [junit4]   2> 2180269 WARN  (TEST-ForceLeaderTest.testReplicasInLIRNoLeader-seed#[2F88C645175B3E58]) [    ] o.a.s.c.SocketProxy Closing 5 connections to: http://127.0.0.1:35341/, target: http://127.0.0.1:44491/
   [junit4]   2> 2180269 WARN  (TEST-ForceLeaderTest.testReplicasInLIRNoLeader-seed#[2F88C645175B3E58]) [    ] o.a.s.c.SocketProxy Closing 3 connections to: http://127.0.0.1:33813/, target: http://127.0.0.1:33619/
   [junit4]   2> NOTE: reproduce with: ant test  -Dtestcase=ForceLeaderTest -Dtests.method=testReplicasInLIRNoLeader -Dtests.seed=2F88C645175B3E58 -Dtests.multiplier=3 -Dtests.slow=true -Dtests.locale=zh-Hant-MO -Dtests.timezone=Etc/GMT+4 -Dtests.asserts=true -Dtests.file.encoding=US-ASCII
   [junit4] FAILURE 61.0s J1 | ForceLeaderTest.testReplicasInLIRNoLeader <<<
   [junit4]    > Throwable #1: java.lang.AssertionError: Doc with id=1 not found in http://127.0.0.1:33327/forceleader_test_collection due to: Path not found: /id; rsp={doc=null}
   [junit4]    > 	at __randomizedtesting.SeedInfo.seed([2F88C645175B3E58:C91FF2852ED9C739]:0)
   [junit4]    > 	at org.apache.solr.cloud.HttpPartitionTest.assertDocExists(HttpPartitionTest.java:603)
   [junit4]    > 	at org.apache.solr.cloud.HttpPartitionTest.assertDocsExistInAllReplicas(HttpPartitionTest.java:556)
   [junit4]    > 	at org.apache.solr.cloud.ForceLeaderTest.testReplicasInLIRNoLeader(ForceLeaderTest.java:142)
   [junit4]    > 	at java.base/jdk.internal.reflect.NativeMethodAccessorImpl.invoke0(Native Method)
   [junit4]    > 	at java.base/jdk.internal.reflect.NativeMethodAccessorImpl.invoke(NativeMethodAccessorImpl.java:62)
   [junit4]    > 	at java.base/jdk.internal.reflect.DelegatingMethodAccessorImpl.invoke(DelegatingMethodAccessorImpl.java:43)
   [junit4]    > 	at java.base/java.lang.reflect.Method.invoke(Method.java:564)
   [junit4]    > 	at org.apache.solr.BaseDistributedSearchTestCase$ShardsRepeatRule$ShardsFixedStatement.callStatement(BaseDistributedSearchTestCase.java:993)
   [junit4]    > 	at org.apache.solr.BaseDistributedSearchTestCase$ShardsRepeatRule$ShardsStatement.evaluate(BaseDistributedSearchTestCase.java:968)
   [junit4]    > 	at java.base/java.lang.Thread.run(Thread.java:844)
   [junit4]   2> NOTE: leaving temporary files on disk at: /home/jenkins/workspace/Lucene-Solr-master-Linux/solr/build/solr-core/test/J1/temp/solr.cloud.ForceLeaderTest_2F88C645175B3E58-001
   [junit4]   2> NOTE: test params are: codec=FastCompressingStoredFields(storedFieldsFormat=CompressingStoredFieldsFormat(compressionMode=FAST, chunkSize=4339, maxDocsPerChunk=467, blockSize=7), termVectorsFormat=CompressingTermVectorsFormat(compressionMode=FAST, chunkSize=4339, blockSize=7)), sim=RandomSimilarity(queryNorm=false): {}, locale=zh-Hant-MO, timezone=Etc/GMT+4
   [junit4]   2> NOTE: Linux 4.10.0-27-generic amd64/Oracle Corporation 9 (64-bit)/cpus=8,threads=1,free=122661944,total=536870912
   [junit4]   2> NOTE: All tests run in this JVM: [TestRebalanceLeaders, TestSweetSpotSimilarityFactory, DirectoryFactoryTest, BitVectorTest, CdcrBootstrapTest, CreateCollectionCleanupTest, FileUtilsTest, NoCacheHeaderTest, TestHashQParserPlugin, TolerantUpdateProcessorTest, TriLevelCompositeIdRoutingTest, IndexSchemaTest, TestSolrCloudWithKerberosAlt, TestCollectionAPIs, MultiThreadedOCPTest, CdcrRequestHandlerTest, DistributedFacetPivotLargeTest, TestEmbeddedSolrServerSchemaAPI, DirectSolrSpellCheckerTest, TestSolrCloudSnapshots, HdfsNNFailoverTest, ReplaceNodeTest, TestStressInPlaceUpdates, TestSolrCloudWithHadoopAuthPlugin, TestOrdValues, TestConfigSetsAPI, UninvertDocValuesMergePolicyTest, TestNRTOpen, SubstringBytesRefFilterTest, DistributedMLTComponentTest, TestStreamBody, TestCoreDiscovery, HLLSerializationTest, TestCryptoKeys, TestInPlaceUpdatesDistrib, DocValuesMultiTest, CoreAdminHandlerTest, TestNumericTerms32, LargeFieldTest, DistributedTermsComponentTest, TestSolrFieldCacheBean, ScriptEngineTest, TestDownShardTolerantSearch, TestCloudInspectUtil, TestScoreJoinQPNoScore, SpellCheckComponentTest, TestFuzzyAnalyzedSuggestions, TestQueryTypes, VersionInfoTest, SuggesterTSTTest, FileBasedSpellCheckerTest, TestCoreContainer, TestAtomicUpdateErrorCases, TestImplicitCoreProperties, OverseerRolesTest, LeaderFailoverAfterPartitionTest, HighlighterTest, ClassificationUpdateProcessorTest, TestMaxScoreQueryParser, DistanceFunctionTest, TestLegacyTerms, TestAuthorizationFramework, DistributedQueryComponentOptimizationTest, QueryResultKeyTest, TestBM25SimilarityFactory, TestSolrIndexConfig, TestHdfsBackupRestoreCore, IndexSchemaRuntimeFieldTest, TestSchemaNameResource, AddBlockUpdateTest, MoreLikeThisHandlerTest, PeerSyncReplicationTest, TestNoOpRegenerator, TestTrieFacet, CacheHeaderTest, TestDocBasedVersionConstraints, TestFastLRUCache, ConvertedLegacyTest, ActionThrottleTest, StatelessScriptUpdateProcessorFactoryTest, JvmMetricsTest, SolrMetricManagerTest, ResponseHeaderTest, AlternateDirectoryTest, TestFieldSortValues, TermVectorComponentTest, TestPayloadScoreQParserPlugin, DirectSolrConnectionTest, BasicAuthIntegrationTest, CollectionsAPIDistributedZkTest, DistributedIntervalFacetingTest, CachingDirectoryFactoryTest, SystemInfoHandlerTest, TestGraphMLResponseWriter, TestLegacyField, DeleteShardTest, JsonLoaderTest, TestCharFilters, StressHdfsTest, TestPartialUpdateDeduplication, TestOnReconnectListenerSupport, MetricUtilsTest, ChaosMonkeySafeLeaderTest, CSVRequestHandlerTest, TestLRUCache, InfixSuggestersTest, AssignTest, HdfsLockFactoryTest, DistributedDebugComponentTest, SolrGangliaReporterTest, ZkControllerTest, TestPolicyCloud, HdfsRestartWhileUpdatingTest, SpatialFilterTest, TestFieldCacheReopen, TestValueSourceCache, SortSpecParsingTest, TestCorePropertiesReload, RecoveryZkTest, ClusterStateUpdateTest, ZkSolrClientTest, ZkCLITest, TestJoin, TestSolr4Spatial, SolrCoreTest, SolrCmdDistributorTest, QueryElevationComponentTest, PeerSyncTest, BadIndexSchemaTest, TestFiltering, BasicFunctionalityTest, SoftAutoCommitTest, TestStressLucene, SuggesterWFSTTest, TestCSVLoader, WordBreakSolrSpellCheckerTest, SchemaVersionSpecificBehaviorTest, TestUpdate, FieldMutatingUpdateProcessorTest, QueryEqualityTest, DirectUpdateHandlerOptimizeTest, SortByFunctionTest, XsltUpdateRequestHandlerTest, LukeRequestHandlerTest, TestWriterPerf, PrimitiveFieldTypeTest, XmlUpdateRequestHandlerTest, TestIndexingPerformance, FieldAnalysisRequestHandlerTest, LoggingHandlerTest, UpdateRequestProcessorFactoryTest, QueryParsingTest, BinaryUpdateRequestHandlerTest, SOLR749Test, UpdateParamsTest, TestQuerySenderNoQuery, BadComponentTest, TestStressRecovery, TestMergePolicyConfig, TestSolrDeletionPolicy2, SampleTest, TestBinaryField, TestSearchPerf, MinimalSchemaTest, TestElisionMultitermQuery, TestConfig, OutputWriterTest, TestPostingsSolrHighlighter, NotRequiredUniqueKeyTest, TestLuceneMatchVersion, TestPhraseSuggestions, SpellPossibilityIteratorTest, TestXIncludeConfig, EchoParamsTest, TestPerFieldSimilarity, TestLMDirichletSimilarityFactory, TestLMJelinekMercerSimilarityFactory, TestIBSimilarityFactory, TestFastWriter, TimeZoneUtilsTest, ResourceLoaderTest, OpenExchangeRatesOrgProviderTest, URLClassifyProcessorTest, ChaosMonkeyNothingIsSafeTest, CdcrReplicationDistributedZkTest, CdcrVersionReplicationTest, ChaosMonkeyNothingIsSafeWithPullReplicasTest, CollectionStateFormat2Test, CollectionsAPIAsyncDistributedZkTest, DeleteLastCustomShardedReplicaTest, DeleteReplicaTest, DistribCursorPagingTest, DistributedQueueTest, ForceLeaderTest]
   [junit4] Completed [520/729 (3!)] on J1 in 134.20s, 3 tests, 1 failure, 1 skipped <<< FAILURES!

[...truncated 37221 lines...]

Mime
View raw message