lucene-dev mailing list archives

Site index · List index
Message view « Date » · « Thread »
Top « Date » · « Thread »
From Policeman Jenkins Server <jenk...@thetaphi.de>
Subject [JENKINS] Lucene-Solr-7.x-Solaris (64bit/jdk1.8.0) - Build # 129 - Still Unstable!
Date Wed, 23 Aug 2017 08:23:25 GMT
Build: https://jenkins.thetaphi.de/job/Lucene-Solr-7.x-Solaris/129/
Java: 64bit/jdk1.8.0 -XX:-UseCompressedOops -XX:+UseG1GC

3 tests failed.
FAILED:  junit.framework.TestSuite.org.apache.solr.cloud.TestSolrCloudWithSecureImpersonation

Error Message:
1 thread leaked from SUITE scope at org.apache.solr.cloud.TestSolrCloudWithSecureImpersonation:     1) Thread[id=7278, name=jetty-launcher-1266-thread-1-EventThread, state=TIMED_WAITING, group=TGRP-TestSolrCloudWithSecureImpersonation]         at sun.misc.Unsafe.park(Native Method)         at java.util.concurrent.locks.LockSupport.parkNanos(LockSupport.java:215)         at java.util.concurrent.locks.AbstractQueuedSynchronizer.doAcquireSharedNanos(AbstractQueuedSynchronizer.java:1037)         at java.util.concurrent.locks.AbstractQueuedSynchronizer.tryAcquireSharedNanos(AbstractQueuedSynchronizer.java:1328)         at java.util.concurrent.CountDownLatch.await(CountDownLatch.java:277)         at org.apache.curator.CuratorZookeeperClient.internalBlockUntilConnectedOrTimedOut(CuratorZookeeperClient.java:323)         at org.apache.curator.RetryLoop.callWithRetry(RetryLoop.java:105)         at org.apache.curator.framework.imps.GetDataBuilderImpl.pathInForeground(GetDataBuilderImpl.java:288)         at org.apache.curator.framework.imps.GetDataBuilderImpl.forPath(GetDataBuilderImpl.java:279)         at org.apache.curator.framework.imps.GetDataBuilderImpl.forPath(GetDataBuilderImpl.java:41)         at org.apache.curator.framework.recipes.shared.SharedValue.readValue(SharedValue.java:244)         at org.apache.curator.framework.recipes.shared.SharedValue.access$100(SharedValue.java:44)         at org.apache.curator.framework.recipes.shared.SharedValue$1.process(SharedValue.java:61)         at org.apache.curator.framework.imps.NamespaceWatcher.process(NamespaceWatcher.java:67)         at org.apache.zookeeper.ClientCnxn$EventThread.processEvent(ClientCnxn.java:530)         at org.apache.zookeeper.ClientCnxn$EventThread.run(ClientCnxn.java:505)

Stack Trace:
com.carrotsearch.randomizedtesting.ThreadLeakError: 1 thread leaked from SUITE scope at org.apache.solr.cloud.TestSolrCloudWithSecureImpersonation: 
   1) Thread[id=7278, name=jetty-launcher-1266-thread-1-EventThread, state=TIMED_WAITING, group=TGRP-TestSolrCloudWithSecureImpersonation]
        at sun.misc.Unsafe.park(Native Method)
        at java.util.concurrent.locks.LockSupport.parkNanos(LockSupport.java:215)
        at java.util.concurrent.locks.AbstractQueuedSynchronizer.doAcquireSharedNanos(AbstractQueuedSynchronizer.java:1037)
        at java.util.concurrent.locks.AbstractQueuedSynchronizer.tryAcquireSharedNanos(AbstractQueuedSynchronizer.java:1328)
        at java.util.concurrent.CountDownLatch.await(CountDownLatch.java:277)
        at org.apache.curator.CuratorZookeeperClient.internalBlockUntilConnectedOrTimedOut(CuratorZookeeperClient.java:323)
        at org.apache.curator.RetryLoop.callWithRetry(RetryLoop.java:105)
        at org.apache.curator.framework.imps.GetDataBuilderImpl.pathInForeground(GetDataBuilderImpl.java:288)
        at org.apache.curator.framework.imps.GetDataBuilderImpl.forPath(GetDataBuilderImpl.java:279)
        at org.apache.curator.framework.imps.GetDataBuilderImpl.forPath(GetDataBuilderImpl.java:41)
        at org.apache.curator.framework.recipes.shared.SharedValue.readValue(SharedValue.java:244)
        at org.apache.curator.framework.recipes.shared.SharedValue.access$100(SharedValue.java:44)
        at org.apache.curator.framework.recipes.shared.SharedValue$1.process(SharedValue.java:61)
        at org.apache.curator.framework.imps.NamespaceWatcher.process(NamespaceWatcher.java:67)
        at org.apache.zookeeper.ClientCnxn$EventThread.processEvent(ClientCnxn.java:530)
        at org.apache.zookeeper.ClientCnxn$EventThread.run(ClientCnxn.java:505)
	at __randomizedtesting.SeedInfo.seed([2EB2598FEDFA575D]:0)


FAILED:  org.apache.solr.cloud.LeaderElectionContextKeyTest.test

Error Message:


Stack Trace:
java.lang.AssertionError
	at __randomizedtesting.SeedInfo.seed([2EB2598FEDFA575D:A6E6665543063AA5]:0)
	at org.junit.Assert.fail(Assert.java:92)
	at org.junit.Assert.assertTrue(Assert.java:43)
	at org.junit.Assert.assertTrue(Assert.java:54)
	at org.apache.solr.cloud.LeaderElectionContextKeyTest.test(LeaderElectionContextKeyTest.java:88)
	at sun.reflect.NativeMethodAccessorImpl.invoke0(Native Method)
	at sun.reflect.NativeMethodAccessorImpl.invoke(NativeMethodAccessorImpl.java:62)
	at sun.reflect.DelegatingMethodAccessorImpl.invoke(DelegatingMethodAccessorImpl.java:43)
	at java.lang.reflect.Method.invoke(Method.java:498)
	at com.carrotsearch.randomizedtesting.RandomizedRunner.invoke(RandomizedRunner.java:1713)
	at com.carrotsearch.randomizedtesting.RandomizedRunner$8.evaluate(RandomizedRunner.java:907)
	at com.carrotsearch.randomizedtesting.RandomizedRunner$9.evaluate(RandomizedRunner.java:943)
	at com.carrotsearch.randomizedtesting.RandomizedRunner$10.evaluate(RandomizedRunner.java:957)
	at com.carrotsearch.randomizedtesting.rules.SystemPropertiesRestoreRule$1.evaluate(SystemPropertiesRestoreRule.java:57)
	at org.apache.lucene.util.TestRuleSetupTeardownChained$1.evaluate(TestRuleSetupTeardownChained.java:49)
	at org.apache.lucene.util.AbstractBeforeAfterRule$1.evaluate(AbstractBeforeAfterRule.java:45)
	at org.apache.lucene.util.TestRuleThreadAndTestName$1.evaluate(TestRuleThreadAndTestName.java:48)
	at org.apache.lucene.util.TestRuleIgnoreAfterMaxFailures$1.evaluate(TestRuleIgnoreAfterMaxFailures.java:64)
	at org.apache.lucene.util.TestRuleMarkFailure$1.evaluate(TestRuleMarkFailure.java:47)
	at com.carrotsearch.randomizedtesting.rules.StatementAdapter.evaluate(StatementAdapter.java:36)
	at com.carrotsearch.randomizedtesting.ThreadLeakControl$StatementRunner.run(ThreadLeakControl.java:368)
	at com.carrotsearch.randomizedtesting.ThreadLeakControl.forkTimeoutingTask(ThreadLeakControl.java:817)
	at com.carrotsearch.randomizedtesting.ThreadLeakControl$3.evaluate(ThreadLeakControl.java:468)
	at com.carrotsearch.randomizedtesting.RandomizedRunner.runSingleTest(RandomizedRunner.java:916)
	at com.carrotsearch.randomizedtesting.RandomizedRunner$5.evaluate(RandomizedRunner.java:802)
	at com.carrotsearch.randomizedtesting.RandomizedRunner$6.evaluate(RandomizedRunner.java:852)
	at com.carrotsearch.randomizedtesting.RandomizedRunner$7.evaluate(RandomizedRunner.java:863)
	at com.carrotsearch.randomizedtesting.rules.StatementAdapter.evaluate(StatementAdapter.java:36)
	at com.carrotsearch.randomizedtesting.rules.SystemPropertiesRestoreRule$1.evaluate(SystemPropertiesRestoreRule.java:57)
	at org.apache.lucene.util.AbstractBeforeAfterRule$1.evaluate(AbstractBeforeAfterRule.java:45)
	at com.carrotsearch.randomizedtesting.rules.StatementAdapter.evaluate(StatementAdapter.java:36)
	at org.apache.lucene.util.TestRuleStoreClassName$1.evaluate(TestRuleStoreClassName.java:41)
	at com.carrotsearch.randomizedtesting.rules.NoShadowingOrOverridesOnMethodsRule$1.evaluate(NoShadowingOrOverridesOnMethodsRule.java:40)
	at com.carrotsearch.randomizedtesting.rules.NoShadowingOrOverridesOnMethodsRule$1.evaluate(NoShadowingOrOverridesOnMethodsRule.java:40)
	at com.carrotsearch.randomizedtesting.rules.StatementAdapter.evaluate(StatementAdapter.java:36)
	at com.carrotsearch.randomizedtesting.rules.StatementAdapter.evaluate(StatementAdapter.java:36)
	at com.carrotsearch.randomizedtesting.rules.StatementAdapter.evaluate(StatementAdapter.java:36)
	at org.apache.lucene.util.TestRuleAssertionsRequired$1.evaluate(TestRuleAssertionsRequired.java:53)
	at org.apache.lucene.util.TestRuleMarkFailure$1.evaluate(TestRuleMarkFailure.java:47)
	at org.apache.lucene.util.TestRuleIgnoreAfterMaxFailures$1.evaluate(TestRuleIgnoreAfterMaxFailures.java:64)
	at org.apache.lucene.util.TestRuleIgnoreTestSuites$1.evaluate(TestRuleIgnoreTestSuites.java:54)
	at com.carrotsearch.randomizedtesting.rules.StatementAdapter.evaluate(StatementAdapter.java:36)
	at com.carrotsearch.randomizedtesting.ThreadLeakControl$StatementRunner.run(ThreadLeakControl.java:368)
	at java.lang.Thread.run(Thread.java:748)


FAILED:  org.apache.solr.metrics.reporters.SolrSlf4jReporterTest.testReporter

Error Message:


Stack Trace:
java.lang.AssertionError
	at __randomizedtesting.SeedInfo.seed([2EB2598FEDFA575D:715674B886F6C418]:0)
	at org.junit.Assert.fail(Assert.java:92)
	at org.junit.Assert.assertTrue(Assert.java:43)
	at org.junit.Assert.assertTrue(Assert.java:54)
	at org.apache.solr.metrics.reporters.SolrSlf4jReporterTest.testReporter(SolrSlf4jReporterTest.java:84)
	at sun.reflect.NativeMethodAccessorImpl.invoke0(Native Method)
	at sun.reflect.NativeMethodAccessorImpl.invoke(NativeMethodAccessorImpl.java:62)
	at sun.reflect.DelegatingMethodAccessorImpl.invoke(DelegatingMethodAccessorImpl.java:43)
	at java.lang.reflect.Method.invoke(Method.java:498)
	at com.carrotsearch.randomizedtesting.RandomizedRunner.invoke(RandomizedRunner.java:1713)
	at com.carrotsearch.randomizedtesting.RandomizedRunner$8.evaluate(RandomizedRunner.java:907)
	at com.carrotsearch.randomizedtesting.RandomizedRunner$9.evaluate(RandomizedRunner.java:943)
	at com.carrotsearch.randomizedtesting.RandomizedRunner$10.evaluate(RandomizedRunner.java:957)
	at com.carrotsearch.randomizedtesting.rules.SystemPropertiesRestoreRule$1.evaluate(SystemPropertiesRestoreRule.java:57)
	at org.apache.lucene.util.TestRuleSetupTeardownChained$1.evaluate(TestRuleSetupTeardownChained.java:49)
	at org.apache.lucene.util.AbstractBeforeAfterRule$1.evaluate(AbstractBeforeAfterRule.java:45)
	at org.apache.lucene.util.TestRuleThreadAndTestName$1.evaluate(TestRuleThreadAndTestName.java:48)
	at org.apache.lucene.util.TestRuleIgnoreAfterMaxFailures$1.evaluate(TestRuleIgnoreAfterMaxFailures.java:64)
	at org.apache.lucene.util.TestRuleMarkFailure$1.evaluate(TestRuleMarkFailure.java:47)
	at com.carrotsearch.randomizedtesting.rules.StatementAdapter.evaluate(StatementAdapter.java:36)
	at com.carrotsearch.randomizedtesting.ThreadLeakControl$StatementRunner.run(ThreadLeakControl.java:368)
	at com.carrotsearch.randomizedtesting.ThreadLeakControl.forkTimeoutingTask(ThreadLeakControl.java:817)
	at com.carrotsearch.randomizedtesting.ThreadLeakControl$3.evaluate(ThreadLeakControl.java:468)
	at com.carrotsearch.randomizedtesting.RandomizedRunner.runSingleTest(RandomizedRunner.java:916)
	at com.carrotsearch.randomizedtesting.RandomizedRunner$5.evaluate(RandomizedRunner.java:802)
	at com.carrotsearch.randomizedtesting.RandomizedRunner$6.evaluate(RandomizedRunner.java:852)
	at com.carrotsearch.randomizedtesting.RandomizedRunner$7.evaluate(RandomizedRunner.java:863)
	at com.carrotsearch.randomizedtesting.rules.StatementAdapter.evaluate(StatementAdapter.java:36)
	at com.carrotsearch.randomizedtesting.rules.SystemPropertiesRestoreRule$1.evaluate(SystemPropertiesRestoreRule.java:57)
	at org.apache.lucene.util.AbstractBeforeAfterRule$1.evaluate(AbstractBeforeAfterRule.java:45)
	at com.carrotsearch.randomizedtesting.rules.StatementAdapter.evaluate(StatementAdapter.java:36)
	at org.apache.lucene.util.TestRuleStoreClassName$1.evaluate(TestRuleStoreClassName.java:41)
	at com.carrotsearch.randomizedtesting.rules.NoShadowingOrOverridesOnMethodsRule$1.evaluate(NoShadowingOrOverridesOnMethodsRule.java:40)
	at com.carrotsearch.randomizedtesting.rules.NoShadowingOrOverridesOnMethodsRule$1.evaluate(NoShadowingOrOverridesOnMethodsRule.java:40)
	at com.carrotsearch.randomizedtesting.rules.StatementAdapter.evaluate(StatementAdapter.java:36)
	at com.carrotsearch.randomizedtesting.rules.StatementAdapter.evaluate(StatementAdapter.java:36)
	at com.carrotsearch.randomizedtesting.rules.StatementAdapter.evaluate(StatementAdapter.java:36)
	at org.apache.lucene.util.TestRuleAssertionsRequired$1.evaluate(TestRuleAssertionsRequired.java:53)
	at org.apache.lucene.util.TestRuleMarkFailure$1.evaluate(TestRuleMarkFailure.java:47)
	at org.apache.lucene.util.TestRuleIgnoreAfterMaxFailures$1.evaluate(TestRuleIgnoreAfterMaxFailures.java:64)
	at org.apache.lucene.util.TestRuleIgnoreTestSuites$1.evaluate(TestRuleIgnoreTestSuites.java:54)
	at com.carrotsearch.randomizedtesting.rules.StatementAdapter.evaluate(StatementAdapter.java:36)
	at com.carrotsearch.randomizedtesting.ThreadLeakControl$StatementRunner.run(ThreadLeakControl.java:368)
	at java.lang.Thread.run(Thread.java:748)




Build Log:
[...truncated 11397 lines...]
   [junit4] Suite: org.apache.solr.cloud.TestSolrCloudWithSecureImpersonation
   [junit4]   2> Creating dataDir: /export/home/jenkins/workspace/Lucene-Solr-7.x-Solaris/solr/build/solr-core/test/J0/temp/solr.cloud.TestSolrCloudWithSecureImpersonation_2EB2598FEDFA575D-001/init-core-data-001
   [junit4]   2> 1024656 WARN  (SUITE-TestSolrCloudWithSecureImpersonation-seed#[2EB2598FEDFA575D]-worker) [    ] o.a.s.SolrTestCaseJ4 startTrackingSearchers: numOpens=4 numCloses=4
   [junit4]   2> 1024715 ERROR (Thread-1528) [    ] o.a.z.s.ZooKeeperServer ZKShutdownHandler is not registered, so ZooKeeper server won't take any action on ERROR or SHUTDOWN server state changes
   [junit4]   2> 1024840 ERROR (jetty-launcher-1266-thread-1) [    ] o.a.s.u.StartupLoggingUtils Missing Java Option solr.log.dir. Logging may be missing or incomplete.
   [junit4]   2> 1024844 ERROR (jetty-launcher-1266-thread-2) [    ] o.a.s.u.StartupLoggingUtils Missing Java Option solr.log.dir. Logging may be missing or incomplete.
   [junit4]   2> 1024909 WARN  (NIOServerCxn.Factory:0.0.0.0/0.0.0.0:0) [    ] o.a.z.s.NIOServerCnxn caught end of stream exception
   [junit4]   2> EndOfStreamException: Unable to read additional data from client sessionid 0x15e0df3453e0005, likely client has closed socket
   [junit4]   2> 	at org.apache.zookeeper.server.NIOServerCnxn.doIO(NIOServerCnxn.java:239)
   [junit4]   2> 	at org.apache.zookeeper.server.NIOServerCnxnFactory.run(NIOServerCnxnFactory.java:203)
   [junit4]   2> 	at java.lang.Thread.run(Thread.java:748)
   [junit4]   2> 1025156 WARN  (jetty-launcher-1266-thread-2) [n:127.0.0.1:58031_solr    ] o.a.s.c.s.i.Krb5HttpClientBuilder org.apache.solr.client.solrj.impl.Krb5HttpClientBuilder is configured without specifying system property 'java.security.auth.login.config'
   [junit4]   2> 1025188 WARN  (jetty-launcher-1266-thread-1) [n:127.0.0.1:61782_solr    ] o.a.s.c.s.i.Krb5HttpClientBuilder org.apache.solr.client.solrj.impl.Krb5HttpClientBuilder is configured without specifying system property 'java.security.auth.login.config'
   [junit4]   2> 1025423 WARN  (jetty-launcher-1266-thread-1) [n:127.0.0.1:61782_solr    ] o.a.s.c.s.i.Krb5HttpClientBuilder org.apache.solr.client.solrj.impl.Krb5HttpClientBuilder is configured without specifying system property 'java.security.auth.login.config'
   [junit4]   2> 1025425 WARN  (jetty-launcher-1266-thread-2) [n:127.0.0.1:58031_solr    ] o.a.s.c.s.i.Krb5HttpClientBuilder org.apache.solr.client.solrj.impl.Krb5HttpClientBuilder is configured without specifying system property 'java.security.auth.login.config'
   [junit4]   2> 1025713 WARN  (TEST-TestSolrCloudWithSecureImpersonation.testProxyUnknownRemote-seed#[2EB2598FEDFA575D]) [    ] o.a.h.c.p.ResponseProcessCookies Invalid cookie header: "Set-Cookie: hadoop.auth="u=localHostAnyGroup&p=localHostAnyGroup&t=test&e=1503508601271&s=mqIOfPv6xJ6R86Fu5qPvFbRROto="; Path=/; Domain=127.0.0.1; Expires= , 23-   -2017 17:16:41 GMT; HttpOnly". Invalid 'expires' attribute: , 23- -2017 17:16:41 GMT
   [junit4]   2> 1025736 WARN  (TEST-TestSolrCloudWithSecureImpersonation.testProxyInvalidProxyUser-seed#[2EB2598FEDFA575D]) [    ] o.a.h.c.p.ResponseProcessCookies Invalid cookie header: "Set-Cookie: hadoop.auth="u=bar&p=bar&t=test&e=1503508601399&s=c3IapSpDySA1eu9NEt9rbBG35Ss="; Path=/; Domain=127.0.0.1; Expires= , 23-   -2017 17:16:41 GMT; HttpOnly". Invalid 'expires' attribute: , 23- -2017 17:16:41 GMT
   [junit4]   2> 1025758 WARN  (TEST-TestSolrCloudWithSecureImpersonation.testProxyValidateGroup-seed#[2EB2598FEDFA575D]) [    ] o.a.h.c.p.ResponseProcessCookies Invalid cookie header: "Set-Cookie: hadoop.auth="u=anyHostUsersGroup&p=anyHostUsersGroup&t=test&e=1503508601422&s=xg8UwLdGIsu0n3jzXTVZb1hEfHw="; Path=/; Domain=127.0.0.1; Expires= , 23-   -2017 17:16:41 GMT; HttpOnly". Invalid 'expires' attribute: , 23- -2017 17:16:41 GMT
   [junit4]   2> 1025777 WARN  (TEST-TestSolrCloudWithSecureImpersonation.testProxyValidateHost-seed#[2EB2598FEDFA575D]) [    ] o.a.h.c.p.ResponseProcessCookies Invalid cookie header: "Set-Cookie: hadoop.auth="u=localHostAnyGroup&p=localHostAnyGroup&t=test&e=1503508601444&s=ltUeOk9pJbDoQKiI2jF/8FPNuIg="; Path=/; Domain=127.0.0.1; Expires= , 23-   -2017 17:16:41 GMT; HttpOnly". Invalid 'expires' attribute: , 23- -2017 17:16:41 GMT
   [junit4]   2> 1025798 WARN  (TEST-TestSolrCloudWithSecureImpersonation.testProxyInvalidRemote-seed#[2EB2598FEDFA575D]) [    ] o.a.h.c.p.ResponseProcessCookies Invalid cookie header: "Set-Cookie: hadoop.auth="u=localHostAnyGroup&p=localHostAnyGroup&t=test&e=1503508601460&s=Ov3PxumbyaPHDaowfMol0I8vj58="; Path=/; Domain=127.0.0.1; Expires= , 23-   -2017 17:16:41 GMT; HttpOnly". Invalid 'expires' attribute: , 23- -2017 17:16:41 GMT
   [junit4]   2> 1025820 WARN  (qtp250307323-7228) [    ] o.e.j.s.ServletHandler /solr/admin/collections
   [junit4]   2> org.apache.solr.common.SolrException: Error during request authentication, 
   [junit4]   2> 	at org.apache.solr.servlet.SolrDispatchFilter.authenticateRequest(SolrDispatchFilter.java:457)
   [junit4]   2> 	at org.apache.solr.servlet.SolrDispatchFilter.doFilter(SolrDispatchFilter.java:347)
   [junit4]   2> 	at org.apache.solr.servlet.SolrDispatchFilter.doFilter(SolrDispatchFilter.java:326)
   [junit4]   2> 	at org.eclipse.jetty.servlet.ServletHandler$CachedChain.doFilter(ServletHandler.java:1759)
   [junit4]   2> 	at org.apache.solr.client.solrj.embedded.JettySolrRunner$DebugFilter.doFilter(JettySolrRunner.java:139)
   [junit4]   2> 	at org.eclipse.jetty.servlet.ServletHandler$CachedChain.doFilter(ServletHandler.java:1759)
   [junit4]   2> 	at org.eclipse.jetty.servlet.ServletHandler.doHandle(ServletHandler.java:582)
   [junit4]   2> 	at org.eclipse.jetty.server.session.SessionHandler.doHandle(SessionHandler.java:224)
   [junit4]   2> 	at org.eclipse.jetty.server.handler.ContextHandler.doHandle(ContextHandler.java:1180)
   [junit4]   2> 	at org.eclipse.jetty.servlet.ServletHandler.doScope(ServletHandler.java:512)
   [junit4]   2> 	at org.eclipse.jetty.server.session.SessionHandler.doScope(SessionHandler.java:185)
   [junit4]   2> 	at org.eclipse.jetty.server.handler.ContextHandler.doScope(ContextHandler.java:1112)
   [junit4]   2> 	at org.eclipse.jetty.server.handler.ScopedHandler.handle(ScopedHandler.java:141)
   [junit4]   2> 	at org.eclipse.jetty.server.handler.gzip.GzipHandler.handle(GzipHandler.java:493)
   [junit4]   2> 	at org.eclipse.jetty.server.handler.HandlerWrapper.handle(HandlerWrapper.java:134)
   [junit4]   2> 	at org.eclipse.jetty.server.Server.handle(Server.java:534)
   [junit4]   2> 	at org.eclipse.jetty.server.HttpChannel.handle(HttpChannel.java:320)
   [junit4]   2> 	at org.eclipse.jetty.server.HttpConnection.onFillable(HttpConnection.java:251)
   [junit4]   2> 	at org.eclipse.jetty.io.AbstractConnection$ReadCallback.succeeded(AbstractConnection.java:283)
   [junit4]   2> 	at org.eclipse.jetty.io.FillInterest.fillable(FillInterest.java:108)
   [junit4]   2> 	at org.eclipse.jetty.io.SelectChannelEndPoint$2.run(SelectChannelEndPoint.java:93)
   [junit4]   2> 	at org.eclipse.jetty.util.thread.strategy.ExecuteProduceConsume.executeProduceConsume(ExecuteProduceConsume.java:303)
   [junit4]   2> 	at org.eclipse.jetty.util.thread.strategy.ExecuteProduceConsume.produceConsume(ExecuteProduceConsume.java:148)
   [junit4]   2> 	at org.eclipse.jetty.util.thread.strategy.ExecuteProduceConsume.run(ExecuteProduceConsume.java:136)
   [junit4]   2> 	at org.eclipse.jetty.util.thread.QueuedThreadPool.runJob(QueuedThreadPool.java:671)
   [junit4]   2> 	at org.eclipse.jetty.util.thread.QueuedThreadPool$2.run(QueuedThreadPool.java:589)
   [junit4]   2> 	at java.lang.Thread.run(Thread.java:748)
   [junit4]   2> Caused by: java.lang.IllegalArgumentException: userName is NULL, empty or contains a '&'
   [junit4]   2> 	at org.apache.hadoop.security.authentication.util.AuthToken.checkForIllegalArgument(AuthToken.java:87)
   [junit4]   2> 	at org.apache.hadoop.security.authentication.util.AuthToken.<init>(AuthToken.java:70)
   [junit4]   2> 	at org.apache.hadoop.security.authentication.server.AuthenticationToken.<init>(AuthenticationToken.java:58)
   [junit4]   2> 	at org.apache.solr.security.HttpParamDelegationTokenPlugin$HttpParamDelegationTokenAuthenticationHandler$HttpParamAuthenticationHandler.authenticate(HttpParamDelegationTokenPlugin.java:213)
   [junit4]   2> 	at org.apache.hadoop.security.token.delegation.web.DelegationTokenAuthenticationHandler.authenticate(DelegationTokenAuthenticationHandler.java:348)
   [junit4]   2> 	at org.apache.solr.security.RequestContinuesRecorderAuthenticationHandler.authenticate(RequestContinuesRecorderAuthenticationHandler.java:69)
   [junit4]   2> 	at org.apache.hadoop.security.authentication.server.AuthenticationFilter.doFilter(AuthenticationFilter.java:518)
   [junit4]   2> 	at org.apache.solr.security.DelegationTokenKerberosFilter.doFilter(DelegationTokenKerberosFilter.java:134)
   [junit4]   2> 	at org.apache.solr.security.HttpParamDelegationTokenPlugin$HttpParamToRequestFilter.doFilter(HttpParamDelegationTokenPlugin.java:245)
   [junit4]   2> 	at org.apache.solr.security.KerberosPlugin.doAuthenticate(KerberosPlugin.java:243)
   [junit4]   2> 	at org.apache.solr.servlet.SolrDispatchFilter.authenticateRequest(SolrDispatchFilter.java:451)
   [junit4]   2> 	... 26 more
   [junit4]   2> 1025840 WARN  (TEST-TestSolrCloudWithSecureImpersonation.testProxyNoConfigGroups-seed#[2EB2598FEDFA575D]) [    ] o.a.h.c.p.ResponseProcessCookies Invalid cookie header: "Set-Cookie: hadoop.auth="u=noGroups&p=noGroups&t=test&e=1503508601504&s=1+Y3sCS+kDRxidzeyBjzVKcKPPU="; Path=/; Domain=127.0.0.1; Expires= , 23-   -2017 17:16:41 GMT; HttpOnly". Invalid 'expires' attribute: , 23- -2017 17:16:41 GMT
   [junit4]   2> 1028533 WARN  (httpShardExecutor-3205-thread-1-processing-n:127.0.0.1:61782_solr [http:////127.0.0.1:61782//solr] http:////127.0.0.1:61782//solr) [n:127.0.0.1:61782_solr    ] o.a.h.c.p.ResponseProcessCookies Invalid cookie header: "Set-Cookie: hadoop.auth="u=$&p=$&t=test&e=1503508602459&s=rcaWwpPTrEqJZoOZdG0M/K1wEHA="; Path=/; Domain=127.0.0.1; Expires= , 23-   -2017 17:16:42 GMT; HttpOnly". Invalid 'expires' attribute: , 23- -2017 17:16:42 GMT
   [junit4]   2> 1029538 WARN  (TEST-TestSolrCloudWithSecureImpersonation.testForwarding-seed#[2EB2598FEDFA575D]) [    ] o.a.h.c.p.ResponseProcessCookies Invalid cookie header: "Set-Cookie: hadoop.auth="u=user&p=user&t=test&e=1503508602120&s=zmj4xunVWVnLVmKMKqnLz4HjSZk="; Path=/; Domain=127.0.0.1; Expires= , 23-   -2017 17:16:42 GMT; HttpOnly". Invalid 'expires' attribute: , 23- -2017 17:16:42 GMT
   [junit4]   2> 1029546 WARN  (TEST-TestSolrCloudWithSecureImpersonation.testForwarding-seed#[2EB2598FEDFA575D]) [    ] o.a.h.c.p.ResponseProcessCookies Invalid cookie header: "Set-Cookie: hadoop.auth="u=user&p=user&t=test&e=1503508605212&s=dqQU+SQ5ZI44CRQ1aDvXjvzNOIY="; Path=/; Domain=127.0.0.1; Expires= , 23-   -2017 17:16:45 GMT; HttpOnly". Invalid 'expires' attribute: , 23- -2017 17:16:45 GMT
   [junit4]   2> 1029556 WARN  (qtp760845770-7240) [n:127.0.0.1:58031_solr    ] o.a.h.c.p.ResponseProcessCookies Invalid cookie header: "Set-Cookie: hadoop.auth="u=$&p=$&t=test&e=1503508605223&s=JD93+xdYCR2Swu44IQjH5qT114M="; Path=/; Domain=127.0.0.1; Expires= , 23-   -2017 17:16:45 GMT; HttpOnly". Invalid 'expires' attribute: , 23- -2017 17:16:45 GMT
   [junit4]   2> 1029557 WARN  (TEST-TestSolrCloudWithSecureImpersonation.testForwarding-seed#[2EB2598FEDFA575D]) [    ] o.a.h.c.p.ResponseProcessCookies Invalid cookie header: "Set-Cookie: hadoop.auth="u=user&p=user&t=test&e=1503508605220&s=uEgFVsFCdh2RNQr5unVsVVmUYU4="; Path=/; Domain=127.0.0.1; Expires= , 23-   -2017 17:16:45 GMT; HttpOnly". Invalid 'expires' attribute: , 23- -2017 17:16:45 GMT
   [junit4]   2> 1029557 WARN  (TEST-TestSolrCloudWithSecureImpersonation.testForwarding-seed#[2EB2598FEDFA575D]) [    ] o.a.h.c.p.ResponseProcessCookies Invalid cookie header: "Set-Cookie: hadoop.auth="u=$&p=$&t=test&e=1503508605223&s=JD93+xdYCR2Swu44IQjH5qT114M="; Path=/; Domain=127.0.0.1; Expires= , 23-   -2017 17:16:45 GMT; HttpOnly". Invalid 'expires' attribute: , 23- -2017 17:16:45 GMT
   [junit4]   2> 1044638 WARN  (jetty-launcher-1266-thread-2-SendThread(127.0.0.1:56373)) [n:127.0.0.1:58031_solr    ] o.a.z.ClientCnxn Client session timed out, have not heard from server in 15084ms for sessionid 0x15e0df3453e0004
   [junit4]   2> 1044638 WARN  (jetty-launcher-1266-thread-2-SendThread(127.0.0.1:56373)) [n:127.0.0.1:58031_solr    ] o.a.z.ClientCnxn Client session timed out, have not heard from server in 19153ms for sessionid 0x15e0df3453e0007
   [junit4]   2> 1044639 WARN  (jetty-launcher-1266-thread-1-SendThread(127.0.0.1:56373)) [n:127.0.0.1:61782_solr    ] o.a.z.ClientCnxn Client session timed out, have not heard from server in 19170ms for sessionid 0x15e0df3453e0008
   [junit4]   2> 1044639 WARN  (jetty-launcher-1266-thread-1-SendThread(127.0.0.1:56373)) [n:127.0.0.1:61782_solr    ] o.a.z.ClientCnxn Client session timed out, have not heard from server in 16000ms for sessionid 0x15e0df3453e0006
   [junit4]   2> 1044639 WARN  (NIOServerCxn.Factory:0.0.0.0/0.0.0.0:0) [    ] o.a.z.s.NIOServerCnxn caught end of stream exception
   [junit4]   2> EndOfStreamException: Unable to read additional data from client sessionid 0x15e0df3453e0007, likely client has closed socket
   [junit4]   2> 	at org.apache.zookeeper.server.NIOServerCnxn.doIO(NIOServerCnxn.java:239)
   [junit4]   2> 	at org.apache.zookeeper.server.NIOServerCnxnFactory.run(NIOServerCnxnFactory.java:203)
   [junit4]   2> 	at java.lang.Thread.run(Thread.java:748)
   [junit4]   2> 1044639 WARN  (NIOServerCxn.Factory:0.0.0.0/0.0.0.0:0) [    ] o.a.z.s.NIOServerCnxn caught end of stream exception
   [junit4]   2> EndOfStreamException: Unable to read additional data from client sessionid 0x15e0df3453e0008, likely client has closed socket
   [junit4]   2> 	at org.apache.zookeeper.server.NIOServerCnxn.doIO(NIOServerCnxn.java:239)
   [junit4]   2> 	at org.apache.zookeeper.server.NIOServerCnxnFactory.run(NIOServerCnxnFactory.java:203)
   [junit4]   2> 	at java.lang.Thread.run(Thread.java:748)
   [junit4]   2> 1044640 WARN  (NIOServerCxn.Factory:0.0.0.0/0.0.0.0:0) [    ] o.a.z.s.NIOServerCnxn caught end of stream exception
   [junit4]   2> EndOfStreamException: Unable to read additional data from client sessionid 0x15e0df3453e0004, likely client has closed socket
   [junit4]   2> 	at org.apache.zookeeper.server.NIOServerCnxn.doIO(NIOServerCnxn.java:239)
   [junit4]   2> 	at org.apache.zookeeper.server.NIOServerCnxnFactory.run(NIOServerCnxnFactory.java:203)
   [junit4]   2> 	at java.lang.Thread.run(Thread.java:748)
   [junit4]   2> 1044640 WARN  (NIOServerCxn.Factory:0.0.0.0/0.0.0.0:0) [    ] o.a.z.s.NIOServerCnxn caught end of stream exception
   [junit4]   2> EndOfStreamException: Unable to read additional data from client sessionid 0x15e0df3453e0006, likely client has closed socket
   [junit4]   2> 	at org.apache.zookeeper.server.NIOServerCnxn.doIO(NIOServerCnxn.java:239)
   [junit4]   2> 	at org.apache.zookeeper.server.NIOServerCnxnFactory.run(NIOServerCnxnFactory.java:203)
   [junit4]   2> 	at java.lang.Thread.run(Thread.java:748)
   [junit4]   2> 1044687 WARN  (TEST-TestSolrCloudWithSecureImpersonation.testProxyWrongHost-seed#[2EB2598FEDFA575D]) [    ] o.a.h.c.p.ResponseProcessCookies Invalid cookie header: "Set-Cookie: hadoop.auth="u=wrongHost&p=wrongHost&t=test&e=1503508605266&s=qccZWUjxAZUIE+ELizaB/JbiJVw="; Path=/; Domain=127.0.0.1; Expires= , 23-   -2017 17:16:45 GMT; HttpOnly". Invalid 'expires' attribute: , 23- -2017 17:16:45 GMT
   [junit4]   2> 1044764 WARN  (zkCallback-1274-thread-1-processing-n:127.0.0.1:58031_solr) [n:127.0.0.1:58031_solr    ] o.a.s.c.c.ConnectionManager Watcher org.apache.solr.common.cloud.ConnectionManager@4cc7d9f6 name: ZooKeeperConnection Watcher:127.0.0.1:56373/solr got event WatchedEvent state:Disconnected type:None path:null path: null type: None
   [junit4]   2> 1044764 WARN  (zkCallback-1274-thread-1-processing-n:127.0.0.1:58031_solr) [n:127.0.0.1:58031_solr    ] o.a.s.c.c.ConnectionManager zkClient has disconnected
   [junit4]   2> 1044793 WARN  (zkCallback-1285-thread-3) [    ] o.a.s.c.c.ConnectionManager Watcher org.apache.solr.common.cloud.ConnectionManager@78fe087c name: ZooKeeperConnection Watcher:127.0.0.1:56373/solr got event WatchedEvent state:Disconnected type:None path:null path: null type: None
   [junit4]   2> 1044793 WARN  (zkCallback-1285-thread-3) [    ] o.a.s.c.c.ConnectionManager zkClient has disconnected
   [junit4]   2> 1044795 WARN  (zkCallback-1279-thread-7-processing-n:127.0.0.1:61782_solr) [n:127.0.0.1:61782_solr    ] o.a.s.c.c.ConnectionManager Watcher org.apache.solr.common.cloud.ConnectionManager@21fcea36 name: ZooKeeperConnection Watcher:127.0.0.1:56373/solr got event WatchedEvent state:Disconnected type:None path:null path: null type: None
   [junit4]   2> 1044795 WARN  (zkCallback-1279-thread-7-processing-n:127.0.0.1:61782_solr) [n:127.0.0.1:61782_solr    ] o.a.s.c.c.ConnectionManager zkClient has disconnected
   [junit4]   2> 1044859 WARN  (qtp250307323-7234) [n:127.0.0.1:61782_solr c:forwardingCollection s:shard1 r:core_node2 x:forwardingCollection_shard1_replica_n1] o.a.h.s.ShellBasedUnixGroupsMapping got exception trying to get groups for user bar: id: invalid user name: "bar"
   [junit4]   2> id: invalid user name: "bar"
   [junit4]   2> 
   [junit4]   2> 1044861 WARN  (TEST-TestSolrCloudWithSecureImpersonation.testProxyInvalidGroup-seed#[2EB2598FEDFA575D]) [    ] o.a.h.c.p.ResponseProcessCookies Invalid cookie header: "Set-Cookie: hadoop.auth="u=bogusGroup&p=bogusGroup&t=test&e=1503508620396&s=tx/wUHWjhq6InJjoy5cQKQO2W7g="; Path=/; Domain=127.0.0.1; Expires= , 23-   -2017 17:17:00 GMT; HttpOnly". Invalid 'expires' attribute: , 23- -2017 17:17:00 GMT
   [junit4]   2> 1045094 WARN  (TEST-TestSolrCloudWithSecureImpersonation.testProxyValidateAnyHostAnyUser-seed#[2EB2598FEDFA575D]) [    ] o.a.h.c.p.ResponseProcessCookies Invalid cookie header: "Set-Cookie: hadoop.auth="u=anyHostAnyUser&p=anyHostAnyUser&t=test&e=1503508620760&s=VDyVqoLkMih+54pmHzbcONLvWEs="; Path=/; Domain=127.0.0.1; Expires= , 23-   -2017 17:17:00 GMT; HttpOnly". Invalid 'expires' attribute: , 23- -2017 17:17:00 GMT
   [junit4]   2> 1045157 WARN  (TEST-TestSolrCloudWithSecureImpersonation.testProxyNoConfigHosts-seed#[2EB2598FEDFA575D]) [    ] o.a.h.c.p.ResponseProcessCookies Invalid cookie header: "Set-Cookie: hadoop.auth="u=noHosts&p=noHosts&t=test&e=1503508620815&s=PHc/tJrzxoGnMoRMOBNjQ/KUyQM="; Path=/; Domain=127.0.0.1; Expires= , 23-   -2017 17:17:00 GMT; HttpOnly". Invalid 'expires' attribute: , 23- -2017 17:17:00 GMT
   [junit4]   2> 1046118 ERROR (Thread[Thread-1549,5,TGRP-TestSolrCloudWithSecureImpersonation]) [n:127.0.0.1:58031_solr    ] o.a.h.s.t.d.AbstractDelegationTokenSecretManager ExpiredTokenRemover received java.lang.InterruptedException: sleep interrupted
   [junit4]   2> 1046435 WARN  (jetty-launcher-1266-thread-1-SendThread(127.0.0.1:56373)) [n:127.0.0.1:61782_solr    ] o.a.z.ClientCnxn Unable to reconnect to ZooKeeper service, session 0x15e0df3453e0008 has expired
   [junit4]   2> 1046985 WARN  (zkCallback-1279-thread-1-processing-n:127.0.0.1:61782_solr) [n:127.0.0.1:61782_solr    ] o.a.s.c.c.ZkStateReader ZooKeeper watch triggered, but Solr cannot talk to ZK: [KeeperErrorCode = Session expired for /live_nodes]
   [junit4]   2> 1048478 WARN  (zkCallback-1279-thread-13-processing-n:127.0.0.1:61782_solr) [n:127.0.0.1:61782_solr    ] o.a.s.c.c.ZkStateReader ZooKeeper watch triggered, but Solr cannot talk to ZK: [KeeperErrorCode = Session expired for /collections/forwardingCollection/state.json]
   [junit4]   2> 1048480 WARN  (zkCallback-1279-thread-10-processing-n:127.0.0.1:61782_solr) [n:127.0.0.1:61782_solr    ] o.a.s.c.c.ZkStateReader ZooKeeper watch triggered, but Solr cannot talk to ZK: [KeeperErrorCode = Session expired for /collections/forwardingCollection/state.json]
   [junit4]   2> 1048481 ERROR (Thread[Thread-1547,5,TGRP-TestSolrCloudWithSecureImpersonation]) [n:127.0.0.1:61782_solr    ] o.a.h.s.t.d.AbstractDelegationTokenSecretManager ExpiredTokenRemover received java.lang.InterruptedException: sleep interrupted
   [junit4]   2> 1048494 ERROR (SUITE-TestSolrCloudWithSecureImpersonation-seed#[2EB2598FEDFA575D]-worker) [    ] o.a.z.s.ZooKeeperServer ZKShutdownHandler is not registered, so ZooKeeper server won't take any action on ERROR or SHUTDOWN server state changes
   [junit4]   2> 1056012 WARN  (Thread-1528) [    ] o.a.s.c.ZkTestServer Watch limit violations: 
   [junit4]   2> Maximum concurrent create/delete watches above limit:
   [junit4]   2> 
   [junit4]   2> 	3	/solr/aliases.json
   [junit4]   2> 	3	/solr/clusterprops.json
   [junit4]   2> 	2	/solr/security.json
   [junit4]   2> 
   [junit4]   2> Maximum concurrent data watches above limit:
   [junit4]   2> 
   [junit4]   2> 	5	/solr/collections/forwardingCollection/state.json
   [junit4]   2> 	4	/solr/security/zkdtsm/ZKDTSMRoot/ZKDTSMKeyIdRoot
   [junit4]   2> 	3	/solr/clusterstate.json
   [junit4]   2> 	2	/solr/security/zkdtsm/ZKDTSMRoot/ZKDTSMMasterKeyRoot/DK_1
   [junit4]   2> 	2	/solr/security/zkdtsm/ZKDTSMRoot/ZKDTSMMasterKeyRoot/DK_3
   [junit4]   2> 	2	/solr/security/zkdtsm/ZKDTSMRoot/ZKDTSMMasterKeyRoot/DK_2
   [junit4]   2> 	2	/solr/security/zkdtsm/ZKDTSMRoot/ZKDTSMMasterKeyRoot/DK_4
   [junit4]   2> 	2	/solr/security/zkdtsm/ZKDTSMRoot/ZKDTSMSeqNumRoot
   [junit4]   2> 
   [junit4]   2> Maximum concurrent children watches above limit:
   [junit4]   2> 
   [junit4]   2> 	3	/solr/live_nodes
   [junit4]   2> 	3	/solr/collections
   [junit4]   2> 	3	/solr/security/zkdtsm/ZKDTSMRoot/ZKDTSMTokensRoot
   [junit4]   2> 	2	/solr/security/zkdtsm/ZKDTSMRoot/ZKDTSMMasterKeyRoot
   [junit4]   2> 
   [junit4]   2> Aug 23, 2017 7:17:11 AM com.carrotsearch.randomizedtesting.ThreadLeakControl checkThreadLeaks
   [junit4]   2> WARNING: Will linger awaiting termination of 2 leaked thread(s).
   [junit4]   2> 1074913 ERROR (jetty-launcher-1266-thread-2-EventThread) [n:127.0.0.1:58031_solr    ] o.a.c.f.i.CuratorFrameworkImpl Watcher exception
   [junit4]   2> java.lang.IllegalStateException: Client is not started
   [junit4]   2> 	at com.google.common.base.Preconditions.checkState(Preconditions.java:149)
   [junit4]   2> 	at org.apache.curator.CuratorZookeeperClient.getZooKeeper(CuratorZookeeperClient.java:113)
   [junit4]   2> 	at org.apache.curator.framework.imps.CuratorFrameworkImpl.getZooKeeper(CuratorFrameworkImpl.java:477)
   [junit4]   2> 	at org.apache.curator.framework.imps.NamespaceFacade.getZooKeeper(NamespaceFacade.java:112)
   [junit4]   2> 	at org.apache.curator.framework.imps.GetDataBuilderImpl$4.call(GetDataBuilderImpl.java:302)
   [junit4]   2> 	at org.apache.curator.framework.imps.GetDataBuilderImpl$4.call(GetDataBuilderImpl.java:291)
   [junit4]   2> 	at org.apache.curator.RetryLoop.callWithRetry(RetryLoop.java:107)
   [junit4]   2> 	at org.apache.curator.framework.imps.GetDataBuilderImpl.pathInForeground(GetDataBuilderImpl.java:288)
   [junit4]   2> 	at org.apache.curator.framework.imps.GetDataBuilderImpl.forPath(GetDataBuilderImpl.java:279)
   [junit4]   2> 	at org.apache.curator.framework.imps.GetDataBuilderImpl.forPath(GetDataBuilderImpl.java:41)
   [junit4]   2> 	at org.apache.curator.framework.recipes.shared.SharedValue.readValue(SharedValue.java:244)
   [junit4]   2> 	at org.apache.curator.framework.recipes.shared.SharedValue.access$100(SharedValue.java:44)
   [junit4]   2> 	at org.apache.curator.framework.recipes.shared.SharedValue$1.process(SharedValue.java:61)
   [junit4]   2> 	at org.apache.curator.framework.imps.NamespaceWatcher.process(NamespaceWatcher.java:67)
   [junit4]   2> 	at org.apache.zookeeper.ClientCnxn$EventThread.processEvent(ClientCnxn.java:530)
   [junit4]   2> 	at org.apache.zookeeper.ClientCnxn$EventThread.run(ClientCnxn.java:505)
   [junit4]   2> Aug 23, 2017 7:17:31 AM com.carrotsearch.randomizedtesting.ThreadLeakControl checkThreadLeaks
   [junit4]   2> SEVERE: 1 thread leaked from SUITE scope at org.apache.solr.cloud.TestSolrCloudWithSecureImpersonation: 
   [junit4]   2>    1) Thread[id=7278, name=jetty-launcher-1266-thread-1-EventThread, state=TIMED_WAITING, group=TGRP-TestSolrCloudWithSecureImpersonation]
   [junit4]   2>         at sun.misc.Unsafe.park(Native Method)
   [junit4]   2>         at java.util.concurrent.locks.LockSupport.parkNanos(LockSupport.java:215)
   [junit4]   2>         at java.util.concurrent.locks.AbstractQueuedSynchronizer.doAcquireSharedNanos(AbstractQueuedSynchronizer.java:1037)
   [junit4]   2>         at java.util.concurrent.locks.AbstractQueuedSynchronizer.tryAcquireSharedNanos(AbstractQueuedSynchronizer.java:1328)
   [junit4]   2>         at java.util.concurrent.CountDownLatch.await(CountDownLatch.java:277)
   [junit4]   2>         at org.apache.curator.CuratorZookeeperClient.internalBlockUntilConnectedOrTimedOut(CuratorZookeeperClient.java:323)
   [junit4]   2>         at org.apache.curator.RetryLoop.callWithRetry(RetryLoop.java:105)
   [junit4]   2>         at org.apache.curator.framework.imps.GetDataBuilderImpl.pathInForeground(GetDataBuilderImpl.java:288)
   [junit4]   2>         at org.apache.curator.framework.imps.GetDataBuilderImpl.forPath(GetDataBuilderImpl.java:279)
   [junit4]   2>         at org.apache.curator.framework.imps.GetDataBuilderImpl.forPath(GetDataBuilderImpl.java:41)
   [junit4]   2>         at org.apache.curator.framework.recipes.shared.SharedValue.readValue(SharedValue.java:244)
   [junit4]   2>         at org.apache.curator.framework.recipes.shared.SharedValue.access$100(SharedValue.java:44)
   [junit4]   2>         at org.apache.curator.framework.recipes.shared.SharedValue$1.process(SharedValue.java:61)
   [junit4]   2>         at org.apache.curator.framework.imps.NamespaceWatcher.process(NamespaceWatcher.java:67)
   [junit4]   2>         at org.apache.zookeeper.ClientCnxn$EventThread.processEvent(ClientCnxn.java:530)
   [junit4]   2>         at org.apache.zookeeper.ClientCnxn$EventThread.run(ClientCnxn.java:505)
   [junit4]   2> Aug 23, 2017 7:17:31 AM com.carrotsearch.randomizedtesting.ThreadLeakControl tryToInterruptAll
   [junit4]   2> INFO: Starting to interrupt leaked threads:
   [junit4]   2>    1) Thread[id=7278, name=jetty-launcher-1266-thread-1-EventThread, state=TIMED_WAITING, group=TGRP-TestSolrCloudWithSecureImpersonation]
   [junit4]   2> 1076238 ERROR (jetty-launcher-1266-thread-1-EventThread) [n:127.0.0.1:61782_solr    ] o.a.c.f.i.CuratorFrameworkImpl Watcher exception
   [junit4]   2> java.lang.InterruptedException
   [junit4]   2> 	at java.util.concurrent.locks.AbstractQueuedSynchronizer.doAcquireSharedNanos(AbstractQueuedSynchronizer.java:1039)
   [junit4]   2> 	at java.util.concurrent.locks.AbstractQueuedSynchronizer.tryAcquireSharedNanos(AbstractQueuedSynchronizer.java:1328)
   [junit4]   2> 	at java.util.concurrent.CountDownLatch.await(CountDownLatch.java:277)
   [junit4]   2> 	at org.apache.curator.CuratorZookeeperClient.internalBlockUntilConnectedOrTimedOut(CuratorZookeeperClient.java:323)
   [junit4]   2> 	at org.apache.curator.RetryLoop.callWithRetry(RetryLoop.java:105)
   [junit4]   2> 	at org.apache.curator.framework.imps.GetDataBuilderImpl.pathInForeground(GetDataBuilderImpl.java:288)
   [junit4]   2> 	at org.apache.curator.framework.imps.GetDataBuilderImpl.forPath(GetDataBuilderImpl.java:279)
   [junit4]   2> 	at org.apache.curator.framework.imps.GetDataBuilderImpl.forPath(GetDataBuilderImpl.java:41)
   [junit4]   2> 	at org.apache.curator.framework.recipes.shared.SharedValue.readValue(SharedValue.java:244)
   [junit4]   2> 	at org.apache.curator.framework.recipes.shared.SharedValue.access$100(SharedValue.java:44)
   [junit4]   2> 	at org.apache.curator.framework.recipes.shared.SharedValue$1.process(SharedValue.java:61)
   [junit4]   2> 	at org.apache.curator.framework.imps.NamespaceWatcher.process(NamespaceWatcher.java:67)
   [junit4]   2> 	at org.apache.zookeeper.ClientCnxn$EventThread.processEvent(ClientCnxn.java:530)
   [junit4]   2> 	at org.apache.zookeeper.ClientCnxn$EventThread.run(ClientCnxn.java:505)
   [junit4]   2> 1076239 WARN  (jetty-launcher-1266-thread-1-EventThread) [n:127.0.0.1:61782_solr    ] o.a.c.ConnectionState Session expired event received
   [junit4]   2> 1076240 WARN  (jetty-launcher-1266-thread-1-SendThread(127.0.0.1:56373)) [n:127.0.0.1:61782_solr    ] o.a.z.ClientCnxn Session 0x0 for server null, unexpected error, closing socket connection and attempting reconnect
   [junit4]   2> java.net.ConnectException: Connection refused
   [junit4]   2> 	at sun.nio.ch.SocketChannelImpl.checkConnect(Native Method)
   [junit4]   2> 	at sun.nio.ch.SocketChannelImpl.finishConnect(SocketChannelImpl.java:717)
   [junit4]   2> 	at org.apache.zookeeper.ClientCnxnSocketNIO.doTransport(ClientCnxnSocketNIO.java:361)
   [junit4]   2> 	at org.apache.zookeeper.ClientCnxn$SendThread.run(ClientCnxn.java:1141)
   [junit4]   2> Aug 23, 2017 7:17:31 AM com.carrotsearch.randomizedtesting.ThreadLeakControl tryToInterruptAll
   [junit4]   2> INFO: All leaked threads terminated.
   [junit4]   2> NOTE: test params are: codec=Asserting(Lucene70): {}, docValues:{}, maxPointsInLeafNode=979, maxMBSortInHeap=7.152869178685901, sim=RandomSimilarity(queryNorm=true): {}, locale=ar-BH, timezone=Europe/Gibraltar
   [junit4]   2> NOTE: SunOS 5.11 amd64/Oracle Corporation 1.8.0_141 (64-bit)/cpus=3,threads=3,free=278095784,total=536870912
   [junit4]   2> NOTE: All tests run in this JVM: [TestSolrCloudSnapshots, SoftAutoCommitTest, IgnoreCommitOptimizeUpdateProcessorFactoryTest, OverseerTest, TestFaceting, TestNRTOpen, ReturnFieldsTest, RegexBoostProcessorTest, DistanceFunctionTest, TestOverriddenPrefixQueryForCustomFieldType, UnloadDistributedZkTest, SuggesterWFSTTest, TestLegacyField, DistributedFacetPivotSmallTest, TestJsonRequest, TestTlogReplica, TestSolrConfigHandler, TestRestManager, TestUpdate, AddSchemaFieldsUpdateProcessorFactoryTest, TestPHPSerializedResponseWriter, BlobRepositoryCloudTest, HdfsTlogReplayBufferedWhileIndexingTest, OutputWriterTest, TestFieldTypeResource, ZkStateWriterTest, TestPushWriter, LeaderInitiatedRecoveryOnCommitTest, SortSpecParsingTest, TestGraphTermsQParserPlugin, TestConfigsApi, TestTrackingShardHandlerFactory, MetricsConfigTest, TestMaxScoreQueryParser, TestXIncludeConfig, RemoteQueryErrorTest, HLLUtilTest, HardAutoCommitTest, TestTolerantSearch, TestTolerantUpdateProcessorRandomCloud, TestMinMaxOnMultiValuedField, TestMultiWordSynonyms, RecoveryZkTest, CollectionStateFormat2Test, TestLockTree, TestInitQParser, TimeZoneUtilsTest, TestSolrFieldCacheBean, BitVectorTest, OverseerStatusTest, TestSortByMinMaxFunction, ConnectionReuseTest, DistributedQueryComponentCustomSortTest, AnalyticsMergeStrategyTest, AliasIntegrationTest, TestRandomFlRTGCloud, TestCursorMarkWithoutUniqueKey, TestDefaultStatsCache, TestStressVersions, TestSolrCLIRunExample, NodeMutatorTest, QueryResultKeyTest, DocValuesTest, TestPhraseSuggestions, DirectUpdateHandlerOptimizeTest, SaslZkACLProviderTest, TestManagedSynonymFilterFactory, TestReloadDeadlock, BasicAuthStandaloneTest, TestCollationFieldDocValues, DirectUpdateHandlerTest, TestConfigSetsAPIExclusivity, SpatialFilterTest, DateMathParserTest, OverseerModifyCollectionTest, TestIBSimilarityFactory, TestDynamicLoading, TestJsonFacetRefinement, CircularListTest, TestStressReorder, TestRandomDVFaceting, TestPseudoReturnFields, CSVRequestHandlerTest, ScriptEngineTest, TestShortCircuitedRequests, TestLegacyNumericUtils, QueryParsingTest, TestSSLRandomization, MoveReplicaTest, SegmentsInfoRequestHandlerTest, TestCloudInspectUtil, DateRangeFieldTest, HdfsNNFailoverTest, TestAtomicUpdateErrorCases, TestSolrCloudWithSecureImpersonation]
   [junit4]   2> NOTE: reproduce with: ant test  -Dtestcase=TestSolrCloudWithSecureImpersonation -Dtests.seed=2EB2598FEDFA575D -Dtests.slow=true -Dtests.locale=ar-BH -Dtests.timezone=Europe/Gibraltar -Dtests.asserts=true -Dtests.file.encoding=US-ASCII
   [junit4] ERROR   0.00s J0 | TestSolrCloudWithSecureImpersonation (suite) <<<
   [junit4]    > Throwable #1: com.carrotsearch.randomizedtesting.ThreadLeakError: 1 thread leaked from SUITE scope at org.apache.solr.cloud.TestSolrCloudWithSecureImpersonation: 
   [junit4]    >    1) Thread[id=7278, name=jetty-launcher-1266-thread-1-EventThread, state=TIMED_WAITING, group=TGRP-TestSolrCloudWithSecureImpersonation]
   [junit4]    >         at sun.misc.Unsafe.park(Native Method)
   [junit4]    >         at java.util.concurrent.locks.LockSupport.parkNanos(LockSupport.java:215)
   [junit4]    >         at java.util.concurrent.locks.AbstractQueuedSynchronizer.doAcquireSharedNanos(AbstractQueuedSynchronizer.java:1037)
   [junit4]    >         at java.util.concurrent.locks.AbstractQueuedSynchronizer.tryAcquireSharedNanos(AbstractQueuedSynchronizer.java:1328)
   [junit4]    >         at java.util.concurrent.CountDownLatch.await(CountDownLatch.java:277)
   [junit4]    >         at org.apache.curator.CuratorZookeeperClient.internalBlockUntilConnectedOrTimedOut(CuratorZookeeperClient.java:323)
   [junit4]    >         at org.apache.curator.RetryLoop.callWithRetry(RetryLoop.java:105)
   [junit4]    >         at org.apache.curator.framework.imps.GetDataBuilderImpl.pathInForeground(GetDataBuilderImpl.java:288)
   [junit4]    >         at org.apache.curator.framework.imps.GetDataBuilderImpl.forPath(GetDataBuilderImpl.java:279)
   [junit4]    >         at org.apache.curator.framework.imps.GetDataBuilderImpl.forPath(GetDataBuilderImpl.java:41)
   [junit4]    >         at org.apache.curator.framework.recipes.shared.SharedValue.readValue(SharedValue.java:244)
   [junit4]    >         at org.apache.curator.framework.recipes.shared.SharedValue.access$100(SharedValue.java:44)
   [junit4]    >         at org.apache.curator.framework.recipes.shared.SharedValue$1.process(SharedValue.java:61)
   [junit4]    >         at org.apache.curator.framework.imps.NamespaceWatcher.process(NamespaceWatcher.java:67)
   [junit4]    >         at org.apache.zookeeper.ClientCnxn$EventThread.processEvent(ClientCnxn.java:530)
   [junit4]    >         at org.apache.zookeeper.ClientCnxn$EventThread.run(ClientCnxn.java:505)
   [junit4]    > 	at __randomizedtesting.SeedInfo.seed([2EB2598FEDFA575D]:0)
   [junit4] Completed [216/730 (1!)] on J0 in 51.60s, 12 tests, 1 error <<< FAILURES!

[...truncated 960 lines...]
   [junit4] Suite: org.apache.solr.cloud.LeaderElectionContextKeyTest
   [junit4]   2> Creating dataDir: /export/home/jenkins/workspace/Lucene-Solr-7.x-Solaris/solr/build/solr-core/test/J0/temp/solr.cloud.LeaderElectionContextKeyTest_2EB2598FEDFA575D-001/init-core-data-001
   [junit4]   2> 2858610 WARN  (SUITE-LeaderElectionContextKeyTest-seed#[2EB2598FEDFA575D]-worker) [    ] o.a.s.SolrTestCaseJ4 startTrackingSearchers: numOpens=37 numCloses=37
   [junit4]   2> 2858621 ERROR (Thread-6330) [    ] o.a.z.s.ZooKeeperServer ZKShutdownHandler is not registered, so ZooKeeper server won't take any action on ERROR or SHUTDOWN server state changes
   [junit4]   2> 2858767 ERROR (jetty-launcher-3284-thread-1) [    ] o.a.s.u.StartupLoggingUtils Missing Java Option solr.log.dir. Logging may be missing or incomplete.
   [junit4]   2> 2859394 WARN  (jetty-launcher-1266-thread-1-SendThread(127.0.0.1:56373)) [n:127.0.0.1:61782_solr    ] o.a.z.ClientCnxn Session 0x0 for server null, unexpected error, closing socket connection and attempting reconnect
   [junit4]   2> java.net.ConnectException: Connection refused
   [junit4]   2> 	at sun.nio.ch.SocketChannelImpl.checkConnect(Native Method)
   [junit4]   2> 	at sun.nio.ch.SocketChannelImpl.finishConnect(SocketChannelImpl.java:717)
   [junit4]   2> 	at org.apache.zookeeper.ClientCnxnSocketNIO.doTransport(ClientCnxnSocketNIO.java:361)
   [junit4]   2> 	at org.apache.zookeeper.ClientCnxn$SendThread.run(ClientCnxn.java:1141)
   [junit4]   2> 2860495 WARN  (jetty-launcher-1266-thread-1-SendThread(127.0.0.1:56373)) [n:127.0.0.1:61782_solr    ] o.a.z.ClientCnxn Session 0x0 for server null, unexpected error, closing socket connection and attempting reconnect
   [junit4]   2> java.net.ConnectException: Connection refused
   [junit4]   2> 	at sun.nio.ch.SocketChannelImpl.checkConnect(Native Method)
   [junit4]   2> 	at sun.nio.ch.SocketChannelImpl.finishConnect(SocketChannelImpl.java:717)
   [junit4]   2> 	at org.apache.zookeeper.ClientCnxnSocketNIO.doTransport(ClientCnxnSocketNIO.java:361)
   [junit4]   2> 	at org.apache.zookeeper.ClientCnxn$SendThread.run(ClientCnxn.java:1141)
   [junit4]   2> 2861600 WARN  (jetty-launcher-1266-thread-1-SendThread(127.0.0.1:56373)) [n:127.0.0.1:61782_solr    ] o.a.z.ClientCnxn Session 0x0 for server null, unexpected error, closing socket connection and attempting reconnect
   [junit4]   2> java.net.ConnectException: Connection refused
   [junit4]   2> 	at sun.nio.ch.SocketChannelImpl.checkConnect(Native Method)
   [junit4]   2> 	at sun.nio.ch.SocketChannelImpl.finishConnect(SocketChannelImpl.java:717)
   [junit4]   2> 	at org.apache.zookeeper.ClientCnxnSocketNIO.doTransport(ClientCnxnSocketNIO.java:361)
   [junit4]   2> 	at org.apache.zookeeper.ClientCnxn$SendThread.run(ClientCnxn.java:1141)
   [junit4]   2> 2862707 WARN  (jetty-launcher-1266-thread-1-SendThread(127.0.0.1:56373)) [n:127.0.0.1:61782_solr    ] o.a.z.ClientCnxn Session 0x0 for server null, unexpected error, closing socket connection and attempting reconnect
   [junit4]   2> java.net.ConnectException: Connection refused
   [junit4]   2> 	at sun.nio.ch.SocketChannelImpl.checkConnect(Native Method)
   [junit4]   2> 	at sun.nio.ch.SocketChannelImpl.finishConnect(SocketChannelImpl.java:717)
   [junit4]   2> 	at org.apache.zookeeper.ClientCnxnSocketNIO.doTransport(ClientCnxnSocketNIO.java:361)
   [junit4]   2> 	at org.apache.zookeeper.ClientCnxn$SendThread.run(ClientCnxn.java:1141)
   [junit4]   2> 2863812 WARN  (jetty-launcher-1266-thread-1-SendThread(127.0.0.1:56373)) [n:127.0.0.1:61782_solr    ] o.a.z.ClientCnxn Session 0x0 for server null, unexpected error, closing socket connection and attempting reconnect
   [junit4]   2> java.net.ConnectException: Connection refused
   [junit4]   2> 	at sun.nio.ch.SocketChannelImpl.checkConnect(Native Method)
   [junit4]   2> 	at sun.nio.ch.SocketChannelImpl.finishConnect(SocketChannelImpl.java:717)
   [junit4]   2> 	at org.apache.zookeeper.ClientCnxnSocketNIO.doTransport(ClientCnxnSocketNIO.java:361)
   [junit4]   2> 	at org.apache.zookeeper.ClientCnxn$SendThread.run(ClientCnxn.java:1141)
   [junit4]   2> NOTE: reproduce with: ant test  -Dtestcase=LeaderElectionContextKeyTest -Dtests.method=test -Dtests.seed=2EB2598FEDFA575D -Dtests.slow=true -Dtests.locale=cs -Dtests.timezone=America/Denver -Dtests.asserts=true -Dtests.file.encoding=US-ASCII
   [junit4] FAILURE 0.17s J0 | LeaderElectionContextKeyTest.test <<<
   [junit4]    > Throwable #1: java.lang.AssertionError
   [junit4]    > 	at __randomizedtesting.SeedInfo.seed([2EB2598FEDFA575D:A6E6665543063AA5]:0)
   [junit4]    > 	at org.apache.solr.cloud.LeaderElectionContextKeyTest.test(LeaderElectionContextKeyTest.java:88)
   [junit4]    > 	at java.lang.Thread.run(Thread.java:748)
   [junit4]   2> 2864859 ERROR (SUITE-LeaderElectionContextKeyTest-seed#[2EB2598FEDFA575D]-worker) [    ] o.a.z.s.ZooKeeperServer ZKShutdownHandler is not registered, so ZooKeeper server won't take any action on ERROR or SHUTDOWN server state changes
   [junit4]   2> 2875539 WARN  (jetty-launcher-1266-thread-1-SendThread(127.0.0.1:56373)) [n:127.0.0.1:61782_solr    ] o.a.z.ClientCnxn Session 0x0 for server null, unexpected error, closing socket connection and attempting reconnect
   [junit4]   2> java.net.ConnectException: Connection refused
   [junit4]   2> 	at sun.nio.ch.SocketChannelImpl.checkConnect(Native Method)
   [junit4]   2> 	at sun.nio.ch.SocketChannelImpl.finishConnect(SocketChannelImpl.java:717)
   [junit4]   2> 	at org.apache.zookeeper.ClientCnxnSocketNIO.doTransport(ClientCnxnSocketNIO.java:361)
   [junit4]   2> 	at org.apache.zookeeper.ClientCnxn$SendThread.run(ClientCnxn.java:1141)
   [junit4]   2> 2875546 WARN  (Thread-6330) [    ] o.a.s.c.ZkTestServer Watch limit violations: 
   [junit4]   2> Maximum concurrent create/delete watches above limit:
   [junit4]   2> 
   [junit4]   2> 	2	/solr/aliases.json
   [junit4]   2> 	2	/solr/clusterprops.json
   [junit4]   2> 
   [junit4]   2> Maximum concurrent data watches above limit:
   [junit4]   2> 
   [junit4]   2> 	5	/solr/collections/testCollection2/state.json
   [junit4]   2> 	5	/solr/collections/testCollection1/state.json
   [junit4]   2> 	2	/solr/clusterstate.json
   [junit4]   2> 
   [junit4]   2> Maximum concurrent children watches above limit:
   [junit4]   2> 
   [junit4]   2> 	2	/solr/live_nodes
   [junit4]   2> 	2	/solr/collections
   [junit4]   2> 
   [junit4]   2> NOTE: leaving temporary files on disk at: /export/home/jenkins/workspace/Lucene-Solr-7.x-Solaris/solr/build/solr-core/test/J0/temp/solr.cloud.LeaderElectionContextKeyTest_2EB2598FEDFA575D-001
   [junit4]   2> NOTE: test params are: codec=Lucene70, sim=RandomSimilarity(queryNorm=true): {}, locale=cs, timezone=America/Denver
   [junit4]   2> NOTE: SunOS 5.11 amd64/Oracle Corporation 1.8.0_141 (64-bit)/cpus=3,threads=1,free=153542384,total=536870912
   [junit4]   2> NOTE: All tests run in this JVM: [TestSolrCloudSnapshots, SoftAutoCommitTest, IgnoreCommitOptimizeUpdateProcessorFactoryTest, OverseerTest, TestFaceting, TestNRTOpen, ReturnFieldsTest, RegexBoostProcessorTest, DistanceFunctionTest, TestOverriddenPrefixQueryForCustomFieldType, UnloadDistributedZkTest, SuggesterWFSTTest, TestLegacyField, DistributedFacetPivotSmallTest, TestJsonRequest, TestTlogReplica, TestSolrConfigHandler, TestRestManager, TestUpdate, AddSchemaFieldsUpdateProcessorFactoryTest, TestPHPSerializedResponseWriter, BlobRepositoryCloudTest, HdfsTlogReplayBufferedWhileIndexingTest, OutputWriterTest, TestFieldTypeResource, ZkStateWriterTest, TestPushWriter, LeaderInitiatedRecoveryOnCommitTest, SortSpecParsingTest, TestGraphTermsQParserPlugin, TestConfigsApi, TestTrackingShardHandlerFactory, MetricsConfigTest, TestMaxScoreQueryParser, TestXIncludeConfig, RemoteQueryErrorTest, HLLUtilTest, HardAutoCommitTest, TestTolerantSearch, TestTolerantUpdateProcessorRandomCloud, TestMinMaxOnMultiValuedField, TestMultiWordSynonyms, RecoveryZkTest, CollectionStateFormat2Test, TestLockTree, TestInitQParser, TimeZoneUtilsTest, TestSolrFieldCacheBean, BitVectorTest, OverseerStatusTest, TestSortByMinMaxFunction, ConnectionReuseTest, DistributedQueryComponentCustomSortTest, AnalyticsMergeStrategyTest, AliasIntegrationTest, TestRandomFlRTGCloud, TestCursorMarkWithoutUniqueKey, TestDefaultStatsCache, TestStressVersions, TestSolrCLIRunExample, NodeMutatorTest, QueryResultKeyTest, DocValuesTest, TestPhraseSuggestions, DirectUpdateHandlerOptimizeTest, SaslZkACLProviderTest, TestManagedSynonymFilterFactory, TestReloadDeadlock, BasicAuthStandaloneTest, TestCollationFieldDocValues, DirectUpdateHandlerTest, TestConfigSetsAPIExclusivity, SpatialFilterTest, DateMathParserTest, OverseerModifyCollectionTest, TestIBSimilarityFactory, TestDynamicLoading, TestJsonFacetRefinement, CircularListTest, TestStressReorder, TestRandomDVFaceting, TestPseudoReturnFields, CSVRequestHandlerTest, ScriptEngineTest, TestShortCircuitedRequests, TestLegacyNumericUtils, QueryParsingTest, TestSSLRandomization, MoveReplicaTest, SegmentsInfoRequestHandlerTest, TestCloudInspectUtil, DateRangeFieldTest, HdfsNNFailoverTest, TestAtomicUpdateErrorCases, TestSolrCloudWithSecureImpersonation, TestQuerySenderListener, TestFuzzyAnalyzedSuggestions, SharedFSAutoReplicaFailoverTest, TestQuerySenderNoQuery, TestRuleBasedAuthorizationPlugin, BlockJoinFacetDistribTest, InfixSuggestersTest, SolrTestCaseJ4Test, TestConfigSetProperties, PropertiesRequestHandlerTest, NumericFieldsTest, TestAuthenticationFramework, TestStressUserVersions, AlternateDirectoryTest, CollectionsAPIAsyncDistributedZkTest, TestInPlaceUpdatesDistrib, SimplePostToolTest, CloneFieldUpdateProcessorFactoryTest, DistributedSpellCheckComponentTest, DistanceUnitsTest, TestDistributedStatsComponentCardinality, TestXmlQParser, MergeStrategyTest, TestLeaderInitiatedRecoveryThread, UUIDFieldTest, BlockDirectoryTest, DistribDocExpirationUpdateProcessorTest, EnumFieldTest, RequiredFieldsTest, TestEmbeddedSolrServerSchemaAPI, JSONWriterTest, TestHttpShardHandlerFactory, BlockJoinFacetSimpleTest, OverriddenZkACLAndCredentialsProvidersTest, HdfsDirectoryTest, TestExclusionRuleCollectionAccess, SolrJmxReporterTest, FieldAnalysisRequestHandlerTest, TestCorePropertiesReload, MultiTermTest, DeleteLastCustomShardedReplicaTest, TestManagedSchemaThreadSafety, TestCollectionsAPIViaSolrCloudCluster, DistributedSuggestComponentTest, TestLRUStatsCache, TestLMDirichletSimilarityFactory, DateFieldTest, TestIntervalFaceting, PreAnalyzedUpdateProcessorTest, SimpleCollectionCreateDeleteTest, TestPullReplica, DistributedFacetPivotLongTailTest, SuggestComponentContextFilterQueryTest, SuggesterTest, CloudExitableDirectoryReaderTest, TestBlobHandler, MigrateRouteKeyTest, BasicDistributedZkTest, HdfsRecoveryZkTest, TestDynamicFieldResource, TestManagedResource, TestCloudRecovery, DistributedQueueTest, TestFunctionQuery, URLClassifyProcessorTest, ReplicationFactorTest, TestCryptoKeys, DocValuesNotIndexedTest, TestExportWriter, TestSchemaVersionResource, SubstringBytesRefFilterTest, ResourceLoaderTest, V2StandaloneTest, DefaultValueUpdateProcessorTest, TestStressInPlaceUpdates, AnalysisErrorHandlingTest, TestGroupingSearch, TestSolrCloudWithDelegationTokens, HighlighterConfigTest, TestCloudPivotFacet, ConjunctionSolrSpellCheckerTest, DisMaxRequestHandlerTest, TestSubQueryTransformerCrossCore, TestReplicationHandler, TestDistributedSearch, ZkControllerTest, PeerSyncTest, TestBadConfig, HighlighterTest, SolrIndexSplitterTest, AnalysisAfterCoreReloadTest, TestExtendedDismaxParser, CoreAdminHandlerTest, NoCacheHeaderTest, SolrCoreCheckLockOnStartupTest, SortByFunctionTest, TestSolrDeletionPolicy1, SolrInfoBeanTest, CacheHeaderTest, TestSurroundQueryParser, TestQueryUtils, TestWriterPerf, TestReversedWildcardFilterFactory, XmlUpdateRequestHandlerTest, DocumentBuilderTest, TermVectorComponentTest, FastVectorHighlighterTest, IndexSchemaTest, TestCollationField, TestCSVResponseWriter, UniqFieldsUpdateProcessorFactoryTest, JsonLoaderTest, BinaryUpdateRequestHandlerTest, PingRequestHandlerTest, SearchHandlerTest, TestLFUCache, EchoParamsTest, TestSweetSpotSimilarityFactory, TestLMJelinekMercerSimilarityFactory, PluginInfoTest, TestFastLRUCache, PreAnalyzedFieldTest, PrimUtilsTest, TestSuggestSpellingConverter, RAMDirectoryFactoryTest, ClusterStateTest, TestUtils, TestDocumentBuilder, SliceStateTest, SystemInfoHandlerTest, TestRTGBase, CursorPagingTest, TestCrossCoreJoin, TestHighlightDedupGrouping, AssignBackwardCompatibilityTest, AssignTest, AsyncCallRequestStatusResponseTest, BaseCdcrDistributedZkTest, CdcrBootstrapTest, CdcrReplicationDistributedZkTest, CdcrReplicationHandlerTest, CdcrRequestHandlerTest, CdcrVersionReplicationTest, CleanupOldIndexTest, CollectionReloadTest, CollectionsAPISolrJTest, CreateCollectionCleanupTest, DeleteNodeTest, DeleteShardTest, DeleteStatusTest, HttpPartitionTest, LeaderElectionContextKeyTest]
   [junit4] Completed [513/730 (2!)] on J0 in 16.99s, 1 test, 1 failure <<< FAILURES!

[...truncated 360 lines...]
   [junit4] Suite: org.apache.solr.metrics.reporters.SolrSlf4jReporterTest
   [junit4]   2> Creating dataDir: /export/home/jenkins/workspace/Lucene-Solr-7.x-Solaris/solr/build/solr-core/test/J1/temp/solr.metrics.reporters.SolrSlf4jReporterTest_2EB2598FEDFA575D-001/init-core-data-001
   [junit4]   2> 3589094 WARN  (SUITE-SolrSlf4jReporterTest-seed#[2EB2598FEDFA575D]-worker) [    ] o.a.s.SolrTestCaseJ4 startTrackingSearchers: numOpens=1 numCloses=1
   [junit4]   2> 3589095 INFO  (SUITE-SolrSlf4jReporterTest-seed#[2EB2598FEDFA575D]-worker) [    ] o.a.s.SolrTestCaseJ4 Using PointFields (NUMERIC_POINTS_SYSPROP=true) w/NUMERIC_DOCVALUES_SYSPROP=false
   [junit4]   2> 3589101 INFO  (SUITE-SolrSlf4jReporterTest-seed#[2EB2598FEDFA575D]-worker) [    ] o.a.s.SolrTestCaseJ4 Randomized ssl (false) and clientAuth (true) via: @org.apache.solr.util.RandomizeSSL(reason=, value=NaN, ssl=NaN, clientAuth=NaN)
   [junit4]   2> 3589101 INFO  (SUITE-SolrSlf4jReporterTest-seed#[2EB2598FEDFA575D]-worker) [    ] o.a.s.SolrTestCaseJ4 SecureRandom sanity checks: test.solr.allowed.securerandom=null & java.security.egd=file:/dev/./urandom
   [junit4]   2> 3589108 INFO  (TEST-SolrSlf4jReporterTest.testReporter-seed#[2EB2598FEDFA575D]) [    ] o.a.s.SolrTestCaseJ4 ###Starting testReporter
   [junit4]   2> 3595649 INFO  (TEST-SolrSlf4jReporterTest.testReporter-seed#[2EB2598FEDFA575D]) [    ] o.a.s.SolrTestCaseJ4 ###Ending testReporter
   [junit4]   2> NOTE: reproduce with: ant test  -Dtestcase=SolrSlf4jReporterTest -Dtests.method=testReporter -Dtests.seed=2EB2598FEDFA575D -Dtests.slow=true -Dtests.locale=vi-VN -Dtests.timezone=America/Dominica -Dtests.asserts=true -Dtests.file.encoding=US-ASCII
   [junit4] FAILURE 6.55s J1 | SolrSlf4jReporterTest.testReporter <<<
   [junit4]    > Throwable #1: java.lang.AssertionError
   [junit4]    > 	at __randomizedtesting.SeedInfo.seed([2EB2598FEDFA575D:715674B886F6C418]:0)
   [junit4]    > 	at org.apache.solr.metrics.reporters.SolrSlf4jReporterTest.testReporter(SolrSlf4jReporterTest.java:84)
   [junit4]    > 	at java.lang.Thread.run(Thread.java:748)
   [junit4]   2> 3595653 INFO  (SUITE-SolrSlf4jReporterTest-seed#[2EB2598FEDFA575D]-worker) [    ] o.a.s.SolrTestCaseJ4 ###deleteCore
   [junit4]   2> NOTE: leaving temporary files on disk at: /export/home/jenkins/workspace/Lucene-Solr-7.x-Solaris/solr/build/solr-core/test/J1/temp/solr.metrics.reporters.SolrSlf4jReporterTest_2EB2598FEDFA575D-001
   [junit4]   2> NOTE: test params are: codec=HighCompressionCompressingStoredFields(storedFieldsFormat=CompressingStoredFieldsFormat(compressionMode=HIGH_COMPRESSION, chunkSize=7, maxDocsPerChunk=6, blockSize=7), termVectorsFormat=CompressingTermVectorsFormat(compressionMode=HIGH_COMPRESSION, chunkSize=7, blockSize=7)), sim=RandomSimilarity(queryNorm=false): {}, locale=vi-VN, timezone=America/Dominica
   [junit4]   2> NOTE: SunOS 5.11 amd64/Oracle Corporation 1.8.0_141 (64-bit)/cpus=3,threads=1,free=300765600,total=536870912
   [junit4]   2> NOTE: All tests run in this JVM: [TestCSVLoader, CdcrUpdateLogTest, FieldMutatingUpdateProcessorTest, OverseerRolesTest, CheckHdfsIndexTest, TestRemoteStreaming, TestSolrXml, TestCustomSort, SignatureUpdateProcessorFactoryTest, TestXmlQParserPlugin, TestQueryTypes, ChaosMonkeySafeLeaderTest, AutoScalingHandlerTest, SpellCheckCollatorTest, DistributedMLTComponentTest, GraphQueryTest, VMParamsZkACLAndCredentialsProvidersTest, MoreLikeThisHandlerTest, TestFieldTypeCollectionResource, TestInPlaceUpdatesStandalone, VersionInfoTest, TestSubQueryTransformer, OpenCloseCoreStressTest, ImplicitSnitchTest, SampleTest, TestManagedStopFilterFactory, ConfigureRecoveryStrategyTest, TestSubQueryTransformerDistrib, LeaderElectionIntegrationTest, TestDocSet, TestLRUCache, DistributedExpandComponentTest, TermVectorComponentDistributedTest, JvmMetricsTest, TestNoOpRegenerator, SearchHandlerTest, ReplaceNodeTest, HLLSerializationTest, AddBlockUpdateTest, TestCharFilters, ZkNodePropsTest, TestTrieFacet, TestPayloadCheckQParserPlugin, RecoveryAfterSoftCommitTest, CollectionTooManyReplicasTest, TestRandomRequestDistribution, TestLegacyNumericRangeQueryBuilder, TestSystemIdResolver, TestRecoveryHdfs, BigEndianAscendingWordSerializerTest, OverseerCollectionConfigSetProcessorTest, TestValueSourceCache, TestJettySolrRunner, DistributedQueryComponentOptimizationTest, RankQueryTest, ActionThrottleTest, TestSegmentSorting, TestDistributedMissingSort, TestPerFieldSimilarity, TestSolr4Spatial, TestMaxTokenLenTokenizer, MoveReplicaHDFSUlogDirTest, TestBackupRepositoryFactory, IndexSchemaRuntimeFieldTest, SuggesterFSTTest, TestLegacyFieldCache, ShardRoutingCustomTest, CopyFieldTest, TestExactStatsCache, TestManagedSchemaAPI, TestNumericTerms64, TestDownShardTolerantSearch, TestElisionMultitermQuery, DOMUtilTest, OutOfBoxZkACLAndCredentialsProvidersTest, TestBM25SimilarityFactory, TestReloadAndDeleteDocs, TestSolrQueryParser, UpdateRequestProcessorFactoryTest, TestSearcherReuse, TestSimpleTrackingShardHandler, TestQueryWrapperFilter, TestReplicationHandlerBackup, TestStressLiveNodes, TestLegacyFieldReuse, TestComponentsName, TestStressCloudBlindAtomicUpdates, MissingSegmentRecoveryTest, BadComponentTest, TestCloudSearcherWarming, ExternalFileFieldSortTest, HdfsUnloadDistributedZkTest, SolrCmdDistributorTest, TestZkChroot, TestSolrCoreSnapshots, SpellingQueryConverterTest, SharedFSAutoReplicaFailoverUtilsTest, DocumentAnalysisRequestHandlerTest, PKIAuthenticationIntegrationTest, TestJsonFacets, FacetPivotSmallTest, TestDistributedGrouping, TestImplicitCoreProperties, TestCoreAdminApis, SchemaVersionSpecificBehaviorTest, TestCloudPseudoReturnFields, TestSmileRequest, HdfsDirectoryFactoryTest, CollectionsAPIDistributedZkTest, TestDocBasedVersionConstraints, TestFastOutputStream, ClassificationUpdateProcessorTest, DistributedQueryElevationComponentTest, FileUtilsTest, StatsComponentTest, TestSolrJ, TestComplexPhraseLeadingWildcard, TestPullReplicaErrorHandling, QueryEqualityTest, SuggesterTSTTest, DistribCursorPagingTest, ManagedSchemaRoundRobinCloudTest, TestBulkSchemaConcurrent, TestEmbeddedSolrServerConstructors, TestCustomDocTransformer, SuggestComponentTest, TestOrdValues, MultiThreadedOCPTest, TestAnalyzedSuggestions, TestLocalFSCloudBackupRestore, SolrJmxReporterCloudTest, TestRestoreCore, TestMergePolicyConfig, PolyFieldTest, DeleteInactiveReplicaTest, TestSchemalessBufferedUpdates, TestDeleteCollectionOnDownNodes, DistributedTermsComponentTest, TestDistribIDF, TestClassicSimilarityFactory, DocValuesMultiTest, TestStreamBody, ParsingFieldUpdateProcessorsTest, SolrCLIZkUtilsTest, TestRequestStatusCollectionAPI, DistributedFacetPivotWhiteBoxTest, SpellCheckComponentTest, FileBasedSpellCheckerTest, ChaosMonkeySafeLeaderWithPullReplicasTest, TestSolrConfigHandlerConcurrent, LeaderFailureAfterFreshStartTest, BasicDistributedZk2Test, StressHdfsTest, TestSchemaSimilarityResource, TestFieldCollectionResource, TestConfigSetsAPI, DistribJoinFromCollectionTest, TestStressLucene, TestPartialUpdateDeduplication, RestartWhileUpdatingTest, TestHdfsCloudBackupRestore, DistributedVersionInfoTest, TestRawResponseWriter, BadIndexSchemaTest, TestConfigSetImmutable, MetricsHandlerTest, DocExpirationUpdateProcessorFactoryTest, TlogReplayBufferedWhileIndexingTest, TestFieldCacheSort, TestJoin, TestTolerantUpdateProcessorCloud, TermsComponentTest, TestCollectionAPI, ResponseHeaderTest, DistributedIntervalFacetingTest, TestDynamicFieldCollectionResource, SyncSliceTest, ShardRoutingTest, BasicZkTest, FullSolrCloudDistribCmdsTest, ClusterStateUpdateTest, TestRandomFaceting, LeaderElectionTest, ZkSolrClientTest, ZkCLITest, AutoCommitTest, TestRecovery, TestHashPartitioner, TestRealTimeGet, TestReload, TestRangeQuery, TestCoreContainer, SimpleFacetsTest, SolrCoreTest, QueryElevationComponentTest, ConvertedLegacyTest, TestSort, TestFiltering, BasicFunctionalityTest, TestLazyCores, TestIndexSearcher, ShowFileRequestHandlerTest, TestCoreDiscovery, SolrRequestParserTest, TestFoldingMultitermQuery, TestTrie, WordBreakSolrSpellCheckerTest, TestWordDelimiterFilterFactory, StatelessScriptUpdateProcessorFactoryTest, XsltUpdateRequestHandlerTest, DebugComponentTest, IndexBasedSpellCheckerTest, LukeRequestHandlerTest, DirectSolrSpellCheckerTest, PrimitiveFieldTypeTest, TestOmitPositions, RequestHandlersTest, PathHierarchyTokenizerFactoryTest, TestIndexingPerformance, LoggingHandlerTest, SolrPluginUtilsTest, TestJmxIntegration, MBeansHandlerTest, SOLR749Test, UpdateParamsTest, TestSolrIndexConfig, ResponseLogComponentTest, SolrIndexConfigTest, TestStressRecovery, TestSolrDeletionPolicy2, TestBinaryField, TestSearchPerf, MinimalSchemaTest, TestConfig, TestSolrCoreProperties, TestPostingsSolrHighlighter, DirectSolrConnectionTest, NotRequiredUniqueKeyTest, TestLuceneMatchVersion, SpellPossibilityIteratorTest, TestCodecSupport, SynonymTokenizerTest, TestDFRSimilarityFactory, TestFastWriter, OpenExchangeRatesOrgProviderTest, ChaosMonkeyNothingIsSafeTest, ChaosMonkeyNothingIsSafeWithPullReplicasTest, ConcurrentDeleteAndCreateCollectionTest, ConfigSetsAPITest, ConnectionManagerTest, CustomCollectionTest, DeleteReplicaTest, ForceLeaderTest, LeaderInitiatedRecoveryOnShardRestartTest, MoveReplicaHDFSTest, OverseerTaskQueueTest, RollingRestartTest, SSLMigrationTest, ShardSplitTest, TestPrepRecovery, TestRequestForwarding, TestSizeLimitedDistributedMap, TriLevelCompositeIdRoutingTest, TestPolicyCloud, HdfsBasicDistributedZk2Test, HdfsBasicDistributedZkTest, HdfsChaosMonkeyNothingIsSafeTest, HdfsChaosMonkeySafeLeaderTest, HdfsCollectionsAPIDistributedZkTest, HdfsRecoverLeaseTest, HdfsRestartWhileUpdatingTest, HdfsSyncSliceTest, HdfsThreadLeakTest, CachingDirectoryFactoryTest, CoreSorterTest, DirectoryFactoryTest, ExitableDirectoryReaderTest, TestConfigOverlay, TestConfigSets, TestCustomStream, TestConfigReload, TestReqParamsAPI, TestSQLHandler, TestSystemCollAutoCreate, CoreAdminCreateDiscoverTest, CoreAdminRequestStatusTest, SecurityConfHandlerTest, TestApiFramework, TestCollectionAPIs, DistributedDebugComponentTest, DistributedFacetExistsSmallTest, DistributedFacetPivotLargeTest, TestExpandComponent, TestPivotHelperCode, JavabinLoaderTest, HighlighterMaxOffsetTest, TestUnifiedSolrHighlighter, TestSlowCompositeReaderWrapper, UninvertDocValuesMergePolicyTest, WrapperMergePolicyFactoryTest, TestLegacyTerms, TestMultiValuedNumericRangeQuery, TestNumericRangeQuery32, TestNumericRangeQuery64, TestNumericTokenStream, SolrCoreMetricManagerTest, SolrMetricManagerTest, SolrMetricReporterTest, SolrMetricsIntegrationTest, SolrGangliaReporterTest, SolrGraphiteReporterTest, SolrSlf4jReporterTest]
   [junit4] Completed [613/730 (3!)] on J1 in 6.61s, 1 test, 1 failure <<< FAILURES!

[...truncated 43784 lines...]

Mime
View raw message