lucene-dev mailing list archives

Site index · List index
Message view « Date » · « Thread »
Top « Date » · « Thread »
From Apache Jenkins Server <jenk...@builds.apache.org>
Subject [JENKINS] Lucene-Solr-Tests-7.0 - Build # 105 - Unstable
Date Wed, 09 Aug 2017 13:40:01 GMT
Build: https://builds.apache.org/job/Lucene-Solr-Tests-7.0/105/

3 tests failed.
FAILED:  junit.framework.TestSuite.org.apache.solr.security.hadoop.TestZkAclsWithHadoopAuth

Error Message:
KeeperErrorCode = AuthFailed for /solr

Stack Trace:
org.apache.zookeeper.KeeperException$AuthFailedException: KeeperErrorCode = AuthFailed for
/solr
	at __randomizedtesting.SeedInfo.seed([206B883F6041D1BE]:0)
	at org.apache.zookeeper.KeeperException.create(KeeperException.java:123)
	at org.apache.zookeeper.KeeperException.create(KeeperException.java:51)
	at org.apache.zookeeper.ZooKeeper.exists(ZooKeeper.java:1102)
	at org.apache.solr.common.cloud.SolrZkClient$4.execute(SolrZkClient.java:306)
	at org.apache.solr.common.cloud.SolrZkClient$4.execute(SolrZkClient.java:303)
	at org.apache.solr.common.cloud.ZkCmdExecutor.retryOperation(ZkCmdExecutor.java:60)
	at org.apache.solr.common.cloud.SolrZkClient.exists(SolrZkClient.java:303)
	at org.apache.solr.common.cloud.SolrZkClient.makePath(SolrZkClient.java:512)
	at org.apache.solr.common.cloud.SolrZkClient.makePath(SolrZkClient.java:467)
	at org.apache.solr.common.cloud.SolrZkClient.makePath(SolrZkClient.java:454)
	at org.apache.solr.common.cloud.SolrZkClient.makePath(SolrZkClient.java:441)
	at org.apache.solr.cloud.MiniSolrCloudCluster.<init>(MiniSolrCloudCluster.java:233)
	at org.apache.solr.cloud.SolrCloudTestCase$Builder.configure(SolrCloudTestCase.java:190)
	at org.apache.solr.security.hadoop.TestZkAclsWithHadoopAuth.setupClass(TestZkAclsWithHadoopAuth.java:69)
	at sun.reflect.NativeMethodAccessorImpl.invoke0(Native Method)
	at sun.reflect.NativeMethodAccessorImpl.invoke(NativeMethodAccessorImpl.java:62)
	at sun.reflect.DelegatingMethodAccessorImpl.invoke(DelegatingMethodAccessorImpl.java:43)
	at java.lang.reflect.Method.invoke(Method.java:498)
	at com.carrotsearch.randomizedtesting.RandomizedRunner.invoke(RandomizedRunner.java:1713)
	at com.carrotsearch.randomizedtesting.RandomizedRunner$6.evaluate(RandomizedRunner.java:847)
	at com.carrotsearch.randomizedtesting.RandomizedRunner$7.evaluate(RandomizedRunner.java:863)
	at com.carrotsearch.randomizedtesting.rules.StatementAdapter.evaluate(StatementAdapter.java:36)
	at com.carrotsearch.randomizedtesting.rules.SystemPropertiesRestoreRule$1.evaluate(SystemPropertiesRestoreRule.java:57)
	at org.apache.lucene.util.AbstractBeforeAfterRule$1.evaluate(AbstractBeforeAfterRule.java:45)
	at com.carrotsearch.randomizedtesting.rules.StatementAdapter.evaluate(StatementAdapter.java:36)
	at org.apache.lucene.util.TestRuleStoreClassName$1.evaluate(TestRuleStoreClassName.java:41)
	at com.carrotsearch.randomizedtesting.rules.NoShadowingOrOverridesOnMethodsRule$1.evaluate(NoShadowingOrOverridesOnMethodsRule.java:40)
	at com.carrotsearch.randomizedtesting.rules.NoShadowingOrOverridesOnMethodsRule$1.evaluate(NoShadowingOrOverridesOnMethodsRule.java:40)
	at com.carrotsearch.randomizedtesting.rules.StatementAdapter.evaluate(StatementAdapter.java:36)
	at com.carrotsearch.randomizedtesting.rules.StatementAdapter.evaluate(StatementAdapter.java:36)
	at com.carrotsearch.randomizedtesting.rules.StatementAdapter.evaluate(StatementAdapter.java:36)
	at org.apache.lucene.util.TestRuleAssertionsRequired$1.evaluate(TestRuleAssertionsRequired.java:53)
	at org.apache.lucene.util.TestRuleMarkFailure$1.evaluate(TestRuleMarkFailure.java:47)
	at org.apache.lucene.util.TestRuleIgnoreAfterMaxFailures$1.evaluate(TestRuleIgnoreAfterMaxFailures.java:64)
	at org.apache.lucene.util.TestRuleIgnoreTestSuites$1.evaluate(TestRuleIgnoreTestSuites.java:54)
	at com.carrotsearch.randomizedtesting.rules.StatementAdapter.evaluate(StatementAdapter.java:36)
	at com.carrotsearch.randomizedtesting.ThreadLeakControl$StatementRunner.run(ThreadLeakControl.java:368)
	at java.lang.Thread.run(Thread.java:748)


FAILED:  junit.framework.TestSuite.org.apache.solr.security.hadoop.TestZkAclsWithHadoopAuth

Error Message:
5 threads leaked from SUITE scope at org.apache.solr.security.hadoop.TestZkAclsWithHadoopAuth:
    1) Thread[id=23348, name=NIOServerCxn.Factory:0.0.0.0/0.0.0.0:0, state=RUNNABLE, group=TGRP-TestZkAclsWithHadoopAuth]
        at sun.nio.ch.EPollArrayWrapper.epollWait(Native Method)         at sun.nio.ch.EPollArrayWrapper.poll(EPollArrayWrapper.java:269)
        at sun.nio.ch.EPollSelectorImpl.doSelect(EPollSelectorImpl.java:93)         at sun.nio.ch.SelectorImpl.lockAndDoSelect(SelectorImpl.java:86)
        at sun.nio.ch.SelectorImpl.select(SelectorImpl.java:97)         at org.apache.zookeeper.server.NIOServerCnxnFactory.run(NIOServerCnxnFactory.java:173)
        at java.lang.Thread.run(Thread.java:748)    2) Thread[id=23349, name=SessionTracker,
state=TIMED_WAITING, group=TGRP-TestZkAclsWithHadoopAuth]         at java.lang.Object.wait(Native
Method)         at org.apache.zookeeper.server.SessionTrackerImpl.run(SessionTrackerImpl.java:146)
   3) Thread[id=23347, name=Thread-6630, state=WAITING, group=TGRP-TestZkAclsWithHadoopAuth]
        at java.lang.Object.wait(Native Method)         at java.lang.Thread.join(Thread.java:1252)
        at java.lang.Thread.join(Thread.java:1326)         at org.apache.zookeeper.server.NIOServerCnxnFactory.join(NIOServerCnxnFactory.java:297)
        at org.apache.solr.cloud.ZkTestServer$ZKServerMain.runFromConfig(ZkTestServer.java:309)
        at org.apache.solr.cloud.ZkTestServer$2.run(ZkTestServer.java:490)    4) Thread[id=23353,
name=SUITE-TestZkAclsWithHadoopAuth-seed#[206B883F6041D1BE]-worker-EventThread, state=WAITING,
group=TGRP-TestZkAclsWithHadoopAuth]         at sun.misc.Unsafe.park(Native Method)      
  at java.util.concurrent.locks.LockSupport.park(LockSupport.java:175)         at java.util.concurrent.locks.AbstractQueuedSynchronizer$ConditionObject.await(AbstractQueuedSynchronizer.java:2039)
        at java.util.concurrent.LinkedBlockingQueue.take(LinkedBlockingQueue.java:442)   
     at org.apache.zookeeper.ClientCnxn$EventThread.run(ClientCnxn.java:501)    5) Thread[id=23351,
name=ProcessThread(sid:0 cport:34067):, state=WAITING, group=TGRP-TestZkAclsWithHadoopAuth]
        at sun.misc.Unsafe.park(Native Method)         at java.util.concurrent.locks.LockSupport.park(LockSupport.java:175)
        at java.util.concurrent.locks.AbstractQueuedSynchronizer$ConditionObject.await(AbstractQueuedSynchronizer.java:2039)
        at java.util.concurrent.LinkedBlockingQueue.take(LinkedBlockingQueue.java:442)   
     at org.apache.zookeeper.server.PrepRequestProcessor.run(PrepRequestProcessor.java:122)

Stack Trace:
com.carrotsearch.randomizedtesting.ThreadLeakError: 5 threads leaked from SUITE scope at org.apache.solr.security.hadoop.TestZkAclsWithHadoopAuth:

   1) Thread[id=23348, name=NIOServerCxn.Factory:0.0.0.0/0.0.0.0:0, state=RUNNABLE, group=TGRP-TestZkAclsWithHadoopAuth]
        at sun.nio.ch.EPollArrayWrapper.epollWait(Native Method)
        at sun.nio.ch.EPollArrayWrapper.poll(EPollArrayWrapper.java:269)
        at sun.nio.ch.EPollSelectorImpl.doSelect(EPollSelectorImpl.java:93)
        at sun.nio.ch.SelectorImpl.lockAndDoSelect(SelectorImpl.java:86)
        at sun.nio.ch.SelectorImpl.select(SelectorImpl.java:97)
        at org.apache.zookeeper.server.NIOServerCnxnFactory.run(NIOServerCnxnFactory.java:173)
        at java.lang.Thread.run(Thread.java:748)
   2) Thread[id=23349, name=SessionTracker, state=TIMED_WAITING, group=TGRP-TestZkAclsWithHadoopAuth]
        at java.lang.Object.wait(Native Method)
        at org.apache.zookeeper.server.SessionTrackerImpl.run(SessionTrackerImpl.java:146)
   3) Thread[id=23347, name=Thread-6630, state=WAITING, group=TGRP-TestZkAclsWithHadoopAuth]
        at java.lang.Object.wait(Native Method)
        at java.lang.Thread.join(Thread.java:1252)
        at java.lang.Thread.join(Thread.java:1326)
        at org.apache.zookeeper.server.NIOServerCnxnFactory.join(NIOServerCnxnFactory.java:297)
        at org.apache.solr.cloud.ZkTestServer$ZKServerMain.runFromConfig(ZkTestServer.java:309)
        at org.apache.solr.cloud.ZkTestServer$2.run(ZkTestServer.java:490)
   4) Thread[id=23353, name=SUITE-TestZkAclsWithHadoopAuth-seed#[206B883F6041D1BE]-worker-EventThread,
state=WAITING, group=TGRP-TestZkAclsWithHadoopAuth]
        at sun.misc.Unsafe.park(Native Method)
        at java.util.concurrent.locks.LockSupport.park(LockSupport.java:175)
        at java.util.concurrent.locks.AbstractQueuedSynchronizer$ConditionObject.await(AbstractQueuedSynchronizer.java:2039)
        at java.util.concurrent.LinkedBlockingQueue.take(LinkedBlockingQueue.java:442)
        at org.apache.zookeeper.ClientCnxn$EventThread.run(ClientCnxn.java:501)
   5) Thread[id=23351, name=ProcessThread(sid:0 cport:34067):, state=WAITING, group=TGRP-TestZkAclsWithHadoopAuth]
        at sun.misc.Unsafe.park(Native Method)
        at java.util.concurrent.locks.LockSupport.park(LockSupport.java:175)
        at java.util.concurrent.locks.AbstractQueuedSynchronizer$ConditionObject.await(AbstractQueuedSynchronizer.java:2039)
        at java.util.concurrent.LinkedBlockingQueue.take(LinkedBlockingQueue.java:442)
        at org.apache.zookeeper.server.PrepRequestProcessor.run(PrepRequestProcessor.java:122)
	at __randomizedtesting.SeedInfo.seed([206B883F6041D1BE]:0)


FAILED:  junit.framework.TestSuite.org.apache.solr.security.hadoop.TestZkAclsWithHadoopAuth

Error Message:
There are still zombie threads that couldn't be terminated:    1) Thread[id=23348, name=NIOServerCxn.Factory:0.0.0.0/0.0.0.0:0,
state=RUNNABLE, group=TGRP-TestZkAclsWithHadoopAuth]         at sun.nio.ch.EPollArrayWrapper.epollWait(Native
Method)         at sun.nio.ch.EPollArrayWrapper.poll(EPollArrayWrapper.java:269)         at
sun.nio.ch.EPollSelectorImpl.doSelect(EPollSelectorImpl.java:93)         at sun.nio.ch.SelectorImpl.lockAndDoSelect(SelectorImpl.java:86)
        at sun.nio.ch.SelectorImpl.select(SelectorImpl.java:97)         at org.apache.zookeeper.server.NIOServerCnxnFactory.run(NIOServerCnxnFactory.java:173)
        at java.lang.Thread.run(Thread.java:748)

Stack Trace:
com.carrotsearch.randomizedtesting.ThreadLeakError: There are still zombie threads that couldn't
be terminated:
   1) Thread[id=23348, name=NIOServerCxn.Factory:0.0.0.0/0.0.0.0:0, state=RUNNABLE, group=TGRP-TestZkAclsWithHadoopAuth]
        at sun.nio.ch.EPollArrayWrapper.epollWait(Native Method)
        at sun.nio.ch.EPollArrayWrapper.poll(EPollArrayWrapper.java:269)
        at sun.nio.ch.EPollSelectorImpl.doSelect(EPollSelectorImpl.java:93)
        at sun.nio.ch.SelectorImpl.lockAndDoSelect(SelectorImpl.java:86)
        at sun.nio.ch.SelectorImpl.select(SelectorImpl.java:97)
        at org.apache.zookeeper.server.NIOServerCnxnFactory.run(NIOServerCnxnFactory.java:173)
        at java.lang.Thread.run(Thread.java:748)
	at __randomizedtesting.SeedInfo.seed([206B883F6041D1BE]:0)




Build Log:
[...truncated 13175 lines...]
   [junit4] Suite: org.apache.solr.security.hadoop.TestZkAclsWithHadoopAuth
   [junit4]   2> Creating dataDir: /x1/jenkins/jenkins-slave/workspace/Lucene-Solr-Tests-7.0/solr/build/solr-core/test/J2/temp/solr.security.hadoop.TestZkAclsWithHadoopAuth_206B883F6041D1BE-001/init-core-data-001
   [junit4]   2> 2517886 INFO  (SUITE-TestZkAclsWithHadoopAuth-seed#[206B883F6041D1BE]-worker)
[    ] o.a.s.SolrTestCaseJ4 Using PointFields (NUMERIC_POINTS_SYSPROP=true) w/NUMERIC_DOCVALUES_SYSPROP=true
   [junit4]   2> 2517888 INFO  (SUITE-TestZkAclsWithHadoopAuth-seed#[206B883F6041D1BE]-worker)
[    ] o.a.s.SolrTestCaseJ4 Randomized ssl (true) and clientAuth (false) via: @org.apache.solr.util.RandomizeSSL(reason=,
ssl=NaN, value=NaN, clientAuth=NaN)
   [junit4]   2> 2517894 INFO  (SUITE-TestZkAclsWithHadoopAuth-seed#[206B883F6041D1BE]-worker)
[    ] o.a.s.c.MiniSolrCloudCluster Starting cluster of 1 servers in /x1/jenkins/jenkins-slave/workspace/Lucene-Solr-Tests-7.0/solr/build/solr-core/test/J2/temp/solr.security.hadoop.TestZkAclsWithHadoopAuth_206B883F6041D1BE-001/tempDir-001
   [junit4]   2> 2517894 INFO  (SUITE-TestZkAclsWithHadoopAuth-seed#[206B883F6041D1BE]-worker)
[    ] o.a.s.c.ZkTestServer STARTING ZK TEST SERVER
   [junit4]   2> 2517909 INFO  (Thread-6630) [    ] o.a.s.c.ZkTestServer client port:0.0.0.0/0.0.0.0:0
   [junit4]   2> 2517909 INFO  (Thread-6630) [    ] o.a.s.c.ZkTestServer Starting server
   [junit4]   2> 2517951 ERROR (Thread-6630) [    ] o.a.z.s.ZooKeeperServer ZKShutdownHandler
is not registered, so ZooKeeper server won't take any action on ERROR or SHUTDOWN server state
changes
   [junit4]   2> 2518006 INFO  (SUITE-TestZkAclsWithHadoopAuth-seed#[206B883F6041D1BE]-worker)
[    ] o.a.s.c.ZkTestServer start zk server on port:34067
   [junit4]   2> 2518006 INFO  (SUITE-TestZkAclsWithHadoopAuth-seed#[206B883F6041D1BE]-worker)
[    ] o.a.s.c.c.SolrZkClient Using ZkCredentialsProvider: org.apache.solr.security.hadoop.TestZkAclsWithHadoopAuth$DummyZkCredentialsProvider
   [junit4]   2> 2518026 WARN  (NIOServerCxn.Factory:0.0.0.0/0.0.0.0:0) [    ] o.a.z.s.ZooKeeperServer
No authentication provider for scheme: dummyauth has sasl ip digest 
   [junit4]   2> 2518042 INFO  (SUITE-TestZkAclsWithHadoopAuth-seed#[206B883F6041D1BE]-worker)
[    ] o.a.s.c.c.SolrZkClient Using ZkACLProvider: org.apache.solr.security.hadoop.TestZkAclsWithHadoopAuth$DummyZkAclProvider
   [junit4]   2> 2518043 WARN  (zkCallback-3769-thread-2) [    ] o.a.s.c.c.ConnectionManager
Watcher org.apache.solr.common.cloud.ConnectionManager@11d9ed6e name: ZooKeeperConnection
Watcher:127.0.0.1:34067 got event WatchedEvent state:AuthFailed type:None path:null path:
null type: None
   [junit4]   2> 2518044 INFO  (SUITE-TestZkAclsWithHadoopAuth-seed#[206B883F6041D1BE]-worker)
[    ] o.a.s.SolrTestCaseJ4 ------------------------------------------------------- Done waiting
for tracked resources to be released
   [junit4]   2> Aug 09, 2017 1:19:38 PM com.carrotsearch.randomizedtesting.ThreadLeakControl
checkThreadLeaks
   [junit4]   2> WARNING: Will linger awaiting termination of 6 leaked thread(s).
   [junit4]   2> Aug 09, 2017 1:19:58 PM com.carrotsearch.randomizedtesting.ThreadLeakControl
checkThreadLeaks
   [junit4]   2> SEVERE: 5 threads leaked from SUITE scope at org.apache.solr.security.hadoop.TestZkAclsWithHadoopAuth:

   [junit4]   2>    1) Thread[id=23348, name=NIOServerCxn.Factory:0.0.0.0/0.0.0.0:0, state=RUNNABLE,
group=TGRP-TestZkAclsWithHadoopAuth]
   [junit4]   2>         at sun.nio.ch.EPollArrayWrapper.epollWait(Native Method)
   [junit4]   2>         at sun.nio.ch.EPollArrayWrapper.poll(EPollArrayWrapper.java:269)
   [junit4]   2>         at sun.nio.ch.EPollSelectorImpl.doSelect(EPollSelectorImpl.java:93)
   [junit4]   2>         at sun.nio.ch.SelectorImpl.lockAndDoSelect(SelectorImpl.java:86)
   [junit4]   2>         at sun.nio.ch.SelectorImpl.select(SelectorImpl.java:97)
   [junit4]   2>         at org.apache.zookeeper.server.NIOServerCnxnFactory.run(NIOServerCnxnFactory.java:173)
   [junit4]   2>         at java.lang.Thread.run(Thread.java:748)
   [junit4]   2>    2) Thread[id=23349, name=SessionTracker, state=TIMED_WAITING, group=TGRP-TestZkAclsWithHadoopAuth]
   [junit4]   2>         at java.lang.Object.wait(Native Method)
   [junit4]   2>         at org.apache.zookeeper.server.SessionTrackerImpl.run(SessionTrackerImpl.java:146)
   [junit4]   2>    3) Thread[id=23347, name=Thread-6630, state=WAITING, group=TGRP-TestZkAclsWithHadoopAuth]
   [junit4]   2>         at java.lang.Object.wait(Native Method)
   [junit4]   2>         at java.lang.Thread.join(Thread.java:1252)
   [junit4]   2>         at java.lang.Thread.join(Thread.java:1326)
   [junit4]   2>         at org.apache.zookeeper.server.NIOServerCnxnFactory.join(NIOServerCnxnFactory.java:297)
   [junit4]   2>         at org.apache.solr.cloud.ZkTestServer$ZKServerMain.runFromConfig(ZkTestServer.java:309)
   [junit4]   2>         at org.apache.solr.cloud.ZkTestServer$2.run(ZkTestServer.java:490)
   [junit4]   2>    4) Thread[id=23353, name=SUITE-TestZkAclsWithHadoopAuth-seed#[206B883F6041D1BE]-worker-EventThread,
state=WAITING, group=TGRP-TestZkAclsWithHadoopAuth]
   [junit4]   2>         at sun.misc.Unsafe.park(Native Method)
   [junit4]   2>         at java.util.concurrent.locks.LockSupport.park(LockSupport.java:175)
   [junit4]   2>         at java.util.concurrent.locks.AbstractQueuedSynchronizer$ConditionObject.await(AbstractQueuedSynchronizer.java:2039)
   [junit4]   2>         at java.util.concurrent.LinkedBlockingQueue.take(LinkedBlockingQueue.java:442)
   [junit4]   2>         at org.apache.zookeeper.ClientCnxn$EventThread.run(ClientCnxn.java:501)
   [junit4]   2>    5) Thread[id=23351, name=ProcessThread(sid:0 cport:34067):, state=WAITING,
group=TGRP-TestZkAclsWithHadoopAuth]
   [junit4]   2>         at sun.misc.Unsafe.park(Native Method)
   [junit4]   2>         at java.util.concurrent.locks.LockSupport.park(LockSupport.java:175)
   [junit4]   2>         at java.util.concurrent.locks.AbstractQueuedSynchronizer$ConditionObject.await(AbstractQueuedSynchronizer.java:2039)
   [junit4]   2>         at java.util.concurrent.LinkedBlockingQueue.take(LinkedBlockingQueue.java:442)
   [junit4]   2>         at org.apache.zookeeper.server.PrepRequestProcessor.run(PrepRequestProcessor.java:122)
   [junit4]   2> Aug 09, 2017 1:19:58 PM com.carrotsearch.randomizedtesting.ThreadLeakControl
tryToInterruptAll
   [junit4]   2> INFO: Starting to interrupt leaked threads:
   [junit4]   2>    1) Thread[id=23348, name=NIOServerCxn.Factory:0.0.0.0/0.0.0.0:0, state=RUNNABLE,
group=TGRP-TestZkAclsWithHadoopAuth]
   [junit4]   2>    2) Thread[id=23349, name=SessionTracker, state=TIMED_WAITING, group=TGRP-TestZkAclsWithHadoopAuth]
   [junit4]   2>    3) Thread[id=23347, name=Thread-6630, state=WAITING, group=TGRP-TestZkAclsWithHadoopAuth]
   [junit4]   2>    4) Thread[id=23353, name=SUITE-TestZkAclsWithHadoopAuth-seed#[206B883F6041D1BE]-worker-EventThread,
state=WAITING, group=TGRP-TestZkAclsWithHadoopAuth]
   [junit4]   2>    5) Thread[id=23351, name=ProcessThread(sid:0 cport:34067):, state=WAITING,
group=TGRP-TestZkAclsWithHadoopAuth]
   [junit4]   2> 2538265 ERROR (SessionTracker) [    ] o.a.z.s.ZooKeeperCriticalThread
Severe unrecoverable error, from thread : SessionTracker
   [junit4]   2> java.lang.InterruptedException
   [junit4]   2> 	at java.lang.Object.wait(Native Method)
   [junit4]   2> 	at org.apache.zookeeper.server.SessionTrackerImpl.run(SessionTrackerImpl.java:146)
   [junit4]   2> 2538265 ERROR (SessionTracker) [    ] o.a.z.s.ZooKeeperServer ZKShutdownHandler
is not registered, so ZooKeeper server won't take any action on ERROR or SHUTDOWN server state
changes
   [junit4]   2> 2538265 WARN  (Thread-6630) [    ] o.a.s.c.ZkTestServer Server interrupted
   [junit4]   2> java.lang.InterruptedException
   [junit4]   2> 	at java.lang.Object.wait(Native Method)
   [junit4]   2> 	at java.lang.Thread.join(Thread.java:1252)
   [junit4]   2> 	at java.lang.Thread.join(Thread.java:1326)
   [junit4]   2> 	at org.apache.zookeeper.server.NIOServerCnxnFactory.join(NIOServerCnxnFactory.java:297)
   [junit4]   2> 	at org.apache.solr.cloud.ZkTestServer$ZKServerMain.runFromConfig(ZkTestServer.java:309)
   [junit4]   2> 	at org.apache.solr.cloud.ZkTestServer$2.run(ZkTestServer.java:490)
   [junit4]   2> 2538265 ERROR (SUITE-TestZkAclsWithHadoopAuth-seed#[206B883F6041D1BE]-worker-EventThread)
[    ] o.a.z.ClientCnxn Event thread exiting due to interruption
   [junit4]   2> java.lang.InterruptedException
   [junit4]   2> 	at java.util.concurrent.locks.AbstractQueuedSynchronizer$ConditionObject.reportInterruptAfterWait(AbstractQueuedSynchronizer.java:2014)
   [junit4]   2> 	at java.util.concurrent.locks.AbstractQueuedSynchronizer$ConditionObject.await(AbstractQueuedSynchronizer.java:2048)
   [junit4]   2> 	at java.util.concurrent.LinkedBlockingQueue.take(LinkedBlockingQueue.java:442)
   [junit4]   2> 	at org.apache.zookeeper.ClientCnxn$EventThread.run(ClientCnxn.java:501)
   [junit4]   2> 2538266 ERROR (ProcessThread(sid:0 cport:34067):) [    ] o.a.z.s.ZooKeeperCriticalThread
Severe unrecoverable error, from thread : ProcessThread(sid:0 cport:34067):
   [junit4]   2> java.lang.InterruptedException
   [junit4]   2> 	at java.util.concurrent.locks.AbstractQueuedSynchronizer$ConditionObject.reportInterruptAfterWait(AbstractQueuedSynchronizer.java:2014)
   [junit4]   2> 	at java.util.concurrent.locks.AbstractQueuedSynchronizer$ConditionObject.await(AbstractQueuedSynchronizer.java:2048)
   [junit4]   2> 	at java.util.concurrent.LinkedBlockingQueue.take(LinkedBlockingQueue.java:442)
   [junit4]   2> 	at org.apache.zookeeper.server.PrepRequestProcessor.run(PrepRequestProcessor.java:122)
   [junit4]   2> 2538266 ERROR (ProcessThread(sid:0 cport:34067):) [    ] o.a.z.s.ZooKeeperServer
ZKShutdownHandler is not registered, so ZooKeeper server won't take any action on ERROR or
SHUTDOWN server state changes
   [junit4]   2> Aug 09, 2017 1:20:01 PM com.carrotsearch.randomizedtesting.ThreadLeakControl
tryToInterruptAll
   [junit4]   2> SEVERE: There are still zombie threads that couldn't be terminated:
   [junit4]   2>    1) Thread[id=23348, name=NIOServerCxn.Factory:0.0.0.0/0.0.0.0:0, state=RUNNABLE,
group=TGRP-TestZkAclsWithHadoopAuth]
   [junit4]   2>         at sun.nio.ch.EPollArrayWrapper.epollWait(Native Method)
   [junit4]   2>         at sun.nio.ch.EPollArrayWrapper.poll(EPollArrayWrapper.java:269)
   [junit4]   2>         at sun.nio.ch.EPollSelectorImpl.doSelect(EPollSelectorImpl.java:93)
   [junit4]   2>         at sun.nio.ch.SelectorImpl.lockAndDoSelect(SelectorImpl.java:86)
   [junit4]   2>         at sun.nio.ch.SelectorImpl.select(SelectorImpl.java:97)
   [junit4]   2>         at org.apache.zookeeper.server.NIOServerCnxnFactory.run(NIOServerCnxnFactory.java:173)
   [junit4]   2>         at java.lang.Thread.run(Thread.java:748)
   [junit4]   2> NOTE: test params are: codec=CheapBastard, sim=RandomSimilarity(queryNorm=true):
{}, locale=ja-JP, timezone=Asia/Vladivostok
   [junit4]   2> NOTE: Linux 3.13.0-88-generic amd64/Oracle Corporation 1.8.0_144 (64-bit)/cpus=4,threads=3,free=191483816,total=515375104
   [junit4]   2> NOTE: All tests run in this JVM: [TestCollationFieldDocValues, TestClassicSimilarityFactory,
NumericFieldsTest, TestPivotHelperCode, TestFieldResource, TestSchemaVersionResource, TestDistribDocBasedVersion,
TestSort, CleanupOldIndexTest, TestRecovery, DistanceUnitsTest, TermVectorComponentDistributedTest,
TestTrie, OverriddenZkACLAndCredentialsProvidersTest, ReturnFieldsTest, PKIAuthenticationIntegrationTest,
SimplePostToolTest, DeleteReplicaTest, BaseCdcrDistributedZkTest, CdcrUpdateLogTest, ZkStateWriterTest,
DirectUpdateHandlerOptimizeTest, TestRawTransformer, TestAnalyzedSuggestions, TestOnReconnectListenerSupport,
CdcrReplicationHandlerTest, SpatialHeatmapFacetsTest, OverseerRolesTest, TestHdfsUpdateLog,
CollectionsAPISolrJTest, TestMiniSolrCloudCluster, SignatureUpdateProcessorFactoryTest, TestConfigSetsAPIZkFailure,
HdfsNNFailoverTest, OverseerTest, TestXmlQParserPlugin, TestConfigSetImmutable, DistributedFacetPivotSmallTest,
TestJettySolrRunner, SortByFunctionTest, TestLRUStatsCache, TestDynamicFieldCollectionResource,
MetricsHandlerTest, UtilsToolTest, TestRandomCollapseQParserPlugin, HdfsRestartWhileUpdatingTest,
MoveReplicaHDFSTest, BasicDistributedZk2Test, TestStressReorder, TestShortCircuitedRequests,
TestTolerantSearch, AliasIntegrationTest, SolrSlf4jReporterTest, BadIndexSchemaTest, InfixSuggestersTest,
CopyFieldTest, DateMathParserTest, TestSolrConfigHandlerCloud, V2ApiIntegrationTest, TestExportWriter,
RollingRestartTest, DateFieldTest, TestReload, SmileWriterTest, SearchHandlerTest, FullHLLTest,
TestLFUCache, RulesTest, ConnectionManagerTest, TestLMJelinekMercerSimilarityFactory, TestFieldCacheSortRandom,
TestFoldingMultitermQuery, TestDistributedMissingSort, TestCloudInspectUtil, TestCloudManagedSchema,
TestPerFieldSimilarityWithDefaultOverride, PolyFieldTest, TestCollapseQParserPlugin, HardAutoCommitTest,
TestGroupingSearch, TestManagedStopFilterFactory, TestUninvertingReader, ForceLeaderTest,
FastVectorHighlighterTest, TestMinMaxOnMultiValuedField, TestCollectionAPI, SimpleCollectionCreateDeleteTest,
ClusterStateTest, ReplaceNodeTest, TestCollectionAPIs, TestPayloadCheckQParserPlugin, TestManagedSchemaAPI,
TestJsonRequest, LeaderInitiatedRecoveryOnShardRestartTest, TestJavabinTupleStreamParser,
TestSchemaNameResource, SpellCheckCollatorWithCollapseTest, TestMultiWordSynonyms, JvmMetricsTest,
TestNamedUpdateProcessors, HdfsChaosMonkeyNothingIsSafeTest, QueryEqualityTest, TestLegacyFieldCache,
TestLegacyTerms, XsltUpdateRequestHandlerTest, CircularListTest, TestNRTOpen, TestRestoreCore,
PrimitiveFieldTypeTest, ShardSplitTest, TestStressUserVersions, DistribCursorPagingTest, CollectionStateFormat2Test,
UninvertDocValuesMergePolicyTest, TestBulkSchemaAPI, TestCloudPseudoReturnFields, SuggesterTest,
TestSolrCoreParser, StatsComponentTest, DirectUpdateHandlerTest, TestBadConfig, ShowFileRequestHandlerTest,
AnalysisAfterCoreReloadTest, SpellCheckCollatorTest, CoreAdminHandlerTest, SolrCoreCheckLockOnStartupTest,
FieldMutatingUpdateProcessorTest, DefaultValueUpdateProcessorTest, SolrInfoBeanTest, TestSurroundQueryParser,
TestQueryUtils, TestWriterPerf, TestReversedWildcardFilterFactory, DocumentBuilderTest, PathHierarchyTokenizerFactoryTest,
RequiredFieldsTest, TestSolrQueryParser, RegexBoostProcessorTest, IndexSchemaTest, UniqFieldsUpdateProcessorFactoryTest,
PingRequestHandlerTest, TestConfig, ExternalFileFieldSortTest, TestSolrCoreProperties, DirectSolrConnectionTest,
TestCharFilters, SynonymTokenizerTest, EchoParamsTest, TestSweetSpotSimilarityFactory, TestLMDirichletSimilarityFactory,
TestFastWriter, TestFastOutputStream, URLClassifyProcessorTest, PreAnalyzedFieldTest, TestSuggestSpellingConverter,
DOMUtilTest, TestLRUCache, TestDocumentBuilder, SystemInfoHandlerTest, SolrTestCaseJ4Test,
TestSimpleTrackingShardHandler, CdcrBootstrapTest, ChaosMonkeySafeLeaderWithPullReplicasTest,
DistributedQueueTest, DistributedVersionInfoTest, LeaderFailureAfterFreshStartTest, LeaderInitiatedRecoveryOnCommitTest,
MoveReplicaHDFSUlogDirTest, OutOfBoxZkACLAndCredentialsProvidersTest, OverseerCollectionConfigSetProcessorTest,
OverseerModifyCollectionTest, OverseerStatusTest, OverseerTaskQueueTest, TestConfigSetsAPI,
TestPullReplicaErrorHandling, TestRandomFlRTGCloud, TestRebalanceLeaders, TestSSLRandomization,
TestSizeLimitedDistributedMap, TestStressInPlaceUpdates, VMParamsZkACLAndCredentialsProvidersTest,
AutoScalingHandlerTest, HdfsBasicDistributedZkTest, HdfsChaosMonkeySafeLeaderTest, HdfsRecoverLeaseTest,
HdfsTlogReplayBufferedWhileIndexingTest, HdfsWriteToMultipleCollectionsTest, StressHdfsTest,
RequestLoggingTest, SearchHandlerTest, TestBlobHandler, TestReplicationHandlerBackup, TestSystemCollAutoCreate,
PropertiesRequestHandlerTest, StatsReloadRaceTest, DistributedQueryComponentCustomSortTest,
DistributedQueryComponentOptimizationTest, FacetPivotSmallTest, ReplicaListTransformerTest,
SuggestComponentContextFilterQueryTest, TestDistributedStatsComponentCardinality, TestManagedResource,
TestClassNameShortening, TestFieldTypeResource, TestSerializedLuceneMatchVersion, TestUniqueKeyFieldResource,
TestManagedSynonymFilterFactory, ManagedSchemaRoundRobinCloudTest, TestHalfAndHalfDocValues,
TestManagedSchemaThreadSafety, TestSchemaManager, TestUseDocValuesAsStored, TestUseDocValuesAsStored2,
AnalyticsMergeStrategyTest, TestSearcherReuse, TestSimpleQParserPlugin, TestSmileRequest,
TestSolr4Spatial2, TestSolrFieldCacheBean, TestStandardQParsers, TestTrieFacet, TestXmlQParser,
TestJsonFacets, BasicAuthIntegrationTest, TestRuleBasedAuthorizationPlugin, TestDelegationWithHadoopAuth,
TestImpersonationWithHadoopAuth, TestZkAclsWithHadoopAuth]
   [junit4]   2> NOTE: reproduce with: ant test  -Dtestcase=TestZkAclsWithHadoopAuth -Dtests.seed=206B883F6041D1BE
-Dtests.multiplier=2 -Dtests.slow=true -Dtests.locale=ja-JP -Dtests.timezone=Asia/Vladivostok
-Dtests.asserts=true -Dtests.file.encoding=US-ASCII
   [junit4] ERROR   0.00s J2 | TestZkAclsWithHadoopAuth (suite) <<<
   [junit4]    > Throwable #1: org.apache.zookeeper.KeeperException$AuthFailedException:
KeeperErrorCode = AuthFailed for /solr
   [junit4]    > 	at __randomizedtesting.SeedInfo.seed([206B883F6041D1BE]:0)
   [junit4]    > 	at org.apache.zookeeper.KeeperException.create(KeeperException.java:123)
   [junit4]    > 	at org.apache.zookeeper.KeeperException.create(KeeperException.java:51)
   [junit4]    > 	at org.apache.zookeeper.ZooKeeper.exists(ZooKeeper.java:1102)
   [junit4]    > 	at org.apache.solr.common.cloud.SolrZkClient$4.execute(SolrZkClient.java:306)
   [junit4]    > 	at org.apache.solr.common.cloud.SolrZkClient$4.execute(SolrZkClient.java:303)
   [junit4]    > 	at org.apache.solr.common.cloud.ZkCmdExecutor.retryOperation(ZkCmdExecutor.java:60)
   [junit4]    > 	at org.apache.solr.common.cloud.SolrZkClient.exists(SolrZkClient.java:303)
   [junit4]    > 	at org.apache.solr.common.cloud.SolrZkClient.makePath(SolrZkClient.java:512)
   [junit4]    > 	at org.apache.solr.common.cloud.SolrZkClient.makePath(SolrZkClient.java:467)
   [junit4]    > 	at org.apache.solr.common.cloud.SolrZkClient.makePath(SolrZkClient.java:454)
   [junit4]    > 	at org.apache.solr.common.cloud.SolrZkClient.makePath(SolrZkClient.java:441)
   [junit4]    > 	at org.apache.solr.cloud.MiniSolrCloudCluster.<init>(MiniSolrCloudCluster.java:233)
   [junit4]    > 	at org.apache.solr.cloud.SolrCloudTestCase$Builder.configure(SolrCloudTestCase.java:190)
   [junit4]    > 	at org.apache.solr.security.hadoop.TestZkAclsWithHadoopAuth.setupClass(TestZkAclsWithHadoopAuth.java:69)
   [junit4]    > 	at java.lang.Thread.run(Thread.java:748)Throwable #2: com.carrotsearch.randomizedtesting.ThreadLeakError:
5 threads leaked from SUITE scope at org.apache.solr.security.hadoop.TestZkAclsWithHadoopAuth:

   [junit4]    >    1) Thread[id=23348, name=NIOServerCxn.Factory:0.0.0.0/0.0.0.0:0, state=RUNNABLE,
group=TGRP-TestZkAclsWithHadoopAuth]
   [junit4]    >         at sun.nio.ch.EPollArrayWrapper.epollWait(Native Method)
   [junit4]    >         at sun.nio.ch.EPollArrayWrapper.poll(EPollArrayWrapper.java:269)
   [junit4]    >         at sun.nio.ch.EPollSelectorImpl.doSelect(EPollSelectorImpl.java:93)
   [junit4]    >         at sun.nio.ch.SelectorImpl.lockAndDoSelect(SelectorImpl.java:86)
   [junit4]    >         at sun.nio.ch.SelectorImpl.select(SelectorImpl.java:97)
   [junit4]    >         at org.apache.zookeeper.server.NIOServerCnxnFactory.run(NIOServerCnxnFactory.java:173)
   [junit4]    >         at java.lang.Thread.run(Thread.java:748)
   [junit4]    >    2) Thread[id=23349, name=SessionTracker, state=TIMED_WAITING, group=TGRP-TestZkAclsWithHadoopAuth]
   [junit4]    >         at java.lang.Object.wait(Native Method)
   [junit4]    >         at org.apache.zookeeper.server.SessionTrackerImpl.run(SessionTrackerImpl.java:146)
   [junit4]    >    3) Thread[id=23347, name=Thread-6630, state=WAITING, group=TGRP-TestZkAclsWithHadoopAuth]
   [junit4]    >         at java.lang.Object.wait(Native Method)
   [junit4]    >         at java.lang.Thread.join(Thread.java:1252)
   [junit4]    >         at java.lang.Thread.join(Thread.java:1326)
   [junit4]    >         at org.apache.zookeeper.server.NIOServerCnxnFactory.join(NIOServerCnxnFactory.java:297)
   [junit4]    >         at org.apache.solr.cloud.ZkTestServer$ZKServerMain.runFromConfig(ZkTestServer.java:309)
   [junit4]    >         at org.apache.solr.cloud.ZkTestServer$2.run(ZkTestServer.java:490)
   [junit4]    >    4) Thread[id=23353, name=SUITE-TestZkAclsWithHadoopAuth-seed#[206B883F6041D1BE]-worker-EventThread,
state=WAITING, group=TGRP-TestZkAclsWithHadoopAuth]
   [junit4]    >         at sun.misc.Unsafe.park(Native Method)
   [junit4]    >         at java.util.concurrent.locks.LockSupport.park(LockSupport.java:175)
   [junit4]    >         at java.util.concurrent.locks.AbstractQueuedSynchronizer$ConditionObject.await(AbstractQueuedSynchronizer.java:2039)
   [junit4]    >         at java.util.concurrent.LinkedBlockingQueue.take(LinkedBlockingQueue.java:442)
   [junit4]    >         at org.apache.zookeeper.ClientCnxn$EventThread.run(ClientCnxn.java:501)
   [junit4]    >    5) Thread[id=23351, name=ProcessThread(sid:0 cport:34067):, state=WAITING,
group=TGRP-TestZkAclsWithHadoopAuth]
   [junit4]    >         at sun.misc.Unsafe.park(Native Method)
   [junit4]    >         at java.util.concurrent.locks.LockSupport.park(LockSupport.java:175)
   [junit4]    >         at java.util.concurrent.locks.AbstractQueuedSynchronizer$ConditionObject.await(AbstractQueuedSynchronizer.java:2039)
   [junit4]    >         at java.util.concurrent.LinkedBlockingQueue.take(LinkedBlockingQueue.java:442)
   [junit4]    >         at org.apache.zookeeper.server.PrepRequestProcessor.run(PrepRequestProcessor.java:122)
   [junit4]    > 	at __randomizedtesting.SeedInfo.seed([206B883F6041D1BE]:0)Throwable #3:
com.carrotsearch.randomizedtesting.ThreadLeakError: There are still zombie threads that couldn't
be terminated:
   [junit4]    >    1) Thread[id=23348, name=NIOServerCxn.Factory:0.0.0.0/0.0.0.0:0, state=RUNNABLE,
group=TGRP-TestZkAclsWithHadoopAuth]
   [junit4]    >         at sun.nio.ch.EPollArrayWrapper.epollWait(Native Method)
   [junit4]    >         at sun.nio.ch.EPollArrayWrapper.poll(EPollArrayWrapper.java:269)
   [junit4]    >         at sun.nio.ch.EPollSelectorImpl.doSelect(EPollSelectorImpl.java:93)
   [junit4]    >         at sun.nio.ch.SelectorImpl.lockAndDoSelect(SelectorImpl.java:86)
   [junit4]    >         at sun.nio.ch.SelectorImpl.select(SelectorImpl.java:97)
   [junit4]    >         at org.apache.zookeeper.server.NIOServerCnxnFactory.run(NIOServerCnxnFactory.java:173)
   [junit4]    >         at java.lang.Thread.run(Thread.java:748)
   [junit4]    > 	at __randomizedtesting.SeedInfo.seed([206B883F6041D1BE]:0)
   [junit4] Completed [697/728 (1!)] on J2 in 23.43s, 0 tests, 3 errors <<< FAILURES!

[...truncated 43411 lines...]

Mime
View raw message