lucene-dev mailing list archives

Site index · List index
Message view « Date » · « Thread »
Top « Date » · « Thread »
From Policeman Jenkins Server <jenk...@thetaphi.de>
Subject [JENKINS] Lucene-Solr-master-MacOSX (64bit/jdk1.8.0) - Build # 4140 - Still Failing!
Date Wed, 23 Aug 2017 05:07:35 GMT
Build: https://jenkins.thetaphi.de/job/Lucene-Solr-master-MacOSX/4140/
Java: 64bit/jdk1.8.0 -XX:-UseCompressedOops -XX:+UseSerialGC

4 tests failed.
FAILED:  org.apache.solr.cloud.CustomCollectionTest.testCreateShardRepFactor

Error Message:
Error from server at http://127.0.0.1:49497/solr: Could not find collection : testCreateShardRepFactor

Stack Trace:
org.apache.solr.client.solrj.impl.HttpSolrClient$RemoteSolrException: Error from server at http://127.0.0.1:49497/solr: Could not find collection : testCreateShardRepFactor
	at __randomizedtesting.SeedInfo.seed([ACF841744A332569:5816CBF0526730A9]:0)
	at org.apache.solr.client.solrj.impl.HttpSolrClient.executeMethod(HttpSolrClient.java:627)
	at org.apache.solr.client.solrj.impl.HttpSolrClient.request(HttpSolrClient.java:253)
	at org.apache.solr.client.solrj.impl.HttpSolrClient.request(HttpSolrClient.java:242)
	at org.apache.solr.client.solrj.impl.LBHttpSolrClient.doRequest(LBHttpSolrClient.java:483)
	at org.apache.solr.client.solrj.impl.LBHttpSolrClient.request(LBHttpSolrClient.java:413)
	at org.apache.solr.client.solrj.impl.CloudSolrClient.sendRequest(CloudSolrClient.java:1121)
	at org.apache.solr.client.solrj.impl.CloudSolrClient.requestWithRetryOnStaleState(CloudSolrClient.java:862)
	at org.apache.solr.client.solrj.impl.CloudSolrClient.request(CloudSolrClient.java:793)
	at org.apache.solr.client.solrj.SolrRequest.process(SolrRequest.java:178)
	at org.apache.solr.client.solrj.SolrRequest.process(SolrRequest.java:195)
	at org.apache.solr.cloud.CustomCollectionTest.testCreateShardRepFactor(CustomCollectionTest.java:190)
	at sun.reflect.NativeMethodAccessorImpl.invoke0(Native Method)
	at sun.reflect.NativeMethodAccessorImpl.invoke(NativeMethodAccessorImpl.java:62)
	at sun.reflect.DelegatingMethodAccessorImpl.invoke(DelegatingMethodAccessorImpl.java:43)
	at java.lang.reflect.Method.invoke(Method.java:498)
	at com.carrotsearch.randomizedtesting.RandomizedRunner.invoke(RandomizedRunner.java:1713)
	at com.carrotsearch.randomizedtesting.RandomizedRunner$8.evaluate(RandomizedRunner.java:907)
	at com.carrotsearch.randomizedtesting.RandomizedRunner$9.evaluate(RandomizedRunner.java:943)
	at com.carrotsearch.randomizedtesting.RandomizedRunner$10.evaluate(RandomizedRunner.java:957)
	at com.carrotsearch.randomizedtesting.rules.SystemPropertiesRestoreRule$1.evaluate(SystemPropertiesRestoreRule.java:57)
	at org.apache.lucene.util.TestRuleSetupTeardownChained$1.evaluate(TestRuleSetupTeardownChained.java:49)
	at org.apache.lucene.util.AbstractBeforeAfterRule$1.evaluate(AbstractBeforeAfterRule.java:45)
	at org.apache.lucene.util.TestRuleThreadAndTestName$1.evaluate(TestRuleThreadAndTestName.java:48)
	at org.apache.lucene.util.TestRuleIgnoreAfterMaxFailures$1.evaluate(TestRuleIgnoreAfterMaxFailures.java:64)
	at org.apache.lucene.util.TestRuleMarkFailure$1.evaluate(TestRuleMarkFailure.java:47)
	at com.carrotsearch.randomizedtesting.rules.StatementAdapter.evaluate(StatementAdapter.java:36)
	at com.carrotsearch.randomizedtesting.ThreadLeakControl$StatementRunner.run(ThreadLeakControl.java:368)
	at com.carrotsearch.randomizedtesting.ThreadLeakControl.forkTimeoutingTask(ThreadLeakControl.java:817)
	at com.carrotsearch.randomizedtesting.ThreadLeakControl$3.evaluate(ThreadLeakControl.java:468)
	at com.carrotsearch.randomizedtesting.RandomizedRunner.runSingleTest(RandomizedRunner.java:916)
	at com.carrotsearch.randomizedtesting.RandomizedRunner$5.evaluate(RandomizedRunner.java:802)
	at com.carrotsearch.randomizedtesting.RandomizedRunner$6.evaluate(RandomizedRunner.java:852)
	at com.carrotsearch.randomizedtesting.RandomizedRunner$7.evaluate(RandomizedRunner.java:863)
	at com.carrotsearch.randomizedtesting.rules.StatementAdapter.evaluate(StatementAdapter.java:36)
	at com.carrotsearch.randomizedtesting.rules.SystemPropertiesRestoreRule$1.evaluate(SystemPropertiesRestoreRule.java:57)
	at org.apache.lucene.util.AbstractBeforeAfterRule$1.evaluate(AbstractBeforeAfterRule.java:45)
	at com.carrotsearch.randomizedtesting.rules.StatementAdapter.evaluate(StatementAdapter.java:36)
	at org.apache.lucene.util.TestRuleStoreClassName$1.evaluate(TestRuleStoreClassName.java:41)
	at com.carrotsearch.randomizedtesting.rules.NoShadowingOrOverridesOnMethodsRule$1.evaluate(NoShadowingOrOverridesOnMethodsRule.java:40)
	at com.carrotsearch.randomizedtesting.rules.NoShadowingOrOverridesOnMethodsRule$1.evaluate(NoShadowingOrOverridesOnMethodsRule.java:40)
	at com.carrotsearch.randomizedtesting.rules.StatementAdapter.evaluate(StatementAdapter.java:36)
	at com.carrotsearch.randomizedtesting.rules.StatementAdapter.evaluate(StatementAdapter.java:36)
	at com.carrotsearch.randomizedtesting.rules.StatementAdapter.evaluate(StatementAdapter.java:36)
	at org.apache.lucene.util.TestRuleAssertionsRequired$1.evaluate(TestRuleAssertionsRequired.java:53)
	at org.apache.lucene.util.TestRuleMarkFailure$1.evaluate(TestRuleMarkFailure.java:47)
	at org.apache.lucene.util.TestRuleIgnoreAfterMaxFailures$1.evaluate(TestRuleIgnoreAfterMaxFailures.java:64)
	at org.apache.lucene.util.TestRuleIgnoreTestSuites$1.evaluate(TestRuleIgnoreTestSuites.java:54)
	at com.carrotsearch.randomizedtesting.rules.StatementAdapter.evaluate(StatementAdapter.java:36)
	at com.carrotsearch.randomizedtesting.ThreadLeakControl$StatementRunner.run(ThreadLeakControl.java:368)
	at java.lang.Thread.run(Thread.java:748)


FAILED:  org.apache.solr.cloud.HttpPartitionTest.test

Error Message:
Doc with id=1 not found in http://127.0.0.1:60897/b/xj/collMinRf_1x3 due to: Path not found: /id; rsp={doc=null}

Stack Trace:
java.lang.AssertionError: Doc with id=1 not found in http://127.0.0.1:60897/b/xj/collMinRf_1x3 due to: Path not found: /id; rsp={doc=null}
	at __randomizedtesting.SeedInfo.seed([ACF841744A332569:24AC7EAEE4CF4891]:0)
	at org.junit.Assert.fail(Assert.java:93)
	at org.junit.Assert.assertTrue(Assert.java:43)
	at org.apache.solr.cloud.HttpPartitionTest.assertDocExists(HttpPartitionTest.java:603)
	at org.apache.solr.cloud.HttpPartitionTest.assertDocsExistInAllReplicas(HttpPartitionTest.java:558)
	at org.apache.solr.cloud.HttpPartitionTest.testMinRf(HttpPartitionTest.java:249)
	at org.apache.solr.cloud.HttpPartitionTest.test(HttpPartitionTest.java:127)
	at sun.reflect.NativeMethodAccessorImpl.invoke0(Native Method)
	at sun.reflect.NativeMethodAccessorImpl.invoke(NativeMethodAccessorImpl.java:62)
	at sun.reflect.DelegatingMethodAccessorImpl.invoke(DelegatingMethodAccessorImpl.java:43)
	at java.lang.reflect.Method.invoke(Method.java:498)
	at com.carrotsearch.randomizedtesting.RandomizedRunner.invoke(RandomizedRunner.java:1713)
	at com.carrotsearch.randomizedtesting.RandomizedRunner$8.evaluate(RandomizedRunner.java:907)
	at com.carrotsearch.randomizedtesting.RandomizedRunner$9.evaluate(RandomizedRunner.java:943)
	at com.carrotsearch.randomizedtesting.RandomizedRunner$10.evaluate(RandomizedRunner.java:957)
	at org.apache.solr.BaseDistributedSearchTestCase$ShardsRepeatRule$ShardsFixedStatement.callStatement(BaseDistributedSearchTestCase.java:993)
	at org.apache.solr.BaseDistributedSearchTestCase$ShardsRepeatRule$ShardsStatement.evaluate(BaseDistributedSearchTestCase.java:968)
	at com.carrotsearch.randomizedtesting.rules.SystemPropertiesRestoreRule$1.evaluate(SystemPropertiesRestoreRule.java:57)
	at org.apache.lucene.util.TestRuleSetupTeardownChained$1.evaluate(TestRuleSetupTeardownChained.java:49)
	at org.apache.lucene.util.AbstractBeforeAfterRule$1.evaluate(AbstractBeforeAfterRule.java:45)
	at org.apache.lucene.util.TestRuleThreadAndTestName$1.evaluate(TestRuleThreadAndTestName.java:48)
	at org.apache.lucene.util.TestRuleIgnoreAfterMaxFailures$1.evaluate(TestRuleIgnoreAfterMaxFailures.java:64)
	at org.apache.lucene.util.TestRuleMarkFailure$1.evaluate(TestRuleMarkFailure.java:47)
	at com.carrotsearch.randomizedtesting.rules.StatementAdapter.evaluate(StatementAdapter.java:36)
	at com.carrotsearch.randomizedtesting.ThreadLeakControl$StatementRunner.run(ThreadLeakControl.java:368)
	at com.carrotsearch.randomizedtesting.ThreadLeakControl.forkTimeoutingTask(ThreadLeakControl.java:817)
	at com.carrotsearch.randomizedtesting.ThreadLeakControl$3.evaluate(ThreadLeakControl.java:468)
	at com.carrotsearch.randomizedtesting.RandomizedRunner.runSingleTest(RandomizedRunner.java:916)
	at com.carrotsearch.randomizedtesting.RandomizedRunner$5.evaluate(RandomizedRunner.java:802)
	at com.carrotsearch.randomizedtesting.RandomizedRunner$6.evaluate(RandomizedRunner.java:852)
	at com.carrotsearch.randomizedtesting.RandomizedRunner$7.evaluate(RandomizedRunner.java:863)
	at com.carrotsearch.randomizedtesting.rules.StatementAdapter.evaluate(StatementAdapter.java:36)
	at com.carrotsearch.randomizedtesting.rules.SystemPropertiesRestoreRule$1.evaluate(SystemPropertiesRestoreRule.java:57)
	at org.apache.lucene.util.AbstractBeforeAfterRule$1.evaluate(AbstractBeforeAfterRule.java:45)
	at com.carrotsearch.randomizedtesting.rules.StatementAdapter.evaluate(StatementAdapter.java:36)
	at org.apache.lucene.util.TestRuleStoreClassName$1.evaluate(TestRuleStoreClassName.java:41)
	at com.carrotsearch.randomizedtesting.rules.NoShadowingOrOverridesOnMethodsRule$1.evaluate(NoShadowingOrOverridesOnMethodsRule.java:40)
	at com.carrotsearch.randomizedtesting.rules.NoShadowingOrOverridesOnMethodsRule$1.evaluate(NoShadowingOrOverridesOnMethodsRule.java:40)
	at com.carrotsearch.randomizedtesting.rules.StatementAdapter.evaluate(StatementAdapter.java:36)
	at com.carrotsearch.randomizedtesting.rules.StatementAdapter.evaluate(StatementAdapter.java:36)
	at com.carrotsearch.randomizedtesting.rules.StatementAdapter.evaluate(StatementAdapter.java:36)
	at org.apache.lucene.util.TestRuleAssertionsRequired$1.evaluate(TestRuleAssertionsRequired.java:53)
	at org.apache.lucene.util.TestRuleMarkFailure$1.evaluate(TestRuleMarkFailure.java:47)
	at org.apache.lucene.util.TestRuleIgnoreAfterMaxFailures$1.evaluate(TestRuleIgnoreAfterMaxFailures.java:64)
	at org.apache.lucene.util.TestRuleIgnoreTestSuites$1.evaluate(TestRuleIgnoreTestSuites.java:54)
	at com.carrotsearch.randomizedtesting.rules.StatementAdapter.evaluate(StatementAdapter.java:36)
	at com.carrotsearch.randomizedtesting.ThreadLeakControl$StatementRunner.run(ThreadLeakControl.java:368)
	at java.lang.Thread.run(Thread.java:748)


FAILED:  org.apache.solr.update.processor.UpdateRequestProcessorFactoryTest.testUpdateDistribChainSkipping

Error Message:
Tests must be run with INFO level logging otherwise LogUpdateProcessor isn't used and can't be tested.

Stack Trace:
java.lang.AssertionError: Tests must be run with INFO level logging otherwise LogUpdateProcessor isn't used and can't be tested.
	at __randomizedtesting.SeedInfo.seed([ACF841744A332569:DD1CBFA23CD802A5]:0)
	at org.junit.Assert.fail(Assert.java:93)
	at org.junit.Assert.assertTrue(Assert.java:43)
	at org.apache.solr.update.processor.UpdateRequestProcessorFactoryTest.testUpdateDistribChainSkipping(UpdateRequestProcessorFactoryTest.java:101)
	at sun.reflect.NativeMethodAccessorImpl.invoke0(Native Method)
	at sun.reflect.NativeMethodAccessorImpl.invoke(NativeMethodAccessorImpl.java:62)
	at sun.reflect.DelegatingMethodAccessorImpl.invoke(DelegatingMethodAccessorImpl.java:43)
	at java.lang.reflect.Method.invoke(Method.java:498)
	at com.carrotsearch.randomizedtesting.RandomizedRunner.invoke(RandomizedRunner.java:1713)
	at com.carrotsearch.randomizedtesting.RandomizedRunner$8.evaluate(RandomizedRunner.java:907)
	at com.carrotsearch.randomizedtesting.RandomizedRunner$9.evaluate(RandomizedRunner.java:943)
	at com.carrotsearch.randomizedtesting.RandomizedRunner$10.evaluate(RandomizedRunner.java:957)
	at com.carrotsearch.randomizedtesting.rules.SystemPropertiesRestoreRule$1.evaluate(SystemPropertiesRestoreRule.java:57)
	at org.apache.lucene.util.TestRuleSetupTeardownChained$1.evaluate(TestRuleSetupTeardownChained.java:49)
	at org.apache.lucene.util.AbstractBeforeAfterRule$1.evaluate(AbstractBeforeAfterRule.java:45)
	at org.apache.lucene.util.TestRuleThreadAndTestName$1.evaluate(TestRuleThreadAndTestName.java:48)
	at org.apache.lucene.util.TestRuleIgnoreAfterMaxFailures$1.evaluate(TestRuleIgnoreAfterMaxFailures.java:64)
	at org.apache.lucene.util.TestRuleMarkFailure$1.evaluate(TestRuleMarkFailure.java:47)
	at com.carrotsearch.randomizedtesting.rules.StatementAdapter.evaluate(StatementAdapter.java:36)
	at com.carrotsearch.randomizedtesting.ThreadLeakControl$StatementRunner.run(ThreadLeakControl.java:368)
	at com.carrotsearch.randomizedtesting.ThreadLeakControl.forkTimeoutingTask(ThreadLeakControl.java:817)
	at com.carrotsearch.randomizedtesting.ThreadLeakControl$3.evaluate(ThreadLeakControl.java:468)
	at com.carrotsearch.randomizedtesting.RandomizedRunner.runSingleTest(RandomizedRunner.java:916)
	at com.carrotsearch.randomizedtesting.RandomizedRunner$5.evaluate(RandomizedRunner.java:802)
	at com.carrotsearch.randomizedtesting.RandomizedRunner$6.evaluate(RandomizedRunner.java:852)
	at com.carrotsearch.randomizedtesting.RandomizedRunner$7.evaluate(RandomizedRunner.java:863)
	at com.carrotsearch.randomizedtesting.rules.StatementAdapter.evaluate(StatementAdapter.java:36)
	at com.carrotsearch.randomizedtesting.rules.SystemPropertiesRestoreRule$1.evaluate(SystemPropertiesRestoreRule.java:57)
	at org.apache.lucene.util.AbstractBeforeAfterRule$1.evaluate(AbstractBeforeAfterRule.java:45)
	at com.carrotsearch.randomizedtesting.rules.StatementAdapter.evaluate(StatementAdapter.java:36)
	at org.apache.lucene.util.TestRuleStoreClassName$1.evaluate(TestRuleStoreClassName.java:41)
	at com.carrotsearch.randomizedtesting.rules.NoShadowingOrOverridesOnMethodsRule$1.evaluate(NoShadowingOrOverridesOnMethodsRule.java:40)
	at com.carrotsearch.randomizedtesting.rules.NoShadowingOrOverridesOnMethodsRule$1.evaluate(NoShadowingOrOverridesOnMethodsRule.java:40)
	at com.carrotsearch.randomizedtesting.rules.StatementAdapter.evaluate(StatementAdapter.java:36)
	at com.carrotsearch.randomizedtesting.rules.StatementAdapter.evaluate(StatementAdapter.java:36)
	at com.carrotsearch.randomizedtesting.rules.StatementAdapter.evaluate(StatementAdapter.java:36)
	at org.apache.lucene.util.TestRuleAssertionsRequired$1.evaluate(TestRuleAssertionsRequired.java:53)
	at org.apache.lucene.util.TestRuleMarkFailure$1.evaluate(TestRuleMarkFailure.java:47)
	at org.apache.lucene.util.TestRuleIgnoreAfterMaxFailures$1.evaluate(TestRuleIgnoreAfterMaxFailures.java:64)
	at org.apache.lucene.util.TestRuleIgnoreTestSuites$1.evaluate(TestRuleIgnoreTestSuites.java:54)
	at com.carrotsearch.randomizedtesting.rules.StatementAdapter.evaluate(StatementAdapter.java:36)
	at com.carrotsearch.randomizedtesting.ThreadLeakControl$StatementRunner.run(ThreadLeakControl.java:368)
	at java.lang.Thread.run(Thread.java:748)


FAILED:  org.apache.solr.cloud.CustomCollectionTest.testRouteFieldForHashRouter

Error Message:
Collection not found: routeFieldColl

Stack Trace:
org.apache.solr.common.SolrException: Collection not found: routeFieldColl
	at __randomizedtesting.SeedInfo.seed([ACF841744A332569:4CEDFA9D552CE33]:0)
	at org.apache.solr.client.solrj.impl.CloudSolrClient.getCollectionNames(CloudSolrClient.java:1139)
	at org.apache.solr.client.solrj.impl.CloudSolrClient.requestWithRetryOnStaleState(CloudSolrClient.java:822)
	at org.apache.solr.client.solrj.impl.CloudSolrClient.request(CloudSolrClient.java:793)
	at org.apache.solr.client.solrj.SolrRequest.process(SolrRequest.java:178)
	at org.apache.solr.client.solrj.request.UpdateRequest.commit(UpdateRequest.java:233)
	at org.apache.solr.cloud.CustomCollectionTest.testRouteFieldForHashRouter(CustomCollectionTest.java:166)
	at sun.reflect.NativeMethodAccessorImpl.invoke0(Native Method)
	at sun.reflect.NativeMethodAccessorImpl.invoke(NativeMethodAccessorImpl.java:62)
	at sun.reflect.DelegatingMethodAccessorImpl.invoke(DelegatingMethodAccessorImpl.java:43)
	at java.lang.reflect.Method.invoke(Method.java:498)
	at com.carrotsearch.randomizedtesting.RandomizedRunner.invoke(RandomizedRunner.java:1713)
	at com.carrotsearch.randomizedtesting.RandomizedRunner$8.evaluate(RandomizedRunner.java:907)
	at com.carrotsearch.randomizedtesting.RandomizedRunner$9.evaluate(RandomizedRunner.java:943)
	at com.carrotsearch.randomizedtesting.RandomizedRunner$10.evaluate(RandomizedRunner.java:957)
	at com.carrotsearch.randomizedtesting.rules.SystemPropertiesRestoreRule$1.evaluate(SystemPropertiesRestoreRule.java:57)
	at org.apache.lucene.util.TestRuleSetupTeardownChained$1.evaluate(TestRuleSetupTeardownChained.java:49)
	at org.apache.lucene.util.AbstractBeforeAfterRule$1.evaluate(AbstractBeforeAfterRule.java:45)
	at org.apache.lucene.util.TestRuleThreadAndTestName$1.evaluate(TestRuleThreadAndTestName.java:48)
	at org.apache.lucene.util.TestRuleIgnoreAfterMaxFailures$1.evaluate(TestRuleIgnoreAfterMaxFailures.java:64)
	at org.apache.lucene.util.TestRuleMarkFailure$1.evaluate(TestRuleMarkFailure.java:47)
	at com.carrotsearch.randomizedtesting.rules.StatementAdapter.evaluate(StatementAdapter.java:36)
	at com.carrotsearch.randomizedtesting.ThreadLeakControl$StatementRunner.run(ThreadLeakControl.java:368)
	at com.carrotsearch.randomizedtesting.ThreadLeakControl.forkTimeoutingTask(ThreadLeakControl.java:817)
	at com.carrotsearch.randomizedtesting.ThreadLeakControl$3.evaluate(ThreadLeakControl.java:468)
	at com.carrotsearch.randomizedtesting.RandomizedRunner.runSingleTest(RandomizedRunner.java:916)
	at com.carrotsearch.randomizedtesting.RandomizedRunner$5.evaluate(RandomizedRunner.java:802)
	at com.carrotsearch.randomizedtesting.RandomizedRunner$6.evaluate(RandomizedRunner.java:852)
	at com.carrotsearch.randomizedtesting.RandomizedRunner$7.evaluate(RandomizedRunner.java:863)
	at com.carrotsearch.randomizedtesting.rules.StatementAdapter.evaluate(StatementAdapter.java:36)
	at com.carrotsearch.randomizedtesting.rules.SystemPropertiesRestoreRule$1.evaluate(SystemPropertiesRestoreRule.java:57)
	at org.apache.lucene.util.AbstractBeforeAfterRule$1.evaluate(AbstractBeforeAfterRule.java:45)
	at com.carrotsearch.randomizedtesting.rules.StatementAdapter.evaluate(StatementAdapter.java:36)
	at org.apache.lucene.util.TestRuleStoreClassName$1.evaluate(TestRuleStoreClassName.java:41)
	at com.carrotsearch.randomizedtesting.rules.NoShadowingOrOverridesOnMethodsRule$1.evaluate(NoShadowingOrOverridesOnMethodsRule.java:40)
	at com.carrotsearch.randomizedtesting.rules.NoShadowingOrOverridesOnMethodsRule$1.evaluate(NoShadowingOrOverridesOnMethodsRule.java:40)
	at com.carrotsearch.randomizedtesting.rules.StatementAdapter.evaluate(StatementAdapter.java:36)
	at com.carrotsearch.randomizedtesting.rules.StatementAdapter.evaluate(StatementAdapter.java:36)
	at com.carrotsearch.randomizedtesting.rules.StatementAdapter.evaluate(StatementAdapter.java:36)
	at org.apache.lucene.util.TestRuleAssertionsRequired$1.evaluate(TestRuleAssertionsRequired.java:53)
	at org.apache.lucene.util.TestRuleMarkFailure$1.evaluate(TestRuleMarkFailure.java:47)
	at org.apache.lucene.util.TestRuleIgnoreAfterMaxFailures$1.evaluate(TestRuleIgnoreAfterMaxFailures.java:64)
	at org.apache.lucene.util.TestRuleIgnoreTestSuites$1.evaluate(TestRuleIgnoreTestSuites.java:54)
	at com.carrotsearch.randomizedtesting.rules.StatementAdapter.evaluate(StatementAdapter.java:36)
	at com.carrotsearch.randomizedtesting.ThreadLeakControl$StatementRunner.run(ThreadLeakControl.java:368)
	at java.lang.Thread.run(Thread.java:748)




Build Log:
[...truncated 11441 lines...]
   [junit4] Suite: org.apache.solr.cloud.HttpPartitionTest
   [junit4]   2> 1071032 INFO  (SUITE-HttpPartitionTest-seed#[ACF841744A332569]-worker) [    ] o.a.s.SolrTestCaseJ4 SecureRandom sanity checks: test.solr.allowed.securerandom=null & java.security.egd=file:/dev/./urandom
   [junit4]   2> Creating dataDir: /Users/jenkins/workspace/Lucene-Solr-master-MacOSX/solr/build/solr-core/test/J1/temp/solr.cloud.HttpPartitionTest_ACF841744A332569-001/init-core-data-001
   [junit4]   2> 1071033 WARN  (SUITE-HttpPartitionTest-seed#[ACF841744A332569]-worker) [    ] o.a.s.SolrTestCaseJ4 startTrackingSearchers: numOpens=668 numCloses=668
   [junit4]   2> 1071033 INFO  (SUITE-HttpPartitionTest-seed#[ACF841744A332569]-worker) [    ] o.a.s.SolrTestCaseJ4 Using PointFields (NUMERIC_POINTS_SYSPROP=true) w/NUMERIC_DOCVALUES_SYSPROP=true
   [junit4]   2> 1071036 INFO  (SUITE-HttpPartitionTest-seed#[ACF841744A332569]-worker) [    ] o.a.s.SolrTestCaseJ4 Randomized ssl (false) and clientAuth (false) via: @org.apache.solr.SolrTestCaseJ4$SuppressSSL(bugUrl=https://issues.apache.org/jira/browse/SOLR-5776) w/ MAC_OS_X supressed clientAuth
   [junit4]   2> 1071039 ERROR (Thread-1850) [    ] o.a.z.s.ZooKeeperServer ZKShutdownHandler is not registered, so ZooKeeper server won't take any action on ERROR or SHUTDOWN server state changes
   [junit4]   2> 1071614 ERROR (TEST-HttpPartitionTest.test-seed#[ACF841744A332569]) [    ] o.a.s.u.StartupLoggingUtils Missing Java Option solr.log.dir. Logging may be missing or incomplete.
   [junit4]   2> 1073165 WARN  (qtp323197654-11636) [n:127.0.0.1:60873_b%2Fxj c:control_collection s:shard1  x:control_collection_shard1_replica_n1] o.a.s.c.RequestHandlers INVALID paramSet a in requestHandler {type = requestHandler,name = /dump,class = DumpRequestHandler,attributes = {initParams=a, name=/dump, class=DumpRequestHandler},args = {defaults={a=A,b=B}}}
   [junit4]   2> 1074434 WARN  (OverseerThreadFactory-4464-thread-2-processing-n:127.0.0.1:60873_b%2Fxj) [n:127.0.0.1:60873_b%2Fxj    ] o.a.s.c.CreateCollectionCmd It is unusual to create a collection (collection1) without cores.
   [junit4]   2> 1074907 ERROR (TEST-HttpPartitionTest.test-seed#[ACF841744A332569]) [    ] o.a.s.u.StartupLoggingUtils Missing Java Option solr.log.dir. Logging may be missing or incomplete.
   [junit4]   2> 1076226 WARN  (qtp632827187-11684) [n:127.0.0.1:60897_b%2Fxj c:collection1 s:shard2  x:collection1_shard2_replica_t41] o.a.s.c.RequestHandlers INVALID paramSet a in requestHandler {type = requestHandler,name = /dump,class = DumpRequestHandler,attributes = {initParams=a, name=/dump, class=DumpRequestHandler},args = {defaults={a=A,b=B}}}
   [junit4]   2> 1076718 ERROR (TEST-HttpPartitionTest.test-seed#[ACF841744A332569]) [    ] o.a.s.u.StartupLoggingUtils Missing Java Option solr.log.dir. Logging may be missing or incomplete.
   [junit4]   2> 1078036 WARN  (qtp213335398-11717) [n:127.0.0.1:60911_b%2Fxj c:collection1 s:shard1  x:collection1_shard1_replica_t43] o.a.s.c.RequestHandlers INVALID paramSet a in requestHandler {type = requestHandler,name = /dump,class = DumpRequestHandler,attributes = {initParams=a, name=/dump, class=DumpRequestHandler},args = {defaults={a=A,b=B}}}
   [junit4]   2> 1078592 ERROR (TEST-HttpPartitionTest.test-seed#[ACF841744A332569]) [    ] o.a.s.u.StartupLoggingUtils Missing Java Option solr.log.dir. Logging may be missing or incomplete.
   [junit4]   2> 1079943 WARN  (qtp1863018983-11749) [n:127.0.0.1:60925_b%2Fxj c:collection1 s:shard2  x:collection1_shard2_replica_t45] o.a.s.c.RequestHandlers INVALID paramSet a in requestHandler {type = requestHandler,name = /dump,class = DumpRequestHandler,attributes = {initParams=a, name=/dump, class=DumpRequestHandler},args = {defaults={a=A,b=B}}}
   [junit4]   2> 1080005 INFO  (TEST-HttpPartitionTest.test-seed#[ACF841744A332569]) [    ] o.a.s.SolrTestCaseJ4 ###Starting test
   [junit4]   2> 1085409 WARN  (qtp213335398-11722) [n:127.0.0.1:60911_b%2Fxj c:c8n_crud_1x2 s:shard1  x:c8n_crud_1x2_shard1_replica_t1] o.a.s.c.RequestHandlers INVALID paramSet a in requestHandler {type = requestHandler,name = /dump,class = DumpRequestHandler,attributes = {initParams=a, name=/dump, class=DumpRequestHandler},args = {defaults={a=A,b=B}}}
   [junit4]   2> 1085409 WARN  (qtp1863018983-11754) [n:127.0.0.1:60925_b%2Fxj c:c8n_crud_1x2 s:shard1  x:c8n_crud_1x2_shard1_replica_t2] o.a.s.c.RequestHandlers INVALID paramSet a in requestHandler {type = requestHandler,name = /dump,class = DumpRequestHandler,attributes = {initParams=a, name=/dump, class=DumpRequestHandler},args = {defaults={a=A,b=B}}}
   [junit4]   2> 1087553 WARN  (zkCallback-3136-thread-1-processing-n:127.0.0.1:60925_b%2Fxj) [n:127.0.0.1:60925_b%2Fxj    ] o.a.s.c.LeaderElector Our node is no longer in line to be leader
   [junit4]   2> 1089766 WARN  (qtp1863018983-11751) [n:127.0.0.1:60925_b%2Fxj c:collMinRf_1x3 s:shard1  x:collMinRf_1x3_shard1_replica_t1] o.a.s.c.RequestHandlers INVALID paramSet a in requestHandler {type = requestHandler,name = /dump,class = DumpRequestHandler,attributes = {initParams=a, name=/dump, class=DumpRequestHandler},args = {defaults={a=A,b=B}}}
   [junit4]   2> 1089775 WARN  (qtp323197654-11636) [n:127.0.0.1:60873_b%2Fxj c:collMinRf_1x3 s:shard1  x:collMinRf_1x3_shard1_replica_t3] o.a.s.c.RequestHandlers INVALID paramSet a in requestHandler {type = requestHandler,name = /dump,class = DumpRequestHandler,attributes = {initParams=a, name=/dump, class=DumpRequestHandler},args = {defaults={a=A,b=B}}}
   [junit4]   2> 1089776 WARN  (qtp632827187-11684) [n:127.0.0.1:60897_b%2Fxj c:collMinRf_1x3 s:shard1  x:collMinRf_1x3_shard1_replica_t2] o.a.s.c.RequestHandlers INVALID paramSet a in requestHandler {type = requestHandler,name = /dump,class = DumpRequestHandler,attributes = {initParams=a, name=/dump, class=DumpRequestHandler},args = {defaults={a=A,b=B}}}
   [junit4]   2> 1091923 WARN  (TEST-HttpPartitionTest.test-seed#[ACF841744A332569]) [    ] o.a.s.c.SocketProxy Closing 5 connections to: http://127.0.0.1:60873/b/xj, target: http://127.0.0.1:60874/b/xj
   [junit4]   2> 1091929 ERROR (updateExecutor-3133-thread-2-processing-http:////127.0.0.1:60873//b//xj//collMinRf_1x3_shard1_replica_t3 x:collMinRf_1x3_shard1_replica_t1 r:core_node4 n:127.0.0.1:60925_b%2Fxj s:shard1 c:collMinRf_1x3) [n:127.0.0.1:60925_b%2Fxj c:collMinRf_1x3 s:shard1 r:core_node4 x:collMinRf_1x3_shard1_replica_t1] o.a.s.u.ErrorReportingConcurrentUpdateSolrClient error
   [junit4]   2> java.net.SocketException: Broken pipe (Write failed)
   [junit4]   2> 	at java.net.SocketOutputStream.socketWrite0(Native Method)
   [junit4]   2> 	at java.net.SocketOutputStream.socketWrite(SocketOutputStream.java:111)
   [junit4]   2> 	at java.net.SocketOutputStream.write(SocketOutputStream.java:155)
   [junit4]   2> 	at org.apache.http.impl.io.SessionOutputBufferImpl.streamWrite(SessionOutputBufferImpl.java:126)
   [junit4]   2> 	at org.apache.http.impl.io.SessionOutputBufferImpl.flushBuffer(SessionOutputBufferImpl.java:138)
   [junit4]   2> 	at org.apache.http.impl.io.SessionOutputBufferImpl.flush(SessionOutputBufferImpl.java:146)
   [junit4]   2> 	at org.apache.http.impl.io.ChunkedOutputStream.close(ChunkedOutputStream.java:205)
   [junit4]   2> 	at org.apache.http.impl.DefaultBHttpClientConnection.sendRequestEntity(DefaultBHttpClientConnection.java:159)
   [junit4]   2> 	at org.apache.http.impl.conn.CPoolProxy.sendRequestEntity(CPoolProxy.java:162)
   [junit4]   2> 	at org.apache.http.protocol.HttpRequestExecutor.doSendRequest(HttpRequestExecutor.java:237)
   [junit4]   2> 	at org.apache.http.protocol.HttpRequestExecutor.execute(HttpRequestExecutor.java:122)
   [junit4]   2> 	at org.apache.solr.util.stats.InstrumentedHttpRequestExecutor.execute(InstrumentedHttpRequestExecutor.java:118)
   [junit4]   2> 	at org.apache.http.impl.execchain.MainClientExec.execute(MainClientExec.java:271)
   [junit4]   2> 	at org.apache.http.impl.execchain.ProtocolExec.execute(ProtocolExec.java:184)
   [junit4]   2> 	at org.apache.http.impl.execchain.RetryExec.execute(RetryExec.java:88)
   [junit4]   2> 	at org.apache.http.impl.execchain.RedirectExec.execute(RedirectExec.java:110)
   [junit4]   2> 	at org.apache.http.impl.client.InternalHttpClient.doExecute(InternalHttpClient.java:184)
   [junit4]   2> 	at org.apache.http.impl.client.CloseableHttpClient.execute(CloseableHttpClient.java:82)
   [junit4]   2> 	at org.apache.http.impl.client.CloseableHttpClient.execute(CloseableHttpClient.java:55)
   [junit4]   2> 	at org.apache.solr.client.solrj.impl.ConcurrentUpdateSolrClient$Runner.sendUpdateStream(ConcurrentUpdateSolrClient.java:347)
   [junit4]   2> 	at org.apache.solr.client.solrj.impl.ConcurrentUpdateSolrClient$Runner.run(ConcurrentUpdateSolrClient.java:182)
   [junit4]   2> 	at com.codahale.metrics.InstrumentedExecutorService$InstrumentedRunnable.run(InstrumentedExecutorService.java:176)
   [junit4]   2> 	at org.apache.solr.common.util.ExecutorUtil$MDCAwareThreadPoolExecutor.lambda$execute$0(ExecutorUtil.java:188)
   [junit4]   2> 	at java.util.concurrent.ThreadPoolExecutor.runWorker(ThreadPoolExecutor.java:1149)
   [junit4]   2> 	at java.util.concurrent.ThreadPoolExecutor$Worker.run(ThreadPoolExecutor.java:624)
   [junit4]   2> 	at java.lang.Thread.run(Thread.java:748)
   [junit4]   2> 1091930 WARN  (qtp1863018983-11754) [n:127.0.0.1:60925_b%2Fxj c:collMinRf_1x3 s:shard1 r:core_node4 x:collMinRf_1x3_shard1_replica_t1] o.a.s.u.p.DistributedUpdateProcessor Error sending update to http://127.0.0.1:60873/b/xj
   [junit4]   2> java.net.SocketException: Broken pipe (Write failed)
   [junit4]   2> 	at java.net.SocketOutputStream.socketWrite0(Native Method)
   [junit4]   2> 	at java.net.SocketOutputStream.socketWrite(SocketOutputStream.java:111)
   [junit4]   2> 	at java.net.SocketOutputStream.write(SocketOutputStream.java:155)
   [junit4]   2> 	at org.apache.http.impl.io.SessionOutputBufferImpl.streamWrite(SessionOutputBufferImpl.java:126)
   [junit4]   2> 	at org.apache.http.impl.io.SessionOutputBufferImpl.flushBuffer(SessionOutputBufferImpl.java:138)
   [junit4]   2> 	at org.apache.http.impl.io.SessionOutputBufferImpl.flush(SessionOutputBufferImpl.java:146)
   [junit4]   2> 	at org.apache.http.impl.io.ChunkedOutputStream.close(ChunkedOutputStream.java:205)
   [junit4]   2> 	at org.apache.http.impl.DefaultBHttpClientConnection.sendRequestEntity(DefaultBHttpClientConnection.java:159)
   [junit4]   2> 	at org.apache.http.impl.conn.CPoolProxy.sendRequestEntity(CPoolProxy.java:162)
   [junit4]   2> 	at org.apache.http.protocol.HttpRequestExecutor.doSendRequest(HttpRequestExecutor.java:237)
   [junit4]   2> 	at org.apache.http.protocol.HttpRequestExecutor.execute(HttpRequestExecutor.java:122)
   [junit4]   2> 	at org.apache.solr.util.stats.InstrumentedHttpRequestExecutor.execute(InstrumentedHttpRequestExecutor.java:118)
   [junit4]   2> 	at org.apache.http.impl.execchain.MainClientExec.execute(MainClientExec.java:271)
   [junit4]   2> 	at org.apache.http.impl.execchain.ProtocolExec.execute(ProtocolExec.java:184)
   [junit4]   2> 	at org.apache.http.impl.execchain.RetryExec.execute(RetryExec.java:88)
   [junit4]   2> 	at org.apache.http.impl.execchain.RedirectExec.execute(RedirectExec.java:110)
   [junit4]   2> 	at org.apache.http.impl.client.InternalHttpClient.doExecute(InternalHttpClient.java:184)
   [junit4]   2> 	at org.apache.http.impl.client.CloseableHttpClient.execute(CloseableHttpClient.java:82)
   [junit4]   2> 	at org.apache.http.impl.client.CloseableHttpClient.execute(CloseableHttpClient.java:55)
   [junit4]   2> 	at org.apache.solr.client.solrj.impl.ConcurrentUpdateSolrClient$Runner.sendUpdateStream(ConcurrentUpdateSolrClient.java:347)
   [junit4]   2> 	at org.apache.solr.client.solrj.impl.ConcurrentUpdateSolrClient$Runner.run(ConcurrentUpdateSolrClient.java:182)
   [junit4]   2> 	at com.codahale.metrics.InstrumentedExecutorService$InstrumentedRunnable.run(InstrumentedExecutorService.java:176)
   [junit4]   2> 	at org.apache.solr.common.util.ExecutorUtil$MDCAwareThreadPoolExecutor.lambda$execute$0(ExecutorUtil.java:188)
   [junit4]   2> 	at java.util.concurrent.ThreadPoolExecutor.runWorker(ThreadPoolExecutor.java:1149)
   [junit4]   2> 	at java.util.concurrent.ThreadPoolExecutor$Worker.run(ThreadPoolExecutor.java:624)
   [junit4]   2> 	at java.lang.Thread.run(Thread.java:748)
   [junit4]   2> 1091931 ERROR (qtp1863018983-11754) [n:127.0.0.1:60925_b%2Fxj c:collMinRf_1x3 s:shard1 r:core_node4 x:collMinRf_1x3_shard1_replica_t1] o.a.s.u.p.DistributedUpdateProcessor Setting up to try to start recovery on replica http://127.0.0.1:60873/b/xj/collMinRf_1x3_shard1_replica_t3/
   [junit4]   2> java.net.SocketException: Broken pipe (Write failed)
   [junit4]   2> 	at java.net.SocketOutputStream.socketWrite0(Native Method)
   [junit4]   2> 	at java.net.SocketOutputStream.socketWrite(SocketOutputStream.java:111)
   [junit4]   2> 	at java.net.SocketOutputStream.write(SocketOutputStream.java:155)
   [junit4]   2> 	at org.apache.http.impl.io.SessionOutputBufferImpl.streamWrite(SessionOutputBufferImpl.java:126)
   [junit4]   2> 	at org.apache.http.impl.io.SessionOutputBufferImpl.flushBuffer(SessionOutputBufferImpl.java:138)
   [junit4]   2> 	at org.apache.http.impl.io.SessionOutputBufferImpl.flush(SessionOutputBufferImpl.java:146)
   [junit4]   2> 	at org.apache.http.impl.io.ChunkedOutputStream.close(ChunkedOutputStream.java:205)
   [junit4]   2> 	at org.apache.http.impl.DefaultBHttpClientConnection.sendRequestEntity(DefaultBHttpClientConnection.java:159)
   [junit4]   2> 	at org.apache.http.impl.conn.CPoolProxy.sendRequestEntity(CPoolProxy.java:162)
   [junit4]   2> 	at org.apache.http.protocol.HttpRequestExecutor.doSendRequest(HttpRequestExecutor.java:237)
   [junit4]   2> 	at org.apache.http.protocol.HttpRequestExecutor.execute(HttpRequestExecutor.java:122)
   [junit4]   2> 	at org.apache.solr.util.stats.InstrumentedHttpRequestExecutor.execute(InstrumentedHttpRequestExecutor.java:118)
   [junit4]   2> 	at org.apache.http.impl.execchain.MainClientExec.execute(MainClientExec.java:271)
   [junit4]   2> 	at org.apache.http.impl.execchain.ProtocolExec.execute(ProtocolExec.java:184)
   [junit4]   2> 	at org.apache.http.impl.execchain.RetryExec.execute(RetryExec.java:88)
   [junit4]   2> 	at org.apache.http.impl.execchain.RedirectExec.execute(RedirectExec.java:110)
   [junit4]   2> 	at org.apache.http.impl.client.InternalHttpClient.doExecute(InternalHttpClient.java:184)
   [junit4]   2> 	at org.apache.http.impl.client.CloseableHttpClient.execute(CloseableHttpClient.java:82)
   [junit4]   2> 	at org.apache.http.impl.client.CloseableHttpClient.execute(CloseableHttpClient.java:55)
   [junit4]   2> 	at org.apache.solr.client.solrj.impl.ConcurrentUpdateSolrClient$Runner.sendUpdateStream(ConcurrentUpdateSolrClient.java:347)
   [junit4]   2> 	at org.apache.solr.client.solrj.impl.ConcurrentUpdateSolrClient$Runner.run(ConcurrentUpdateSolrClient.java:182)
   [junit4]   2> 	at com.codahale.metrics.InstrumentedExecutorService$InstrumentedRunnable.run(InstrumentedExecutorService.java:176)
   [junit4]   2> 	at org.apache.solr.common.util.ExecutorUtil$MDCAwareThreadPoolExecutor.lambda$execute$0(ExecutorUtil.java:188)
   [junit4]   2> 	at java.util.concurrent.ThreadPoolExecutor.runWorker(ThreadPoolExecutor.java:1149)
   [junit4]   2> 	at java.util.concurrent.ThreadPoolExecutor$Worker.run(ThreadPoolExecutor.java:624)
   [junit4]   2> 	at java.lang.Thread.run(Thread.java:748)
   [junit4]   2> 1091934 WARN  (updateExecutor-3133-thread-1-processing-x:collMinRf_1x3_shard1_replica_t1 r:core_node4 http:////127.0.0.1:60873//b//xj//collMinRf_1x3_shard1_replica_t3// n:127.0.0.1:60925_b%2Fxj s:shard1 c:collMinRf_1x3) [n:127.0.0.1:60925_b%2Fxj c:collMinRf_1x3 s:shard1 r:core_node4 x:collMinRf_1x3_shard1_replica_t1] o.a.s.c.LeaderInitiatedRecoveryThread Leader is publishing core=collMinRf_1x3_shard1_replica_t3 coreNodeName =core_node6 state=down on behalf of un-reachable replica http://127.0.0.1:60873/b/xj/collMinRf_1x3_shard1_replica_t3/
   [junit4]   2> 1091937 ERROR (updateExecutor-3133-thread-1-processing-x:collMinRf_1x3_shard1_replica_t1 r:core_node4 http:////127.0.0.1:60873//b//xj//collMinRf_1x3_shard1_replica_t3// n:127.0.0.1:60925_b%2Fxj s:shard1 c:collMinRf_1x3) [n:127.0.0.1:60925_b%2Fxj c:collMinRf_1x3 s:shard1 r:core_node4 x:collMinRf_1x3_shard1_replica_t1] o.a.s.c.LeaderInitiatedRecoveryThread http://127.0.0.1:60873/b/xj: Could not tell a replica to recover:org.apache.solr.client.solrj.SolrServerException: Server refused connection at: http://127.0.0.1:60873/b/xj
   [junit4]   2> 	at org.apache.solr.client.solrj.impl.HttpSolrClient.executeMethod(HttpSolrClient.java:634)
   [junit4]   2> 	at org.apache.solr.client.solrj.impl.HttpSolrClient.request(HttpSolrClient.java:253)
   [junit4]   2> 	at org.apache.solr.client.solrj.impl.HttpSolrClient.request(HttpSolrClient.java:242)
   [junit4]   2> 	at org.apache.solr.client.solrj.SolrClient.request(SolrClient.java:1219)
   [junit4]   2> 	at org.apache.solr.cloud.LeaderInitiatedRecoveryThread.sendRecoveryCommandWithRetry(LeaderInitiatedRecoveryThread.java:209)
   [junit4]   2> 	at org.apache.solr.cloud.LeaderInitiatedRecoveryThread.run(LeaderInitiatedRecoveryThread.java:95)
   [junit4]   2> 	at com.codahale.metrics.InstrumentedExecutorService$InstrumentedRunnable.run(InstrumentedExecutorService.java:176)
   [junit4]   2> 	at org.apache.solr.common.util.ExecutorUtil$MDCAwareThreadPoolExecutor.lambda$execute$0(ExecutorUtil.java:188)
   [junit4]   2> 	at java.util.concurrent.ThreadPoolExecutor.runWorker(ThreadPoolExecutor.java:1149)
   [junit4]   2> 	at java.util.concurrent.ThreadPoolExecutor$Worker.run(ThreadPoolExecutor.java:624)
   [junit4]   2> 	at java.lang.Thread.run(Thread.java:748)
   [junit4]   2> Caused by: org.apache.http.conn.HttpHostConnectException: Connect to 127.0.0.1:60873 [/127.0.0.1] failed: Connection refused (Connection refused)
   [junit4]   2> 	at org.apache.http.impl.conn.DefaultHttpClientConnectionOperator.connect(DefaultHttpClientConnectionOperator.java:151)
   [junit4]   2> 	at org.apache.http.impl.conn.PoolingHttpClientConnectionManager.connect(PoolingHttpClientConnectionManager.java:353)
   [junit4]   2> 	at org.apache.http.impl.execchain.MainClientExec.establishRoute(MainClientExec.java:380)
   [junit4]   2> 	at org.apache.http.impl.execchain.MainClientExec.execute(MainClientExec.java:236)
   [junit4]   2> 	at org.apache.http.impl.execchain.ProtocolExec.execute(ProtocolExec.java:184)
   [junit4]   2> 	at org.apache.http.impl.execchain.RetryExec.execute(RetryExec.java:88)
   [junit4]   2> 	at org.apache.http.impl.execchain.RedirectExec.execute(RedirectExec.java:110)
   [junit4]   2> 	at org.apache.http.impl.client.InternalHttpClient.doExecute(InternalHttpClient.java:184)
   [junit4]   2> 	at org.apache.http.impl.client.CloseableHttpClient.execute(CloseableHttpClient.java:82)
   [junit4]   2> 	at org.apache.http.impl.client.CloseableHttpClient.execute(CloseableHttpClient.java:55)
   [junit4]   2> 	at org.apache.solr.client.solrj.impl.HttpSolrClient.executeMethod(HttpSolrClient.java:526)
   [junit4]   2> 	... 10 more
   [junit4]   2> Caused by: java.net.ConnectException: Connection refused (Connection refused)
   [junit4]   2> 	at java.net.PlainSocketImpl.socketConnect(Native Method)
   [junit4]   2> 	at java.net.AbstractPlainSocketImpl.doConnect(AbstractPlainSocketImpl.java:350)
   [junit4]   2> 	at java.net.AbstractPlainSocketImpl.connectToAddress(AbstractPlainSocketImpl.java:206)
   [junit4]   2> 	at java.net.AbstractPlainSocketImpl.connect(AbstractPlainSocketImpl.java:188)
   [junit4]   2> 	at java.net.SocksSocketImpl.connect(SocksSocketImpl.java:392)
   [junit4]   2> 	at java.net.Socket.connect(Socket.java:589)
   [junit4]   2> 	at org.apache.http.conn.socket.PlainConnectionSocketFactory.connectSocket(PlainConnectionSocketFactory.java:74)
   [junit4]   2> 	at org.apache.http.impl.conn.DefaultHttpClientConnectionOperator.connect(DefaultHttpClientConnectionOperator.java:134)
   [junit4]   2> 	... 20 more
   [junit4]   2> 
   [junit4]   2> 1096949 WARN  (updateExecutor-3133-thread-1-processing-x:collMinRf_1x3_shard1_replica_t1 r:core_node4 http:////127.0.0.1:60873//b//xj//collMinRf_1x3_shard1_replica_t3// n:127.0.0.1:60925_b%2Fxj s:shard1 c:collMinRf_1x3) [n:127.0.0.1:60925_b%2Fxj c:collMinRf_1x3 s:shard1 r:core_node4 x:collMinRf_1x3_shard1_replica_t1] o.a.s.c.LeaderInitiatedRecoveryThread Asking core=collMinRf_1x3_shard1_replica_t3 coreNodeName=core_node6 on http://127.0.0.1:60873/b/xj to recover; unsuccessful after 2 of 120 attempts so far ...
   [junit4]   2> 1098518 WARN  (recoveryExecutor-3110-thread-1-processing-n:127.0.0.1:60873_b%2Fxj x:collMinRf_1x3_shard1_replica_t3 s:shard1 c:collMinRf_1x3 r:core_node6) [n:127.0.0.1:60873_b%2Fxj c:collMinRf_1x3 s:shard1 r:core_node6 x:collMinRf_1x3_shard1_replica_t3] o.a.s.h.IndexFetcher File segments_2 did not match. expected checksum is 3839732289 and actual is checksum 610668379. expected length is 232 and actual length is 120
   [junit4]   2> 1098869 INFO  (TEST-HttpPartitionTest.test-seed#[ACF841744A332569]) [    ] o.a.s.SolrTestCaseJ4 ###Ending test
   [junit4]   2> 1098913 WARN  (zkCallback-3112-thread-1-processing-n:127.0.0.1:60873_b%2Fxj) [n:127.0.0.1:60873_b%2Fxj    ] o.a.s.c.c.ZkStateReader ZooKeeper watch triggered, but Solr cannot talk to ZK: [KeeperErrorCode = Session expired for /live_nodes]
   [junit4]   2> 1098937 WARN  (zkCallback-3124-thread-1-processing-n:127.0.0.1:60897_b%2Fxj) [n:127.0.0.1:60897_b%2Fxj    ] o.a.s.c.c.ZkStateReader ZooKeeper watch triggered, but Solr cannot talk to ZK: [KeeperErrorCode = Session expired for /live_nodes]
   [junit4]   2> 1098956 WARN  (zkCallback-3130-thread-1-processing-n:127.0.0.1:60911_b%2Fxj) [n:127.0.0.1:60911_b%2Fxj    ] o.a.s.c.c.ZkStateReader ZooKeeper watch triggered, but Solr cannot talk to ZK: [KeeperErrorCode = Session expired for /live_nodes]
   [junit4]   2> 1098974 WARN  (zkCallback-3136-thread-1-processing-n:127.0.0.1:60925_b%2Fxj) [n:127.0.0.1:60925_b%2Fxj    ] o.a.s.c.c.ZkStateReader ZooKeeper watch triggered, but Solr cannot talk to ZK: [KeeperErrorCode = Session expired for /live_nodes]
   [junit4]   2> 1099870 WARN  (indexFetcher-4506-thread-1) [n:127.0.0.1:60925_b%2Fxj c:collection1 s:shard2 r:core_node46 x:collection1_shard2_replica_t45] o.a.s.h.ReplicationHandler I was asked to replicate but CoreContainer is shutting down
   [junit4]   2> 1101442 WARN  (zkCallback-3136-thread-2-processing-n:127.0.0.1:60925_b%2Fxj) [n:127.0.0.1:60925_b%2Fxj c:collection1 s:shard2 r:core_node46 x:collection1_shard2_replica_t45] o.a.s.c.SyncStrategy Closed, skipping sync up.
   [junit4]   2> 1101463 ERROR (TEST-HttpPartitionTest.test-seed#[ACF841744A332569]) [    ] o.a.z.s.ZooKeeperServer ZKShutdownHandler is not registered, so ZooKeeper server won't take any action on ERROR or SHUTDOWN server state changes
   [junit4]   2> 1102054 WARN  (Thread-1850) [    ] o.a.s.c.ZkTestServer Watch limit violations: 
   [junit4]   2> Maximum concurrent create/delete watches above limit:
   [junit4]   2> 
   [junit4]   2> 	6	/solr/aliases.json
   [junit4]   2> 	4	/solr/security.json
   [junit4]   2> 	4	/solr/configs/conf1
   [junit4]   2> 
   [junit4]   2> Maximum concurrent data watches above limit:
   [junit4]   2> 
   [junit4]   2> 	6	/solr/clusterprops.json
   [junit4]   2> 	6	/solr/clusterstate.json
   [junit4]   2> 	3	/solr/collections/collection1/state.json
   [junit4]   2> 	3	/solr/collections/collMinRf_1x3/state.json
   [junit4]   2> 	2	/solr/collections/collMinRf_1x3/leader_elect/shard1/election/98530864353837071-core_node4-n_0000000000
   [junit4]   2> 	2	/solr/collections/c8n_crud_1x2/state.json
   [junit4]   2> 
   [junit4]   2> Maximum concurrent children watches above limit:
   [junit4]   2> 
   [junit4]   2> 	6	/solr/live_nodes
   [junit4]   2> 	6	/solr/collections
   [junit4]   2> 
   [junit4]   2> 1102054 WARN  (TEST-HttpPartitionTest.test-seed#[ACF841744A332569]) [    ] o.a.s.c.SocketProxy Closing 2 connections to: http://127.0.0.1:60873/b/xj, target: http://127.0.0.1:60874/b/xj
   [junit4]   2> 1102055 WARN  (TEST-HttpPartitionTest.test-seed#[ACF841744A332569]) [    ] o.a.s.c.SocketProxy Closing 5 connections to: http://127.0.0.1:60911/b/xj, target: http://127.0.0.1:60912/b/xj
   [junit4]   2> 1102055 WARN  (TEST-HttpPartitionTest.test-seed#[ACF841744A332569]) [    ] o.a.s.c.SocketProxy Closing 11 connections to: http://127.0.0.1:60897/b/xj, target: http://127.0.0.1:60898/b/xj
   [junit4]   2> 1102055 WARN  (TEST-HttpPartitionTest.test-seed#[ACF841744A332569]) [    ] o.a.s.c.SocketProxy Closing 10 connections to: http://127.0.0.1:60925/b/xj, target: http://127.0.0.1:60926/b/xj
   [junit4]   2> NOTE: reproduce with: ant test  -Dtestcase=HttpPartitionTest -Dtests.method=test -Dtests.seed=ACF841744A332569 -Dtests.slow=true -Dtests.locale=es-HN -Dtests.timezone=Africa/Douala -Dtests.asserts=true -Dtests.file.encoding=US-ASCII
   [junit4] FAILURE 31.1s J1 | HttpPartitionTest.test <<<
   [junit4]    > Throwable #1: java.lang.AssertionError: Doc with id=1 not found in http://127.0.0.1:60897/b/xj/collMinRf_1x3 due to: Path not found: /id; rsp={doc=null}
   [junit4]    > 	at __randomizedtesting.SeedInfo.seed([ACF841744A332569:24AC7EAEE4CF4891]:0)
   [junit4]    > 	at org.apache.solr.cloud.HttpPartitionTest.assertDocExists(HttpPartitionTest.java:603)
   [junit4]    > 	at org.apache.solr.cloud.HttpPartitionTest.assertDocsExistInAllReplicas(HttpPartitionTest.java:558)
   [junit4]    > 	at org.apache.solr.cloud.HttpPartitionTest.testMinRf(HttpPartitionTest.java:249)
   [junit4]    > 	at org.apache.solr.cloud.HttpPartitionTest.test(HttpPartitionTest.java:127)
   [junit4]    > 	at org.apache.solr.BaseDistributedSearchTestCase$ShardsRepeatRule$ShardsFixedStatement.callStatement(BaseDistributedSearchTestCase.java:993)
   [junit4]    > 	at org.apache.solr.BaseDistributedSearchTestCase$ShardsRepeatRule$ShardsStatement.evaluate(BaseDistributedSearchTestCase.java:968)
   [junit4]    > 	at java.lang.Thread.run(Thread.java:748)
   [junit4]   2> NOTE: leaving temporary files on disk at: /Users/jenkins/workspace/Lucene-Solr-master-MacOSX/solr/build/solr-core/test/J1/temp/solr.cloud.HttpPartitionTest_ACF841744A332569-001
   [junit4]   2> NOTE: test params are: codec=HighCompressionCompressingStoredFields(storedFieldsFormat=CompressingStoredFieldsFormat(compressionMode=HIGH_COMPRESSION, chunkSize=1, maxDocsPerChunk=10, blockSize=936), termVectorsFormat=CompressingTermVectorsFormat(compressionMode=HIGH_COMPRESSION, chunkSize=1, blockSize=936)), sim=RandomSimilarity(queryNorm=false): {}, locale=es-HN, timezone=Africa/Douala
   [junit4]   2> NOTE: Mac OS X 10.11.6 x86_64/Oracle Corporation 1.8.0_144 (64-bit)/cpus=3,threads=1,free=124705400,total=475144192
   [junit4]   2> NOTE: All tests run in this JVM: [ZkNodePropsTest, BasicZkTest, TestRestManager, TestEmbeddedSolrServerConstructors, TestSimpleTrackingShardHandler, TestNumericRangeQuery64, TestExclusionRuleCollectionAccess, TestFieldCacheWithThreads, PolyFieldTest, SolrPluginUtilsTest, BlobRepositoryCloudTest, RuleEngineTest, BasicDistributedZk2Test, ShowFileRequestHandlerTest, InfixSuggestersTest, TestRuleBasedAuthorizationPlugin, TestPushWriter, TestPolicyCloud, MBeansHandlerTest, BadIndexSchemaTest, SolrRequestParserTest, TriLevelCompositeIdRoutingTest, TestGraphTermsQParserPlugin, ActionThrottleTest, HighlighterMaxOffsetTest, TestPullReplica, SolrMetricsIntegrationTest, PluginInfoTest, LoggingHandlerTest, ChaosMonkeySafeLeaderTest, AddSchemaFieldsUpdateProcessorFactoryTest, TestFieldTypeResource, TestConfigSetsAPIExclusivity, TestSolrCLIRunExample, TestNRTOpen, CacheHeaderTest, SearchHandlerTest, FullHLLTest, BlockDirectoryTest, FileBasedSpellCheckerTest, ChangedSchemaMergeTest, NodeMutatorTest, TestMinMaxOnMultiValuedField, TestDistributedStatsComponentCardinality, FileUtilsTest, IndexSchemaRuntimeFieldTest, TestRealTimeGet, TestInfoStreamLogging, TestSortByMinMaxFunction, TestPerFieldSimilarity, DistributedQueryElevationComponentTest, OpenCloseCoreStressTest, SimpleCollectionCreateDeleteTest, CursorMarkTest, SolrCloudExampleTest, TestWordDelimiterFilterFactory, TestIntervalFaceting, BigEndianAscendingWordDeserializerTest, TestSolrFieldCacheBean, FullSolrCloudDistribCmdsTest, ConvertedLegacyTest, DistributedDebugComponentTest, TestCorePropertiesReload, HdfsTlogReplayBufferedWhileIndexingTest, TestJsonFacetRefinement, DistributedVersionInfoTest, CdcrReplicationHandlerTest, InfoHandlerTest, TestSystemCollAutoCreate, DocumentBuilderTest, MoveReplicaHDFSTest, QueryEqualityTest, SuggesterTSTTest, TestSolrJ, StatsComponentTest, TestConfig, HdfsDirectoryTest, TestLeaderInitiatedRecoveryThread, TestCoreDiscovery, ShufflingReplicaListTransformerTest, PropertiesRequestHandlerTest, CdcrVersionReplicationTest, BadComponentTest, SaslZkACLProviderTest, TestExceedMaxTermLength, ZkSolrClientTest, CloneFieldUpdateProcessorFactoryTest, TestFastLRUCache, ZkStateWriterTest, TestJoin, MetricUtilsTest, TestStressLucene, AssignBackwardCompatibilityTest, DistributedFacetPivotSmallTest, TestLegacyNumericUtils, TestInitQParser, TestLMJelinekMercerSimilarityFactory, TestCloudRecovery, TestLockTree, SolrIndexMetricsTest, BasicFunctionalityTest, TestDelegationWithHadoopAuth, TestNumericTerms32, ReplicationFactorTest, V2StandaloneTest, RollingRestartTest, UpdateParamsTest, TestDocSet, CoreAdminRequestStatusTest, SortSpecParsingTest, DirectSolrSpellCheckerTest, HdfsSyncSliceTest, TestMultiWordSynonyms, CollectionsAPISolrJTest, SOLR749Test, SimpleMLTQParserTest, TestHttpShardHandlerFactory, TestSQLHandler, CopyFieldTest, HLLUtilTest, TestCharFilters, TestRandomCollapseQParserPlugin, HdfsRecoveryZkTest, TemplateUpdateProcessorTest, TestRTGBase, DocValuesMultiTest, DeleteShardTest, DistributedIntervalFacetingTest, TestClusterProperties, MoveReplicaTest, TermsComponentTest, TestTolerantUpdateProcessorRandomCloud, TestLegacyField, HttpPartitionTest]
   [junit4] Completed [247/731 (1!)] on J1 in 31.08s, 1 test, 1 failure <<< FAILURES!

[...truncated 664 lines...]
   [junit4] Suite: org.apache.solr.update.processor.UpdateRequestProcessorFactoryTest
   [junit4]   2> 1949074 INFO  (SUITE-UpdateRequestProcessorFactoryTest-seed#[ACF841744A332569]-worker) [    ] o.a.s.SolrTestCaseJ4 SecureRandom sanity checks: test.solr.allowed.securerandom=null & java.security.egd=file:/dev/./urandom
   [junit4]   2> Creating dataDir: /Users/jenkins/workspace/Lucene-Solr-master-MacOSX/solr/build/solr-core/test/J1/temp/solr.update.processor.UpdateRequestProcessorFactoryTest_ACF841744A332569-001/init-core-data-001
   [junit4]   2> 1949075 WARN  (SUITE-UpdateRequestProcessorFactoryTest-seed#[ACF841744A332569]-worker) [    ] o.a.s.SolrTestCaseJ4 startTrackingSearchers: numOpens=2 numCloses=2
   [junit4]   2> 1949075 INFO  (SUITE-UpdateRequestProcessorFactoryTest-seed#[ACF841744A332569]-worker) [    ] o.a.s.SolrTestCaseJ4 Using TrieFields (NUMERIC_POINTS_SYSPROP=false) w/NUMERIC_DOCVALUES_SYSPROP=false
   [junit4]   2> 1949078 INFO  (SUITE-UpdateRequestProcessorFactoryTest-seed#[ACF841744A332569]-worker) [    ] o.a.s.SolrTestCaseJ4 Randomized ssl (false) and clientAuth (false) via: @org.apache.solr.util.RandomizeSSL(reason=, value=NaN, ssl=NaN, clientAuth=NaN) w/ MAC_OS_X supressed clientAuth
   [junit4]   2> 1949078 INFO  (SUITE-UpdateRequestProcessorFactoryTest-seed#[ACF841744A332569]-worker) [    ] o.a.s.SolrTestCaseJ4 ####initCore
   [junit4]   2> 1949436 WARN  (coreLoadExecutor-9403-thread-1) [    x:collection1] o.a.s.c.RequestHandlers no default request handler is registered (either '/select' or 'standard')
   [junit4]   2> 1949437 WARN  (coreLoadExecutor-9403-thread-1) [    x:collection1] o.a.s.r.ManagedResourceStorage Cannot write to config directory /Users/jenkins/workspace/Lucene-Solr-master-MacOSX/solr/core/src/test-files/solr/collection1/conf; switching to use InMemory storage instead.
   [junit4]   2> 1949438 INFO  (SUITE-UpdateRequestProcessorFactoryTest-seed#[ACF841744A332569]-worker) [    ] o.a.s.SolrTestCaseJ4 ####initCore end
   [junit4]   2> 1949440 INFO  (TEST-UpdateRequestProcessorFactoryTest.testConfiguration-seed#[ACF841744A332569]) [    ] o.a.s.SolrTestCaseJ4 ###Starting testConfiguration
   [junit4]   2> 1949440 INFO  (TEST-UpdateRequestProcessorFactoryTest.testConfiguration-seed#[ACF841744A332569]) [    ] o.a.s.SolrTestCaseJ4 ###Ending testConfiguration
   [junit4]   2> 1949442 INFO  (TEST-UpdateRequestProcessorFactoryTest.testUpdateDistribChainSkipping-seed#[ACF841744A332569]) [    ] o.a.s.SolrTestCaseJ4 ###Starting testUpdateDistribChainSkipping
   [junit4]   2> 1949442 INFO  (TEST-UpdateRequestProcessorFactoryTest.testUpdateDistribChainSkipping-seed#[ACF841744A332569]) [    ] o.a.s.SolrTestCaseJ4 ###Ending testUpdateDistribChainSkipping
   [junit4]   2> NOTE: reproduce with: ant test  -Dtestcase=UpdateRequestProcessorFactoryTest -Dtests.method=testUpdateDistribChainSkipping -Dtests.seed=ACF841744A332569 -Dtests.slow=true -Dtests.locale=ms-MY -Dtests.timezone=Europe/Paris -Dtests.asserts=true -Dtests.file.encoding=US-ASCII
   [junit4] FAILURE 0.00s J1 | UpdateRequestProcessorFactoryTest.testUpdateDistribChainSkipping <<<
   [junit4]    > Throwable #1: java.lang.AssertionError: Tests must be run with INFO level logging otherwise LogUpdateProcessor isn't used and can't be tested.
   [junit4]    > 	at __randomizedtesting.SeedInfo.seed([ACF841744A332569:DD1CBFA23CD802A5]:0)
   [junit4]    > 	at org.apache.solr.update.processor.UpdateRequestProcessorFactoryTest.testUpdateDistribChainSkipping(UpdateRequestProcessorFactoryTest.java:101)
   [junit4]    > 	at java.lang.Thread.run(Thread.java:748)
   [junit4]   2> 1949444 INFO  (TEST-UpdateRequestProcessorFactoryTest.testRequestTimeUrp-seed#[ACF841744A332569]) [    ] o.a.s.SolrTestCaseJ4 ###Starting testRequestTimeUrp
   [junit4]   2> 1949444 INFO  (TEST-UpdateRequestProcessorFactoryTest.testRequestTimeUrp-seed#[ACF841744A332569]) [    ] o.a.s.SolrTestCaseJ4 ###Ending testRequestTimeUrp
   [junit4]   2> 1949444 INFO  (SUITE-UpdateRequestProcessorFactoryTest-seed#[ACF841744A332569]-worker) [    ] o.a.s.SolrTestCaseJ4 ###deleteCore
   [junit4]   2> NOTE: leaving temporary files on disk at: /Users/jenkins/workspace/Lucene-Solr-master-MacOSX/solr/build/solr-core/test/J1/temp/solr.update.processor.UpdateRequestProcessorFactoryTest_ACF841744A332569-001
   [junit4]   2> NOTE: test params are: codec=Lucene70, sim=RandomSimilarity(queryNorm=true): {}, locale=ms-MY, timezone=Europe/Paris
   [junit4]   2> NOTE: Mac OS X 10.11.6 x86_64/Oracle Corporation 1.8.0_144 (64-bit)/cpus=3,threads=1,free=116547608,total=501587968
   [junit4]   2> NOTE: All tests run in this JVM: [ZkNodePropsTest, BasicZkTest, TestRestManager, TestEmbeddedSolrServerConstructors, TestSimpleTrackingShardHandler, TestNumericRangeQuery64, TestExclusionRuleCollectionAccess, TestFieldCacheWithThreads, PolyFieldTest, SolrPluginUtilsTest, BlobRepositoryCloudTest, RuleEngineTest, BasicDistributedZk2Test, ShowFileRequestHandlerTest, InfixSuggestersTest, TestRuleBasedAuthorizationPlugin, TestPushWriter, TestPolicyCloud, MBeansHandlerTest, BadIndexSchemaTest, SolrRequestParserTest, TriLevelCompositeIdRoutingTest, TestGraphTermsQParserPlugin, ActionThrottleTest, HighlighterMaxOffsetTest, TestPullReplica, SolrMetricsIntegrationTest, PluginInfoTest, LoggingHandlerTest, ChaosMonkeySafeLeaderTest, AddSchemaFieldsUpdateProcessorFactoryTest, TestFieldTypeResource, TestConfigSetsAPIExclusivity, TestSolrCLIRunExample, TestNRTOpen, CacheHeaderTest, SearchHandlerTest, FullHLLTest, BlockDirectoryTest, FileBasedSpellCheckerTest, ChangedSchemaMergeTest, NodeMutatorTest, TestMinMaxOnMultiValuedField, TestDistributedStatsComponentCardinality, FileUtilsTest, IndexSchemaRuntimeFieldTest, TestRealTimeGet, TestInfoStreamLogging, TestSortByMinMaxFunction, TestPerFieldSimilarity, DistributedQueryElevationComponentTest, OpenCloseCoreStressTest, SimpleCollectionCreateDeleteTest, CursorMarkTest, SolrCloudExampleTest, TestWordDelimiterFilterFactory, TestIntervalFaceting, BigEndianAscendingWordDeserializerTest, TestSolrFieldCacheBean, FullSolrCloudDistribCmdsTest, ConvertedLegacyTest, DistributedDebugComponentTest, TestCorePropertiesReload, HdfsTlogReplayBufferedWhileIndexingTest, TestJsonFacetRefinement, DistributedVersionInfoTest, CdcrReplicationHandlerTest, InfoHandlerTest, TestSystemCollAutoCreate, DocumentBuilderTest, MoveReplicaHDFSTest, QueryEqualityTest, SuggesterTSTTest, TestSolrJ, StatsComponentTest, TestConfig, HdfsDirectoryTest, TestLeaderInitiatedRecoveryThread, TestCoreDiscovery, ShufflingReplicaListTransformerTest, PropertiesRequestHandlerTest, CdcrVersionReplicationTest, BadComponentTest, SaslZkACLProviderTest, TestExceedMaxTermLength, ZkSolrClientTest, CloneFieldUpdateProcessorFactoryTest, TestFastLRUCache, ZkStateWriterTest, TestJoin, MetricUtilsTest, TestStressLucene, AssignBackwardCompatibilityTest, DistributedFacetPivotSmallTest, TestLegacyNumericUtils, TestInitQParser, TestLMJelinekMercerSimilarityFactory, TestCloudRecovery, TestLockTree, SolrIndexMetricsTest, BasicFunctionalityTest, TestDelegationWithHadoopAuth, TestNumericTerms32, ReplicationFactorTest, V2StandaloneTest, RollingRestartTest, UpdateParamsTest, TestDocSet, CoreAdminRequestStatusTest, SortSpecParsingTest, DirectSolrSpellCheckerTest, HdfsSyncSliceTest, TestMultiWordSynonyms, CollectionsAPISolrJTest, SOLR749Test, SimpleMLTQParserTest, TestHttpShardHandlerFactory, TestSQLHandler, CopyFieldTest, HLLUtilTest, TestCharFilters, TestRandomCollapseQParserPlugin, HdfsRecoveryZkTest, TemplateUpdateProcessorTest, TestRTGBase, DocValuesMultiTest, DeleteShardTest, DistributedIntervalFacetingTest, TestClusterProperties, MoveReplicaTest, TermsComponentTest, TestTolerantUpdateProcessorRandomCloud, TestLegacyField, HttpPartitionTest, TestManagedSynonymFilterFactory, TestSolrCloudSnapshots, SpellPossibilityIteratorTest, TestFieldCacheSortRandom, TestCollapseQParserPlugin, TestScoreJoinQPNoScore, FieldMutatingUpdateProcessorTest, AnalyticsMergeStrategyTest, SegmentsInfoRequestHandlerTest, TestElisionMultitermQuery, DistanceUnitsTest, TestReqParamsAPI, TestOnReconnectListenerSupport, TestDistributedMissingSort, TestRawTransformer, DateRangeFieldTest, CoreSorterTest, TestCloudNestedDocsSort, TestAuthenticationFramework, ShardRoutingCustomTest, TestDocTermOrds, TestBlobHandler, TestTlogReplica, TestCollectionsAPIViaSolrCloudCluster, TestMacroExpander, OverriddenZkACLAndCredentialsProvidersTest, TestCSVLoader, RequestLoggingTest, TestSSLRandomization, TestOverriddenPrefixQueryForCustomFieldType, CollectionReloadTest, ExternalFileFieldSortTest, OverseerModifyCollectionTest, UtilsToolTest, DistribJoinFromCollectionTest, DeleteNodeTest, SolrCmdDistributorTest, TestDFISimilarityFactory, CollectionsAPIDistributedZkTest, TestMaxScoreQueryParser, TestAuthorizationFramework, HttpSolrCallGetCoreTest, BadCopyFieldTest, SpellCheckComponentTest, TestSlowCompositeReaderWrapper, ConfigSetsAPITest, SyncSliceTest, OverseerTest, LeaderElectionIntegrationTest, ShardRoutingTest, RecoveryZkTest, TestReplicationHandler, ClusterStateUpdateTest, TestRandomFaceting, TestZkChroot, TestRandomDVFaceting, AutoCommitTest, TestDistributedGrouping, TestRecovery, TermVectorComponentDistributedTest, TestReload, TestRangeQuery, TestGroupingSearch, TestFiltering, TestLazyCores, SolrIndexSplitterTest, SignatureUpdateProcessorFactoryTest, SuggesterTest, SchemaVersionSpecificBehaviorTest, TestAtomicUpdateErrorCases, StatelessScriptUpdateProcessorFactoryTest, DistanceFunctionTest, DebugComponentTest, LukeRequestHandlerTest, TestReversedWildcardFilterFactory, DocumentAnalysisRequestHandlerTest, TestQueryTypes, XmlUpdateRequestHandlerTest, PathHierarchyTokenizerFactoryTest, TestIndexingPerformance, FieldAnalysisRequestHandlerTest, RegexBoostProcessorTest, TestCollationField, UpdateRequestProcessorFactoryTest]
   [junit4] Completed [437/731 (2!)] on J1 in 0.39s, 3 tests, 1 failure <<< FAILURES!

[...truncated 230 lines...]
   [junit4] Suite: org.apache.solr.cloud.CustomCollectionTest
   [junit4]   2> Creating dataDir: /Users/jenkins/workspace/Lucene-Solr-master-MacOSX/solr/build/solr-core/test/J0/temp/solr.cloud.CustomCollectionTest_ACF841744A332569-001/init-core-data-001
   [junit4]   2> 2109998 ERROR (Thread-2742) [    ] o.a.z.s.ZooKeeperServer ZKShutdownHandler is not registered, so ZooKeeper server won't take any action on ERROR or SHUTDOWN server state changes
   [junit4]   2> 2110165 ERROR (jetty-launcher-2883-thread-2) [    ] o.a.s.u.StartupLoggingUtils Missing Java Option solr.log.dir. Logging may be missing or incomplete.
   [junit4]   2> 2110166 ERROR (jetty-launcher-2883-thread-4) [    ] o.a.s.u.StartupLoggingUtils Missing Java Option solr.log.dir. Logging may be missing or incomplete.
   [junit4]   2> 2110168 ERROR (jetty-launcher-2883-thread-3) [    ] o.a.s.u.StartupLoggingUtils Missing Java Option solr.log.dir. Logging may be missing or incomplete.
   [junit4]   2> 2110171 ERROR (jetty-launcher-2883-thread-1) [    ] o.a.s.u.StartupLoggingUtils Missing Java Option solr.log.dir. Logging may be missing or incomplete.
   [junit4]   2> 2110254 WARN  (NIOServerCxn.Factory:0.0.0.0/0.0.0.0:0) [    ] o.a.z.s.NIOServerCnxn caught end of stream exception
   [junit4]   2> EndOfStreamException: Unable to read additional data from client sessionid 0x15e0d5c6bd90006, likely client has closed socket
   [junit4]   2> 	at org.apache.zookeeper.server.NIOServerCnxn.doIO(NIOServerCnxn.java:239)
   [junit4]   2> 	at org.apache.zookeeper.server.NIOServerCnxnFactory.run(NIOServerCnxnFactory.java:203)
   [junit4]   2> 	at java.lang.Thread.run(Thread.java:748)
   [junit4]   2> 2110257 WARN  (NIOServerCxn.Factory:0.0.0.0/0.0.0.0:0) [    ] o.a.z.s.NIOServerCnxn caught end of stream exception
   [junit4]   2> EndOfStreamException: Unable to read additional data from client sessionid 0x15e0d5c6bd90009, likely client has closed socket
   [junit4]   2> 	at org.apache.zookeeper.server.NIOServerCnxn.doIO(NIOServerCnxn.java:239)
   [junit4]   2> 	at org.apache.zookeeper.server.NIOServerCnxnFactory.run(NIOServerCnxnFactory.java:203)
   [junit4]   2> 	at java.lang.Thread.run(Thread.java:748)
   [junit4]   2> 2119634 WARN  (zkCallback-2903-thread-1-processing-n:127.0.0.1:49498_solr) [n:127.0.0.1:49498_solr    ] o.a.s.c.LeaderElector 
   [junit4]   2> org.apache.solr.common.SolrException: SolrCore not found:implicitcoll_c_replica_n10 in []
   [junit4]   2> 	at org.apache.solr.cloud.ShardLeaderElectionContext.runLeaderProcess(ElectionContext.java:297)
   [junit4]   2> 	at org.apache.solr.cloud.LeaderElector.runIamLeaderProcess(LeaderElector.java:170)
   [junit4]   2> 	at org.apache.solr.cloud.LeaderElector.checkIfIamLeader(LeaderElector.java:135)
   [junit4]   2> 	at org.apache.solr.cloud.LeaderElector.access$200(LeaderElector.java:56)
   [junit4]   2> 	at org.apache.solr.cloud.LeaderElector$ElectionWatcher.process(LeaderElector.java:348)
   [junit4]   2> 	at org.apache.solr.common.cloud.SolrZkClient$3.lambda$process$0(SolrZkClient.java:269)
   [junit4]   2> 	at java.util.concurrent.Executors$RunnableAdapter.call(Executors.java:511)
   [junit4]   2> 	at java.util.concurrent.FutureTask.run(FutureTask.java:266)
   [junit4]   2> 	at org.apache.solr.common.util.ExecutorUtil$MDCAwareThreadPoolExecutor.lambda$execute$0(ExecutorUtil.java:188)
   [junit4]   2> 	at java.util.concurrent.ThreadPoolExecutor.runWorker(ThreadPoolExecutor.java:1149)
   [junit4]   2> 	at java.util.concurrent.ThreadPoolExecutor$Worker.run(ThreadPoolExecutor.java:624)
   [junit4]   2> 	at java.lang.Thread.run(Thread.java:748)
   [junit4]   2> 2119657 WARN  (zkCallback-2905-thread-2-processing-n:127.0.0.1:49501_solr) [n:127.0.0.1:49501_solr    ] o.a.s.c.LeaderElector 
   [junit4]   2> org.apache.solr.common.SolrException: SolrCore not found:implicitcoll_b_replica_n6 in []
   [junit4]   2> 	at org.apache.solr.cloud.ShardLeaderElectionContext.runLeaderProcess(ElectionContext.java:297)
   [junit4]   2> 	at org.apache.solr.cloud.LeaderElector.runIamLeaderProcess(LeaderElector.java:170)
   [junit4]   2> 	at org.apache.solr.cloud.LeaderElector.checkIfIamLeader(LeaderElector.java:135)
   [junit4]   2> 	at org.apache.solr.cloud.LeaderElector.access$200(LeaderElector.java:56)
   [junit4]   2> 	at org.apache.solr.cloud.LeaderElector$ElectionWatcher.process(LeaderElector.java:348)
   [junit4]   2> 	at org.apache.solr.common.cloud.SolrZkClient$3.lambda$process$0(SolrZkClient.java:269)
   [junit4]   2> 	at java.util.concurrent.Executors$RunnableAdapter.call(Executors.java:511)
   [junit4]   2> 	at java.util.concurrent.FutureTask.run(FutureTask.java:266)
   [junit4]   2> 	at org.apache.solr.common.util.ExecutorUtil$MDCAwareThreadPoolExecutor.lambda$execute$0(ExecutorUtil.java:188)
   [junit4]   2> 	at java.util.concurrent.ThreadPoolExecutor.runWorker(ThreadPoolExecutor.java:1149)
   [junit4]   2> 	at java.util.concurrent.ThreadPoolExecutor$Worker.run(ThreadPoolExecutor.java:624)
   [junit4]   2> 	at java.lang.Thread.run(Thread.java:748)
   [junit4]   2> 2119663 WARN  (zkCallback-2898-thread-1-processing-n:127.0.0.1:49497_solr) [n:127.0.0.1:49497_solr    ] o.a.s.c.LeaderElector Our node is no longer in line to be leader
   [junit4]   2> 2119665 WARN  (zkCallback-2904-thread-1-processing-n:127.0.0.1:49500_solr) [n:127.0.0.1:49500_solr    ] o.a.s.c.LeaderElector Our node is no longer in line to be leader
   [junit4]   2> 2124874 WARN  (zkCallback-2905-thread-2-processing-n:127.0.0.1:49501_solr) [n:127.0.0.1:49501_solr    ] o.a.s.c.LeaderElector 
   [junit4]   2> org.apache.solr.common.SolrException: SolrCore not found:withShardField_b_replica_n4 in []
   [junit4]   2> 	at org.apache.solr.cloud.ShardLeaderElectionContext.runLeaderProcess(ElectionContext.java:297)
   [junit4]   2> 	at org.apache.solr.cloud.LeaderElector.runIamLeaderProcess(LeaderElector.java:170)
   [junit4]   2> 	at org.apache.solr.cloud.LeaderElector.checkIfIamLeader(LeaderElector.java:135)
   [junit4]   2> 	at org.apache.solr.cloud.LeaderElector.access$200(LeaderElector.java:56)
   [junit4]   2> 	at org.apache.solr.cloud.LeaderElector$ElectionWatcher.process(LeaderElector.java:348)
   [junit4]   2> 	at org.apache.solr.common.cloud.SolrZkClient$3.lambda$process$0(SolrZkClient.java:269)
   [junit4]   2> 	at java.util.concurrent.Executors$RunnableAdapter.call(Executors.java:511)
   [junit4]   2> 	at java.util.concurrent.FutureTask.run(FutureTask.java:266)
   [junit4]   2> 	at org.apache.solr.common.util.ExecutorUtil$MDCAwareThreadPoolExecutor.lambda$execute$0(ExecutorUtil.java:188)
   [junit4]   2> 	at java.util.concurrent.ThreadPoolExecutor.runWorker(ThreadPoolExecutor.java:1149)
   [junit4]   2> 	at java.util.concurrent.ThreadPoolExecutor$Worker.run(ThreadPoolExecutor.java:624)
   [junit4]   2> 	at java.lang.Thread.run(Thread.java:748)
   [junit4]   2> 2125075 WARN  (zkCallback-2898-thread-1-processing-n:127.0.0.1:49497_solr) [n:127.0.0.1:49497_solr    ] o.a.s.c.LeaderElector 
   [junit4]   2> org.apache.solr.common.SolrException: SolrCore not found:withShardField_c_replica_n8 in []
   [junit4]   2> 	at org.apache.solr.cloud.ShardLeaderElectionContext.runLeaderProcess(ElectionContext.java:297)
   [junit4]   2> 	at org.apache.solr.cloud.LeaderElector.runIamLeaderProcess(LeaderElector.java:170)
   [junit4]   2> 	at org.apache.solr.cloud.LeaderElector.checkIfIamLeader(LeaderElector.java:135)
   [junit4]   2> 	at org.apache.solr.cloud.LeaderElector.access$200(LeaderElector.java:56)
   [junit4]   2> 	at org.apache.solr.cloud.LeaderElector$ElectionWatcher.process(LeaderElector.java:348)
   [junit4]   2> 	at org.apache.solr.common.cloud.SolrZkClient$3.lambda$process$0(SolrZkClient.java:269)
   [junit4]   2> 	at java.util.concurrent.Executors$RunnableAdapter.call(Executors.java:511)
   [junit4]   2> 	at java.util.concurrent.FutureTask.run(FutureTask.java:266)
   [junit4]   2> 	at org.apache.solr.common.util.ExecutorUtil$MDCAwareThreadPoolExecutor.lambda$execute$0(ExecutorUtil.java:188)
   [junit4]   2> 	at java.util.concurrent.ThreadPoolExecutor.runWorker(ThreadPoolExecutor.java:1149)
   [junit4]   2> 	at java.util.concurrent.ThreadPoolExecutor$Worker.run(ThreadPoolExecutor.java:624)
   [junit4]   2> 	at java.lang.Thread.run(Thread.java:748)
   [junit4]   2> 2125077 WARN  (zkCallback-2903-thread-2-processing-n:127.0.0.1:49498_solr) [n:127.0.0.1:49498_solr    ] o.a.s.c.LeaderElector Our node is no longer in line to be leader
   [junit4]   2> 2125079 WARN  (zkCallback-2904-thread-2-processing-n:127.0.0.1:49500_solr) [n:127.0.0.1:49500_solr    ] o.a.s.c.LeaderElector 
   [junit4]   2> org.apache.solr.common.SolrException: SolrCore not found:withShardField_d_replica_n14 in []
   [junit4]   2> 	at org.apache.solr.cloud.ShardLeaderElectionContext.runLeaderProcess(ElectionContext.java:297)
   [junit4]   2> 	at org.apache.solr.cloud.LeaderElector.runIamLeaderProcess(LeaderElector.java:170)
   [junit4]   2> 	at org.apache.solr.cloud.LeaderElector.checkIfIamLeader(LeaderElector.java:135)
   [junit4]   2> 	at org.apache.solr.cloud.LeaderElector.access$200(LeaderElector.java:56)
   [junit4]   2> 	at org.apache.solr.cloud.LeaderElector$ElectionWatcher.process(LeaderElector.java:348)
   [junit4]   2> 	at org.apache.solr.common.cloud.SolrZkClient$3.lambda$process$0(SolrZkClient.java:269)
   [junit4]   2> 	at java.util.concurrent.Executors$RunnableAdapter.call(Executors.java:511)
   [junit4]   2> 	at java.util.concurrent.FutureTask.run(FutureTask.java:266)
   [junit4]   2> 	at org.apache.solr.common.util.ExecutorUtil$MDCAwareThreadPoolExecutor.lambda$execute$0(ExecutorUtil.java:188)
   [junit4]   2> 	at java.util.concurrent.ThreadPoolExecutor.runWorker(ThreadPoolExecutor.java:1149)
   [junit4]   2> 	at java.util.concurrent.ThreadPoolExecutor$Worker.run(ThreadPoolExecutor.java:624)
   [junit4]   2> 	at java.lang.Thread.run(Thread.java:748)
   [junit4]   2> 2127964 ERROR (qtp1051615877-17688) [n:127.0.0.1:49497_solr c:routeFieldColl s:shard4 r:core_node16 x:routeFieldColl_shard4_replica_n14] o.a.s.h.RequestHandlerBase org.apache.solr.common.SolrException: Error CREATEing SolrCore 'routeFieldColl_shard4_replica_n14': Unable to create core [routeFieldColl_shard4_replica_n14] Caused by: invalid API spec: apispec/core.SchemaEdit.json
   [junit4]   2> 	at org.apache.solr.core.CoreContainer.create(CoreContainer.java:971)
   [junit4]   2> 	at org.apache.solr.handler.admin.CoreAdminOperation.lambda$static$0(CoreAdminOperation.java:91)
   [junit4]   2> 	at org.apache.solr.handler.admin.CoreAdminOperation.execute(CoreAdminOperation.java:384)
   [junit4]   2> 	at org.apache.solr.handler.admin.CoreAdminHandler$CallInfo.call(CoreAdminHandler.java:389)
   [junit4]   2> 	at org.apache.solr.handler.admin.CoreAdminHandler.handleRequestBody(CoreAdminHandler.java:174)
   [junit4]   2> 	at org.apache.solr.handler.RequestHandlerBase.handleRequest(RequestHandlerBase.java:177)
   [junit4]   2> 	at org.apache.solr.servlet.HttpSolrCall.handleAdmin(HttpSolrCall.java:745)
   [junit4]   2> 	at org.apache.solr.servlet.HttpSolrCall.handleAdminRequest(HttpSolrCall.java:726)
   [junit4]   2> 	at org.apache.solr.servlet.HttpSolrCall.call(HttpSolrCall.java:507)
   [junit4]   2> 	at org.apache.solr.servlet.SolrDispatchFilter.doFilter(SolrDispatchFilter.java:382)
   [junit4]   2> 	at org.apache.solr.servlet.SolrDispatchFilter.doFilter(SolrDispatchFilter.java:326)
   [junit4]   2> 	at org.eclipse.jetty.servlet.ServletHandler$CachedChain.doFilter(ServletHandler.java:1759)
   [junit4]   2> 	at org.apache.solr.client.solrj.embedded.JettySolrRunner$DebugFilter.doFilter(JettySolrRunner.java:139)
   [junit4]   2> 	at org.eclipse.jetty.servlet.ServletHandler$CachedChain.doFilter(ServletHandler.java:1759)
   [junit4]   2> 	at org.eclipse.jetty.servlet.ServletHandler.doHandle(ServletHandler.java:582)
   [junit4]   2> 	at org.eclipse.jetty.server.session.SessionHandler.doHandle(SessionHandler.java:224)
   [junit4]   2> 	at org.eclipse.jetty.server.handler.ContextHandler.doHandle(ContextHandler.java:1180)
   [junit4]   2> 	at org.eclipse.jetty.servlet.ServletHandler.doScope(ServletHandler.java:512)
   [junit4]   2> 	at org.eclipse.jetty.server.session.SessionHandler.doScope(SessionHandler.java:185)
   [junit4]   2> 	at org.eclipse.jetty.server.handler.ContextHandler.doScope(ContextHandler.java:1112)
   [junit4]   2> 	at org.eclipse.jetty.server.handler.ScopedHandler.handle(ScopedHandler.java:141)
   [junit4]   2> 	at org.eclipse.jetty.server.handler.gzip.GzipHandler.handle(GzipHandler.java:426)
   [junit4]   2> 	at org.eclipse.jetty.server.handler.HandlerWrapper.handle(HandlerWrapper.java:134)
   [junit4]   2> 	at org.eclipse.jetty.server.Server.handle(Server.java:534)
   [junit4]   2> 	at org.eclipse.jetty.server.HttpChannel.handle(HttpChannel.java:320)
   [junit4]   2> 	at org.eclipse.jetty.server.HttpConnection.onFillable(HttpConnection.java:251)
   [junit4]   2> 	at org.eclipse.jetty.io.AbstractConnection$ReadCallback.succeeded(AbstractConnection.java:283)
   [junit4]   2> 	at org.eclipse.jetty.io.FillInterest.fillable(FillInterest.java:108)
   [junit4]   2> 	at org.eclipse.jetty.io.SelectChannelEndPoint$2.run(SelectChannelEndPoint.java:93)
   [junit4]   2> 	at org.eclipse.jetty.util.thread.strategy.ExecuteProduceConsume.executeProduceConsume(ExecuteProduceConsume.java:303)
   [junit4]   2> 	at org.eclipse.jetty.util.thread.strategy.ExecuteProduceConsume.produceConsume(ExecuteProduceConsume.java:148)
   [junit4]   2> 	at org.eclipse.jetty.util.thread.strategy.ExecuteProduceConsume.run(ExecuteProduceConsume.java:136)
   [junit4]   2> 	at org.eclipse.jetty.util.thread.QueuedThreadPool.runJob(QueuedThreadPool.java:671)
   [junit4]   2> 	at org.eclipse.jetty.util.thread.QueuedThreadPool$2.run(QueuedThreadPool.java:589)
   [junit4]   2> 	at java.lang.Thread.run(Thread.java:748)
   [junit4]   2> Caused by: org.apache.solr.common.SolrException: Unable to create core [routeFieldColl_shard4_replica_n14]
   [junit4]   2> 	at org.apache.solr.core.CoreContainer.createFromDescriptor(CoreContainer.java:1018)
   [junit4]   2> 	at org.apache.solr.core.CoreContainer.create(CoreContainer.java:938)
   [junit4]   2> 	... 34 more
   [junit4]   2> Caused by: org.apache.solr.common.SolrException: invalid API spec: apispec/core.SchemaEdit.json
   [junit4]   2> 	at org.apache.solr.core.SolrCore.<init>(SolrCore.java:988)
   [junit4]   2> 	at org.apache.solr.core.SolrCore.<init>(SolrCore.java:843)
   [junit4]   2> 	at org.apache.solr.core.CoreContainer.createFromDescriptor(CoreContainer.java:1002)
   [junit4]   2> 	... 35 more
   [junit4]   2> Caused by: java.lang.RuntimeException: invalid API spec: apispec/core.SchemaEdit.json
   [junit4]   2> 	at org.apache.solr.common.util.ValidatingJsonMap.parse(ValidatingJsonMap.java:318)
   [junit4]   2> 	at org.apache.solr.common.util.Utils.lambda$getSpec$0(Utils.java:394)
   [junit4]   2> 	at org.apache.solr.api.Api.getSpec(Api.java:65)
   [junit4]   2> 	at org.apache.solr.api.ApiBag.register(ApiBag.java:73)
   [junit4]   2> 	at org.apache.solr.core.PluginBag.put(PluginBag.java:217)
   [junit4]   2> 	at org.apache.solr.core.PluginBag.init(PluginBag.java:274)
   [junit4]   2> 	at org.apache.solr.core.RequestHandlers.initHandlersFromConfig(RequestHandlers.java:130)
   [junit4]   2> 	at org.apache.solr.core.SolrCore.<init>(SolrCore.java:946)
   [junit4]   2> 	... 37 more
   [junit4]   2> 
   [junit4]   2> 2127965 ERROR (OverseerThreadFactory-6784-thread-5-processing-n:127.0.0.1:49497_solr) [n:127.0.0.1:49497_solr    ] o.a.s.c.OverseerCollectionMessageHandler Error from shard: http://127.0.0.1:49497/solr
   [junit4]   2> org.apache.solr.client.solrj.impl.HttpSolrClient$RemoteSolrException: Error from server at http://127.0.0.1:49497/solr: Error CREATEing SolrCore 'routeFieldColl_shard4_replica_n14': Unable to create core [routeFieldColl_shard4_replica_n14] Caused by: invalid API spec: apispec/core.SchemaEdit.json
   [junit4]   2> 	at org.apache.solr.client.solrj.impl.HttpSolrClient.executeMethod(HttpSolrClient.java:627)
   [junit4]   2> 	at org.apache.solr.client.solrj.impl.HttpSolrClient.request(HttpSolrClient.java:253)
   [junit4]   2> 	at org.apache.solr.client.solrj.impl.HttpSolrClient.request(HttpSolrClient.java:242)
   [junit4]   2> 	at org.apache.solr.client.solrj.SolrClient.request(SolrClient.java:1219)
   [junit4]   2> 	at org.apache.solr.handler.component.HttpShardHandler.lambda$submit$0(HttpShardHandler.java:172)
   [junit4]   2> 	at java.util.concurrent.FutureTask.run(FutureTask.java:266)
   [junit4]   2> 	at java.util.concurrent.Executors$RunnableAdapter.call(Executors.java:511)
   [junit4]   2> 	at java.util.concurrent.FutureTask.run(FutureTask.java:266)
   [junit4]   2> 	at com.codahale.metrics.InstrumentedExecutorService$InstrumentedRunnable.run(InstrumentedExecutorService.java:176)
   [junit4]   2> 	at org.apache.solr.common.util.ExecutorUtil$MDCAwareThreadPoolExecutor.lambda$execute$0(ExecutorUtil.java:188)
   [junit4]   2> 	at java.util.concurrent.ThreadPoolExecutor.runWorker(ThreadPoolExecutor.java:1149)
   [junit4]   2> 	at java.util.concurrent.ThreadPoolExecutor$Worker.run(ThreadPoolExecutor.java:624)
   [junit4]   2> 	at java.lang.Thread.run(Thread.java:748)
   [junit4]   2> 2127980 ERROR (qtp1051615877-17685) [n:127.0.0.1:49497_solr c:routeFieldColl s:shard2 r:core_node9 x:routeFieldColl_shard2_replica_n6] o.a.s.h.RequestHandlerBase org.apache.solr.common.SolrException: Error CREATEing SolrCore 'routeFieldColl_shard2_replica_n6': Unable to create core [routeFieldColl_shard2_replica_n6] Caused by: invalid API spec: apispec/core.SchemaEdit.json
   [junit4]   2> 	at org.apache.solr.core.CoreContainer.create(CoreContainer.java:971)
   [junit4]   2> 	at org.apache.solr.handler.admin.CoreAdminOperation.lambda$static$0(CoreAdminOperation.java:91)
   [junit4]   2> 	at org.apache.solr.handler.admin.CoreAdminOperation.execute(CoreAdminOperation.java:384)
   [junit4]   2> 	at org.apache.solr.handler.admin.CoreAdminHandler$CallInfo.call(CoreAdminHandler.java:389)
   [junit4]   2> 	at org.apache.solr.handler.admin.CoreAdminHandler.handleRequestBody(CoreAdminHandler.java:174)
   [junit4]   2> 	at org.apache.solr.handler.RequestHandlerBase.handleRequest(RequestHandlerBase.java:177)
   [junit4]   2> 	at org.apache.solr.servlet.HttpSolrCall.handleAdmin(HttpSolrCall.java:745)
   [junit4]   2> 	at org.apache.solr.servlet.HttpSolrCall.handleAdminRequest(HttpSolrCall.java:726)
   [junit4]   2> 	at org.apache.solr.servlet.HttpSolrCall.call(HttpSolrCall.java:507)
   [junit4]   2> 	at org.apache.solr.servlet.SolrDispatchFilter.doFilter(SolrDispatchFilter.java:382)
   [junit4]   2> 	at org.apache.solr.servlet.SolrDispatchFilter.doFilter(SolrDispatchFilter.java:326)
   [junit4]   2> 	at org.eclipse.jetty.servlet.ServletHandler$CachedChain.doFilter(ServletHandler.java:1759)
   [junit4]   2> 	at org.apache.solr.client.solrj.embedded.JettySolrRunner$DebugFilter.doFilter(JettySolrRunner.java:139)
   [junit4]   2> 	at org.eclipse.jetty.servlet.ServletHandler$CachedChain.doFilter(ServletHandler.java:1759)
   [junit4]   2> 	at org.eclipse.jetty.servlet.ServletHandler.doHandle(ServletHandler.java:582)
   [junit4]   2> 	at org.eclipse.jetty.server.session.SessionHandler.doHandle(SessionHandler.java:224)
   [junit4]   2> 	at org.eclipse.jetty.server.handler.ContextHandler.doHandle(ContextHandler.java:1180)
   [junit4]   2> 	at org.eclipse.jetty.servlet.ServletHandler.doScope(ServletHandler.java:512)
   [junit4]   2> 	at org.eclipse.jetty.server.session.SessionHandler.doScope(SessionHandler.java:185)
   [junit4]   2> 	at org.eclipse.jetty.server.handler.ContextHandler.doScope(ContextHandler.java:1112)
   [junit4]   2> 	at org.eclipse.jetty.server.handler.ScopedHandler.handle(ScopedHandler.java:141)
   [junit4]   2> 	at org.eclipse.jetty.server.handler.gzip.GzipHandler.handle(GzipHandler.java:426)
   [junit4]   2> 	at org.eclipse.jetty.server.handler.HandlerWrapper.handle(HandlerWrapper.java:134)
   [junit4]   2> 	at org.eclipse.jetty.server.Server.handle(Server.java:534)
   [junit4]   2> 	at org.eclipse.jetty.server.HttpChannel.handle(HttpChannel.java:320)
   [junit4]   2> 	at org.eclipse.jetty.server.HttpConnection.onFillable(HttpConnection.java:251)
   [junit4]   2> 	at org.eclipse.jetty.io.AbstractConnection$ReadCallback.succeeded(AbstractConnection.java:283)
   [junit4]   2> 	at org.eclipse.jetty.io.FillInterest.fillable(FillInterest.java:108)
   [junit4]   2> 	at org.eclipse.jetty.io.SelectChannelEndPoint$2.run(SelectChannelEndPoint.java:93)
   [junit4]   2> 	at org.eclipse.jetty.util.thread.strategy.ExecuteProduceConsume.executeProduceConsume(ExecuteProduceConsume.java:303)
   [junit4]   2> 	at org.eclipse.jetty.util.thread.strategy.ExecuteProduceConsume.produceConsume(ExecuteProduceConsume.java:148)
   [junit4]   2> 	at org.eclipse.jetty.util.thread.strategy.ExecuteProduceConsume.run(ExecuteProduceConsume.java:136)
   [junit4]   2> 	at org.eclipse.jetty.util.thread.QueuedThreadPool.runJob(QueuedThreadPool.java:671)
   [junit4]   2> 	at org.eclipse.jetty.util.thread.QueuedThreadPool$2.run(QueuedThreadPool.java:589)
   [junit4]   2> 	at java.lang.Thread.run(Thread.java:748)
   [junit4]   2> Caused by: org.apache.solr.common.SolrException: Unable to create core [routeFieldColl_shard2_replica_n6]
   [junit4]   2> 	at org.apache.solr.core.CoreContainer.createFromDescriptor(CoreContainer.java:1018)
   [junit4]   2> 	at org.apache.solr.core.CoreContainer.create(CoreContainer.java:938)
   [junit4]   2> 	... 34 more
   [junit4]   2> Caused by: org.apache.solr.common.SolrException: invalid API spec: apispec/core.SchemaEdit.json
   [junit4]   2> 	at org.apache.solr.core.SolrCore.<init>(SolrCore.java:988)
   [junit4]   2> 	at org.apache.solr.core.SolrCore.<init>(SolrCore.java:843)
   [junit4]   2> 	at org.apache.solr.core.CoreContainer.createFromDescriptor(CoreContainer.java:1002)
   [junit4]   2> 	... 35 more
   [junit4]   2> Caused by: java.lang.RuntimeException: invalid API spec: apispec/core.SchemaEdit.json
   [junit4]   2> 	at org.apache.solr.common.util.ValidatingJsonMap.parse(ValidatingJsonMap.java:318)
   [junit4]   2> 	at org.apache.solr.common.util.Utils.lambda$getSpec$0(Utils.java:394)
   [junit4]   2> 	at org.apache.solr.api.Api.getSpec(Api.java:65)
   [junit4]   2> 	at org.apache.solr.api.ApiBag.register(ApiBag.java:73)
   [junit4]   2> 	at org.apache.solr.core.PluginBag.put(PluginBag.java:217)
   [junit4]   2> 	at org.apache.solr.core.PluginBag.init(PluginBag.java:274)
   [junit4]   2> 	at org.apache.solr.core.RequestHandlers.initHandlersFromConfig(RequestHandlers.java:130)
   [junit4]   2> 	at org.apache.solr.core.SolrCore.<init>(SolrCore.java:946)
   [junit4]   2> 	... 37 more
   [junit4]   2> 
   [junit4]   2> 2127980 ERROR (OverseerThreadFactory-6784-thread-5-processing-n:127.0.0.1:49497_solr) [n:127.0.0.1:49497_solr    ] o.a.s.c.OverseerCollectionMessageHandler Error from shard: http://127.0.0.1:49497/solr
   [junit4]   2> org.apache.solr.client.solrj.impl.HttpSolrClient$RemoteSolrException: Error from server at http://127.0.0.1:49497/solr: Error CREATEing SolrCore 'routeFieldColl_shard2_replica_n6': Unable to create core [routeFieldColl_shard2_replica_n6] Caused by: invalid API spec: apispec/core.SchemaEdit.json
   [junit4]   2> 	at org.apache.solr.client.solrj.impl.HttpSolrClient.executeMethod(HttpSolrClient.java:627)
   [junit4]   2> 	at org.apache.solr.client.solrj.impl.HttpSolrClient.request(HttpSolrClient.java:253)
   [junit4]   2> 	at org.apache.solr.client.solrj.impl.HttpSolrClient.request(HttpSolrClient.java:242)
   [junit4]   2> 	at org.apache.solr.client.solrj.SolrClient.request(SolrClient.java:1219)
   [junit4]   2> 	at org.apache.solr.handler.component.HttpShardHandler.lambda$submit$0(HttpShardHandler.java:172)
   [junit4]   2> 	at java.util.concurrent.FutureTask.run(FutureTask.java:266)
   [junit4]   2> 	at java.util.concurrent.Executors$RunnableAdapter.call(Executors.java:511)
   [junit4]   2> 	at java.util.concurrent.FutureTask.run(FutureTask.java:266)
   [junit4]   2> 	at com.codahale.metrics.InstrumentedExecutorService$InstrumentedRunnable.run(InstrumentedExecutorService.java:176)
   [junit4]   2> 	at org.apache.solr.common.util.ExecutorUtil$MDCAwareThreadPoolExecutor.lambda$execute$0(ExecutorUtil.java:188)
   [junit4]   2> 	at java.util.concurrent.ThreadPoolExecutor.runWorker(ThreadPoolExecutor.java:1149)
   [junit4]   2> 	at java.util.concurrent.ThreadPoolExecutor$Worker.run(ThreadPoolExecutor.java:624)
   [junit4]   2> 	at java.lang.Thread.run(Thread.java:748)
   [junit4]   2> 2127988 ERROR (qtp1449774006-17693) [n:127.0.0.1:49501_solr c:routeFieldColl s:shard4 r:core_node15 x:routeFieldColl_shard4_replica_n12] o.a.s.h.RequestHandlerBase org.apache.solr.common.SolrException: Error CREATEing SolrCore 'routeFieldColl_shard4_replica_n12': Unable to create core [routeFieldColl_shard4_replica_n12] Caused by: invalid API spec: apispec/core.SchemaEdit.json
   [junit4]   2> 	at org.apache.solr.core.CoreContainer.create(CoreContainer.java:971)
   [junit4]   2> 	at org.apache.solr.handler.admin.CoreAdminOperation.lambda$static$0(CoreAdminOperation.java:91)
   [junit4]   2> 	at org.apache.solr.handler.admin.CoreAdminOperation.execute(CoreAdminOperation.java:384)
   [junit4]   2> 	at org.apache.solr.handler.admin.CoreAdminHandler$CallInfo.call(CoreAdminHandler.java:389)
   [junit4]   2> 	at org.apache.solr.handler.admin.CoreAdminHandler.handleRequestBody(CoreAdminHandler.java:174)
   [junit4]   2> 	at org.apache.solr.handler.RequestHandlerBase.handleRequest(RequestHandlerBase.java:177)
   [junit4]   2> 	at org.apache.solr.servlet.HttpSolrCall.handleAdmin(HttpSolrCall.java:745)
   [junit4]   2> 	at org.apache.solr.servlet.HttpSolrCall.handleAdminRequest(HttpSolrCall.java:726)
   [junit4]   2> 	at org.apache.solr.servlet.HttpSolrCall.call(HttpSolrCall.java:507)
   [junit4]   2> 	at org.apache.solr.servlet.SolrDispatchFilter.doFilter(SolrDispatchFilter.java:382)
   [junit4]   2> 	at org.apache.solr.servlet.SolrDispatchFilter.doFilter(SolrDispatchFilter.java:326)
   [junit4]   2> 	at org.eclipse.jetty.servlet.ServletHandler$CachedChain.doFilter(ServletHandler.java:1759)
   [junit4]   2> 	at org.apache.solr.client.solrj.embedded.JettySolrRunner$DebugFilter.doFilter(JettySolrRunner.java:139)
   [junit4]   2> 	at org.eclipse.jetty.servlet.ServletHandler$CachedChain.doFilter(ServletHandler.java:1759)
   [junit4]   2> 	at org.eclipse.jetty.servlet.ServletHandler.doHandle(ServletHandler.java:582)
   [junit4]   2> 	at org.eclipse.jetty.server.session.SessionHandler.doHandle(SessionHandler.java:224)
   [junit4]   2> 	at org.eclipse.jetty.server.handler.ContextHandler.doHandle(ContextHandler.java:1180)
   [junit4]   2> 	at org.eclipse.jetty.servlet.ServletHandler.doScope(ServletHandler.java:512)
   [junit4]   2> 	at org.eclipse.jetty.server.session.SessionHandler.doScope(SessionHandler.java:185)
   [junit4]   2> 	at org.eclipse.jetty.server.handler.ContextHandler.doScope(ContextHandler.java:1112)
   [junit4]   2> 	at org.eclipse.jetty.server.handler.ScopedHandler.handle(ScopedHandler.java:141)
   [junit4]   2> 	at org.eclipse.jetty.server.handler.gzip.GzipHandler.handle(GzipHandler.java:426)
   [junit4]   2> 	at org.eclipse.jetty.server.handler.HandlerWrapper.handle(HandlerWrapper.java:134)
   [junit4]   2> 	at org.eclipse.jetty.server.Server.handle(Server.java:534)
   [junit4]   2> 	at org.eclipse.jetty.server.HttpChannel.handle(HttpChannel.java:320)
   [junit4]   2> 	at org.eclipse.jetty.server.HttpConnection.onFillable(HttpConnection.java:251)
   [junit4]   2> 	at org.eclipse.jetty.io.AbstractConnection$ReadCallback.succeeded(AbstractConnection.java:283)
   [junit4]   2> 	at org.eclipse.jetty.io.FillInterest.fillable(FillInterest.java:108)
   [junit4]   2> 	at org.eclipse.jetty.io.SelectChannelEndPoint$2.run(SelectChannelEndPoint.java:93)
   [junit4]   2> 	at org.eclipse.jetty.util.thread.strategy.ExecuteProduceConsume.executeProduceConsume(ExecuteProduceConsume.java:303)
   [junit4]   2> 	at org.eclipse.jetty.util.thread.strategy.ExecuteProduceConsume.produceConsume(ExecuteProduceConsume.java:148)
   [junit4]   2> 	at org.eclipse.jetty.util.thread.strategy.ExecuteProduceConsume.run(ExecuteProduceConsume.java:136)
   [junit4]   2> 	at org.eclipse.jetty.util.thread.QueuedThreadPool.runJob(QueuedThreadPool.java:671)
   [junit4]   2> 	at org.eclipse.jetty.util.thread.QueuedThreadPool$2.run(QueuedThreadPool.java:589)
   [junit4]   2> 	at java.lang.Thread.run(Thread.java:748)
   [junit4]   2> Caused by: org.apache.solr.common.SolrException: Unable to create core [routeFieldColl_shard4_replica_n12]
   [junit4]   2> 	at org.apache.solr.core.CoreContainer.createFromDescriptor(CoreContainer.java:1018)
   [junit4]   2> 	at org.apache.solr.core.CoreContainer.create(CoreContainer.java:938)
   [junit4]   2> 	... 34 more
   [junit4]   2> Caused by: org.apache.solr.common.SolrException: invalid API spec: apispec/core.SchemaEdit.json
   [junit4]   2> 	at org.apache.solr.core.SolrCore.<init>(SolrCore.java:988)
   [junit4]   2> 	at org.apache.solr.core.SolrCore.<init>(SolrCore.java:843)
   [junit4]   2> 	at org.apache.solr.core.CoreContainer.createFromDescriptor(CoreContainer.java:1002)
   [junit4]   2> 	... 35 more
   [junit4]   2> Caused by: java.lang.RuntimeException: invalid API spec: apispec/core.SchemaEdit.json
   [junit4]   2> 	at org.apache.solr.common.util.ValidatingJsonMap.parse(ValidatingJsonMap.java:318)
   [junit4]   2> 	at org.apache.solr.common.util.Utils.lambda$getSpec$0(Utils.java:394)
   [junit4]   2> 	at org.apache.solr.api.Api.getSpec(Api.java:65)
   [junit4]   2> 	at org.apache.solr.api.ApiBag.register(ApiBag.java:73)
   [junit4]   2> 	at org.apache.solr.core.PluginBag.put(PluginBag.java:217)
   [junit4]   2> 	at org.apache.solr.core.PluginBag.init(PluginBag.java:274)
   [junit4]   2> 	at org.apache.solr.core.RequestHandlers.initHandlersFromConfig(RequestHandlers.java:130)
   [junit4]   2> 	at org.apache.solr.core.SolrCore.<init>(SolrCore.java:946)
   [junit4]   2> 	... 37 more
   [junit4]   2> 
   [junit4]   2> 2127989 ERROR (OverseerThreadFactory-6784-thread-5-processing-n:127.0.0.1:49497_solr) [n:127.0.0.1:49497_solr    ] o.a.s.c.OverseerCollectionMessageHandler Error from shard: http://127.0.0.1:49501/solr
   [junit4]   2> org.apache.solr.client.solrj.impl.HttpSolrClient$RemoteSolrException: Error from server at http://127.0.0.1:49501/solr: Error CREATEing SolrCore 'routeFieldColl_shard4_replica_n12': Unable to create core [routeFieldColl_sha

[...truncated too long message...]

s/jenkins/workspace/Lucene-Solr-master-MacOSX/solr/core/src/test/org/apache/solr/handler/component/DistributedDebugComponentTest.java (at line 221)
 [ecj-lint] 	throw new AssertionError(q.toString() + ": " + e.getMessage(), e);
 [ecj-lint] 	^^^^^^^^^^^^^^^^^^^^^^^^^^^^^^^^^^^^^^^^^^^^^^^^^^^^^^^^^^^^^^^^^^
 [ecj-lint] Resource leak: 'client' is not closed at this location
 [ecj-lint] ----------
 [ecj-lint] ----------
 [ecj-lint] 9. WARNING in /Users/jenkins/workspace/Lucene-Solr-master-MacOSX/solr/core/src/test/org/apache/solr/highlight/HighlighterTest.java (at line 204)
 [ecj-lint] 	Analyzer a1 = new WhitespaceAnalyzer();
 [ecj-lint] 	         ^^
 [ecj-lint] Resource leak: 'a1' is never closed
 [ecj-lint] ----------
 [ecj-lint] 10. WARNING in /Users/jenkins/workspace/Lucene-Solr-master-MacOSX/solr/core/src/test/org/apache/solr/highlight/HighlighterTest.java (at line 207)
 [ecj-lint] 	OffsetWindowTokenFilter tots = new OffsetWindowTokenFilter(tokenStream);
 [ecj-lint] 	                        ^^^^
 [ecj-lint] Resource leak: 'tots' is never closed
 [ecj-lint] ----------
 [ecj-lint] 11. WARNING in /Users/jenkins/workspace/Lucene-Solr-master-MacOSX/solr/core/src/test/org/apache/solr/highlight/HighlighterTest.java (at line 211)
 [ecj-lint] 	Analyzer a2 = new WhitespaceAnalyzer();
 [ecj-lint] 	         ^^
 [ecj-lint] Resource leak: 'a2' is never closed
 [ecj-lint] ----------
 [ecj-lint] ----------
 [ecj-lint] 12. WARNING in /Users/jenkins/workspace/Lucene-Solr-master-MacOSX/solr/core/src/test/org/apache/solr/response/TestJavabinTupleStreamParser.java (at line 72)
 [ecj-lint] 	JavabinTupleStreamParser parser = new JavabinTupleStreamParser(new ByteArrayInputStream(bytes), true);
 [ecj-lint] 	                         ^^^^^^
 [ecj-lint] Resource leak: 'parser' is never closed
 [ecj-lint] ----------
 [ecj-lint] ----------
 [ecj-lint] 13. WARNING in /Users/jenkins/workspace/Lucene-Solr-master-MacOSX/solr/core/src/test/org/apache/solr/search/TestDocSet.java (at line 243)
 [ecj-lint] 	return loadfactor!=0 ? new HashDocSet(a,0,n,1/loadfactor) : new HashDocSet(a,0,n);
 [ecj-lint] 	                       ^^^^^^^^^^^^^^^^^^^^^^^^^^^^^^^^^^
 [ecj-lint] Resource leak: '<unassigned Closeable value>' is never closed
 [ecj-lint] ----------
 [ecj-lint] 14. WARNING in /Users/jenkins/workspace/Lucene-Solr-master-MacOSX/solr/core/src/test/org/apache/solr/search/TestDocSet.java (at line 528)
 [ecj-lint] 	DocSet a = new BitDocSet(bs);
 [ecj-lint] 	       ^
 [ecj-lint] Resource leak: 'a' is never closed
 [ecj-lint] ----------
 [ecj-lint] ----------
 [ecj-lint] 15. WARNING in /Users/jenkins/workspace/Lucene-Solr-master-MacOSX/solr/core/src/test/org/apache/solr/security/TestPKIAuthenticationPlugin.java (at line 76)
 [ecj-lint] 	final MockPKIAuthenticationPlugin mock = new MockPKIAuthenticationPlugin(null, nodeName);
 [ecj-lint] 	                                  ^^^^
 [ecj-lint] Resource leak: 'mock' is never closed
 [ecj-lint] ----------
 [ecj-lint] 16. WARNING in /Users/jenkins/workspace/Lucene-Solr-master-MacOSX/solr/core/src/test/org/apache/solr/security/TestPKIAuthenticationPlugin.java (at line 131)
 [ecj-lint] 	MockPKIAuthenticationPlugin mock1 = new MockPKIAuthenticationPlugin(null, nodeName) {
 [ecj-lint] 	                            ^^^^^
 [ecj-lint] Resource leak: 'mock1' is never closed
 [ecj-lint] ----------
 [ecj-lint] ----------
 [ecj-lint] 17. WARNING in /Users/jenkins/workspace/Lucene-Solr-master-MacOSX/solr/core/src/test/org/apache/solr/security/TestRuleBasedAuthorizationPlugin.java (at line 380)
 [ecj-lint] 	RuleBasedAuthorizationPlugin plugin = new RuleBasedAuthorizationPlugin();
 [ecj-lint] 	                             ^^^^^^
 [ecj-lint] Resource leak: 'plugin' is never closed
 [ecj-lint] ----------
 [ecj-lint] ----------
 [ecj-lint] 18. WARNING in /Users/jenkins/workspace/Lucene-Solr-master-MacOSX/solr/core/src/test/org/apache/solr/security/TestSha256AuthenticationProvider.java (at line 49)
 [ecj-lint] 	BasicAuthPlugin basicAuthPlugin = new BasicAuthPlugin();
 [ecj-lint] 	                ^^^^^^^^^^^^^^^
 [ecj-lint] Resource leak: 'basicAuthPlugin' is never closed
 [ecj-lint] ----------
 [ecj-lint] ----------
 [ecj-lint] 19. WARNING in /Users/jenkins/workspace/Lucene-Solr-master-MacOSX/solr/core/src/test/org/apache/solr/spelling/SimpleQueryConverter.java (at line 42)
 [ecj-lint] 	WhitespaceAnalyzer analyzer = new WhitespaceAnalyzer();
 [ecj-lint] 	                   ^^^^^^^^
 [ecj-lint] Resource leak: 'analyzer' is never closed
 [ecj-lint] ----------
 [ecj-lint] ----------
 [ecj-lint] 20. WARNING in /Users/jenkins/workspace/Lucene-Solr-master-MacOSX/solr/core/src/test/org/apache/solr/uninverting/TestFieldCacheVsDocValues.java (at line 139)
 [ecj-lint] 	IndexWriter w = new IndexWriter(d, newIndexWriterConfig(analyzer));
 [ecj-lint] 	            ^
 [ecj-lint] Resource leak: 'w' is never closed
 [ecj-lint] ----------
 [ecj-lint] 21. WARNING in /Users/jenkins/workspace/Lucene-Solr-master-MacOSX/solr/core/src/test/org/apache/solr/uninverting/TestFieldCacheVsDocValues.java (at line 172)
 [ecj-lint] 	throw iae;
 [ecj-lint] 	^^^^^^^^^^
 [ecj-lint] Resource leak: 'w' is not closed at this location
 [ecj-lint] ----------
 [ecj-lint] 22. WARNING in /Users/jenkins/workspace/Lucene-Solr-master-MacOSX/solr/core/src/test/org/apache/solr/uninverting/TestFieldCacheVsDocValues.java (at line 178)
 [ecj-lint] 	return;
 [ecj-lint] 	^^^^^^^
 [ecj-lint] Resource leak: 'w' is not closed at this location
 [ecj-lint] ----------
 [ecj-lint] ----------
 [ecj-lint] 23. WARNING in /Users/jenkins/workspace/Lucene-Solr-master-MacOSX/solr/core/src/test/org/apache/solr/update/SolrCmdDistributorTest.java (at line 134)
 [ecj-lint] 	SolrCmdDistributor cmdDistrib = new SolrCmdDistributor(updateShardHandler);
 [ecj-lint] 	                   ^^^^^^^^^^
 [ecj-lint] Resource leak: 'cmdDistrib' is never closed
 [ecj-lint] ----------
 [ecj-lint] 24. WARNING in /Users/jenkins/workspace/Lucene-Solr-master-MacOSX/solr/core/src/test/org/apache/solr/update/SolrCmdDistributorTest.java (at line 333)
 [ecj-lint] 	SolrCmdDistributor cmdDistrib = new SolrCmdDistributor(streamingClients, 5, 0);
 [ecj-lint] 	                   ^^^^^^^^^^
 [ecj-lint] Resource leak: 'cmdDistrib' is never closed
 [ecj-lint] ----------
 [ecj-lint] 25. WARNING in /Users/jenkins/workspace/Lucene-Solr-master-MacOSX/solr/core/src/test/org/apache/solr/update/SolrCmdDistributorTest.java (at line 367)
 [ecj-lint] 	SolrCmdDistributor cmdDistrib = new SolrCmdDistributor(streamingClients, 5, 0);
 [ecj-lint] 	                   ^^^^^^^^^^
 [ecj-lint] Resource leak: 'cmdDistrib' is never closed
 [ecj-lint] ----------
 [ecj-lint] 26. WARNING in /Users/jenkins/workspace/Lucene-Solr-master-MacOSX/solr/core/src/test/org/apache/solr/update/SolrCmdDistributorTest.java (at line 413)
 [ecj-lint] 	SolrCmdDistributor cmdDistrib = new SolrCmdDistributor(streamingClients, 5, 0);
 [ecj-lint] 	                   ^^^^^^^^^^
 [ecj-lint] Resource leak: 'cmdDistrib' is never closed
 [ecj-lint] ----------
 [ecj-lint] 27. WARNING in /Users/jenkins/workspace/Lucene-Solr-master-MacOSX/solr/core/src/test/org/apache/solr/update/SolrCmdDistributorTest.java (at line 458)
 [ecj-lint] 	SolrCmdDistributor cmdDistrib = new SolrCmdDistributor(updateShardHandler);
 [ecj-lint] 	                   ^^^^^^^^^^
 [ecj-lint] Resource leak: 'cmdDistrib' is never closed
 [ecj-lint] ----------
 [ecj-lint] 28. WARNING in /Users/jenkins/workspace/Lucene-Solr-master-MacOSX/solr/core/src/test/org/apache/solr/update/SolrCmdDistributorTest.java (at line 516)
 [ecj-lint] 	SolrCmdDistributor cmdDistrib = new SolrCmdDistributor(updateShardHandler);
 [ecj-lint] 	                   ^^^^^^^^^^
 [ecj-lint] Resource leak: 'cmdDistrib' is never closed
 [ecj-lint] ----------
 [ecj-lint] ----------
 [ecj-lint] 29. WARNING in /Users/jenkins/workspace/Lucene-Solr-master-MacOSX/solr/core/src/test/org/apache/solr/update/SolrIndexSplitterTest.java (at line 181)
 [ecj-lint] 	EmbeddedSolrServer server1 = new EmbeddedSolrServer(h.getCoreContainer(), "split1");
 [ecj-lint] 	                   ^^^^^^^
 [ecj-lint] Resource leak: 'server1' is never closed
 [ecj-lint] ----------
 [ecj-lint] 30. WARNING in /Users/jenkins/workspace/Lucene-Solr-master-MacOSX/solr/core/src/test/org/apache/solr/update/SolrIndexSplitterTest.java (at line 182)
 [ecj-lint] 	EmbeddedSolrServer server2 = new EmbeddedSolrServer(h.getCoreContainer(), "split2");
 [ecj-lint] 	                   ^^^^^^^
 [ecj-lint] Resource leak: 'server2' is never closed
 [ecj-lint] ----------
 [ecj-lint] ----------
 [ecj-lint] 31. WARNING in /Users/jenkins/workspace/Lucene-Solr-master-MacOSX/solr/core/src/test/org/apache/solr/update/processor/RecordingUpdateProcessorFactory.java (at line 67)
 [ecj-lint] 	return recording ? new RecordingUpdateRequestProcessor(commandQueue, next) : next;
 [ecj-lint] 	                   ^^^^^^^^^^^^^^^^^^^^^^^^^^^^^^^^^^^^^^^^^^^^^^^^^^^^^^^
 [ecj-lint] Resource leak: '<unassigned Closeable value>' is never closed
 [ecj-lint] ----------
 [ecj-lint] 31 problems (1 error, 30 warnings)

BUILD FAILED
/Users/jenkins/workspace/Lucene-Solr-master-MacOSX/build.xml:810: The following error occurred while executing this line:
/Users/jenkins/workspace/Lucene-Solr-master-MacOSX/build.xml:101: The following error occurred while executing this line:
/Users/jenkins/workspace/Lucene-Solr-master-MacOSX/solr/build.xml:689: The following error occurred while executing this line:
/Users/jenkins/workspace/Lucene-Solr-master-MacOSX/lucene/common-build.xml:2013: The following error occurred while executing this line:
/Users/jenkins/workspace/Lucene-Solr-master-MacOSX/lucene/common-build.xml:2046: Compile failed; see the compiler error output for details.

Total time: 87 minutes 41 seconds
Build step 'Invoke Ant' marked build as failure
Archiving artifacts
[WARNINGS] Skipping publisher since build result is FAILURE
Recording test results
Email was triggered for: Failure - Any
Sending email for trigger: Failure - Any

Mime
View raw message