lucene-dev mailing list archives

Site index · List index
Message view « Date » · « Thread »
Top « Date » · « Thread »
From Policeman Jenkins Server <jenk...@thetaphi.de>
Subject [JENKINS] Lucene-Solr-master-Linux (64bit/jdk1.8.0_144) - Build # 20362 - Still Failing!
Date Wed, 23 Aug 2017 10:46:53 GMT
Build: https://jenkins.thetaphi.de/job/Lucene-Solr-master-Linux/20362/
Java: 64bit/jdk1.8.0_144 -XX:-UseCompressedOops -XX:+UseConcMarkSweepGC

2 tests failed.
FAILED:  junit.framework.TestSuite.org.apache.solr.cloud.TestSolrCloudWithSecureImpersonation

Error Message:
2 threads leaked from SUITE scope at org.apache.solr.cloud.TestSolrCloudWithSecureImpersonation:     1) Thread[id=10782, name=jetty-launcher-1401-thread-1-EventThread, state=TIMED_WAITING, group=TGRP-TestSolrCloudWithSecureImpersonation]         at sun.misc.Unsafe.park(Native Method)         at java.util.concurrent.locks.LockSupport.parkNanos(LockSupport.java:215)         at java.util.concurrent.locks.AbstractQueuedSynchronizer.doAcquireSharedNanos(AbstractQueuedSynchronizer.java:1037)         at java.util.concurrent.locks.AbstractQueuedSynchronizer.tryAcquireSharedNanos(AbstractQueuedSynchronizer.java:1328)         at java.util.concurrent.CountDownLatch.await(CountDownLatch.java:277)         at org.apache.curator.CuratorZookeeperClient.internalBlockUntilConnectedOrTimedOut(CuratorZookeeperClient.java:323)         at org.apache.curator.RetryLoop.callWithRetry(RetryLoop.java:105)         at org.apache.curator.framework.imps.GetDataBuilderImpl.pathInForeground(GetDataBuilderImpl.java:288)         at org.apache.curator.framework.imps.GetDataBuilderImpl.forPath(GetDataBuilderImpl.java:279)         at org.apache.curator.framework.imps.GetDataBuilderImpl.forPath(GetDataBuilderImpl.java:41)         at org.apache.curator.framework.recipes.shared.SharedValue.readValue(SharedValue.java:244)         at org.apache.curator.framework.recipes.shared.SharedValue.access$100(SharedValue.java:44)         at org.apache.curator.framework.recipes.shared.SharedValue$1.process(SharedValue.java:61)         at org.apache.curator.framework.imps.NamespaceWatcher.process(NamespaceWatcher.java:67)         at org.apache.zookeeper.ClientCnxn$EventThread.processEvent(ClientCnxn.java:530)         at org.apache.zookeeper.ClientCnxn$EventThread.run(ClientCnxn.java:505)    2) Thread[id=10792, name=jetty-launcher-1401-thread-2-EventThread, state=TIMED_WAITING, group=TGRP-TestSolrCloudWithSecureImpersonation]         at sun.misc.Unsafe.park(Native Method)         at java.util.concurrent.locks.LockSupport.parkNanos(LockSupport.java:215)         at java.util.concurrent.locks.AbstractQueuedSynchronizer.doAcquireSharedNanos(AbstractQueuedSynchronizer.java:1037)         at java.util.concurrent.locks.AbstractQueuedSynchronizer.tryAcquireSharedNanos(AbstractQueuedSynchronizer.java:1328)         at java.util.concurrent.CountDownLatch.await(CountDownLatch.java:277)         at org.apache.curator.CuratorZookeeperClient.internalBlockUntilConnectedOrTimedOut(CuratorZookeeperClient.java:323)         at org.apache.curator.RetryLoop.callWithRetry(RetryLoop.java:105)         at org.apache.curator.framework.imps.GetDataBuilderImpl.pathInForeground(GetDataBuilderImpl.java:288)         at org.apache.curator.framework.imps.GetDataBuilderImpl.forPath(GetDataBuilderImpl.java:279)         at org.apache.curator.framework.imps.GetDataBuilderImpl.forPath(GetDataBuilderImpl.java:41)         at org.apache.curator.framework.recipes.shared.SharedValue.readValue(SharedValue.java:244)         at org.apache.curator.framework.recipes.shared.SharedValue.access$100(SharedValue.java:44)         at org.apache.curator.framework.recipes.shared.SharedValue$1.process(SharedValue.java:61)         at org.apache.curator.framework.imps.NamespaceWatcher.process(NamespaceWatcher.java:67)         at org.apache.zookeeper.ClientCnxn$EventThread.processEvent(ClientCnxn.java:530)         at org.apache.zookeeper.ClientCnxn$EventThread.run(ClientCnxn.java:505)

Stack Trace:
com.carrotsearch.randomizedtesting.ThreadLeakError: 2 threads leaked from SUITE scope at org.apache.solr.cloud.TestSolrCloudWithSecureImpersonation: 
   1) Thread[id=10782, name=jetty-launcher-1401-thread-1-EventThread, state=TIMED_WAITING, group=TGRP-TestSolrCloudWithSecureImpersonation]
        at sun.misc.Unsafe.park(Native Method)
        at java.util.concurrent.locks.LockSupport.parkNanos(LockSupport.java:215)
        at java.util.concurrent.locks.AbstractQueuedSynchronizer.doAcquireSharedNanos(AbstractQueuedSynchronizer.java:1037)
        at java.util.concurrent.locks.AbstractQueuedSynchronizer.tryAcquireSharedNanos(AbstractQueuedSynchronizer.java:1328)
        at java.util.concurrent.CountDownLatch.await(CountDownLatch.java:277)
        at org.apache.curator.CuratorZookeeperClient.internalBlockUntilConnectedOrTimedOut(CuratorZookeeperClient.java:323)
        at org.apache.curator.RetryLoop.callWithRetry(RetryLoop.java:105)
        at org.apache.curator.framework.imps.GetDataBuilderImpl.pathInForeground(GetDataBuilderImpl.java:288)
        at org.apache.curator.framework.imps.GetDataBuilderImpl.forPath(GetDataBuilderImpl.java:279)
        at org.apache.curator.framework.imps.GetDataBuilderImpl.forPath(GetDataBuilderImpl.java:41)
        at org.apache.curator.framework.recipes.shared.SharedValue.readValue(SharedValue.java:244)
        at org.apache.curator.framework.recipes.shared.SharedValue.access$100(SharedValue.java:44)
        at org.apache.curator.framework.recipes.shared.SharedValue$1.process(SharedValue.java:61)
        at org.apache.curator.framework.imps.NamespaceWatcher.process(NamespaceWatcher.java:67)
        at org.apache.zookeeper.ClientCnxn$EventThread.processEvent(ClientCnxn.java:530)
        at org.apache.zookeeper.ClientCnxn$EventThread.run(ClientCnxn.java:505)
   2) Thread[id=10792, name=jetty-launcher-1401-thread-2-EventThread, state=TIMED_WAITING, group=TGRP-TestSolrCloudWithSecureImpersonation]
        at sun.misc.Unsafe.park(Native Method)
        at java.util.concurrent.locks.LockSupport.parkNanos(LockSupport.java:215)
        at java.util.concurrent.locks.AbstractQueuedSynchronizer.doAcquireSharedNanos(AbstractQueuedSynchronizer.java:1037)
        at java.util.concurrent.locks.AbstractQueuedSynchronizer.tryAcquireSharedNanos(AbstractQueuedSynchronizer.java:1328)
        at java.util.concurrent.CountDownLatch.await(CountDownLatch.java:277)
        at org.apache.curator.CuratorZookeeperClient.internalBlockUntilConnectedOrTimedOut(CuratorZookeeperClient.java:323)
        at org.apache.curator.RetryLoop.callWithRetry(RetryLoop.java:105)
        at org.apache.curator.framework.imps.GetDataBuilderImpl.pathInForeground(GetDataBuilderImpl.java:288)
        at org.apache.curator.framework.imps.GetDataBuilderImpl.forPath(GetDataBuilderImpl.java:279)
        at org.apache.curator.framework.imps.GetDataBuilderImpl.forPath(GetDataBuilderImpl.java:41)
        at org.apache.curator.framework.recipes.shared.SharedValue.readValue(SharedValue.java:244)
        at org.apache.curator.framework.recipes.shared.SharedValue.access$100(SharedValue.java:44)
        at org.apache.curator.framework.recipes.shared.SharedValue$1.process(SharedValue.java:61)
        at org.apache.curator.framework.imps.NamespaceWatcher.process(NamespaceWatcher.java:67)
        at org.apache.zookeeper.ClientCnxn$EventThread.processEvent(ClientCnxn.java:530)
        at org.apache.zookeeper.ClientCnxn$EventThread.run(ClientCnxn.java:505)
	at __randomizedtesting.SeedInfo.seed([DDD9A826DE34A0B3]:0)


FAILED:  org.apache.solr.cloud.HttpPartitionTest.test

Error Message:
Doc with id=1 not found in http://127.0.0.1:44893/collMinRf_1x3 due to: Path not found: /id; rsp={doc=null}

Stack Trace:
java.lang.AssertionError: Doc with id=1 not found in http://127.0.0.1:44893/collMinRf_1x3 due to: Path not found: /id; rsp={doc=null}
	at __randomizedtesting.SeedInfo.seed([DDD9A826DE34A0B3:558D97FC70C8CD4B]:0)
	at org.junit.Assert.fail(Assert.java:93)
	at org.junit.Assert.assertTrue(Assert.java:43)
	at org.apache.solr.cloud.HttpPartitionTest.assertDocExists(HttpPartitionTest.java:603)
	at org.apache.solr.cloud.HttpPartitionTest.assertDocsExistInAllReplicas(HttpPartitionTest.java:558)
	at org.apache.solr.cloud.HttpPartitionTest.testMinRf(HttpPartitionTest.java:249)
	at org.apache.solr.cloud.HttpPartitionTest.test(HttpPartitionTest.java:127)
	at sun.reflect.NativeMethodAccessorImpl.invoke0(Native Method)
	at sun.reflect.NativeMethodAccessorImpl.invoke(NativeMethodAccessorImpl.java:62)
	at sun.reflect.DelegatingMethodAccessorImpl.invoke(DelegatingMethodAccessorImpl.java:43)
	at java.lang.reflect.Method.invoke(Method.java:498)
	at com.carrotsearch.randomizedtesting.RandomizedRunner.invoke(RandomizedRunner.java:1713)
	at com.carrotsearch.randomizedtesting.RandomizedRunner$8.evaluate(RandomizedRunner.java:907)
	at com.carrotsearch.randomizedtesting.RandomizedRunner$9.evaluate(RandomizedRunner.java:943)
	at com.carrotsearch.randomizedtesting.RandomizedRunner$10.evaluate(RandomizedRunner.java:957)
	at org.apache.solr.BaseDistributedSearchTestCase$ShardsRepeatRule$ShardsFixedStatement.callStatement(BaseDistributedSearchTestCase.java:993)
	at org.apache.solr.BaseDistributedSearchTestCase$ShardsRepeatRule$ShardsStatement.evaluate(BaseDistributedSearchTestCase.java:968)
	at com.carrotsearch.randomizedtesting.rules.SystemPropertiesRestoreRule$1.evaluate(SystemPropertiesRestoreRule.java:57)
	at org.apache.lucene.util.TestRuleSetupTeardownChained$1.evaluate(TestRuleSetupTeardownChained.java:49)
	at org.apache.lucene.util.AbstractBeforeAfterRule$1.evaluate(AbstractBeforeAfterRule.java:45)
	at org.apache.lucene.util.TestRuleThreadAndTestName$1.evaluate(TestRuleThreadAndTestName.java:48)
	at org.apache.lucene.util.TestRuleIgnoreAfterMaxFailures$1.evaluate(TestRuleIgnoreAfterMaxFailures.java:64)
	at org.apache.lucene.util.TestRuleMarkFailure$1.evaluate(TestRuleMarkFailure.java:47)
	at com.carrotsearch.randomizedtesting.rules.StatementAdapter.evaluate(StatementAdapter.java:36)
	at com.carrotsearch.randomizedtesting.ThreadLeakControl$StatementRunner.run(ThreadLeakControl.java:368)
	at com.carrotsearch.randomizedtesting.ThreadLeakControl.forkTimeoutingTask(ThreadLeakControl.java:817)
	at com.carrotsearch.randomizedtesting.ThreadLeakControl$3.evaluate(ThreadLeakControl.java:468)
	at com.carrotsearch.randomizedtesting.RandomizedRunner.runSingleTest(RandomizedRunner.java:916)
	at com.carrotsearch.randomizedtesting.RandomizedRunner$5.evaluate(RandomizedRunner.java:802)
	at com.carrotsearch.randomizedtesting.RandomizedRunner$6.evaluate(RandomizedRunner.java:852)
	at com.carrotsearch.randomizedtesting.RandomizedRunner$7.evaluate(RandomizedRunner.java:863)
	at com.carrotsearch.randomizedtesting.rules.StatementAdapter.evaluate(StatementAdapter.java:36)
	at com.carrotsearch.randomizedtesting.rules.SystemPropertiesRestoreRule$1.evaluate(SystemPropertiesRestoreRule.java:57)
	at org.apache.lucene.util.AbstractBeforeAfterRule$1.evaluate(AbstractBeforeAfterRule.java:45)
	at com.carrotsearch.randomizedtesting.rules.StatementAdapter.evaluate(StatementAdapter.java:36)
	at org.apache.lucene.util.TestRuleStoreClassName$1.evaluate(TestRuleStoreClassName.java:41)
	at com.carrotsearch.randomizedtesting.rules.NoShadowingOrOverridesOnMethodsRule$1.evaluate(NoShadowingOrOverridesOnMethodsRule.java:40)
	at com.carrotsearch.randomizedtesting.rules.NoShadowingOrOverridesOnMethodsRule$1.evaluate(NoShadowingOrOverridesOnMethodsRule.java:40)
	at com.carrotsearch.randomizedtesting.rules.StatementAdapter.evaluate(StatementAdapter.java:36)
	at com.carrotsearch.randomizedtesting.rules.StatementAdapter.evaluate(StatementAdapter.java:36)
	at com.carrotsearch.randomizedtesting.rules.StatementAdapter.evaluate(StatementAdapter.java:36)
	at org.apache.lucene.util.TestRuleAssertionsRequired$1.evaluate(TestRuleAssertionsRequired.java:53)
	at org.apache.lucene.util.TestRuleMarkFailure$1.evaluate(TestRuleMarkFailure.java:47)
	at org.apache.lucene.util.TestRuleIgnoreAfterMaxFailures$1.evaluate(TestRuleIgnoreAfterMaxFailures.java:64)
	at org.apache.lucene.util.TestRuleIgnoreTestSuites$1.evaluate(TestRuleIgnoreTestSuites.java:54)
	at com.carrotsearch.randomizedtesting.rules.StatementAdapter.evaluate(StatementAdapter.java:36)
	at com.carrotsearch.randomizedtesting.ThreadLeakControl$StatementRunner.run(ThreadLeakControl.java:368)
	at java.lang.Thread.run(Thread.java:748)




Build Log:
[...truncated 11636 lines...]
   [junit4] Suite: org.apache.solr.cloud.TestSolrCloudWithSecureImpersonation
   [junit4]   2> Creating dataDir: /home/jenkins/workspace/Lucene-Solr-master-Linux/solr/build/solr-core/test/J2/temp/solr.cloud.TestSolrCloudWithSecureImpersonation_DDD9A826DE34A0B3-001/init-core-data-001
   [junit4]   2> 970855 WARN  (SUITE-TestSolrCloudWithSecureImpersonation-seed#[DDD9A826DE34A0B3]-worker) [    ] o.a.s.SolrTestCaseJ4 startTrackingSearchers: numOpens=93 numCloses=93
   [junit4]   2> 970855 INFO  (SUITE-TestSolrCloudWithSecureImpersonation-seed#[DDD9A826DE34A0B3]-worker) [    ] o.a.s.SolrTestCaseJ4 Using PointFields (NUMERIC_POINTS_SYSPROP=true) w/NUMERIC_DOCVALUES_SYSPROP=false
   [junit4]   2> 970856 INFO  (SUITE-TestSolrCloudWithSecureImpersonation-seed#[DDD9A826DE34A0B3]-worker) [    ] o.a.s.SolrTestCaseJ4 Randomized ssl (true) and clientAuth (true) via: @org.apache.solr.util.RandomizeSSL(reason=, value=NaN, ssl=NaN, clientAuth=NaN)
   [junit4]   2> 970857 INFO  (SUITE-TestSolrCloudWithSecureImpersonation-seed#[DDD9A826DE34A0B3]-worker) [    ] o.a.s.SolrTestCaseJ4 SecureRandom sanity checks: test.solr.allowed.securerandom=null & java.security.egd=file:/dev/./urandom
   [junit4]   2> 970870 INFO  (SUITE-TestSolrCloudWithSecureImpersonation-seed#[DDD9A826DE34A0B3]-worker) [    ] o.a.s.c.MiniSolrCloudCluster Starting cluster of 2 servers in /home/jenkins/workspace/Lucene-Solr-master-Linux/solr/build/solr-core/test/J2/temp/solr.cloud.TestSolrCloudWithSecureImpersonation_DDD9A826DE34A0B3-001/tempDir-001
   [junit4]   2> 970871 INFO  (SUITE-TestSolrCloudWithSecureImpersonation-seed#[DDD9A826DE34A0B3]-worker) [    ] o.a.s.c.ZkTestServer STARTING ZK TEST SERVER
   [junit4]   2> 970871 INFO  (Thread-4467) [    ] o.a.s.c.ZkTestServer client port:0.0.0.0/0.0.0.0:0
   [junit4]   2> 970871 INFO  (Thread-4467) [    ] o.a.s.c.ZkTestServer Starting server
   [junit4]   2> 970873 ERROR (Thread-4467) [    ] o.a.z.s.ZooKeeperServer ZKShutdownHandler is not registered, so ZooKeeper server won't take any action on ERROR or SHUTDOWN server state changes
   [junit4]   2> 970971 INFO  (SUITE-TestSolrCloudWithSecureImpersonation-seed#[DDD9A826DE34A0B3]-worker) [    ] o.a.s.c.ZkTestServer start zk server on port:45293
   [junit4]   2> 970975 INFO  (jetty-launcher-1401-thread-1) [    ] o.e.j.s.Server jetty-9.3.20.v20170531
   [junit4]   2> 970975 INFO  (jetty-launcher-1401-thread-2) [    ] o.e.j.s.Server jetty-9.3.20.v20170531
   [junit4]   2> 970985 INFO  (jetty-launcher-1401-thread-1) [    ] o.e.j.s.h.ContextHandler Started o.e.j.s.ServletContextHandler@f121dc5{/solr,null,AVAILABLE}
   [junit4]   2> 970987 INFO  (jetty-launcher-1401-thread-2) [    ] o.e.j.s.h.ContextHandler Started o.e.j.s.ServletContextHandler@b3880f6{/solr,null,AVAILABLE}
   [junit4]   2> 970987 INFO  (jetty-launcher-1401-thread-1) [    ] o.e.j.s.AbstractConnector Started ServerConnector@461e4cda{SSL,[ssl, http/1.1]}{127.0.0.1:45311}
   [junit4]   2> 970988 INFO  (jetty-launcher-1401-thread-1) [    ] o.e.j.s.Server Started @972643ms
   [junit4]   2> 970988 INFO  (jetty-launcher-1401-thread-1) [    ] o.a.s.c.s.e.JettySolrRunner Jetty properties: {hostContext=/solr, hostPort=45311}
   [junit4]   2> 970988 ERROR (jetty-launcher-1401-thread-1) [    ] o.a.s.u.StartupLoggingUtils Missing Java Option solr.log.dir. Logging may be missing or incomplete.
   [junit4]   2> 970988 INFO  (jetty-launcher-1401-thread-1) [    ] o.a.s.s.SolrDispatchFilter  ___      _       Welcome to Apache Solr™ version 8.0.0
   [junit4]   2> 970988 INFO  (jetty-launcher-1401-thread-1) [    ] o.a.s.s.SolrDispatchFilter / __| ___| |_ _   Starting in cloud mode on port null
   [junit4]   2> 970988 INFO  (jetty-launcher-1401-thread-1) [    ] o.a.s.s.SolrDispatchFilter \__ \/ _ \ | '_|  Install dir: null, Default config dir: null
   [junit4]   2> 970988 INFO  (jetty-launcher-1401-thread-1) [    ] o.a.s.s.SolrDispatchFilter |___/\___/_|_|    Start time: 2017-08-23T10:05:43.853Z
   [junit4]   2> 970988 INFO  (jetty-launcher-1401-thread-2) [    ] o.e.j.s.AbstractConnector Started ServerConnector@24cf6837{SSL,[ssl, http/1.1]}{127.0.0.1:41587}
   [junit4]   2> 970988 INFO  (jetty-launcher-1401-thread-2) [    ] o.e.j.s.Server Started @972644ms
   [junit4]   2> 970988 INFO  (jetty-launcher-1401-thread-2) [    ] o.a.s.c.s.e.JettySolrRunner Jetty properties: {hostContext=/solr, hostPort=41587}
   [junit4]   2> 970988 ERROR (jetty-launcher-1401-thread-2) [    ] o.a.s.u.StartupLoggingUtils Missing Java Option solr.log.dir. Logging may be missing or incomplete.
   [junit4]   2> 970988 INFO  (jetty-launcher-1401-thread-2) [    ] o.a.s.s.SolrDispatchFilter  ___      _       Welcome to Apache Solr™ version 8.0.0
   [junit4]   2> 970989 INFO  (jetty-launcher-1401-thread-2) [    ] o.a.s.s.SolrDispatchFilter / __| ___| |_ _   Starting in cloud mode on port null
   [junit4]   2> 970989 INFO  (jetty-launcher-1401-thread-2) [    ] o.a.s.s.SolrDispatchFilter \__ \/ _ \ | '_|  Install dir: null, Default config dir: null
   [junit4]   2> 970989 INFO  (jetty-launcher-1401-thread-2) [    ] o.a.s.s.SolrDispatchFilter |___/\___/_|_|    Start time: 2017-08-23T10:05:43.854Z
   [junit4]   2> 970992 INFO  (jetty-launcher-1401-thread-1) [    ] o.a.s.s.SolrDispatchFilter solr.xml found in ZooKeeper. Loading...
   [junit4]   2> 970992 INFO  (jetty-launcher-1401-thread-2) [    ] o.a.s.s.SolrDispatchFilter solr.xml found in ZooKeeper. Loading...
   [junit4]   2> 970995 WARN  (NIOServerCxn.Factory:0.0.0.0/0.0.0.0:0) [    ] o.a.z.s.NIOServerCnxn caught end of stream exception
   [junit4]   2> EndOfStreamException: Unable to read additional data from client sessionid 0x15e0e8e0bb90002, likely client has closed socket
   [junit4]   2> 	at org.apache.zookeeper.server.NIOServerCnxn.doIO(NIOServerCnxn.java:239)
   [junit4]   2> 	at org.apache.zookeeper.server.NIOServerCnxnFactory.run(NIOServerCnxnFactory.java:203)
   [junit4]   2> 	at java.lang.Thread.run(Thread.java:748)
   [junit4]   2> 971003 INFO  (jetty-launcher-1401-thread-1) [    ] o.a.s.c.ZkContainer Zookeeper client=127.0.0.1:45293/solr
   [junit4]   2> 971004 INFO  (jetty-launcher-1401-thread-2) [    ] o.a.s.c.ZkContainer Zookeeper client=127.0.0.1:45293/solr
   [junit4]   2> 971029 INFO  (jetty-launcher-1401-thread-1) [n:127.0.0.1:45311_solr    ] o.a.s.c.Overseer Overseer (id=null) closing
   [junit4]   2> 971029 INFO  (jetty-launcher-1401-thread-2) [n:127.0.0.1:41587_solr    ] o.a.s.c.Overseer Overseer (id=null) closing
   [junit4]   2> 971030 INFO  (jetty-launcher-1401-thread-1) [n:127.0.0.1:45311_solr    ] o.a.s.c.OverseerElectionContext I am going to be the leader 127.0.0.1:45311_solr
   [junit4]   2> 971030 INFO  (jetty-launcher-1401-thread-2) [n:127.0.0.1:41587_solr    ] o.a.s.c.ZkController Register node as live in ZooKeeper:/live_nodes/127.0.0.1:41587_solr
   [junit4]   2> 971030 INFO  (jetty-launcher-1401-thread-1) [n:127.0.0.1:45311_solr    ] o.a.s.c.Overseer Overseer (id=98532245093548037-127.0.0.1:45311_solr-n_0000000000) starting
   [junit4]   2> 971031 INFO  (zkCallback-1413-thread-1-processing-n:127.0.0.1:41587_solr) [n:127.0.0.1:41587_solr    ] o.a.s.c.c.ZkStateReader Updated live nodes from ZooKeeper... (0) -> (1)
   [junit4]   2> 971037 INFO  (zkCallback-1412-thread-1-processing-n:127.0.0.1:45311_solr) [n:127.0.0.1:45311_solr    ] o.a.s.c.c.ZkStateReader Updated live nodes from ZooKeeper... (0) -> (1)
   [junit4]   2> 971038 INFO  (jetty-launcher-1401-thread-1) [n:127.0.0.1:45311_solr    ] o.a.s.c.ZkController Register node as live in ZooKeeper:/live_nodes/127.0.0.1:45311_solr
   [junit4]   2> 971039 INFO  (zkCallback-1412-thread-1-processing-n:127.0.0.1:45311_solr) [n:127.0.0.1:45311_solr    ] o.a.s.c.c.ZkStateReader Updated live nodes from ZooKeeper... (1) -> (2)
   [junit4]   2> 971039 INFO  (zkCallback-1413-thread-1-processing-n:127.0.0.1:41587_solr) [n:127.0.0.1:41587_solr    ] o.a.s.c.c.ZkStateReader Updated live nodes from ZooKeeper... (1) -> (2)
   [junit4]   2> 971055 INFO  (jetty-launcher-1401-thread-1) [n:127.0.0.1:45311_solr    ] o.a.s.c.CoreContainer Initializing authentication plugin: org.apache.solr.security.HttpParamDelegationTokenPlugin
   [junit4]   2> 971059 WARN  (jetty-launcher-1401-thread-1) [n:127.0.0.1:45311_solr    ] o.a.s.c.s.i.Krb5HttpClientBuilder org.apache.solr.client.solrj.impl.Krb5HttpClientBuilder is configured without specifying system property 'java.security.auth.login.config'
   [junit4]   2> 971060 INFO  (jetty-launcher-1401-thread-1) [n:127.0.0.1:45311_solr    ] o.a.s.s.KerberosPlugin Params: {solr.kerberos.impersonator.user.noGroups.hosts=*, solr.kerberos.impersonator.user.bogusGroup.groups=__some_bogus_group, token.valid=30, cookie.domain=127.0.0.1, solr.kerberos.impersonator.user.anyHostAnyUser.groups=*, solr.kerberos.impersonator.user.bogusGroup.hosts=*, solr.kerberos.impersonator.user.anyHostAnyUser.hosts=*, token.validity=36000, solr.kerberos.impersonator.user.noHosts.groups=*, type=kerberos, solr.kerberos.impersonator.user.localHostAnyGroup.groups=*, delegation-token.token-kind=solr-dt, solr.kerberos.impersonator.user.wrongHost.hosts=1.1.1.1.1.1, cookie.path=/, zk-dt-secret-manager.znodeWorkingPath=solr/security/zkdtsm, solr.kerberos.impersonator.user.localHostAnyGroup.hosts=localhost.localdomain,localhost,127.0.0.1, signer.secret.provider.zookeeper.path=/token, solr.kerberos.impersonator.user.anyHostUsersGroup.groups=jenkins, zk-dt-secret-manager.enable=true, solr.kerberos.impersonator.user.wrongHost.groups=*, kerberos.name.rules=DEFAULT, signer.secret.provider=zookeeper, solr.kerberos.impersonator.user.anyHostUsersGroup.hosts=*}
   [junit4]   2> 971063 INFO  (jetty-launcher-1401-thread-1) [n:127.0.0.1:45311_solr    ] o.a.c.f.i.CuratorFrameworkImpl Starting
   [junit4]   2> 971067 INFO  (jetty-launcher-1401-thread-1-EventThread) [n:127.0.0.1:45311_solr    ] o.a.c.f.s.ConnectionStateManager State change: CONNECTED
   [junit4]   2> 971083 WARN  (jetty-launcher-1401-thread-1) [n:127.0.0.1:45311_solr    ] o.a.s.c.s.i.Krb5HttpClientBuilder org.apache.solr.client.solrj.impl.Krb5HttpClientBuilder is configured without specifying system property 'java.security.auth.login.config'
   [junit4]   2> 971117 INFO  (jetty-launcher-1401-thread-1) [n:127.0.0.1:45311_solr    ] o.a.s.m.r.SolrJmxReporter JMX monitoring for 'solr_45311.solr.node' (registry 'solr.node') enabled at server: com.sun.jmx.mbeanserver.JmxMBeanServer@21d185c1
   [junit4]   2> 971124 INFO  (jetty-launcher-1401-thread-2) [n:127.0.0.1:41587_solr    ] o.a.s.c.CoreContainer Initializing authentication plugin: org.apache.solr.security.HttpParamDelegationTokenPlugin
   [junit4]   2> 971124 WARN  (jetty-launcher-1401-thread-2) [n:127.0.0.1:41587_solr    ] o.a.s.c.s.i.Krb5HttpClientBuilder org.apache.solr.client.solrj.impl.Krb5HttpClientBuilder is configured without specifying system property 'java.security.auth.login.config'
   [junit4]   2> 971124 INFO  (jetty-launcher-1401-thread-2) [n:127.0.0.1:41587_solr    ] o.a.s.s.KerberosPlugin Params: {solr.kerberos.impersonator.user.noGroups.hosts=*, solr.kerberos.impersonator.user.bogusGroup.groups=__some_bogus_group, token.valid=30, cookie.domain=127.0.0.1, solr.kerberos.impersonator.user.anyHostAnyUser.groups=*, solr.kerberos.impersonator.user.bogusGroup.hosts=*, solr.kerberos.impersonator.user.anyHostAnyUser.hosts=*, token.validity=36000, solr.kerberos.impersonator.user.noHosts.groups=*, type=kerberos, solr.kerberos.impersonator.user.localHostAnyGroup.groups=*, delegation-token.token-kind=solr-dt, solr.kerberos.impersonator.user.wrongHost.hosts=1.1.1.1.1.1, cookie.path=/, zk-dt-secret-manager.znodeWorkingPath=solr/security/zkdtsm, solr.kerberos.impersonator.user.localHostAnyGroup.hosts=localhost.localdomain,localhost,127.0.0.1, signer.secret.provider.zookeeper.path=/token, solr.kerberos.impersonator.user.anyHostUsersGroup.groups=jenkins, zk-dt-secret-manager.enable=true, solr.kerberos.impersonator.user.wrongHost.groups=*, kerberos.name.rules=DEFAULT, signer.secret.provider=zookeeper, solr.kerberos.impersonator.user.anyHostUsersGroup.hosts=*}
   [junit4]   2> 971125 INFO  (jetty-launcher-1401-thread-2) [n:127.0.0.1:41587_solr    ] o.a.c.f.i.CuratorFrameworkImpl Starting
   [junit4]   2> 971125 INFO  (jetty-launcher-1401-thread-1) [n:127.0.0.1:45311_solr    ] o.a.s.m.r.SolrJmxReporter JMX monitoring for 'solr_45311.solr.jvm' (registry 'solr.jvm') enabled at server: com.sun.jmx.mbeanserver.JmxMBeanServer@21d185c1
   [junit4]   2> 971125 INFO  (jetty-launcher-1401-thread-1) [n:127.0.0.1:45311_solr    ] o.a.s.m.r.SolrJmxReporter JMX monitoring for 'solr_45311.solr.jetty' (registry 'solr.jetty') enabled at server: com.sun.jmx.mbeanserver.JmxMBeanServer@21d185c1
   [junit4]   2> 971126 INFO  (jetty-launcher-1401-thread-1) [n:127.0.0.1:45311_solr    ] o.a.s.c.CorePropertiesLocator Found 0 core definitions underneath /home/jenkins/workspace/Lucene-Solr-master-Linux/solr/build/solr-core/test/J2/temp/solr.cloud.TestSolrCloudWithSecureImpersonation_DDD9A826DE34A0B3-001/tempDir-001/node1/.
   [junit4]   2> 971128 INFO  (jetty-launcher-1401-thread-2-EventThread) [n:127.0.0.1:41587_solr    ] o.a.c.f.s.ConnectionStateManager State change: CONNECTED
   [junit4]   2> 972140 WARN  (jetty-launcher-1401-thread-2) [n:127.0.0.1:41587_solr    ] o.a.s.c.s.i.Krb5HttpClientBuilder org.apache.solr.client.solrj.impl.Krb5HttpClientBuilder is configured without specifying system property 'java.security.auth.login.config'
   [junit4]   2> 972178 INFO  (jetty-launcher-1401-thread-2) [n:127.0.0.1:41587_solr    ] o.a.s.m.r.SolrJmxReporter JMX monitoring for 'solr_41587.solr.node' (registry 'solr.node') enabled at server: com.sun.jmx.mbeanserver.JmxMBeanServer@21d185c1
   [junit4]   2> 972185 INFO  (jetty-launcher-1401-thread-2) [n:127.0.0.1:41587_solr    ] o.a.s.m.r.SolrJmxReporter JMX monitoring for 'solr_41587.solr.jvm' (registry 'solr.jvm') enabled at server: com.sun.jmx.mbeanserver.JmxMBeanServer@21d185c1
   [junit4]   2> 972185 INFO  (jetty-launcher-1401-thread-2) [n:127.0.0.1:41587_solr    ] o.a.s.m.r.SolrJmxReporter JMX monitoring for 'solr_41587.solr.jetty' (registry 'solr.jetty') enabled at server: com.sun.jmx.mbeanserver.JmxMBeanServer@21d185c1
   [junit4]   2> 972186 INFO  (jetty-launcher-1401-thread-2) [n:127.0.0.1:41587_solr    ] o.a.s.c.CorePropertiesLocator Found 0 core definitions underneath /home/jenkins/workspace/Lucene-Solr-master-Linux/solr/build/solr-core/test/J2/temp/solr.cloud.TestSolrCloudWithSecureImpersonation_DDD9A826DE34A0B3-001/tempDir-001/node2/.
   [junit4]   2> 972223 INFO  (TEST-TestSolrCloudWithSecureImpersonation.testProxyWrongHost-seed#[DDD9A826DE34A0B3]) [    ] o.a.s.SolrTestCaseJ4 ###Starting testProxyWrongHost
   [junit4]   2> 973571 WARN  (TEST-TestSolrCloudWithSecureImpersonation.testProxyWrongHost-seed#[DDD9A826DE34A0B3]) [    ] o.a.h.c.p.ResponseProcessCookies Invalid cookie header: "Set-Cookie: hadoop.auth="u=wrongHost&p=wrongHost&t=test&e=1503518745126&s=LWqBsDSZdDUkCDNOO/0GvO9W4V0="; Path=/; Domain=127.0.0.1; Expires=mié, 23-ago-2017 20:05:45 GMT; Secure; HttpOnly". Invalid 'expires' attribute: mié, 23-ago-2017 20:05:45 GMT
   [junit4]   2> 973572 INFO  (TEST-TestSolrCloudWithSecureImpersonation.testProxyWrongHost-seed#[DDD9A826DE34A0B3]) [    ] o.a.s.SolrTestCaseJ4 ###Ending testProxyWrongHost
   [junit4]   2> 973590 INFO  (TEST-TestSolrCloudWithSecureImpersonation.testProxyValidateGroup-seed#[DDD9A826DE34A0B3]) [    ] o.a.s.SolrTestCaseJ4 ###Starting testProxyValidateGroup
   [junit4]   2> 973591 INFO  (qtp204551648-10746) [n:127.0.0.1:45311_solr    ] o.a.s.h.a.CollectionsHandler Invoked Collection Action :list with params doAs=jenkins&action=LIST&wt=javabin&version=2 and sendToOCPQueue=true
   [junit4]   2> 973591 INFO  (qtp204551648-10746) [n:127.0.0.1:45311_solr    ] o.a.s.s.HttpSolrCall [admin] webapp=null path=/admin/collections params={doAs=jenkins&action=LIST&wt=javabin&version=2} status=0 QTime=0
   [junit4]   2> 973592 WARN  (TEST-TestSolrCloudWithSecureImpersonation.testProxyValidateGroup-seed#[DDD9A826DE34A0B3]) [    ] o.a.h.c.p.ResponseProcessCookies Invalid cookie header: "Set-Cookie: hadoop.auth="u=anyHostUsersGroup&p=anyHostUsersGroup&t=test&e=1503518746456&s=e0YeYIUsEtxPYyLOjP02RFtRHBE="; Path=/; Domain=127.0.0.1; Expires=mié, 23-ago-2017 20:05:46 GMT; Secure; HttpOnly". Invalid 'expires' attribute: mié, 23-ago-2017 20:05:46 GMT
   [junit4]   2> 973592 INFO  (TEST-TestSolrCloudWithSecureImpersonation.testProxyValidateGroup-seed#[DDD9A826DE34A0B3]) [    ] o.a.s.SolrTestCaseJ4 ###Ending testProxyValidateGroup
   [junit4]   2> 973599 INFO  (TEST-TestSolrCloudWithSecureImpersonation.testProxyInvalidGroup-seed#[DDD9A826DE34A0B3]) [    ] o.a.s.SolrTestCaseJ4 ###Starting testProxyInvalidGroup
   [junit4]   2> 973601 WARN  (TEST-TestSolrCloudWithSecureImpersonation.testProxyInvalidGroup-seed#[DDD9A826DE34A0B3]) [    ] o.a.h.c.p.ResponseProcessCookies Invalid cookie header: "Set-Cookie: hadoop.auth="u=bogusGroup&p=bogusGroup&t=test&e=1503518746464&s=apnfoPMFnb1Y62X4tHdw7Lp6hD0="; Path=/; Domain=127.0.0.1; Expires=mié, 23-ago-2017 20:05:46 GMT; Secure; HttpOnly". Invalid 'expires' attribute: mié, 23-ago-2017 20:05:46 GMT
   [junit4]   2> 973601 INFO  (TEST-TestSolrCloudWithSecureImpersonation.testProxyInvalidGroup-seed#[DDD9A826DE34A0B3]) [    ] o.a.s.SolrTestCaseJ4 ###Ending testProxyInvalidGroup
   [junit4]   2> 973608 INFO  (TEST-TestSolrCloudWithSecureImpersonation.testProxyValidateHost-seed#[DDD9A826DE34A0B3]) [    ] o.a.s.SolrTestCaseJ4 ###Starting testProxyValidateHost
   [junit4]   2> 973608 INFO  (qtp204551648-10749) [n:127.0.0.1:45311_solr    ] o.a.s.h.a.CollectionsHandler Invoked Collection Action :list with params doAs=bar&action=LIST&wt=javabin&version=2 and sendToOCPQueue=true
   [junit4]   2> 973608 INFO  (qtp204551648-10749) [n:127.0.0.1:45311_solr    ] o.a.s.s.HttpSolrCall [admin] webapp=null path=/admin/collections params={doAs=bar&action=LIST&wt=javabin&version=2} status=0 QTime=0
   [junit4]   2> 973609 WARN  (TEST-TestSolrCloudWithSecureImpersonation.testProxyValidateHost-seed#[DDD9A826DE34A0B3]) [    ] o.a.h.c.p.ResponseProcessCookies Invalid cookie header: "Set-Cookie: hadoop.auth="u=localHostAnyGroup&p=localHostAnyGroup&t=test&e=1503518746473&s=10M20GTjx4DEUxDPK+njfAShl0g="; Path=/; Domain=127.0.0.1; Expires=mié, 23-ago-2017 20:05:46 GMT; Secure; HttpOnly". Invalid 'expires' attribute: mié, 23-ago-2017 20:05:46 GMT
   [junit4]   2> 973609 INFO  (TEST-TestSolrCloudWithSecureImpersonation.testProxyValidateHost-seed#[DDD9A826DE34A0B3]) [    ] o.a.s.SolrTestCaseJ4 ###Ending testProxyValidateHost
   [junit4]   2> 973616 INFO  (TEST-TestSolrCloudWithSecureImpersonation.testProxyInvalidRemote-seed#[DDD9A826DE34A0B3]) [    ] o.a.s.SolrTestCaseJ4 ###Starting testProxyInvalidRemote
   [junit4]   2> 973620 WARN  (TEST-TestSolrCloudWithSecureImpersonation.testProxyInvalidRemote-seed#[DDD9A826DE34A0B3]) [    ] o.a.h.c.p.ResponseProcessCookies Invalid cookie header: "Set-Cookie: hadoop.auth="u=localHostAnyGroup&p=localHostAnyGroup&t=test&e=1503518746481&s=mw/VlMp4qkARLHqMNDGDQhcOUiE="; Path=/; Domain=127.0.0.1; Expires=mié, 23-ago-2017 20:05:46 GMT; Secure; HttpOnly". Invalid 'expires' attribute: mié, 23-ago-2017 20:05:46 GMT
   [junit4]   2> 973620 INFO  (TEST-TestSolrCloudWithSecureImpersonation.testProxyInvalidRemote-seed#[DDD9A826DE34A0B3]) [    ] o.a.s.SolrTestCaseJ4 ###Ending testProxyInvalidRemote
   [junit4]   2> 973628 INFO  (TEST-TestSolrCloudWithSecureImpersonation.testForwarding-seed#[DDD9A826DE34A0B3]) [    ] o.a.s.SolrTestCaseJ4 ###Starting testForwarding
   [junit4]   2> 973717 INFO  (TEST-TestSolrCloudWithSecureImpersonation.testForwarding-seed#[DDD9A826DE34A0B3]) [    ] o.a.s.c.c.ZkStateReader Updated live nodes from ZooKeeper... (0) -> (2)
   [junit4]   2> 973717 INFO  (TEST-TestSolrCloudWithSecureImpersonation.testForwarding-seed#[DDD9A826DE34A0B3]) [    ] o.a.s.c.s.i.ZkClientClusterStateProvider Cluster at 127.0.0.1:45293/solr ready
   [junit4]   2> 973719 INFO  (qtp204551648-10749) [n:127.0.0.1:45311_solr    ] o.a.s.h.a.CollectionsHandler Invoked Collection Action :create with params pullReplicas=0&replicationFactor=1&collection.configName=conf1&maxShardsPerNode=1&name=forwardingCollection&nrtReplicas=1&action=CREATE&numShards=1&tlogReplicas=0&wt=javabin&version=2 and sendToOCPQueue=true
   [junit4]   2> 973720 INFO  (OverseerThreadFactory-3439-thread-1-processing-n:127.0.0.1:45311_solr) [n:127.0.0.1:45311_solr    ] o.a.s.c.CreateCollectionCmd Create collection forwardingCollection
   [junit4]   2> 973824 INFO  (OverseerStateUpdate-98532245093548037-127.0.0.1:45311_solr-n_0000000000) [n:127.0.0.1:45311_solr    ] o.a.s.c.o.SliceMutator createReplica() {
   [junit4]   2>   "operation":"ADDREPLICA",
   [junit4]   2>   "collection":"forwardingCollection",
   [junit4]   2>   "shard":"shard1",
   [junit4]   2>   "core":"forwardingCollection_shard1_replica_n1",
   [junit4]   2>   "state":"down",
   [junit4]   2>   "base_url":"https://127.0.0.1:41587/solr",
   [junit4]   2>   "type":"NRT"} 
   [junit4]   2> 974063 INFO  (qtp1016239370-10737) [n:127.0.0.1:41587_solr    ] o.a.s.h.a.CoreAdminOperation core create command qt=/admin/cores&coreNodeName=core_node2&collection.configName=conf1&newCollection=true&name=forwardingCollection_shard1_replica_n1&action=CREATE&numShards=1&collection=forwardingCollection&shard=shard1&wt=javabin&version=2&replicaType=NRT
   [junit4]   2> 974063 INFO  (qtp1016239370-10737) [n:127.0.0.1:41587_solr    ] o.a.s.c.TransientSolrCoreCacheDefault Allocating transient cache for 2147483647 transient cores
   [junit4]   2> 974168 INFO  (zkCallback-1413-thread-1-processing-n:127.0.0.1:41587_solr) [n:127.0.0.1:41587_solr    ] o.a.s.c.c.ZkStateReader A cluster state change: [WatchedEvent state:SyncConnected type:NodeDataChanged path:/collections/forwardingCollection/state.json] for collection [forwardingCollection] has occurred - updating... (live nodes size: [2])
   [junit4]   2> 974169 INFO  (zkCallback-1413-thread-2-processing-n:127.0.0.1:41587_solr) [n:127.0.0.1:41587_solr    ] o.a.s.c.c.ZkStateReader A cluster state change: [WatchedEvent state:SyncConnected type:NodeDataChanged path:/collections/forwardingCollection/state.json] for collection [forwardingCollection] has occurred - updating... (live nodes size: [2])
   [junit4]   2> 975086 INFO  (qtp1016239370-10737) [n:127.0.0.1:41587_solr c:forwardingCollection s:shard1 r:core_node2 x:forwardingCollection_shard1_replica_n1] o.a.s.c.SolrConfig Using Lucene MatchVersion: 8.0.0
   [junit4]   2> 975109 INFO  (qtp1016239370-10737) [n:127.0.0.1:41587_solr c:forwardingCollection s:shard1 r:core_node2 x:forwardingCollection_shard1_replica_n1] o.a.s.s.IndexSchema [forwardingCollection_shard1_replica_n1] Schema name=test
   [junit4]   2> 975166 INFO  (qtp1016239370-10737) [n:127.0.0.1:41587_solr c:forwardingCollection s:shard1 r:core_node2 x:forwardingCollection_shard1_replica_n1] o.a.s.s.IndexSchema Loaded schema test/1.0 with uniqueid field id
   [junit4]   2> 975174 INFO  (qtp1016239370-10737) [n:127.0.0.1:41587_solr c:forwardingCollection s:shard1 r:core_node2 x:forwardingCollection_shard1_replica_n1] o.a.s.c.CoreContainer Creating SolrCore 'forwardingCollection_shard1_replica_n1' using configuration from collection forwardingCollection, trusted=true
   [junit4]   2> 975174 INFO  (qtp1016239370-10737) [n:127.0.0.1:41587_solr c:forwardingCollection s:shard1 r:core_node2 x:forwardingCollection_shard1_replica_n1] o.a.s.m.r.SolrJmxReporter JMX monitoring for 'solr_41587.solr.core.forwardingCollection.shard1.replica_n1' (registry 'solr.core.forwardingCollection.shard1.replica_n1') enabled at server: com.sun.jmx.mbeanserver.JmxMBeanServer@21d185c1
   [junit4]   2> 975174 INFO  (qtp1016239370-10737) [n:127.0.0.1:41587_solr c:forwardingCollection s:shard1 r:core_node2 x:forwardingCollection_shard1_replica_n1] o.a.s.c.SolrCore solr.RecoveryStrategy.Builder
   [junit4]   2> 975174 INFO  (qtp1016239370-10737) [n:127.0.0.1:41587_solr c:forwardingCollection s:shard1 r:core_node2 x:forwardingCollection_shard1_replica_n1] o.a.s.c.SolrCore [[forwardingCollection_shard1_replica_n1] ] Opening new SolrCore at [/home/jenkins/workspace/Lucene-Solr-master-Linux/solr/build/solr-core/test/J2/temp/solr.cloud.TestSolrCloudWithSecureImpersonation_DDD9A826DE34A0B3-001/tempDir-001/node2/forwardingCollection_shard1_replica_n1], dataDir=[/home/jenkins/workspace/Lucene-Solr-master-Linux/solr/build/solr-core/test/J2/temp/solr.cloud.TestSolrCloudWithSecureImpersonation_DDD9A826DE34A0B3-001/tempDir-001/node2/./forwardingCollection_shard1_replica_n1/data/]
   [junit4]   2> 975176 INFO  (qtp1016239370-10737) [n:127.0.0.1:41587_solr c:forwardingCollection s:shard1 r:core_node2 x:forwardingCollection_shard1_replica_n1] o.a.s.u.RandomMergePolicy RandomMergePolicy wrapping class org.apache.lucene.index.TieredMergePolicy: [TieredMergePolicy: maxMergeAtOnce=12, maxMergeAtOnceExplicit=26, maxMergedSegmentMB=26.8291015625, floorSegmentMB=0.3525390625, forceMergeDeletesPctAllowed=11.984694190231295, segmentsPerTier=27.0, maxCFSSegmentSizeMB=8.796093022207999E12, noCFSRatio=0.22427659088675764
   [junit4]   2> 975206 INFO  (qtp1016239370-10737) [n:127.0.0.1:41587_solr c:forwardingCollection s:shard1 r:core_node2 x:forwardingCollection_shard1_replica_n1] o.a.s.u.UpdateHandler Using UpdateLog implementation: org.apache.solr.update.UpdateLog
   [junit4]   2> 975206 INFO  (qtp1016239370-10737) [n:127.0.0.1:41587_solr c:forwardingCollection s:shard1 r:core_node2 x:forwardingCollection_shard1_replica_n1] o.a.s.u.UpdateLog Initializing UpdateLog: dataDir= defaultSyncLevel=FLUSH numRecordsToKeep=100 maxNumLogsToKeep=10 numVersionBuckets=65536
   [junit4]   2> 975207 INFO  (qtp1016239370-10737) [n:127.0.0.1:41587_solr c:forwardingCollection s:shard1 r:core_node2 x:forwardingCollection_shard1_replica_n1] o.a.s.u.CommitTracker Hard AutoCommit: disabled
   [junit4]   2> 975207 INFO  (qtp1016239370-10737) [n:127.0.0.1:41587_solr c:forwardingCollection s:shard1 r:core_node2 x:forwardingCollection_shard1_replica_n1] o.a.s.u.CommitTracker Soft AutoCommit: disabled
   [junit4]   2> 975207 INFO  (qtp1016239370-10737) [n:127.0.0.1:41587_solr c:forwardingCollection s:shard1 r:core_node2 x:forwardingCollection_shard1_replica_n1] o.a.s.u.RandomMergePolicy RandomMergePolicy wrapping class org.apache.lucene.index.LogDocMergePolicy: [LogDocMergePolicy: minMergeSize=1000, mergeFactor=35, maxMergeSize=9223372036854775807, maxMergeSizeForForcedMerge=9223372036854775807, calibrateSizeByDeletes=false, maxMergeDocs=2147483647, maxCFSSegmentSizeMB=8.796093022207999E12, noCFSRatio=0.5012619800574343]
   [junit4]   2> 975207 INFO  (qtp1016239370-10737) [n:127.0.0.1:41587_solr c:forwardingCollection s:shard1 r:core_node2 x:forwardingCollection_shard1_replica_n1] o.a.s.s.SolrIndexSearcher Opening [Searcher@1f65255[forwardingCollection_shard1_replica_n1] main]
   [junit4]   2> 975209 INFO  (qtp1016239370-10737) [n:127.0.0.1:41587_solr c:forwardingCollection s:shard1 r:core_node2 x:forwardingCollection_shard1_replica_n1] o.a.s.h.c.SpellCheckComponent Initializing spell checkers
   [junit4]   2> 975232 INFO  (qtp1016239370-10737) [n:127.0.0.1:41587_solr c:forwardingCollection s:shard1 r:core_node2 x:forwardingCollection_shard1_replica_n1] o.a.s.s.DirectSolrSpellChecker init: {name=direct,classname=DirectSolrSpellChecker,field=lowerfilt,minQueryLength=3}
   [junit4]   2> 975286 INFO  (qtp1016239370-10737) [n:127.0.0.1:41587_solr c:forwardingCollection s:shard1 r:core_node2 x:forwardingCollection_shard1_replica_n1] o.a.s.h.ReplicationHandler Commits will be reserved for  10000
   [junit4]   2> 975286 INFO  (searcherExecutor-3444-thread-1-processing-n:127.0.0.1:41587_solr x:forwardingCollection_shard1_replica_n1 s:shard1 c:forwardingCollection r:core_node2) [n:127.0.0.1:41587_solr c:forwardingCollection s:shard1 r:core_node2 x:forwardingCollection_shard1_replica_n1] o.a.s.h.c.SpellCheckComponent Loading spell index for spellchecker: default
   [junit4]   2> 975286 INFO  (qtp1016239370-10737) [n:127.0.0.1:41587_solr c:forwardingCollection s:shard1 r:core_node2 x:forwardingCollection_shard1_replica_n1] o.a.s.u.UpdateLog Could not find max version in index or recent updates, using new clock 1576515926125182976
   [junit4]   2> 975287 INFO  (searcherExecutor-3444-thread-1-processing-n:127.0.0.1:41587_solr x:forwardingCollection_shard1_replica_n1 s:shard1 c:forwardingCollection r:core_node2) [n:127.0.0.1:41587_solr c:forwardingCollection s:shard1 r:core_node2 x:forwardingCollection_shard1_replica_n1] o.a.s.h.c.SpellCheckComponent Loading spell index for spellchecker: direct
   [junit4]   2> 975287 INFO  (searcherExecutor-3444-thread-1-processing-n:127.0.0.1:41587_solr x:forwardingCollection_shard1_replica_n1 s:shard1 c:forwardingCollection r:core_node2) [n:127.0.0.1:41587_solr c:forwardingCollection s:shard1 r:core_node2 x:forwardingCollection_shard1_replica_n1] o.a.s.h.c.SpellCheckComponent Loading spell index for spellchecker: wordbreak
   [junit4]   2> 975287 INFO  (searcherExecutor-3444-thread-1-processing-n:127.0.0.1:41587_solr x:forwardingCollection_shard1_replica_n1 s:shard1 c:forwardingCollection r:core_node2) [n:127.0.0.1:41587_solr c:forwardingCollection s:shard1 r:core_node2 x:forwardingCollection_shard1_replica_n1] o.a.s.h.c.SpellCheckComponent Loading spell index for spellchecker: multipleFields
   [junit4]   2> 975287 INFO  (searcherExecutor-3444-thread-1-processing-n:127.0.0.1:41587_solr x:forwardingCollection_shard1_replica_n1 s:shard1 c:forwardingCollection r:core_node2) [n:127.0.0.1:41587_solr c:forwardingCollection s:shard1 r:core_node2 x:forwardingCollection_shard1_replica_n1] o.a.s.h.c.SpellCheckComponent Loading spell index for spellchecker: jarowinkler
   [junit4]   2> 975287 INFO  (searcherExecutor-3444-thread-1-processing-n:127.0.0.1:41587_solr x:forwardingCollection_shard1_replica_n1 s:shard1 c:forwardingCollection r:core_node2) [n:127.0.0.1:41587_solr c:forwardingCollection s:shard1 r:core_node2 x:forwardingCollection_shard1_replica_n1] o.a.s.h.c.SpellCheckComponent Loading spell index for spellchecker: external
   [junit4]   2> 975288 INFO  (searcherExecutor-3444-thread-1-processing-n:127.0.0.1:41587_solr x:forwardingCollection_shard1_replica_n1 s:shard1 c:forwardingCollection r:core_node2) [n:127.0.0.1:41587_solr c:forwardingCollection s:shard1 r:core_node2 x:forwardingCollection_shard1_replica_n1] o.a.s.h.c.SpellCheckComponent Loading spell index for spellchecker: freq
   [junit4]   2> 975288 INFO  (searcherExecutor-3444-thread-1-processing-n:127.0.0.1:41587_solr x:forwardingCollection_shard1_replica_n1 s:shard1 c:forwardingCollection r:core_node2) [n:127.0.0.1:41587_solr c:forwardingCollection s:shard1 r:core_node2 x:forwardingCollection_shard1_replica_n1] o.a.s.h.c.SpellCheckComponent Loading spell index for spellchecker: fqcn
   [junit4]   2> 975288 INFO  (searcherExecutor-3444-thread-1-processing-n:127.0.0.1:41587_solr x:forwardingCollection_shard1_replica_n1 s:shard1 c:forwardingCollection r:core_node2) [n:127.0.0.1:41587_solr c:forwardingCollection s:shard1 r:core_node2 x:forwardingCollection_shard1_replica_n1] o.a.s.h.c.SpellCheckComponent Loading spell index for spellchecker: perDict
   [junit4]   2> 975289 INFO  (searcherExecutor-3444-thread-1-processing-n:127.0.0.1:41587_solr x:forwardingCollection_shard1_replica_n1 s:shard1 c:forwardingCollection r:core_node2) [n:127.0.0.1:41587_solr c:forwardingCollection s:shard1 r:core_node2 x:forwardingCollection_shard1_replica_n1] o.a.s.c.SolrCore [forwardingCollection_shard1_replica_n1] Registered new searcher Searcher@1f65255[forwardingCollection_shard1_replica_n1] main{ExitableDirectoryReader(UninvertingDirectoryReader())}
   [junit4]   2> 975296 INFO  (qtp1016239370-10737) [n:127.0.0.1:41587_solr c:forwardingCollection s:shard1 r:core_node2 x:forwardingCollection_shard1_replica_n1] o.a.s.c.ShardLeaderElectionContext Enough replicas found to continue.
   [junit4]   2> 975296 INFO  (qtp1016239370-10737) [n:127.0.0.1:41587_solr c:forwardingCollection s:shard1 r:core_node2 x:forwardingCollection_shard1_replica_n1] o.a.s.c.ShardLeaderElectionContext I may be the new leader - try and sync
   [junit4]   2> 975296 INFO  (qtp1016239370-10737) [n:127.0.0.1:41587_solr c:forwardingCollection s:shard1 r:core_node2 x:forwardingCollection_shard1_replica_n1] o.a.s.c.SyncStrategy Sync replicas to https://127.0.0.1:41587/solr/forwardingCollection_shard1_replica_n1/
   [junit4]   2> 975296 INFO  (qtp1016239370-10737) [n:127.0.0.1:41587_solr c:forwardingCollection s:shard1 r:core_node2 x:forwardingCollection_shard1_replica_n1] o.a.s.c.SyncStrategy Sync Success - now sync replicas to me
   [junit4]   2> 975296 INFO  (qtp1016239370-10737) [n:127.0.0.1:41587_solr c:forwardingCollection s:shard1 r:core_node2 x:forwardingCollection_shard1_replica_n1] o.a.s.c.SyncStrategy https://127.0.0.1:41587/solr/forwardingCollection_shard1_replica_n1/ has no replicas
   [junit4]   2> 975296 INFO  (qtp1016239370-10737) [n:127.0.0.1:41587_solr c:forwardingCollection s:shard1 r:core_node2 x:forwardingCollection_shard1_replica_n1] o.a.s.c.ShardLeaderElectionContext Found all replicas participating in election, clear LIR
   [junit4]   2> 975298 INFO  (qtp1016239370-10737) [n:127.0.0.1:41587_solr c:forwardingCollection s:shard1 r:core_node2 x:forwardingCollection_shard1_replica_n1] o.a.s.c.ShardLeaderElectionContext I am the new leader: https://127.0.0.1:41587/solr/forwardingCollection_shard1_replica_n1/ shard1
   [junit4]   2> 975401 INFO  (zkCallback-1413-thread-1-processing-n:127.0.0.1:41587_solr) [n:127.0.0.1:41587_solr    ] o.a.s.c.c.ZkStateReader A cluster state change: [WatchedEvent state:SyncConnected type:NodeDataChanged path:/collections/forwardingCollection/state.json] for collection [forwardingCollection] has occurred - updating... (live nodes size: [2])
   [junit4]   2> 975401 INFO  (zkCallback-1413-thread-2-processing-n:127.0.0.1:41587_solr) [n:127.0.0.1:41587_solr    ] o.a.s.c.c.ZkStateReader A cluster state change: [WatchedEvent state:SyncConnected type:NodeDataChanged path:/collections/forwardingCollection/state.json] for collection [forwardingCollection] has occurred - updating... (live nodes size: [2])
   [junit4]   2> 975449 INFO  (qtp1016239370-10737) [n:127.0.0.1:41587_solr c:forwardingCollection s:shard1 r:core_node2 x:forwardingCollection_shard1_replica_n1] o.a.s.c.ZkController I am the leader, no recovery necessary
   [junit4]   2> 975451 INFO  (qtp1016239370-10737) [n:127.0.0.1:41587_solr c:forwardingCollection s:shard1 r:core_node2 x:forwardingCollection_shard1_replica_n1] o.a.s.s.HttpSolrCall [admin] webapp=null path=/admin/cores params={qt=/admin/cores&coreNodeName=core_node2&collection.configName=conf1&newCollection=true&name=forwardingCollection_shard1_replica_n1&action=CREATE&numShards=1&collection=forwardingCollection&shard=shard1&wt=javabin&version=2&replicaType=NRT} status=0 QTime=1388
   [junit4]   2> 975452 WARN  (httpShardExecutor-3436-thread-1-processing-n:127.0.0.1:45311_solr [https:////127.0.0.1:41587//solr] https:////127.0.0.1:41587//solr) [n:127.0.0.1:45311_solr    ] o.a.h.c.p.ResponseProcessCookies Invalid cookie header: "Set-Cookie: hadoop.auth="u=$&p=$&t=test&e=1503518746927&s=BfienrJzQgREIY9d9nLJolExMUs="; Path=/; Domain=127.0.0.1; Expires=mié, 23-ago-2017 20:05:46 GMT; Secure; HttpOnly". Invalid 'expires' attribute: mié, 23-ago-2017 20:05:46 GMT
   [junit4]   2> 975454 INFO  (qtp204551648-10749) [n:127.0.0.1:45311_solr    ] o.a.s.h.a.CollectionsHandler Wait for new collection to be active for at most 30 seconds. Check all shard replicas
   [junit4]   2> 975554 INFO  (zkCallback-1413-thread-2-processing-n:127.0.0.1:41587_solr) [n:127.0.0.1:41587_solr    ] o.a.s.c.c.ZkStateReader A cluster state change: [WatchedEvent state:SyncConnected type:NodeDataChanged path:/collections/forwardingCollection/state.json] for collection [forwardingCollection] has occurred - updating... (live nodes size: [2])
   [junit4]   2> 975554 INFO  (zkCallback-1413-thread-1-processing-n:127.0.0.1:41587_solr) [n:127.0.0.1:41587_solr    ] o.a.s.c.c.ZkStateReader A cluster state change: [WatchedEvent state:SyncConnected type:NodeDataChanged path:/collections/forwardingCollection/state.json] for collection [forwardingCollection] has occurred - updating... (live nodes size: [2])
   [junit4]   2> 975721 INFO  (OverseerCollectionConfigSetProcessor-98532245093548037-127.0.0.1:45311_solr-n_0000000000) [n:127.0.0.1:45311_solr    ] o.a.s.c.OverseerTaskQueue Response ZK path: /overseer/collection-queue-work/qnr-0000000000 doesn't exist.  Requestor may have disconnected from ZooKeeper
   [junit4]   2> 976455 INFO  (qtp204551648-10749) [n:127.0.0.1:45311_solr    ] o.a.s.s.HttpSolrCall [admin] webapp=null path=/admin/collections params={pullReplicas=0&replicationFactor=1&collection.configName=conf1&maxShardsPerNode=1&name=forwardingCollection&nrtReplicas=1&action=CREATE&numShards=1&tlogReplicas=0&wt=javabin&version=2} status=0 QTime=2735
   [junit4]   2> 976455 WARN  (TEST-TestSolrCloudWithSecureImpersonation.testForwarding-seed#[DDD9A826DE34A0B3]) [    ] o.a.h.c.p.ResponseProcessCookies Invalid cookie header: "Set-Cookie: hadoop.auth="u=user&p=user&t=test&e=1503518746584&s=++ZC0tjn7RutWVsoLevwl27m10M="; Path=/; Domain=127.0.0.1; Expires=mié, 23-ago-2017 20:05:46 GMT; Secure; HttpOnly". Invalid 'expires' attribute: mié, 23-ago-2017 20:05:46 GMT
   [junit4]   2> 976456 INFO  (TEST-TestSolrCloudWithSecureImpersonation.testForwarding-seed#[DDD9A826DE34A0B3]) [    ] o.a.s.c.AbstractDistribZkTestBase Wait for recoveries to finish - collection: forwardingCollection failOnTimeout:true timeout (sec):100
   [junit4]   2> 976456 INFO  (TEST-TestSolrCloudWithSecureImpersonation.testForwarding-seed#[DDD9A826DE34A0B3]) [    ] o.a.s.c.AbstractDistribZkTestBase Recoveries finished - collection: forwardingCollection
   [junit4]   2> 976460 INFO  (qtp204551648-10747) [n:127.0.0.1:45311_solr    ] o.a.s.c.TransientSolrCoreCacheDefault Allocating transient cache for 2147483647 transient cores
   [junit4]   2> 976466 INFO  (qtp1016239370-10737) [n:127.0.0.1:41587_solr c:forwardingCollection s:shard1 r:core_node2 x:forwardingCollection_shard1_replica_n1] o.a.s.c.S.Request [forwardingCollection_shard1_replica_n1]  webapp=/solr path=/select params={q=*:*&wt=javabin&version=2} hits=0 status=0 QTime=0
   [junit4]   2> 976466 WARN  (qtp204551648-10747) [n:127.0.0.1:45311_solr    ] o.a.h.c.p.ResponseProcessCookies Invalid cookie header: "Set-Cookie: hadoop.auth="u=$&p=$&t=test&e=1503518749330&s=L8pIEKb5C8DWDOZlg6qgg4Yh46A="; Path=/; Domain=127.0.0.1; Expires=mié, 23-ago-2017 20:05:49 GMT; Secure; HttpOnly". Invalid 'expires' attribute: mié, 23-ago-2017 20:05:49 GMT
   [junit4]   2> 976467 WARN  (TEST-TestSolrCloudWithSecureImpersonation.testForwarding-seed#[DDD9A826DE34A0B3]) [    ] o.a.h.c.p.ResponseProcessCookies Invalid cookie header: "Set-Cookie: hadoop.auth="u=user&p=user&t=test&e=1503518749325&s=1/B4yxgJUsxsOEj5kujjyI6VR0w="; Path=/; Domain=127.0.0.1; Expires=mié, 23-ago-2017 20:05:49 GMT; Secure; HttpOnly". Invalid 'expires' attribute: mié, 23-ago-2017 20:05:49 GMT
   [junit4]   2> 976468 WARN  (TEST-TestSolrCloudWithSecureImpersonation.testForwarding-seed#[DDD9A826DE34A0B3]) [    ] o.a.h.c.p.ResponseProcessCookies Invalid cookie header: "Set-Cookie: hadoop.auth="u=$&p=$&t=test&e=1503518749330&s=L8pIEKb5C8DWDOZlg6qgg4Yh46A="; Path=/; Domain=127.0.0.1; Expires=mié, 23-ago-2017 20:05:49 GMT; Secure; HttpOnly". Invalid 'expires' attribute: mié, 23-ago-2017 20:05:49 GMT
   [junit4]   2> 976473 INFO  (qtp1016239370-10752) [n:127.0.0.1:41587_solr c:forwardingCollection s:shard1 r:core_node2 x:forwardingCollection_shard1_replica_n1] o.a.s.c.S.Request [forwardingCollection_shard1_replica_n1]  webapp=/solr path=/select params={q=*:*&wt=javabin&version=2} hits=0 status=0 QTime=0
   [junit4]   2> 976474 WARN  (TEST-TestSolrCloudWithSecureImpersonation.testForwarding-seed#[DDD9A826DE34A0B3]) [    ] o.a.h.c.p.ResponseProcessCookies Invalid cookie header: "Set-Cookie: hadoop.auth="u=user&p=user&t=test&e=1503518749337&s=yT2D24No0U2nbhcjpmQxWVixH3A="; Path=/; Domain=127.0.0.1; Expires=mié, 23-ago-2017 20:05:49 GMT; Secure; HttpOnly". Invalid 'expires' attribute: mié, 23-ago-2017 20:05:49 GMT
   [junit4]   2> 976474 INFO  (TEST-TestSolrCloudWithSecureImpersonation.testForwarding-seed#[DDD9A826DE34A0B3]) [    ] o.a.s.SolrTestCaseJ4 ###Ending testForwarding
   [junit4]   2> 976500 INFO  (TEST-TestSolrCloudWithSecureImpersonation.testProxyInvalidProxyUser-seed#[DDD9A826DE34A0B3]) [    ] o.a.s.SolrTestCaseJ4 ###Starting testProxyInvalidProxyUser
   [junit4]   2> 976503 WARN  (TEST-TestSolrCloudWithSecureImpersonation.testProxyInvalidProxyUser-seed#[DDD9A826DE34A0B3]) [    ] o.a.h.c.p.ResponseProcessCookies Invalid cookie header: "Set-Cookie: hadoop.auth="u=bar&p=bar&t=test&e=1503518749366&s=aC3puNwn55wW4yTHtypwfm0yTJo="; Path=/; Domain=127.0.0.1; Expires=mié, 23-ago-2017 20:05:49 GMT; Secure; HttpOnly". Invalid 'expires' attribute: mié, 23-ago-2017 20:05:49 GMT
   [junit4]   2> 976503 INFO  (TEST-TestSolrCloudWithSecureImpersonation.testProxyInvalidProxyUser-seed#[DDD9A826DE34A0B3]) [    ] o.a.s.SolrTestCaseJ4 ###Ending testProxyInvalidProxyUser
   [junit4]   2> 976523 INFO  (TEST-TestSolrCloudWithSecureImpersonation.testProxyNullProxyUser-seed#[DDD9A826DE34A0B3]) [    ] o.a.s.SolrTestCaseJ4 ###Starting testProxyNullProxyUser
   [junit4]   2> 976524 INFO  (qtp204551648-10747) [n:127.0.0.1:45311_solr    ] o.a.s.s.SolrDispatchFilter Error authenticating
   [junit4]   2> java.lang.IllegalArgumentException: userName is NULL, empty or contains a '&'
   [junit4]   2> 	at org.apache.hadoop.security.authentication.util.AuthToken.checkForIllegalArgument(AuthToken.java:87)
   [junit4]   2> 	at org.apache.hadoop.security.authentication.util.AuthToken.<init>(AuthToken.java:70)
   [junit4]   2> 	at org.apache.hadoop.security.authentication.server.AuthenticationToken.<init>(AuthenticationToken.java:58)
   [junit4]   2> 	at org.apache.solr.security.HttpParamDelegationTokenPlugin$HttpParamDelegationTokenAuthenticationHandler$HttpParamAuthenticationHandler.authenticate(HttpParamDelegationTokenPlugin.java:213)
   [junit4]   2> 	at org.apache.hadoop.security.token.delegation.web.DelegationTokenAuthenticationHandler.authenticate(DelegationTokenAuthenticationHandler.java:348)
   [junit4]   2> 	at org.apache.solr.security.RequestContinuesRecorderAuthenticationHandler.authenticate(RequestContinuesRecorderAuthenticationHandler.java:69)
   [junit4]   2> 	at org.apache.hadoop.security.authentication.server.AuthenticationFilter.doFilter(AuthenticationFilter.java:518)
   [junit4]   2> 	at org.apache.solr.security.DelegationTokenKerberosFilter.doFilter(DelegationTokenKerberosFilter.java:134)
   [junit4]   2> 	at org.apache.solr.security.HttpParamDelegationTokenPlugin$HttpParamToRequestFilter.doFilter(HttpParamDelegationTokenPlugin.java:245)
   [junit4]   2> 	at org.apache.solr.security.KerberosPlugin.doAuthenticate(KerberosPlugin.java:243)
   [junit4]   2> 	at org.apache.solr.servlet.SolrDispatchFilter.authenticateRequest(SolrDispatchFilter.java:451)
   [junit4]   2> 	at org.apache.solr.servlet.SolrDispatchFilter.doFilter(SolrDispatchFilter.java:347)
   [junit4]   2> 	at org.apache.solr.servlet.SolrDispatchFilter.doFilter(SolrDispatchFilter.java:326)
   [junit4]   2> 	at org.eclipse.jetty.servlet.ServletHandler$CachedChain.doFilter(ServletHandler.java:1759)
   [junit4]   2> 	at org.apache.solr.client.solrj.embedded.JettySolrRunner$DebugFilter.doFilter(JettySolrRunner.java:139)
   [junit4]   2> 	at org.eclipse.jetty.servlet.ServletHandler$CachedChain.doFilter(ServletHandler.java:1759)
   [junit4]   2> 	at org.eclipse.jetty.servlet.ServletHandler.doHandle(ServletHandler.java:582)
   [junit4]   2> 	at org.eclipse.jetty.server.session.SessionHandler.doHandle(SessionHandler.java:224)
   [junit4]   2> 	at org.eclipse.jetty.server.handler.ContextHandler.doHandle(ContextHandler.java:1180)
   [junit4]   2> 	at org.eclipse.jetty.servlet.ServletHandler.doScope(ServletHandler.java:512)
   [junit4]   2> 	at org.eclipse.jetty.server.session.SessionHandler.doScope(SessionHandler.java:185)
   [junit4]   2> 	at org.eclipse.jetty.server.handler.ContextHandler.doScope(ContextHandler.java:1112)
   [junit4]   2> 	at org.eclipse.jetty.server.handler.ScopedHandler.handle(ScopedHandler.java:141)
   [junit4]   2> 	at org.eclipse.jetty.server.handler.gzip.GzipHandler.handle(GzipHandler.java:493)
   [junit4]   2> 	at org.eclipse.jetty.server.handler.HandlerWrapper.handle(HandlerWrapper.java:134)
   [junit4]   2> 	at org.eclipse.jetty.server.Server.handle(Server.java:534)
   [junit4]   2> 	at org.eclipse.jetty.server.HttpChannel.handle(HttpChannel.java:320)
   [junit4]   2> 	at org.eclipse.jetty.server.HttpConnection.onFillable(HttpConnection.java:251)
   [junit4]   2> 	at org.eclipse.jetty.io.AbstractConnection$ReadCallback.succeeded(AbstractConnection.java:283)
   [junit4]   2> 	at org.eclipse.jetty.io.FillInterest.fillable(FillInterest.java:108)
   [junit4]   2> 	at org.eclipse.jetty.io.ssl.SslConnection.onFillable(SslConnection.java:251)
   [junit4]   2> 	at org.eclipse.jetty.io.AbstractConnection$ReadCallback.succeeded(AbstractConnection.java:283)
   [junit4]   2> 	at org.eclipse.jetty.io.FillInterest.fillable(FillInterest.java:108)
   [junit4]   2> 	at org.eclipse.jetty.io.SelectChannelEndPoint$2.run(SelectChannelEndPoint.java:93)
   [junit4]   2> 	at org.eclipse.jetty.util.thread.strategy.ExecuteProduceConsume.executeProduceConsume(ExecuteProduceConsume.java:303)
   [junit4]   2> 	at org.eclipse.jetty.util.thread.strategy.ExecuteProduceConsume.produceConsume(ExecuteProduceConsume.java:148)
   [junit4]   2> 	at org.eclipse.jetty.util.thread.strategy.ExecuteProduceConsume.run(ExecuteProduceConsume.java:136)
   [junit4]   2> 	at org.eclipse.jetty.util.thread.QueuedThreadPool.runJob(QueuedThreadPool.java:671)
   [junit4]   2> 	at org.eclipse.jetty.util.thread.QueuedThreadPool$2.run(QueuedThreadPool.java:589)
   [junit4]   2> 	at java.lang.Thread.run(Thread.java:748)
   [junit4]   2> 976525 WARN  (qtp204551648-10747) [n:127.0.0.1:45311_solr    ] o.e.j.s.ServletHandler /solr/admin/collections
   [junit4]   2> org.apache.solr.common.SolrException: Error during request authentication, 
   [junit4]   2> 	at org.apache.solr.servlet.SolrDispatchFilter.authenticateRequest(SolrDispatchFilter.java:457)
   [junit4]   2> 	at org.apache.solr.servlet.SolrDispatchFilter.doFilter(SolrDispatchFilter.java:347)
   [junit4]   2> 	at org.apache.solr.servlet.SolrDispatchFilter.doFilter(SolrDispatchFilter.java:326)
   [junit4]   2> 	at org.eclipse.jetty.servlet.ServletHandler$CachedChain.doFilter(ServletHandler.java:1759)
   [junit4]   2> 	at org.apache.solr.client.solrj.embedded.JettySolrRunner$DebugFilter.doFilter(JettySolrRunner.java:139)
   [junit4]   2> 	at org.eclipse.jetty.servlet.ServletHandler$CachedChain.doFilter(ServletHandler.java:1759)
   [junit4]   2> 	at org.eclipse.jetty.servlet.ServletHandler.doHandle(ServletHandler.java:582)
   [junit4]   2> 	at org.eclipse.jetty.server.session.SessionHandler.doHandle(SessionHandler.java:224)
   [junit4]   2> 	at org.eclipse.jetty.server.handler.ContextHandler.doHandle(ContextHandler.java:1180)
   [junit4]   2> 	at org.eclipse.jetty.servlet.ServletHandler.doScope(ServletHandler.java:512)
   [junit4]   2> 	at org.eclipse.jetty.server.session.SessionHandler.doScope(SessionHandler.java:185)
   [junit4]   2> 	at org.eclipse.jetty.server.handler.ContextHandler.doScope(ContextHandler.java:1112)
   [junit4]   2> 	at org.eclipse.jetty.server.handler.ScopedHandler.handle(ScopedHandler.java:141)
   [junit4]   2> 	at org.eclipse.jetty.server.handler.gzip.GzipHandler.handle(GzipHandler.java:493)
   [junit4]   2> 	at org.eclipse.jetty.server.handler.HandlerWrapper.handle(HandlerWrapper.java:134)
   [junit4]   2> 	at org.eclipse.jetty.server.Server.handle(Server.java:534)
   [junit4]   2> 	at org.eclipse.jetty.server.HttpChannel.handle(HttpChannel.java:320)
   [junit4]   2> 	at org.eclipse.jetty.server.HttpConnection.onFillable(HttpConnection.java:251)
   [junit4]   2> 	at org.eclipse.jetty.io.AbstractConnection$ReadCallback.succeeded(AbstractConnection.java:283)
   [junit4]   2> 	at org.eclipse.jetty.io.FillInterest.fillable(FillInterest.java:108)
   [junit4]   2> 	at org.eclipse.jetty.io.ssl.SslConnection.onFillable(SslConnection.java:251)
   [junit4]   2> 	at org.eclipse.jetty.io.AbstractConnection$ReadCallback.succeeded(AbstractConnection.java:283)
   [junit4]   2> 	at org.eclipse.jetty.io.FillInterest.fillable(FillInterest.java:108)
   [junit4]   2> 	at org.eclipse.jetty.io.SelectChannelEndPoint$2.run(SelectChannelEndPoint.java:93)
   [junit4]   2> 	at org.eclipse.jetty.util.thread.strategy.ExecuteProduceConsume.executeProduceConsume(ExecuteProduceConsume.java:303)
   [junit4]   2> 	at org.eclipse.jetty.util.thread.strategy.ExecuteProduceConsume.produceConsume(ExecuteProduceConsume.java:148)
   [junit4]   2> 	at org.eclipse.jetty.util.thread.strategy.ExecuteProduceConsume.run(ExecuteProduceConsume.java:136)
   [junit4]   2> 	at org.eclipse.jetty.util.thread.QueuedThreadPool.runJob(QueuedThreadPool.java:671)
   [junit4]   2> 	at org.eclipse.jetty.util.thread.QueuedThreadPool$2.run(QueuedThreadPool.java:589)
   [junit4]   2> 	at java.lang.Thread.run(Thread.java:748)
   [junit4]   2> Caused by: java.lang.IllegalArgumentException: userName is NULL, empty or contains a '&'
   [junit4]   2> 	at org.apache.hadoop.security.authentication.util.AuthToken.checkForIllegalArgument(AuthToken.java:87)
   [junit4]   2> 	at org.apache.hadoop.security.authentication.util.AuthToken.<init>(AuthToken.java:70)
   [junit4]   2> 	at org.apache.hadoop.security.authentication.server.AuthenticationToken.<init>(AuthenticationToken.java:58)
   [junit4]   2> 	at org.apache.solr.security.HttpParamDelegationTokenPlugin$HttpParamDelegationTokenAuthenticationHandler$HttpParamAuthenticationHandler.authenticate(HttpParamDelegationTokenPlugin.java:213)
   [junit4]   2> 	at org.apache.hadoop.security.token.delegation.web.DelegationTokenAuthenticationHandler.authenticate(DelegationTokenAuthenticationHandler.java:348)
   [junit4]   2> 	at org.apache.solr.security.RequestContinuesRecorderAuthenticationHandler.authenticate(RequestContinuesRecorderAuthenticationHandler.java:69)
   [junit4]   2> 	at org.apache.hadoop.security.authentication.server.AuthenticationFilter.doFilter(AuthenticationFilter.java:518)
   [junit4]   2> 	at org.apache.solr.security.DelegationTokenKerberosFilter.doFilter(DelegationTokenKerberosFilter.java:134)
   [junit4]   2> 	at org.apache.solr.security.HttpParamDelegationTokenPlugin$HttpParamToRequestFilter.doFilter(HttpParamDelegationTokenPlugin.java:245)
   [junit4]   2> 	at org.apache.solr.security.KerberosPlugin.doAuthenticate(KerberosPlugin.java:243)
   [junit4]   2> 	at org.apache.solr.servlet.SolrDispatchFilter.authenticateRequest(SolrDispatchFilter.java:451)
   [junit4]   2> 	... 29 more
   [junit4]   2> 976526 INFO  (TEST-TestSolrCloudWithSecureImpersonation.testProxyNullProxyUser-seed#[DDD9A826DE34A0B3]) [    ] o.a.s.SolrTestCaseJ4 ###Ending testProxyNullProxyUser
   [junit4]   2> 976544 INFO  (TEST-TestSolrCloudWithSecureImpersonation.testProxyNoConfigHosts-seed#[DDD9A826DE34A0B3]) [    ] o.a.s.SolrTestCaseJ4 ###Starting testProxyNoConfigHosts
   [junit4]   2> 976548 WARN  (TEST-TestSolrCloudWithSecureImpersonation.testProxyNoConfigHosts-seed#[DDD9A826DE34A0B3]) [    ] o.a.h.c.p.ResponseProcessCookies Invalid cookie header: "Set-Cookie: hadoop.auth="u=noHosts&p=noHosts&t=test&e=1503518749411&s=UlfKKL1BUodgc3KohPVqZ7KDM4o="; Path=/; Domain=127.0.0.1; Expires=mié, 23-ago-2017 20:05:49 GMT; Secure; HttpOnly". Invalid 'expires' attribute: mié, 23-ago-2017 20:05:49 GMT
   [junit4]   2> 976548 INFO  (TEST-TestSolrCloudWithSecureImpersonation.testProxyNoConfigHosts-seed#[DDD9A826DE34A0B3]) [    ] o.a.s.SolrTestCaseJ4 ###Ending testProxyNoConfigHosts
   [junit4]   2> 976565 INFO  (TEST-TestSolrCloudWithSecureImpersonation.testProxyUnknownRemote-seed#[DDD9A826DE34A0B3]) [    ] o.a.s.SolrTestCaseJ4 ###Starting testProxyUnknownRemote
   [junit4]   2> 988905 WARN  (TEST-TestSolrCloudWithSecureImpersonation.testForwarding-seed#[DDD9A826DE34A0B3]-SendThread(127.0.0.1:45293)) [    ] o.a.z.ClientCnxn Client session timed out, have not heard from server in 12449ms for sessionid 0x15e0e8e0bb9000b
   [junit4]   2> 988905 WARN  (jetty-launcher-1401-thread-1-SendThread(127.0.0.1:45293)) [n:127.0.0.1:45311_solr    ] o.a.z.ClientCnxn Client session timed out, have not heard from server in 16760ms for sessionid 0x15e0e8e0bb90007
   [junit4]   2> 988905 WARN  (jetty-launcher-1401-thread-2-SendThread(127.0.0.1:45293)) [n:127.0.0.1:41587_solr    ] o.a.z.ClientCnxn Client session timed out, have not heard from server in 16757ms for sessionid 0x15e0e8e0bb90008
   [junit4]   2> 988906 WARN  (NIOServerCxn.Factory:0.0.0.0/0.0.0.0:0) [    ] o.a.z.s.NIOServerCnxn caught end of stream exception
   [junit4]   2> EndOfStreamException: Unable to read additional data from client sessionid 0x15e0e8e0bb90007, likely client has closed socket
   [junit4]   2> 	at org.apache.zookeeper.server.NIOServerCnxn.doIO(NIOServerCnxn.java:239)
   [junit4]   2> 	at org.apache.zookeeper.server.NIOServerCnxnFactory.run(NIOServerCnxnFactory.java:203)
   [junit4]   2> 	at java.lang.Thread.run(Thread.java:748)
   [junit4]   2> 988905 WARN  (jetty-launcher-1401-thread-2-SendThread(127.0.0.1:45293)) [n:127.0.0.1:41587_solr    ] o.a.z.ClientCnxn Client session timed out, have not heard from server in 13351ms for sessionid 0x15e0e8e0bb90006
   [junit4]   2> 988907 WARN  (NIOServerCxn.Factory:0.0.0.0/0.0.0.0:0) [    ] o.a.z.s.NIOServerCnxn caught end of stream exception
   [junit4]   2> EndOfStreamException: Unable to read additional data from client sessionid 0x15e0e8e0bb90006, likely client has closed socket
   [junit4]   2> 	at org.apache.zookeeper.server.NIOServerCnxn.doIO(NIOServerCnxn.java:239)
   [junit4]   2> 	at org.apache.zookeeper.server.NIOServerCnxnFactory.run(NIOServerCnxnFactory.java:203)
   [junit4]   2> 	at java.lang.Thread.run(Thread.java:748)
   [junit4]   2> 988907 WARN  (NIOServerCxn.Factory:0.0.0.0/0.0.0.0:0) [    ] o.a.z.s.NIOServerCnxn caught end of stream exception
   [junit4]   2> EndOfStreamException: Unable to read additional data from client sessionid 0x15e0e8e0bb90008, likely client has closed socket
   [junit4]   2> 	at org.apache.zookeeper.server.NIOServerCnxn.doIO(NIOServerCnxn.java:239)
   [junit4]   2> 	at org.apache.zookeeper.server.NIOServerCnxnFactory.run(NIOServerCnxnFactory.java:203)
   [junit4]   2> 	at java.lang.Thread.run(Thread.java:748)
   [junit4]   2> 988907 WARN  (TEST-TestSolrCloudWithSecureImpersonation.testProxyUnknownRemote-seed#[DDD9A826DE34A0B3]) [    ] o.a.h.c.p.ResponseProcessCookies Invalid cookie header: "Set-Cookie: hadoop.auth="u=localHostAnyGroup&p=localHostAnyGroup&t=test&e=1503518749431&s=irTZu7ItrBbq+Yk2TjZtVJu44gk="; Path=/; Domain=127.0.0.1; Expires=mié, 23-ago-2017 20:05:49 GMT; Secure; HttpOnly". Invalid 'expires' attribute: mié, 23-ago-2017 20:05:49 GMT
   [junit4]   2> 988907 INFO  (TEST-TestSolrCloudWithSecureImpersonation.testProxyUnknownRemote-seed#[DDD9A826DE34A0B3]) [    ] o.a.s.SolrTestCaseJ4 ###Ending testProxyUnknownRemote
   [junit4]   2> 988915 INFO  (TEST-TestSolrCloudWithSecureImpersonation.testProxyValidateAnyHostAnyUser-seed#[DDD9A826DE34A0B3]) [    ] o.a.s.SolrTestCaseJ4 ###Starting testProxyValidateAnyHostAnyUser
   [junit4]   2> 988916 INFO  (qtp204551648-10742) [n:127.0.0.1:45311_solr    ] o.a.s.h.a.CollectionsHandler Invoked Collection Action :list with params doAs=bar&action=LIST&wt=javabin&version=2 and sendToOCPQueue=true
   [junit4]   2> 988916 INFO  (qtp204551648-10742) [n:127.0.0.1:45311_solr    ] o.a.s.s.HttpSolrCall [admin] webapp=null path=/admin/collections params={doAs=bar&action=LIST&wt=javabin&version=2} status=0 QTime=0
   [junit4]   2> 988917 WARN  (TEST-TestSolrCloudWithSecureImpersonation.testProxyValidateAnyHostAnyUser-seed#[DDD9A826DE34A0B3]) [    ] o.a.h.c.p.ResponseProcessCookies Invalid cookie header: "Set-Cookie: hadoop.auth="u=anyHostAnyUser&p=anyHostAnyUser&t=test&e=1503518761781&s=biSJwHsP8ZY+hRjAq9a5eL8aH9g="; Path=/; Domain=127.0.0.1; Expires=mié, 23-ago-2017 20:06:01 GMT; Secure; HttpOnly". Invalid 'expires' attribute: mié, 23-ago-2017 20:06:01 GMT
   [junit4]   2> 988917 INFO  (TEST-TestSolrCloudWithSecureImpersonation.testProxyValidateAnyHostAnyUser-seed#[DDD9A826DE34A0B3]) [    ] o.a.s.SolrTestCaseJ4 ###Ending testProxyValidateAnyHostAnyUser
   [junit4]   2> 988924 INFO  (TEST-TestSolrCloudWithSecureImpersonation.testProxyNoConfigGroups-seed#[DDD9A826DE34A0B3]) [    ] o.a.s.SolrTestCaseJ4 ###Starting testProxyNoConfigGroups
   [junit4]   2> 988926 WARN  (TEST-TestSolrCloudWithSecureImpersonation.testProxyNoConfigGroups-seed#[DDD9A826DE34A0B3]) [    ] o.a.h.c.p.ResponseProcessCookies Invalid cookie header: "Set-Cookie: hadoop.auth="u=noGroups&p=noGroups&t=test&e=1503518761790&s=Zz7mKnlbxw5JT5O0/EL+IyI364c="; Path=/; Domain=127.0.0.1; Expires=mié, 23-ago-2017 20:06:01 GMT; Secure; HttpOnly". Invalid 'expires' attribute: mié, 23-ago-2017 20:06:01 GMT
   [junit4]   2> 988926 INFO  (TEST-TestSolrCloudWithSecureImpersonation.testProxyNoConfigGroups-seed#[DDD9A826DE34A0B3]) [    ] o.a.s.SolrTestCaseJ4 ###Ending testProxyNoConfigGroups
   [junit4]   2> 989007 INFO  (jetty-launcher-1401-thread-1-EventThread) [n:127.0.0.1:45311_solr    ] o.a.c.f.s.ConnectionStateManager State change: SUSPENDED
   [junit4]   2> 989007 WARN  (zkCallback-1413-thread-1-processing-n:127.0.0.1:41587_solr) [n:127.0.0.1:41587_solr    ] o.a.s.c.c.ConnectionManager Watcher org.apache.solr.common.cloud.ConnectionManager@35b042ae name: ZooKeeperConnection Watcher:127.0.0.1:45293/solr got event WatchedEvent state:Disconnected type:None path:null path: null type: None
   [junit4]   2> 989007 WARN  (zkCallback-1413-thread-1-processing-n:127.0.0.1:41587_solr) [n:127.0.0.1:41587_solr    ] o.a.s.c.c.ConnectionManager zkClient has disconnected
   [junit4]   2> 989009 INFO  (jetty-closer-1402-thread-1) [    ] o.e.j.s.AbstractConnector Stopped ServerConnector@461e4cda{SSL,[ssl, http/1.1]}{127.0.0.1:0}
   [junit4]   2> 989010 INFO  (jetty-closer-1402-thread-1) [    ] o.a.s.c.CoreContainer Shutting down CoreContainer instance=1263960086
   [junit4]   2> 989010 INFO  (jetty-closer-1402-thread-2) [    ] o.e.j.s.AbstractConnector Stopped ServerConnector@24cf6837{SSL,[ssl, http/1.1]}{127.0.0.1:0}
   [junit4]   2> 989010 INFO  (jetty-closer-1402-thread-1) [    ] o.a.s.m.SolrMetricManager Closing metric reporters for registry=solr.node, tag=null
   [junit4]   2> 989010 INFO  (jetty-closer-1402-thread-2) [    ] o.a.s.c.CoreContainer Shutting down CoreContainer instance=898707594
   [junit4]   2> 989010 INFO  (jetty-closer-1402-thread-1) [    ] o.a.s.m.r.SolrJmxReporter Closing reporter [org.apache.solr.metrics.reporters.SolrJmxReporter@4697018f: rootName = solr_45311, domain = solr.node, service url = null, agent id = null] for registry solr.node / com.codahale.metrics.MetricRegistry@121aa09e
   [junit4]   2> 989010 INFO  (jetty-closer-1402-thread-2) [    ] o.a.s.m.SolrMetricManager Closing metric reporters for registry=solr.node, tag=null
   [junit4]   2> 989010 INFO  (jetty-closer-1402-thread-2) [    ] o.a.s.m.r.SolrJmxReporter Closing reporter [org.apache.solr.metrics.reporters.SolrJmxReporter@2468cff6: rootName = solr_41587, domain = solr.node, service url = null, agent id = null] for registry solr.node / com.codahale.metrics.MetricRegistry@76051e39
   [junit4]   2> 989027 INFO  (jetty-closer-1402-thread-2) [    ] o.a.s.m.SolrMetricManager Closing metric reporters for registry=solr.jvm, tag=null
   [junit4]   2> 989027 INFO  (jetty-closer-1402-thread-1) [    ] o.a.s.m.SolrMetricManager Closing metric reporters for registry=solr.jvm, tag=null
   [junit4]   2> 989027 INFO  (jetty-closer-1402-thread-2) [    ] o.a.s.m.r.SolrJmxReporter Closing reporter [org.apache.solr.metrics.reporters.SolrJmxReporter@4b384668: rootName = solr_41587, domain = solr.jvm, service url = null, agent id = null] for registry solr.jvm / com.codahale.metrics.MetricRegistry@3aa4869c
   [junit4]   2> 989027 INFO  (jetty-closer-1402-thread-1) [    ] o.a.s.m.r.SolrJmxReporter Closing reporter [org.apache.solr.metrics.reporters.SolrJmxReporter@ba7ffde: rootName = solr_45311, domain = solr.jvm, service url = null, agent id = null] for registry solr.jvm / com.codahale.metrics.MetricRegistry@3aa4869c
   [junit4]   2> 989033 INFO  (jetty-closer-1402-thread-1) [    ] o.a.s.m.SolrMetricManager Closing metric reporters for registry=solr.jetty, tag=null
   [junit4]   2> 989033 INFO  (jetty-closer-1402-thread-1) [    ] o.a.s.m.r.SolrJmxReporter Closing reporter [org.apache.solr.metrics.reporters.SolrJmxReporter@71d6a792: rootName = solr_45311, domain = solr.jetty, service url = null, agent id = null] for registry solr.jetty / com.codahale.metrics.MetricRegistry@5bde92c8
   [junit4]   2> 989033 INFO  (jetty-closer-1402-thread-2) [    ] o.a.s.m.SolrMetricManager Closing metric reporters for registry=solr.jetty, tag=null
   [junit4]   2> 989033 INFO  (jetty-closer-1402-thread-2) [    ] o.a.s.m.r.SolrJmxReporter Closing reporter [org.apache.solr.metrics.reporters.SolrJmxReporter@29afe21a: rootName = solr_41587, domain = solr.jetty, service url = null, agent id = null] for registry solr.jetty / com.codahale.metrics.MetricRegistry@5bde92c8
   [junit4]   2> 989034 INFO  (jetty-closer-1402-thread-1) [    ] o.a.s.m.SolrMetricManager Closing metric reporters for registry=solr.cluster, tag=null
   [junit4]   2> 989035 INFO  (jetty-closer-1402-thread-1) [    ] o.a.s.c.Overseer Overseer (id=98532245093548037-127.0.0.1:45311_solr-n_0000000000) closing
   [junit4]   2> 989036 INFO  (OverseerStateUpdate-98532245093548037-127.0.0.1:45311_solr-n_0000000000) [n:127.0.0.1:45311_solr    ] o.a.s.c.Overseer Overseer Loop exiting : 127.0.0.1:45311_solr
   [junit4]   2> 989036 WARN  (zkCallback-1412-thread-2-processing-n:127.0.0.1:45311_solr) [n:127.0.0.1:45311_solr    ] o.a.s.c.c.ZkStateReader ZooKeeper watch triggered, but Solr cannot talk to ZK: [KeeperErrorCode = Session expired for /live_nodes]
   [junit4]   2> 989037 ERROR (Thread[Thread-4484,5,TGRP-TestSolrCloudWithSecureImpersonation]) [n:127.0.0.1:45311_solr    ] o.a.h.s.t.d.AbstractDelegationTokenSecretManager ExpiredTokenRemover received java.lang.InterruptedException: sleep interrupted
   [junit4]   2> 989241 INFO  (jetty-closer-1402-thread-1) [    ] o.e.j.s.h.ContextHandler Stopped o.e.j.s.ServletContextHandler@f121dc5{/solr,null,UNAVAILABLE}
   [junit4]   2> 990733 INFO  (jetty-launcher-1401-thread-2-EventThread) [n:127.0.0.1:41587_solr    ] o.a.c.f.s.ConnectionStateManager State change: SUSPENDED
   [junit4]   2> 990828 INFO  (zkCallback-1413-thread-4-processing-n:127.0.0.1:41587_solr) [n:127.0.0.1:41587_solr    ] o.a.s.c.OverseerElectionContext I am going to be the leader 127.0.0.1:41587_solr
   [junit4]   2> 990828 INFO  (zkCallback-1413-thread-6-processing-n:127.0.0.1:41587_solr) [n:127.0.0.1:41587_solr    ] o.a.s.c.c.ZkStateReader Updated live nodes from ZooKeeper... (2) -> (1)
   [junit4]   2> 990829 INFO  (jetty-closer-1402-thread-2) [    ] o.a.s.m.SolrMetricManager Closing metric reporters for registry=solr.cluster, tag=null
   [junit4]   2> 990829 INFO  (coreCloseExecutor-3450-thread-1) [n:127.0.0.1:41587_solr c:forwardingCollection s:shard1 r:core_node2 x:forwardingCollection_shard1_replica_n1] o.a.s.c.SolrCore [forwardingCollection_shard1_replica_n1]  CLOSING SolrCore org.apache.solr.core.SolrCore@620feb0d
   [junit4]   2> 990829 INFO  (coreCloseExecutor-3450-thread-1) [n:127.0.0.1:41587_solr c:forwardingCollection s:shard1 r:core_node2 x:forwardingCollection_shard1_replica_n1] o.a.s.m.SolrMetricManager Closing metric reporters for registry=solr.core.forwardingCollection.shard1.replica_n1, tag=1645210381
   [junit4]   2> 990829 INFO  (coreCloseExecutor-3450-thread-1) [n:127.0.0.1:41587_solr c:forwardingCollection s:shard1 r:core_node2 x:forwardingCollection_shard1_replica_n1] o.a.s.m.r.SolrJmxReporter Closing reporter [org.apache.solr.metrics.reporters.SolrJmxReporter@697250cc: rootName = solr_41587, domain = solr.core.forwardingCollection.shard1.replica_n1, service url = null, agent id = null] for registry solr.core.forwardingCollection.shard1.replica_n1 / com.codahale.metrics.MetricRegistry@797077f
   [junit4]   2> 990839 INFO  (coreCloseExecutor-3450-thread-1) [n:127.0.0.1:41587_solr c:forwardingCollection s:shard1 r:core_node2 x:forwardingCollection_shard1_replica_n1] o.a.s.m.SolrMetricManager Closing metric reporters for registry=solr.collection.forwardingCollection.shard1.leader, tag=1645210381
   [junit4]   2> 990841 WARN  (zkCallback-1413-thread-4-processing-n:127.0.0.1:41587_solr) [n:127.0.0.1:41587_solr    ] o.a.s.c.c.ZkStateReader ZooKeeper watch triggered, but Solr cannot talk to ZK: [KeeperErrorCode = Session expired for /live_nodes]
   [junit4]   2> 990841 ERROR (Thread[Thread-4487,5,TGRP-TestSolrCloudWithSecureImpersonation]) [n:127.0.0.1:41587_solr    ] o.a.h.s.t.d.AbstractDelegationTokenSecretManager ExpiredTokenRemover received java.lang.InterruptedException: sleep interrupted
   [junit4]   2> 990842 INFO  (jetty-closer-1402-thread-2) [    ] o.e.j.s.h.ContextHandler Stopped o.e.j.s.ServletContextHandler@b3880f6{/solr,null,UNAVAILABLE}
   [junit4]   2> 990842 ERROR (SUITE-TestSolrCloudWithSecureImpersonation-seed#[DDD9A826DE34A0B3]-worker) [    ] o.a.z.s.ZooKeeperServer ZKShutdownHandler is not registered, so ZooKeeper server won't take any action on ERROR or SHUTDOWN server state changes
   [junit4]   2> 990842 INFO  (SUITE-TestSolrCloudWithSecureImpersonation-seed#[DDD9A826DE34A0B3]-worker) [    ] o.a.s.c.ZkTestServer connecting to 127.0.0.1:45293 45293
   [junit4]   2> 997440 INFO  (Thread-4467) [    ] o.a.s.c.ZkTestServer connecting to 127.0.0.1:45293 45293
   [junit4]   2> 997441 WARN  (Thread-4467) [    ] o.a.s.c.ZkTestServer Watch limit violations: 
   [junit4]   2> Maximum concurrent create/delete watches above limit:
   [junit4]   2> 
   [junit4]   2> 	3	/solr/aliases.json
   [junit4]   2> 	2	/solr/security.json
   [junit4]   2> 
   [junit4]   2> Maximum concurrent data watches above limit:
   [junit4]   2> 
   [junit4]   2> 	5	/solr/collections/forwardingCollection/state.json
   [junit4]   2> 	3	/solr/clusterstate.json
   [junit4]   2> 	3	/solr/security/zkdtsm/ZKDTSMRoot/ZKDTSMSeqNumRoot
   [junit4]   2> 	3	/solr/clusterprops.json
   [junit4]   2> 	2	/solr/security/zkdtsm/ZKDTSMRoot/ZKDTSMKeyIdRoot
   [junit4]   2> 	2	/solr/security/zkdtsm/ZKDTSMRoot/ZKDTSMMasterKeyRoot/DK_1
   [junit4]   2> 	2	/solr/security/zkdtsm/ZKDTSMRoot/ZKDTSMMasterKeyRoot/DK_3
   [junit4]   2> 	2	/solr/security/zkdtsm/ZKDTSMRoot/ZKDTSMMasterKeyRoot/DK_2
   [junit4]   2> 	2	/solr/security/zkdtsm/ZKDTSMRoot/ZKDTSMMasterKeyRoot/DK_4
   [junit4]   2> 
   [junit4]   2> Maximum concurrent children watches above limit:
   [junit4]   2> 
   [junit4]   2> 	3	/solr/live_nodes
   [junit4]   2> 	3	/solr/collections
   [junit4]   2> 	3	/solr/security/zkdtsm/ZKDTSMRoot/ZKDTSMMasterKeyRoot
   [junit4]   2> 	2	/solr/security/zkdtsm/ZKDTSMRoot/ZKDTSMTokensRoot
   [junit4]   2> 
   [junit4]   2> 997460 INFO  (SUITE-TestSolrCloudWithSecureImpersonation-seed#[DDD9A826DE34A0B3]-worker) [    ] o.a.s.SolrTestCaseJ4 ------------------------------------------------------- Done waiting for tracked resources to be released
   [junit4]   2> Aug 23, 2017 10:06:10 AM com.carrotsearch.randomizedtesting.ThreadLeakControl checkThreadLeaks
   [junit4]   2> WARNING: Will linger awaiting termination of 2 leaked thread(s).
   [junit4]   2> Aug 23, 2017 10:06:30 AM com.carrotsearch.randomizedtesting.ThreadLeakControl checkThreadLeaks
   [junit4]   2> SEVERE: 2 threads leaked from SUITE scope at org.apache.solr.cloud.TestSolrCloudWithSecureImpersonation: 
   [junit4]   2>    1) Thread[id=10782, name=jetty-launcher-1401-thread-1-EventThread, state=TIMED_WAITING, group=TGRP-TestSolrCloudWithSecureImpersonation]
   [junit4]   2>         at sun.misc.Unsafe.park(Native Method)
   [junit4]   2>         at java.util.concurrent.locks.LockSupport.parkNanos(LockSupport.java:215)
   [junit4]   2>         at java.util.concurrent.locks.AbstractQueuedSynchronizer.doAcquireSharedNanos(AbstractQueuedSynchronizer.java:1037)
   [junit4]   2>         at java.util.concurrent.locks.AbstractQueuedSynchronizer.tryAcquireSharedNanos(AbstractQueuedSynchronizer.java:1328)
   [junit4]   2>         at java.util.concurrent.CountDownLatch.await(CountDownLatch.java:277)
   [junit4]   2>         at org.apache.curator.CuratorZookeeperClient.internalBlockUntilConnectedOrTimedOut(CuratorZookeeperClient.java:323)
   [junit4]   2>         at org.apache.curator.RetryLoop.callWithRetry(RetryLoop.java:105)
   [junit4]   2>         at org.apache.curator.framework.imps.GetDataBuilderImpl.pathInForeground(GetDataBuilderImpl.java:288)
   [junit4]   2>         at org.apache.curator.framework.imps.GetDataBuilderImpl.forPath(GetDataBuilderImpl.java:279)
   [junit4]   2>         at org.apache.curator.framework.imps.GetDataBuilderImpl.forPath(GetDataBuilderImpl.java:41)
   [junit4]   2>         at org.apache.curator.framework.recipes.shared.SharedValue.readValue(SharedValue.java:244)
   [junit4]   2>         at org.apache.curator.framework.recipes.shared.SharedValue.access$100(SharedValue.java:44)
   [junit4]   2>         at org.apache.curator.framework.recipes.shared.SharedValue$1.process(SharedValue.java:61)
   [junit4]   2>         at org.apache.curator.framework.imps.NamespaceWatcher.process(NamespaceWatcher.java:67)
   [junit4]   2>         at org.apache.zookeeper.ClientCnxn$EventThread.processEvent(ClientCnxn.java:530)
   [junit4]   2>         at org.apache.zookeeper.ClientCnxn$EventThread.run(ClientCnxn.java:505)
   [junit4]   2>    2) Thread[id=10792, name=jetty-launcher-1401-thread-2-EventThread, state=TIMED_WAITING, group=TGRP-TestSolrCloudWithSecureImpersonation]
   [junit4]   2>         at sun.misc.Unsafe.park(Native Method)
   [junit4]   2>         at java.util.concurrent.locks.LockSupport.parkNanos(LockSupport.java:215)
   [junit4]   2>         at java.util.concurrent.locks.AbstractQueuedSynchronizer.doAcquireSharedNanos(AbstractQueuedSynchronizer.java:1037)
   [junit4]   2>         at java.util.concurrent.locks.AbstractQueuedSynchronizer.tryAcquireSharedNanos(AbstractQueuedSynchronizer.java:1328)
   [junit4]   2>         at java.util.concurrent.CountDownLatch.await(CountDownLatch.java:277)
   [junit4]   2>         at org.apache.curator.CuratorZookeeperClient.internalBlockUntilConnectedOrTimedOut(CuratorZookeeperClient.java:323)
   [junit4]   2>         at org.apache.curator.RetryLoop.callWithRetry(RetryLoop.java:105)
   [junit4]   2>         at org.apache.curator.framework.imps.GetDataBuilderImpl.pathInForeground(GetDataBuilderImpl.java:288)
   [junit4]   2>         at org.apache.curator.framework.imps.GetDataBuilderImpl.forPath(GetDataBuilderImpl.java:279)
   [junit4]   2>         at org.apache.curator.framework.imps.GetDataBuilderImpl.forPath(GetDataBuilderImpl.java:41)
   [junit4]   2>         at org.apache.curator.framework.recipes.shared.SharedValue.readValue(SharedValue.java:244)
   [junit4]   2>         at org.apache.curator.framework.recipes.shared.SharedValue.access$100(SharedValue.java:44)
   [junit4]   2>         at org.apache.curator.framework.recipes.shared.SharedValue$1.process(SharedValue.java:61)
   [junit4]   2>         at org.apache.curator.framework.imps.NamespaceWatcher.process(NamespaceWatcher.java:67)
   [junit4]   2>         at org.apache.zookeeper.ClientCnxn$EventThread.processEvent(ClientCnxn.java:530)
   [junit4]   2>         at org.apache.zookeeper.ClientCnxn$EventThread.run(ClientCnxn.java:505)
   [junit4]   2> Aug 23, 2017 10:06:30 AM com.carrotsearch.randomizedtesting.ThreadLeakControl tryToInterruptAll
   [junit4]   2> INFO: Starting to interrupt leaked threads:
   [junit4]   2>    1) Thread[id=10782, name=jetty-launcher-1401-thread-1-EventThread, state=TIMED_WAITING, group=TGRP-TestSolrCloudWithSecureImpersonation]
   [junit4]   2>    2) Thread[id=10792, name=jetty-launcher-1401-thread-2-EventThread, state=TIMED_WAITING, group=TGRP-TestSolrCloudWithSecureImpersonation]
   [junit4]   2> 1017557 ERROR (jetty-launcher-1401-thread-2-EventThread) [n:127.0.0.1:41587_solr    ] o.a.c.f.i.CuratorFrameworkImpl Watcher exception
   [junit4]   2> java.lang.InterruptedException
   [junit4]   2> 	at java.util.concurrent.locks.AbstractQueuedSynchronizer.doAcquireSharedNanos(AbstractQueuedSynchronizer.java:1039)
   [junit4]   2> 	at java.util.concurrent.locks.AbstractQueuedSynchronizer.tryAcquireSharedNanos(AbstractQueuedSynchronizer.java:1328)
   [junit4]   2> 	at java.util.concurrent.CountDownLatch.await(CountDownLatch.java:277)
   [junit4]   2> 	at org.apache.curator.CuratorZookeeperClient.internalBlockUntilConnectedOrTimedOut(CuratorZookeeperClient.java:323)
   [junit4]   2> 	at org.apache.curator.RetryLoop.callWithRetry(RetryLoop.java:105)
   [junit4]   2> 	at org.apache.curator.framework.imps.GetDataBuilderImpl.pathInForeground(GetDataBuilderImpl.java:288)
   [junit4]   2> 	at org.apache.curator.framework.imps.GetDataBuilderImpl.forPath(GetDataBuilderImpl.java:279)
   [junit4]   2> 	at org.apache.curator.framework.imps.GetDataBuilderImpl.forPath(GetDataBuilderImpl.java:41)
   [junit4]   2> 	at org.apache.curator.framework.recipes.shared.SharedValue.readValue(SharedValue.java:244)
   [junit4]   2> 	at org.apache.curator.framework.recipes.shared.SharedValue.access$100(SharedValue.java:44)
   [junit4]   2> 	at org.apache.curator.framework.recipes.shared.SharedValue$1.process(SharedValue.java:61)
   [junit4]   2> 	at org.apache.curator.framework.imps.NamespaceWatcher.process(NamespaceWatcher.java:67)
   [junit4]   2> 	at org.apache.zookeeper.ClientCnxn$EventThread.processEvent(ClientCnxn.java:530)
   [junit4]   2> 	at org.apache.zookeeper.ClientCnxn$EventThread.run(ClientCnxn.java:505)
   [junit4]   2> 1017557 ERROR (jetty-launcher-1401-thread-1-EventThread) [n:127.0.0.1:45311_solr    ] o.a.c.f.i.CuratorFrameworkImpl Watcher exception
   [junit4]   2> java.lang.InterruptedException
   [junit4]   2> 	at java.util.concurrent.locks.AbstractQueuedSynchronizer.doAcquireSharedNanos(AbstractQueuedSynchronizer.java:1039)
   [junit4]   2> 	at java.util.concurrent.locks.AbstractQueuedSynchronizer.tryAcquireSharedNanos(AbstractQueuedSynchronizer.java:1328)
   [junit4]   2> 	at java.util.concurrent.CountDownLatch.await(CountDownLatch.java:277)
   [junit4]   2> 	at org.apache.curator.CuratorZookeeperClient.internalBlockUntilConnectedOrTimedOut(CuratorZookeeperClient.java:323)
   [junit4]   2> 	at org.apache.curator.RetryLoop.callWithRetry(RetryLoop.java:105)
   [junit4]   2> 	at org.apache.curator.framework.imps.GetDataBuilderImpl.pathInForeground(GetDataBuilderImpl.java:288)
   [junit4]   2> 	at org.apache.curator.framework.imps.GetDataBuilderImpl.forPath(GetDataBuilderImpl.java:279)
   [junit4]   2> 	at org.apache.curator.framework.imps.GetDataBuilderImpl.forPath(GetDataBuilderImpl.java:41)
   [junit4]   2> 	at org.apache.curator.framework.recipes.shared.SharedValue.readValue(SharedValue.java:244)
   [junit4]   2> 	at org.apache.curator.framework.recipes.shared.SharedValue.access$100(SharedValue.java:44)
   [junit4]   2> 	at org.apache.curator.framework.recipes.shared.SharedValue$1.process(SharedValue.java:61)
   [junit4]   2> 	at org.apache.curator.framework.imps.NamespaceWatcher.process(NamespaceWatcher.java:67)
   [junit4]   2> 	at org.apache.zookeeper.ClientCnxn$EventThread.processEvent(ClientCnxn.java:530)
   [junit4]   2> 	at org.apache.zookeeper.ClientCnxn$EventThread.run(ClientCnxn.java:505)
   [junit4]   2> Aug 23, 2017 10:06:30 AM com.carrotsearch.randomizedtesting.ThreadLeakControl tryToInterruptAll
   [junit4]   2> INFO: All leaked threads terminated.
   [junit4]   2> NOTE: test params are: codec=Asserting(Lucene70): {}, docValues:{}, maxPointsInLeafNode=1830, maxMBSortInHeap=7.907444902231738, sim=RandomSimilarity(queryNorm=false): {}, locale=es-PR, timezone=Etc/GMT+6
   [junit4]   2> NOTE: Linux 4.10.0-27-generic amd64/Oracle Corporation 1.8.0_144 (64-bit)/cpus=8,threads=1,free=176700528,total=518979584
   [junit4]   2> NOTE: All tests run in this JVM: [RulesTest, SegmentsInfoRequestHandlerTest, ChangedSchemaMergeTest, SolrIndexMetricsTest, PrimitiveFieldTypeTest, SpellCheckCollatorWithCollapseTest, CollectionReloadTest, HdfsRestartWhileUpdatingTest, TestSubQueryTransformerCrossCore, TestMultiWordSynonyms, SortByFunctionTest, DateFieldTest, TestJettySolrRunner, DistribJoinFromCollectionTest, TestSolrCoreProperties, CircularListTest, TestJmxIntegration, SparseHLLTest, AsyncCallRequestStatusResponseTest, CollectionsAPIAsyncDistributedZkTest, TestCollectionAPI, TestPseudoReturnFields, DistributedFacetPivotLargeTest, HardAutoCommitTest, TestSolrCloudSnapshots, TestLockTree, UnloadDistributedZkTest, TestCloudJSONFacetJoinDomain, TestLegacyFieldCache, RequiredFieldsTest, TestClassicSimilarityFactory, TestRTimerTree, TestQueryUtils, TestPrepRecovery, TestFileDictionaryLookup, NotRequiredUniqueKeyTest, CdcrReplicationDistributedZkTest, TestReversedWildcardFilterFactory, CoreAdminRequestStatusTest, TestAnalyzedSuggestions, TestFieldCollectionResource, TestPivotHelperCode, MetricsHandlerTest, TestSolrCoreParser, TestFieldTypeResource, TestSolrDeletionPolicy2, ZkStateWriterTest, TestUninvertingReader, MoveReplicaHDFSUlogDirTest, PreAnalyzedFieldTest, TestLFUCache, OverseerCollectionConfigSetProcessorTest, TestIntervalFaceting, ConfigSetsAPITest, TimeZoneUtilsTest, CursorMarkTest, Solr

[...truncated too long message...]

sed
 [ecj-lint] ----------
 [ecj-lint] 8. WARNING in /home/jenkins/workspace/Lucene-Solr-master-Linux/solr/core/src/test/org/apache/solr/handler/component/DistributedDebugComponentTest.java (at line 221)
 [ecj-lint] 	throw new AssertionError(q.toString() + ": " + e.getMessage(), e);
 [ecj-lint] 	^^^^^^^^^^^^^^^^^^^^^^^^^^^^^^^^^^^^^^^^^^^^^^^^^^^^^^^^^^^^^^^^^^
 [ecj-lint] Resource leak: 'client' is not closed at this location
 [ecj-lint] ----------
 [ecj-lint] ----------
 [ecj-lint] 9. WARNING in /home/jenkins/workspace/Lucene-Solr-master-Linux/solr/core/src/test/org/apache/solr/highlight/HighlighterTest.java (at line 204)
 [ecj-lint] 	Analyzer a1 = new WhitespaceAnalyzer();
 [ecj-lint] 	         ^^
 [ecj-lint] Resource leak: 'a1' is never closed
 [ecj-lint] ----------
 [ecj-lint] 10. WARNING in /home/jenkins/workspace/Lucene-Solr-master-Linux/solr/core/src/test/org/apache/solr/highlight/HighlighterTest.java (at line 207)
 [ecj-lint] 	OffsetWindowTokenFilter tots = new OffsetWindowTokenFilter(tokenStream);
 [ecj-lint] 	                        ^^^^
 [ecj-lint] Resource leak: 'tots' is never closed
 [ecj-lint] ----------
 [ecj-lint] 11. WARNING in /home/jenkins/workspace/Lucene-Solr-master-Linux/solr/core/src/test/org/apache/solr/highlight/HighlighterTest.java (at line 211)
 [ecj-lint] 	Analyzer a2 = new WhitespaceAnalyzer();
 [ecj-lint] 	         ^^
 [ecj-lint] Resource leak: 'a2' is never closed
 [ecj-lint] ----------
 [ecj-lint] ----------
 [ecj-lint] 12. WARNING in /home/jenkins/workspace/Lucene-Solr-master-Linux/solr/core/src/test/org/apache/solr/response/TestJavabinTupleStreamParser.java (at line 72)
 [ecj-lint] 	JavabinTupleStreamParser parser = new JavabinTupleStreamParser(new ByteArrayInputStream(bytes), true);
 [ecj-lint] 	                         ^^^^^^
 [ecj-lint] Resource leak: 'parser' is never closed
 [ecj-lint] ----------
 [ecj-lint] ----------
 [ecj-lint] 13. WARNING in /home/jenkins/workspace/Lucene-Solr-master-Linux/solr/core/src/test/org/apache/solr/search/TestDocSet.java (at line 243)
 [ecj-lint] 	return loadfactor!=0 ? new HashDocSet(a,0,n,1/loadfactor) : new HashDocSet(a,0,n);
 [ecj-lint] 	                       ^^^^^^^^^^^^^^^^^^^^^^^^^^^^^^^^^^
 [ecj-lint] Resource leak: '<unassigned Closeable value>' is never closed
 [ecj-lint] ----------
 [ecj-lint] 14. WARNING in /home/jenkins/workspace/Lucene-Solr-master-Linux/solr/core/src/test/org/apache/solr/search/TestDocSet.java (at line 528)
 [ecj-lint] 	DocSet a = new BitDocSet(bs);
 [ecj-lint] 	       ^
 [ecj-lint] Resource leak: 'a' is never closed
 [ecj-lint] ----------
 [ecj-lint] ----------
 [ecj-lint] 15. WARNING in /home/jenkins/workspace/Lucene-Solr-master-Linux/solr/core/src/test/org/apache/solr/security/TestPKIAuthenticationPlugin.java (at line 76)
 [ecj-lint] 	final MockPKIAuthenticationPlugin mock = new MockPKIAuthenticationPlugin(null, nodeName);
 [ecj-lint] 	                                  ^^^^
 [ecj-lint] Resource leak: 'mock' is never closed
 [ecj-lint] ----------
 [ecj-lint] 16. WARNING in /home/jenkins/workspace/Lucene-Solr-master-Linux/solr/core/src/test/org/apache/solr/security/TestPKIAuthenticationPlugin.java (at line 131)
 [ecj-lint] 	MockPKIAuthenticationPlugin mock1 = new MockPKIAuthenticationPlugin(null, nodeName) {
 [ecj-lint] 	                            ^^^^^
 [ecj-lint] Resource leak: 'mock1' is never closed
 [ecj-lint] ----------
 [ecj-lint] ----------
 [ecj-lint] 17. WARNING in /home/jenkins/workspace/Lucene-Solr-master-Linux/solr/core/src/test/org/apache/solr/security/TestRuleBasedAuthorizationPlugin.java (at line 380)
 [ecj-lint] 	RuleBasedAuthorizationPlugin plugin = new RuleBasedAuthorizationPlugin();
 [ecj-lint] 	                             ^^^^^^
 [ecj-lint] Resource leak: 'plugin' is never closed
 [ecj-lint] ----------
 [ecj-lint] ----------
 [ecj-lint] 18. WARNING in /home/jenkins/workspace/Lucene-Solr-master-Linux/solr/core/src/test/org/apache/solr/security/TestSha256AuthenticationProvider.java (at line 49)
 [ecj-lint] 	BasicAuthPlugin basicAuthPlugin = new BasicAuthPlugin();
 [ecj-lint] 	                ^^^^^^^^^^^^^^^
 [ecj-lint] Resource leak: 'basicAuthPlugin' is never closed
 [ecj-lint] ----------
 [ecj-lint] ----------
 [ecj-lint] 19. WARNING in /home/jenkins/workspace/Lucene-Solr-master-Linux/solr/core/src/test/org/apache/solr/spelling/SimpleQueryConverter.java (at line 42)
 [ecj-lint] 	WhitespaceAnalyzer analyzer = new WhitespaceAnalyzer();
 [ecj-lint] 	                   ^^^^^^^^
 [ecj-lint] Resource leak: 'analyzer' is never closed
 [ecj-lint] ----------
 [ecj-lint] ----------
 [ecj-lint] 20. WARNING in /home/jenkins/workspace/Lucene-Solr-master-Linux/solr/core/src/test/org/apache/solr/uninverting/TestFieldCacheVsDocValues.java (at line 139)
 [ecj-lint] 	IndexWriter w = new IndexWriter(d, newIndexWriterConfig(analyzer));
 [ecj-lint] 	            ^
 [ecj-lint] Resource leak: 'w' is never closed
 [ecj-lint] ----------
 [ecj-lint] 21. WARNING in /home/jenkins/workspace/Lucene-Solr-master-Linux/solr/core/src/test/org/apache/solr/uninverting/TestFieldCacheVsDocValues.java (at line 172)
 [ecj-lint] 	throw iae;
 [ecj-lint] 	^^^^^^^^^^
 [ecj-lint] Resource leak: 'w' is not closed at this location
 [ecj-lint] ----------
 [ecj-lint] 22. WARNING in /home/jenkins/workspace/Lucene-Solr-master-Linux/solr/core/src/test/org/apache/solr/uninverting/TestFieldCacheVsDocValues.java (at line 178)
 [ecj-lint] 	return;
 [ecj-lint] 	^^^^^^^
 [ecj-lint] Resource leak: 'w' is not closed at this location
 [ecj-lint] ----------
 [ecj-lint] ----------
 [ecj-lint] 23. WARNING in /home/jenkins/workspace/Lucene-Solr-master-Linux/solr/core/src/test/org/apache/solr/update/SolrCmdDistributorTest.java (at line 134)
 [ecj-lint] 	SolrCmdDistributor cmdDistrib = new SolrCmdDistributor(updateShardHandler);
 [ecj-lint] 	                   ^^^^^^^^^^
 [ecj-lint] Resource leak: 'cmdDistrib' is never closed
 [ecj-lint] ----------
 [ecj-lint] 24. WARNING in /home/jenkins/workspace/Lucene-Solr-master-Linux/solr/core/src/test/org/apache/solr/update/SolrCmdDistributorTest.java (at line 333)
 [ecj-lint] 	SolrCmdDistributor cmdDistrib = new SolrCmdDistributor(streamingClients, 5, 0);
 [ecj-lint] 	                   ^^^^^^^^^^
 [ecj-lint] Resource leak: 'cmdDistrib' is never closed
 [ecj-lint] ----------
 [ecj-lint] 25. WARNING in /home/jenkins/workspace/Lucene-Solr-master-Linux/solr/core/src/test/org/apache/solr/update/SolrCmdDistributorTest.java (at line 367)
 [ecj-lint] 	SolrCmdDistributor cmdDistrib = new SolrCmdDistributor(streamingClients, 5, 0);
 [ecj-lint] 	                   ^^^^^^^^^^
 [ecj-lint] Resource leak: 'cmdDistrib' is never closed
 [ecj-lint] ----------
 [ecj-lint] 26. WARNING in /home/jenkins/workspace/Lucene-Solr-master-Linux/solr/core/src/test/org/apache/solr/update/SolrCmdDistributorTest.java (at line 413)
 [ecj-lint] 	SolrCmdDistributor cmdDistrib = new SolrCmdDistributor(streamingClients, 5, 0);
 [ecj-lint] 	                   ^^^^^^^^^^
 [ecj-lint] Resource leak: 'cmdDistrib' is never closed
 [ecj-lint] ----------
 [ecj-lint] 27. WARNING in /home/jenkins/workspace/Lucene-Solr-master-Linux/solr/core/src/test/org/apache/solr/update/SolrCmdDistributorTest.java (at line 458)
 [ecj-lint] 	SolrCmdDistributor cmdDistrib = new SolrCmdDistributor(updateShardHandler);
 [ecj-lint] 	                   ^^^^^^^^^^
 [ecj-lint] Resource leak: 'cmdDistrib' is never closed
 [ecj-lint] ----------
 [ecj-lint] 28. WARNING in /home/jenkins/workspace/Lucene-Solr-master-Linux/solr/core/src/test/org/apache/solr/update/SolrCmdDistributorTest.java (at line 516)
 [ecj-lint] 	SolrCmdDistributor cmdDistrib = new SolrCmdDistributor(updateShardHandler);
 [ecj-lint] 	                   ^^^^^^^^^^
 [ecj-lint] Resource leak: 'cmdDistrib' is never closed
 [ecj-lint] ----------
 [ecj-lint] ----------
 [ecj-lint] 29. WARNING in /home/jenkins/workspace/Lucene-Solr-master-Linux/solr/core/src/test/org/apache/solr/update/SolrIndexSplitterTest.java (at line 181)
 [ecj-lint] 	EmbeddedSolrServer server1 = new EmbeddedSolrServer(h.getCoreContainer(), "split1");
 [ecj-lint] 	                   ^^^^^^^
 [ecj-lint] Resource leak: 'server1' is never closed
 [ecj-lint] ----------
 [ecj-lint] 30. WARNING in /home/jenkins/workspace/Lucene-Solr-master-Linux/solr/core/src/test/org/apache/solr/update/SolrIndexSplitterTest.java (at line 182)
 [ecj-lint] 	EmbeddedSolrServer server2 = new EmbeddedSolrServer(h.getCoreContainer(), "split2");
 [ecj-lint] 	                   ^^^^^^^
 [ecj-lint] Resource leak: 'server2' is never closed
 [ecj-lint] ----------
 [ecj-lint] ----------
 [ecj-lint] 31. WARNING in /home/jenkins/workspace/Lucene-Solr-master-Linux/solr/core/src/test/org/apache/solr/update/processor/RecordingUpdateProcessorFactory.java (at line 67)
 [ecj-lint] 	return recording ? new RecordingUpdateRequestProcessor(commandQueue, next) : next;
 [ecj-lint] 	                   ^^^^^^^^^^^^^^^^^^^^^^^^^^^^^^^^^^^^^^^^^^^^^^^^^^^^^^^
 [ecj-lint] Resource leak: '<unassigned Closeable value>' is never closed
 [ecj-lint] ----------
 [ecj-lint] 31 problems (1 error, 30 warnings)

BUILD FAILED
/home/jenkins/workspace/Lucene-Solr-master-Linux/build.xml:810: The following error occurred while executing this line:
/home/jenkins/workspace/Lucene-Solr-master-Linux/build.xml:101: The following error occurred while executing this line:
/home/jenkins/workspace/Lucene-Solr-master-Linux/solr/build.xml:689: The following error occurred while executing this line:
/home/jenkins/workspace/Lucene-Solr-master-Linux/lucene/common-build.xml:2013: The following error occurred while executing this line:
/home/jenkins/workspace/Lucene-Solr-master-Linux/lucene/common-build.xml:2046: Compile failed; see the compiler error output for details.

Total time: 75 minutes 40 seconds
Build step 'Invoke Ant' marked build as failure
Archiving artifacts
[WARNINGS] Skipping publisher since build result is FAILURE
Recording test results
Email was triggered for: Failure - Any
Sending email for trigger: Failure - Any

Mime
View raw message