lucene-dev mailing list archives

Site index · List index
Message view « Date » · « Thread »
Top « Date » · « Thread »
From Policeman Jenkins Server <jenk...@thetaphi.de>
Subject [JENKINS] Lucene-Solr-7.x-Linux (64bit/jdk1.8.0_144) - Build # 320 - Still Unstable!
Date Sat, 26 Aug 2017 17:34:34 GMT
Build: https://jenkins.thetaphi.de/job/Lucene-Solr-7.x-Linux/320/
Java: 64bit/jdk1.8.0_144 -XX:-UseCompressedOops -XX:+UseSerialGC

1 tests failed.
FAILED:  org.apache.solr.metrics.reporters.SolrSlf4jReporterTest.testReporter

Error Message:
No 'solr.node' logs in: {numFound=0,start=0,docs=[]}

Stack Trace:
java.lang.AssertionError: No 'solr.node' logs in: {numFound=0,start=0,docs=[]}
	at __randomizedtesting.SeedInfo.seed([6DBE62167CDC9AAC:325A4F2117D009E9]:0)
	at org.junit.Assert.fail(Assert.java:93)
	at org.apache.solr.metrics.reporters.SolrSlf4jReporterTest.testReporter(SolrSlf4jReporterTest.java:85)
	at sun.reflect.NativeMethodAccessorImpl.invoke0(Native Method)
	at sun.reflect.NativeMethodAccessorImpl.invoke(NativeMethodAccessorImpl.java:62)
	at sun.reflect.DelegatingMethodAccessorImpl.invoke(DelegatingMethodAccessorImpl.java:43)
	at java.lang.reflect.Method.invoke(Method.java:498)
	at com.carrotsearch.randomizedtesting.RandomizedRunner.invoke(RandomizedRunner.java:1713)
	at com.carrotsearch.randomizedtesting.RandomizedRunner$8.evaluate(RandomizedRunner.java:907)
	at com.carrotsearch.randomizedtesting.RandomizedRunner$9.evaluate(RandomizedRunner.java:943)
	at com.carrotsearch.randomizedtesting.RandomizedRunner$10.evaluate(RandomizedRunner.java:957)
	at com.carrotsearch.randomizedtesting.rules.SystemPropertiesRestoreRule$1.evaluate(SystemPropertiesRestoreRule.java:57)
	at org.apache.lucene.util.TestRuleSetupTeardownChained$1.evaluate(TestRuleSetupTeardownChained.java:49)
	at org.apache.lucene.util.AbstractBeforeAfterRule$1.evaluate(AbstractBeforeAfterRule.java:45)
	at org.apache.lucene.util.TestRuleThreadAndTestName$1.evaluate(TestRuleThreadAndTestName.java:48)
	at org.apache.lucene.util.TestRuleIgnoreAfterMaxFailures$1.evaluate(TestRuleIgnoreAfterMaxFailures.java:64)
	at org.apache.lucene.util.TestRuleMarkFailure$1.evaluate(TestRuleMarkFailure.java:47)
	at com.carrotsearch.randomizedtesting.rules.StatementAdapter.evaluate(StatementAdapter.java:36)
	at com.carrotsearch.randomizedtesting.ThreadLeakControl$StatementRunner.run(ThreadLeakControl.java:368)
	at com.carrotsearch.randomizedtesting.ThreadLeakControl.forkTimeoutingTask(ThreadLeakControl.java:817)
	at com.carrotsearch.randomizedtesting.ThreadLeakControl$3.evaluate(ThreadLeakControl.java:468)
	at com.carrotsearch.randomizedtesting.RandomizedRunner.runSingleTest(RandomizedRunner.java:916)
	at com.carrotsearch.randomizedtesting.RandomizedRunner$5.evaluate(RandomizedRunner.java:802)
	at com.carrotsearch.randomizedtesting.RandomizedRunner$6.evaluate(RandomizedRunner.java:852)
	at com.carrotsearch.randomizedtesting.RandomizedRunner$7.evaluate(RandomizedRunner.java:863)
	at com.carrotsearch.randomizedtesting.rules.StatementAdapter.evaluate(StatementAdapter.java:36)
	at com.carrotsearch.randomizedtesting.rules.SystemPropertiesRestoreRule$1.evaluate(SystemPropertiesRestoreRule.java:57)
	at org.apache.lucene.util.AbstractBeforeAfterRule$1.evaluate(AbstractBeforeAfterRule.java:45)
	at com.carrotsearch.randomizedtesting.rules.StatementAdapter.evaluate(StatementAdapter.java:36)
	at org.apache.lucene.util.TestRuleStoreClassName$1.evaluate(TestRuleStoreClassName.java:41)
	at com.carrotsearch.randomizedtesting.rules.NoShadowingOrOverridesOnMethodsRule$1.evaluate(NoShadowingOrOverridesOnMethodsRule.java:40)
	at com.carrotsearch.randomizedtesting.rules.NoShadowingOrOverridesOnMethodsRule$1.evaluate(NoShadowingOrOverridesOnMethodsRule.java:40)
	at com.carrotsearch.randomizedtesting.rules.StatementAdapter.evaluate(StatementAdapter.java:36)
	at com.carrotsearch.randomizedtesting.rules.StatementAdapter.evaluate(StatementAdapter.java:36)
	at com.carrotsearch.randomizedtesting.rules.StatementAdapter.evaluate(StatementAdapter.java:36)
	at org.apache.lucene.util.TestRuleAssertionsRequired$1.evaluate(TestRuleAssertionsRequired.java:53)
	at org.apache.lucene.util.TestRuleMarkFailure$1.evaluate(TestRuleMarkFailure.java:47)
	at org.apache.lucene.util.TestRuleIgnoreAfterMaxFailures$1.evaluate(TestRuleIgnoreAfterMaxFailures.java:64)
	at org.apache.lucene.util.TestRuleIgnoreTestSuites$1.evaluate(TestRuleIgnoreTestSuites.java:54)
	at com.carrotsearch.randomizedtesting.rules.StatementAdapter.evaluate(StatementAdapter.java:36)
	at com.carrotsearch.randomizedtesting.ThreadLeakControl$StatementRunner.run(ThreadLeakControl.java:368)
	at java.lang.Thread.run(Thread.java:748)




Build Log:
[...truncated 12821 lines...]
   [junit4] Suite: org.apache.solr.metrics.reporters.SolrSlf4jReporterTest
   [junit4]   2> Creating dataDir: /home/jenkins/workspace/Lucene-Solr-7.x-Linux/solr/build/solr-core/test/J2/temp/solr.metrics.reporters.SolrSlf4jReporterTest_6DBE62167CDC9AAC-001/init-core-data-001
   [junit4]   2> 2576189 WARN  (SUITE-SolrSlf4jReporterTest-seed#[6DBE62167CDC9AAC]-worker)
[    ] o.a.s.SolrTestCaseJ4 startTrackingSearchers: numOpens=7 numCloses=7
   [junit4]   2> NOTE: reproduce with: ant test  -Dtestcase=SolrSlf4jReporterTest -Dtests.method=testReporter
-Dtests.seed=6DBE62167CDC9AAC -Dtests.multiplier=3 -Dtests.slow=true -Dtests.locale=ar-LB
-Dtests.timezone=Europe/Athens -Dtests.asserts=true -Dtests.file.encoding=UTF-8
   [junit4] FAILURE 6.29s J2 | SolrSlf4jReporterTest.testReporter <<<
   [junit4]    > Throwable #1: java.lang.AssertionError: No 'solr.node' logs in: {numFound=0,start=0,docs=[]}
   [junit4]    > 	at __randomizedtesting.SeedInfo.seed([6DBE62167CDC9AAC:325A4F2117D009E9]:0)
   [junit4]    > 	at org.apache.solr.metrics.reporters.SolrSlf4jReporterTest.testReporter(SolrSlf4jReporterTest.java:85)
   [junit4]    > 	at java.lang.Thread.run(Thread.java:748)
   [junit4]   2> NOTE: leaving temporary files on disk at: /home/jenkins/workspace/Lucene-Solr-7.x-Linux/solr/build/solr-core/test/J2/temp/solr.metrics.reporters.SolrSlf4jReporterTest_6DBE62167CDC9AAC-001
   [junit4]   2> NOTE: test params are: codec=Asserting(Lucene70): {}, docValues:{}, maxPointsInLeafNode=685,
maxMBSortInHeap=7.489197441672118, sim=RandomSimilarity(queryNorm=true): {}, locale=ar-LB,
timezone=Europe/Athens
   [junit4]   2> NOTE: Linux 4.10.0-27-generic amd64/Oracle Corporation 1.8.0_144 (64-bit)/cpus=8,threads=1,free=129539744,total=518979584
   [junit4]   2> NOTE: All tests run in this JVM: [TestLockTree, TestRestoreCore, UninvertDocValuesMergePolicyTest,
TestManagedSchemaAPI, TestPerFieldSimilarityWithDefaultOverride, UpdateLogTest, BlockCacheTest,
MoveReplicaHDFSUlogDirTest, HdfsNNFailoverTest, DateFieldTest, FullHLLTest, OverseerTest,
TestNumericRangeQuery64, TestAnalyzedSuggestions, ShowFileRequestHandlerTest, TestTrie, TestFieldCache,
DeleteShardTest, DistributedQueryComponentOptimizationTest, TestNamedUpdateProcessors, ClusterStateTest,
TestPseudoReturnFields, TestSubQueryTransformerCrossCore, CachingDirectoryFactoryTest, TestSSLRandomization,
HdfsTlogReplayBufferedWhileIndexingTest, TestIntervalFaceting, SearchHandlerTest, TestFastWriter,
MinimalSchemaTest, TestSolrQueryResponse, MetricsHandlerTest, SimplePostToolTest, ConcurrentDeleteAndCreateCollectionTest,
TestCloudRecovery, CreateCollectionCleanupTest, TestFileDictionaryLookup, TestGroupingSearch,
TestReplicaProperties, NotRequiredUniqueKeyTest, ChangedSchemaMergeTest, TestCollationFieldDocValues,
TestLFUCache, TestSolrCoreProperties, TermVectorComponentDistributedTest, PathHierarchyTokenizerFactoryTest,
StatsComponentTest, SharedFSAutoReplicaFailoverTest, TestSimpleTextCodec, SolrMetricManagerTest,
DocumentBuilderTest, PolyFieldTest, FastVectorHighlighterTest, DirectoryFactoryTest, TestJmxIntegration,
CdcrBootstrapTest, RecoveryAfterSoftCommitTest, QueryResultKeyTest, URLClassifyProcessorTest,
ReplicationFactorTest, TestQueryUtils, TestSolrConfigHandlerCloud, TestImpersonationWithHadoopAuth,
TestSurroundQueryParser, TestMultiWordSynonyms, PreAnalyzedFieldTest, TestConfigSetsAPIExclusivity,
TestCloudJSONFacetJoinDomain, TestRecoveryHdfs, TestReversedWildcardFilterFactory, TestCustomSort,
TestIndexSearcher, BlockJoinFacetSimpleTest, DocValuesMissingTest, RankQueryTest, DirectUpdateHandlerTest,
TestMinMaxOnMultiValuedField, TestSimpleQParserPlugin, TestPayloadCheckQParserPlugin, TestFieldCollectionResource,
TestRandomCollapseQParserPlugin, LeaderElectionTest, SolrInfoBeanTest, HttpPartitionTest,
TestCorePropertiesReload, BigEndianAscendingWordSerializerTest, TestPushWriter, TestCopyFieldCollectionResource,
TestXmlQParserPlugin, TestManagedSynonymGraphFilterFactory, UniqFieldsUpdateProcessorFactoryTest,
DistribDocExpirationUpdateProcessorTest, PrimitiveFieldTypeTest, TestSolrDeletionPolicy2,
TestDFRSimilarityFactory, TestLeaderElectionZkExpiry, TestExclusionRuleCollectionAccess, TestStressLiveNodes,
TestStressUserVersions, XsltUpdateRequestHandlerTest, OverseerCollectionConfigSetProcessorTest,
TestUseDocValuesAsStored2, TestRuleBasedAuthorizationPlugin, TestPrepRecovery, TestSolrCoreParser,
TestFieldCacheSortRandom, TestFoldingMultitermQuery, V2ApiIntegrationTest, CursorMarkTest,
CircularListTest, UnloadDistributedZkTest, DistributedDebugComponentTest, TestBulkSchemaConcurrent,
AutoCommitTest, StressHdfsTest, TestSolrCloudSnapshots, SolrCoreCheckLockOnStartupTest, OverseerStatusTest,
SpatialHeatmapFacetsTest, SparseHLLTest, ChaosMonkeySafeLeaderTest, BasicDistributedZk2Test,
SyncSliceTest, BasicZkTest, RecoveryZkTest, FullSolrCloudDistribCmdsTest, TestRandomFaceting,
ZkSolrClientTest, DistributedSpellCheckComponentTest, TestRealTimeGet, TestJoin, DistributedTermsComponentTest,
SimpleFacetsTest, SpellCheckComponentTest, QueryElevationComponentTest, PeerSyncTest, BadIndexSchemaTest,
TestSort, TestFiltering, BasicFunctionalityTest, HighlighterTest, SoftAutoCommitTest, JsonLoaderTest,
BinaryUpdateRequestHandlerTest, TestPartialUpdateDeduplication, PingRequestHandlerTest, CSVRequestHandlerTest,
SearchHandlerTest, CursorPagingTest, TestHighlightDedupGrouping, TestTolerantSearch, TestEmbeddedSolrServerSchemaAPI,
ConnectionReuseTest, AssignTest, CleanupOldIndexTest, CloudExitableDirectoryReaderTest, CollectionTooManyReplicasTest,
DeleteLastCustomShardedReplicaTest, DeleteNodeTest, DistribCursorPagingTest, ForceLeaderTest,
MissingSegmentRecoveryTest, MoveReplicaHDFSTest, NodeMutatorTest, OverriddenZkACLAndCredentialsProvidersTest,
OverseerRolesTest, OverseerTaskQueueTest, SSLMigrationTest, SharedFSAutoReplicaFailoverUtilsTest,
SolrCLIZkUtilsTest, TestAuthenticationFramework, TestCloudInspectUtil, TestCloudPivotFacet,
TestCloudSearcherWarming, TestConfigSetsAPI, TestLeaderElectionWithEmptyReplica, TestOnReconnectListenerSupport,
TestPullReplica, TestRandomRequestDistribution, TestSizeLimitedDistributedMap, TestSolrCloudWithSecureImpersonation,
TestTolerantUpdateProcessorRandomCloud, TlogReplayBufferedWhileIndexingTest, TriLevelCompositeIdRoutingTest,
HdfsBasicDistributedZk2Test, HdfsBasicDistributedZkTest, HdfsChaosMonkeyNothingIsSafeTest,
HdfsCollectionsAPIDistributedZkTest, HdfsRecoverLeaseTest, HdfsRestartWhileUpdatingTest, HdfsSyncSliceTest,
HdfsThreadLeakTest, RuleEngineTest, RulesTest, TestSolrCoreSnapshots, DistributedFacetPivotLongTailTest,
DistributedFacetPivotSmallTest, DistributedSuggestComponentTest, TestExpandComponent, TestHttpShardHandlerFactory,
TestPivotHelperCode, TestTrackingShardHandlerFactory, SolrSlf4jReporterTest]
   [junit4] Completed [625/731 (1!)] on J2 in 6.32s, 1 test, 1 failure <<< FAILURES!

[...truncated 43816 lines...]

Mime
View raw message