lucene-dev mailing list archives

Site index · List index
Message view « Date » · « Thread »
Top « Date » · « Thread »
From Policeman Jenkins Server <jenk...@thetaphi.de>
Subject [JENKINS] Lucene-Solr-7.x-Linux (32bit/jdk1.8.0_144) - Build # 275 - Unstable!
Date Thu, 17 Aug 2017 08:51:56 GMT
Build: https://jenkins.thetaphi.de/job/Lucene-Solr-7.x-Linux/275/
Java: 32bit/jdk1.8.0_144 -server -XX:+UseParallelGC

1 tests failed.
FAILED:  org.apache.solr.cloud.HttpPartitionTest.test

Error Message:
Doc with id=1 not found in http://127.0.0.1:39949/fwin/f/collMinRf_1x3 due to: Path not found: /id; rsp={doc=null}

Stack Trace:
java.lang.AssertionError: Doc with id=1 not found in http://127.0.0.1:39949/fwin/f/collMinRf_1x3 due to: Path not found: /id; rsp={doc=null}
	at __randomizedtesting.SeedInfo.seed([AC5C69CB3F0CD5EC:2408561191F0B814]:0)
	at org.junit.Assert.fail(Assert.java:93)
	at org.junit.Assert.assertTrue(Assert.java:43)
	at org.apache.solr.cloud.HttpPartitionTest.assertDocExists(HttpPartitionTest.java:603)
	at org.apache.solr.cloud.HttpPartitionTest.assertDocsExistInAllReplicas(HttpPartitionTest.java:558)
	at org.apache.solr.cloud.HttpPartitionTest.testMinRf(HttpPartitionTest.java:249)
	at org.apache.solr.cloud.HttpPartitionTest.test(HttpPartitionTest.java:127)
	at sun.reflect.NativeMethodAccessorImpl.invoke0(Native Method)
	at sun.reflect.NativeMethodAccessorImpl.invoke(NativeMethodAccessorImpl.java:62)
	at sun.reflect.DelegatingMethodAccessorImpl.invoke(DelegatingMethodAccessorImpl.java:43)
	at java.lang.reflect.Method.invoke(Method.java:498)
	at com.carrotsearch.randomizedtesting.RandomizedRunner.invoke(RandomizedRunner.java:1713)
	at com.carrotsearch.randomizedtesting.RandomizedRunner$8.evaluate(RandomizedRunner.java:907)
	at com.carrotsearch.randomizedtesting.RandomizedRunner$9.evaluate(RandomizedRunner.java:943)
	at com.carrotsearch.randomizedtesting.RandomizedRunner$10.evaluate(RandomizedRunner.java:957)
	at org.apache.solr.BaseDistributedSearchTestCase$ShardsRepeatRule$ShardsFixedStatement.callStatement(BaseDistributedSearchTestCase.java:993)
	at org.apache.solr.BaseDistributedSearchTestCase$ShardsRepeatRule$ShardsStatement.evaluate(BaseDistributedSearchTestCase.java:968)
	at com.carrotsearch.randomizedtesting.rules.SystemPropertiesRestoreRule$1.evaluate(SystemPropertiesRestoreRule.java:57)
	at org.apache.lucene.util.TestRuleSetupTeardownChained$1.evaluate(TestRuleSetupTeardownChained.java:49)
	at org.apache.lucene.util.AbstractBeforeAfterRule$1.evaluate(AbstractBeforeAfterRule.java:45)
	at org.apache.lucene.util.TestRuleThreadAndTestName$1.evaluate(TestRuleThreadAndTestName.java:48)
	at org.apache.lucene.util.TestRuleIgnoreAfterMaxFailures$1.evaluate(TestRuleIgnoreAfterMaxFailures.java:64)
	at org.apache.lucene.util.TestRuleMarkFailure$1.evaluate(TestRuleMarkFailure.java:47)
	at com.carrotsearch.randomizedtesting.rules.StatementAdapter.evaluate(StatementAdapter.java:36)
	at com.carrotsearch.randomizedtesting.ThreadLeakControl$StatementRunner.run(ThreadLeakControl.java:368)
	at com.carrotsearch.randomizedtesting.ThreadLeakControl.forkTimeoutingTask(ThreadLeakControl.java:817)
	at com.carrotsearch.randomizedtesting.ThreadLeakControl$3.evaluate(ThreadLeakControl.java:468)
	at com.carrotsearch.randomizedtesting.RandomizedRunner.runSingleTest(RandomizedRunner.java:916)
	at com.carrotsearch.randomizedtesting.RandomizedRunner$5.evaluate(RandomizedRunner.java:802)
	at com.carrotsearch.randomizedtesting.RandomizedRunner$6.evaluate(RandomizedRunner.java:852)
	at com.carrotsearch.randomizedtesting.RandomizedRunner$7.evaluate(RandomizedRunner.java:863)
	at com.carrotsearch.randomizedtesting.rules.StatementAdapter.evaluate(StatementAdapter.java:36)
	at com.carrotsearch.randomizedtesting.rules.SystemPropertiesRestoreRule$1.evaluate(SystemPropertiesRestoreRule.java:57)
	at org.apache.lucene.util.AbstractBeforeAfterRule$1.evaluate(AbstractBeforeAfterRule.java:45)
	at com.carrotsearch.randomizedtesting.rules.StatementAdapter.evaluate(StatementAdapter.java:36)
	at org.apache.lucene.util.TestRuleStoreClassName$1.evaluate(TestRuleStoreClassName.java:41)
	at com.carrotsearch.randomizedtesting.rules.NoShadowingOrOverridesOnMethodsRule$1.evaluate(NoShadowingOrOverridesOnMethodsRule.java:40)
	at com.carrotsearch.randomizedtesting.rules.NoShadowingOrOverridesOnMethodsRule$1.evaluate(NoShadowingOrOverridesOnMethodsRule.java:40)
	at com.carrotsearch.randomizedtesting.rules.StatementAdapter.evaluate(StatementAdapter.java:36)
	at com.carrotsearch.randomizedtesting.rules.StatementAdapter.evaluate(StatementAdapter.java:36)
	at com.carrotsearch.randomizedtesting.rules.StatementAdapter.evaluate(StatementAdapter.java:36)
	at org.apache.lucene.util.TestRuleAssertionsRequired$1.evaluate(TestRuleAssertionsRequired.java:53)
	at org.apache.lucene.util.TestRuleMarkFailure$1.evaluate(TestRuleMarkFailure.java:47)
	at org.apache.lucene.util.TestRuleIgnoreAfterMaxFailures$1.evaluate(TestRuleIgnoreAfterMaxFailures.java:64)
	at org.apache.lucene.util.TestRuleIgnoreTestSuites$1.evaluate(TestRuleIgnoreTestSuites.java:54)
	at com.carrotsearch.randomizedtesting.rules.StatementAdapter.evaluate(StatementAdapter.java:36)
	at com.carrotsearch.randomizedtesting.ThreadLeakControl$StatementRunner.run(ThreadLeakControl.java:368)
	at java.lang.Thread.run(Thread.java:748)




Build Log:
[...truncated 12402 lines...]
   [junit4] Suite: org.apache.solr.cloud.HttpPartitionTest
   [junit4]   2> 1735503 INFO  (SUITE-HttpPartitionTest-seed#[AC5C69CB3F0CD5EC]-worker) [    ] o.a.s.SolrTestCaseJ4 SecureRandom sanity checks: test.solr.allowed.securerandom=null & java.security.egd=file:/dev/./urandom
   [junit4]   2> Creating dataDir: /home/jenkins/workspace/Lucene-Solr-7.x-Linux/solr/build/solr-core/test/J2/temp/solr.cloud.HttpPartitionTest_AC5C69CB3F0CD5EC-001/init-core-data-001
   [junit4]   2> 1735503 WARN  (SUITE-HttpPartitionTest-seed#[AC5C69CB3F0CD5EC]-worker) [    ] o.a.s.SolrTestCaseJ4 startTrackingSearchers: numOpens=102 numCloses=102
   [junit4]   2> 1735503 INFO  (SUITE-HttpPartitionTest-seed#[AC5C69CB3F0CD5EC]-worker) [    ] o.a.s.SolrTestCaseJ4 Using PointFields (NUMERIC_POINTS_SYSPROP=true) w/NUMERIC_DOCVALUES_SYSPROP=false
   [junit4]   2> 1735505 INFO  (SUITE-HttpPartitionTest-seed#[AC5C69CB3F0CD5EC]-worker) [    ] o.a.s.SolrTestCaseJ4 Randomized ssl (false) and clientAuth (false) via: @org.apache.solr.SolrTestCaseJ4$SuppressSSL(bugUrl=https://issues.apache.org/jira/browse/SOLR-5776)
   [junit4]   2> 1735505 INFO  (SUITE-HttpPartitionTest-seed#[AC5C69CB3F0CD5EC]-worker) [    ] o.a.s.BaseDistributedSearchTestCase Setting hostContext system property: /fwin/f
   [junit4]   2> 1735506 INFO  (TEST-HttpPartitionTest.test-seed#[AC5C69CB3F0CD5EC]) [    ] o.a.s.c.ZkTestServer STARTING ZK TEST SERVER
   [junit4]   2> 1735506 INFO  (Thread-6043) [    ] o.a.s.c.ZkTestServer client port:0.0.0.0/0.0.0.0:0
   [junit4]   2> 1735506 INFO  (Thread-6043) [    ] o.a.s.c.ZkTestServer Starting server
   [junit4]   2> 1735507 ERROR (Thread-6043) [    ] o.a.z.s.ZooKeeperServer ZKShutdownHandler is not registered, so ZooKeeper server won't take any action on ERROR or SHUTDOWN server state changes
   [junit4]   2> 1735606 INFO  (TEST-HttpPartitionTest.test-seed#[AC5C69CB3F0CD5EC]) [    ] o.a.s.c.ZkTestServer start zk server on port:33213
   [junit4]   2> 1735613 INFO  (TEST-HttpPartitionTest.test-seed#[AC5C69CB3F0CD5EC]) [    ] o.a.s.c.AbstractZkTestCase put /home/jenkins/workspace/Lucene-Solr-7.x-Linux/solr/core/src/test-files/solr/collection1/conf/solrconfig-tlog.xml to /configs/conf1/solrconfig.xml
   [junit4]   2> 1735614 INFO  (TEST-HttpPartitionTest.test-seed#[AC5C69CB3F0CD5EC]) [    ] o.a.s.c.AbstractZkTestCase put /home/jenkins/workspace/Lucene-Solr-7.x-Linux/solr/core/src/test-files/solr/collection1/conf/schema.xml to /configs/conf1/schema.xml
   [junit4]   2> 1735615 INFO  (TEST-HttpPartitionTest.test-seed#[AC5C69CB3F0CD5EC]) [    ] o.a.s.c.AbstractZkTestCase put /home/jenkins/workspace/Lucene-Solr-7.x-Linux/solr/core/src/test-files/solr/collection1/conf/solrconfig.snippet.randomindexconfig.xml to /configs/conf1/solrconfig.snippet.randomindexconfig.xml
   [junit4]   2> 1735615 INFO  (TEST-HttpPartitionTest.test-seed#[AC5C69CB3F0CD5EC]) [    ] o.a.s.c.AbstractZkTestCase put /home/jenkins/workspace/Lucene-Solr-7.x-Linux/solr/core/src/test-files/solr/collection1/conf/stopwords.txt to /configs/conf1/stopwords.txt
   [junit4]   2> 1735616 INFO  (TEST-HttpPartitionTest.test-seed#[AC5C69CB3F0CD5EC]) [    ] o.a.s.c.AbstractZkTestCase put /home/jenkins/workspace/Lucene-Solr-7.x-Linux/solr/core/src/test-files/solr/collection1/conf/protwords.txt to /configs/conf1/protwords.txt
   [junit4]   2> 1735616 INFO  (TEST-HttpPartitionTest.test-seed#[AC5C69CB3F0CD5EC]) [    ] o.a.s.c.AbstractZkTestCase put /home/jenkins/workspace/Lucene-Solr-7.x-Linux/solr/core/src/test-files/solr/collection1/conf/currency.xml to /configs/conf1/currency.xml
   [junit4]   2> 1735617 INFO  (TEST-HttpPartitionTest.test-seed#[AC5C69CB3F0CD5EC]) [    ] o.a.s.c.AbstractZkTestCase put /home/jenkins/workspace/Lucene-Solr-7.x-Linux/solr/core/src/test-files/solr/collection1/conf/enumsConfig.xml to /configs/conf1/enumsConfig.xml
   [junit4]   2> 1735617 INFO  (TEST-HttpPartitionTest.test-seed#[AC5C69CB3F0CD5EC]) [    ] o.a.s.c.AbstractZkTestCase put /home/jenkins/workspace/Lucene-Solr-7.x-Linux/solr/core/src/test-files/solr/collection1/conf/open-exchange-rates.json to /configs/conf1/open-exchange-rates.json
   [junit4]   2> 1735618 INFO  (TEST-HttpPartitionTest.test-seed#[AC5C69CB3F0CD5EC]) [    ] o.a.s.c.AbstractZkTestCase put /home/jenkins/workspace/Lucene-Solr-7.x-Linux/solr/core/src/test-files/solr/collection1/conf/mapping-ISOLatin1Accent.txt to /configs/conf1/mapping-ISOLatin1Accent.txt
   [junit4]   2> 1735625 INFO  (TEST-HttpPartitionTest.test-seed#[AC5C69CB3F0CD5EC]) [    ] o.a.s.c.AbstractZkTestCase put /home/jenkins/workspace/Lucene-Solr-7.x-Linux/solr/core/src/test-files/solr/collection1/conf/old_synonyms.txt to /configs/conf1/old_synonyms.txt
   [junit4]   2> 1735626 INFO  (TEST-HttpPartitionTest.test-seed#[AC5C69CB3F0CD5EC]) [    ] o.a.s.c.AbstractZkTestCase put /home/jenkins/workspace/Lucene-Solr-7.x-Linux/solr/core/src/test-files/solr/collection1/conf/synonyms.txt to /configs/conf1/synonyms.txt
   [junit4]   2> 1735626 INFO  (TEST-HttpPartitionTest.test-seed#[AC5C69CB3F0CD5EC]) [    ] o.a.s.c.AbstractFullDistribZkTestBase Will use TLOG replicas unless explicitly asked otherwise
   [junit4]   2> 1735706 INFO  (TEST-HttpPartitionTest.test-seed#[AC5C69CB3F0CD5EC]) [    ] o.e.j.s.Server jetty-9.3.14.v20161028
   [junit4]   2> 1735707 INFO  (TEST-HttpPartitionTest.test-seed#[AC5C69CB3F0CD5EC]) [    ] o.e.j.s.h.ContextHandler Started o.e.j.s.ServletContextHandler@40feb2{/fwin/f,null,AVAILABLE}
   [junit4]   2> 1735710 INFO  (TEST-HttpPartitionTest.test-seed#[AC5C69CB3F0CD5EC]) [    ] o.e.j.s.AbstractConnector Started ServerConnector@1cf73dd{HTTP/1.1,[http/1.1]}{127.0.0.1:41053}
   [junit4]   2> 1735711 INFO  (TEST-HttpPartitionTest.test-seed#[AC5C69CB3F0CD5EC]) [    ] o.e.j.s.Server Started @1737182ms
   [junit4]   2> 1735711 INFO  (TEST-HttpPartitionTest.test-seed#[AC5C69CB3F0CD5EC]) [    ] o.a.s.c.s.e.JettySolrRunner Jetty properties: {solr.data.dir=/home/jenkins/workspace/Lucene-Solr-7.x-Linux/solr/build/solr-core/test/J2/temp/solr.cloud.HttpPartitionTest_AC5C69CB3F0CD5EC-001/tempDir-001/control/data, hostContext=/fwin/f, hostPort=39949, coreRootDirectory=/home/jenkins/workspace/Lucene-Solr-7.x-Linux/solr/build/solr-core/test/J2/temp/solr.cloud.HttpPartitionTest_AC5C69CB3F0CD5EC-001/control-001/cores}
   [junit4]   2> 1735711 ERROR (TEST-HttpPartitionTest.test-seed#[AC5C69CB3F0CD5EC]) [    ] o.a.s.s.StartupLoggingUtils Missing Java Option solr.log.dir. Logging may be missing or incomplete.
   [junit4]   2> 1735711 INFO  (TEST-HttpPartitionTest.test-seed#[AC5C69CB3F0CD5EC]) [    ] o.a.s.s.SolrDispatchFilter  ___      _       Welcome to Apache Solr? version 7.1.0
   [junit4]   2> 1735711 INFO  (TEST-HttpPartitionTest.test-seed#[AC5C69CB3F0CD5EC]) [    ] o.a.s.s.SolrDispatchFilter / __| ___| |_ _   Starting in cloud mode on port null
   [junit4]   2> 1735711 INFO  (TEST-HttpPartitionTest.test-seed#[AC5C69CB3F0CD5EC]) [    ] o.a.s.s.SolrDispatchFilter \__ \/ _ \ | '_|  Install dir: null, Default config dir: null
   [junit4]   2> 1735711 INFO  (TEST-HttpPartitionTest.test-seed#[AC5C69CB3F0CD5EC]) [    ] o.a.s.s.SolrDispatchFilter |___/\___/_|_|    Start time: 2017-08-17T08:24:18.300Z
   [junit4]   2> 1735713 INFO  (TEST-HttpPartitionTest.test-seed#[AC5C69CB3F0CD5EC]) [    ] o.a.s.s.SolrDispatchFilter Loading solr.xml from SolrHome (not found in ZooKeeper)
   [junit4]   2> 1735713 INFO  (TEST-HttpPartitionTest.test-seed#[AC5C69CB3F0CD5EC]) [    ] o.a.s.c.SolrXmlConfig Loading container configuration from /home/jenkins/workspace/Lucene-Solr-7.x-Linux/solr/build/solr-core/test/J2/temp/solr.cloud.HttpPartitionTest_AC5C69CB3F0CD5EC-001/control-001/solr.xml
   [junit4]   2> 1735716 INFO  (TEST-HttpPartitionTest.test-seed#[AC5C69CB3F0CD5EC]) [    ] o.a.s.c.SolrXmlConfig MBean server found: com.sun.jmx.mbeanserver.JmxMBeanServer@7970b7, but no JMX reporters were configured - adding default JMX reporter.
   [junit4]   2> 1735719 INFO  (TEST-HttpPartitionTest.test-seed#[AC5C69CB3F0CD5EC]) [    ] o.a.s.c.ZkContainer Zookeeper client=127.0.0.1:33213/solr
   [junit4]   2> 1735746 INFO  (TEST-HttpPartitionTest.test-seed#[AC5C69CB3F0CD5EC]) [n:127.0.0.1:39949_fwin%2Ff    ] o.a.s.c.Overseer Overseer (id=null) closing
   [junit4]   2> 1735746 INFO  (TEST-HttpPartitionTest.test-seed#[AC5C69CB3F0CD5EC]) [n:127.0.0.1:39949_fwin%2Ff    ] o.a.s.c.OverseerElectionContext I am going to be the leader 127.0.0.1:39949_fwin%2Ff
   [junit4]   2> 1735747 INFO  (TEST-HttpPartitionTest.test-seed#[AC5C69CB3F0CD5EC]) [n:127.0.0.1:39949_fwin%2Ff    ] o.a.s.c.Overseer Overseer (id=98497872402579460-127.0.0.1:39949_fwin%2Ff-n_0000000000) starting
   [junit4]   2> 1735749 INFO  (TEST-HttpPartitionTest.test-seed#[AC5C69CB3F0CD5EC]) [n:127.0.0.1:39949_fwin%2Ff    ] o.a.s.c.ZkController Register node as live in ZooKeeper:/live_nodes/127.0.0.1:39949_fwin%2Ff
   [junit4]   2> 1735749 INFO  (zkCallback-2637-thread-1-processing-n:127.0.0.1:39949_fwin%2Ff) [n:127.0.0.1:39949_fwin%2Ff    ] o.a.s.c.c.ZkStateReader Updated live nodes from ZooKeeper... (0) -> (1)
   [junit4]   2> 1735846 INFO  (TEST-HttpPartitionTest.test-seed#[AC5C69CB3F0CD5EC]) [n:127.0.0.1:39949_fwin%2Ff    ] o.a.s.m.r.SolrJmxReporter JMX monitoring for 'solr.node' (registry 'solr.node') enabled at server: com.sun.jmx.mbeanserver.JmxMBeanServer@7970b7
   [junit4]   2> 1735852 INFO  (TEST-HttpPartitionTest.test-seed#[AC5C69CB3F0CD5EC]) [n:127.0.0.1:39949_fwin%2Ff    ] o.a.s.m.r.SolrJmxReporter JMX monitoring for 'solr.jvm' (registry 'solr.jvm') enabled at server: com.sun.jmx.mbeanserver.JmxMBeanServer@7970b7
   [junit4]   2> 1735852 INFO  (TEST-HttpPartitionTest.test-seed#[AC5C69CB3F0CD5EC]) [n:127.0.0.1:39949_fwin%2Ff    ] o.a.s.m.r.SolrJmxReporter JMX monitoring for 'solr.jetty' (registry 'solr.jetty') enabled at server: com.sun.jmx.mbeanserver.JmxMBeanServer@7970b7
   [junit4]   2> 1735853 INFO  (TEST-HttpPartitionTest.test-seed#[AC5C69CB3F0CD5EC]) [n:127.0.0.1:39949_fwin%2Ff    ] o.a.s.c.CorePropertiesLocator Found 0 core definitions underneath /home/jenkins/workspace/Lucene-Solr-7.x-Linux/solr/build/solr-core/test/J2/temp/solr.cloud.HttpPartitionTest_AC5C69CB3F0CD5EC-001/control-001/cores
   [junit4]   2> 1735866 INFO  (TEST-HttpPartitionTest.test-seed#[AC5C69CB3F0CD5EC]) [    ] o.a.s.c.c.ZkStateReader Updated live nodes from ZooKeeper... (0) -> (1)
   [junit4]   2> 1735866 INFO  (TEST-HttpPartitionTest.test-seed#[AC5C69CB3F0CD5EC]) [    ] o.a.s.c.s.i.ZkClientClusterStateProvider Cluster at 127.0.0.1:33213/solr ready
   [junit4]   2> 1735866 INFO  (SocketProxy-Acceptor-39949) [    ] o.a.s.c.SocketProxy accepted Socket[addr=/127.0.0.1,port=47936,localport=39949], receiveBufferSize:531000
   [junit4]   2> 1735866 INFO  (SocketProxy-Acceptor-39949) [    ] o.a.s.c.SocketProxy proxy connection Socket[addr=/127.0.0.1,port=41053,localport=41020], receiveBufferSize=530904
   [junit4]   2> 1735867 INFO  (qtp24986027-17951) [n:127.0.0.1:39949_fwin%2Ff    ] o.a.s.h.a.CollectionsHandler Invoked Collection Action :create with params replicationFactor=1&collection.configName=conf1&name=control_collection&nrtReplicas=1&action=CREATE&numShards=1&createNodeSet=127.0.0.1:39949_fwin%252Ff&wt=javabin&version=2 and sendToOCPQueue=true
   [junit4]   2> 1735868 INFO  (OverseerThreadFactory-7385-thread-1-processing-n:127.0.0.1:39949_fwin%2Ff) [n:127.0.0.1:39949_fwin%2Ff    ] o.a.s.c.CreateCollectionCmd Create collection control_collection
   [junit4]   2> 1735971 INFO  (SocketProxy-Acceptor-39949) [    ] o.a.s.c.SocketProxy accepted Socket[addr=/127.0.0.1,port=47940,localport=39949], receiveBufferSize:531000
   [junit4]   2> 1735972 INFO  (SocketProxy-Acceptor-39949) [    ] o.a.s.c.SocketProxy proxy connection Socket[addr=/127.0.0.1,port=41053,localport=41024], receiveBufferSize=530904
   [junit4]   2> 1735972 INFO  (qtp24986027-17953) [n:127.0.0.1:39949_fwin%2Ff    ] o.a.s.h.a.CoreAdminOperation core create command qt=/admin/cores&collection.configName=conf1&newCollection=true&name=control_collection_shard1_replica_n1&action=CREATE&numShards=1&collection=control_collection&shard=shard1&wt=javabin&version=2&replicaType=NRT
   [junit4]   2> 1735973 INFO  (qtp24986027-17953) [n:127.0.0.1:39949_fwin%2Ff    ] o.a.s.c.TransientSolrCoreCacheDefault Allocating transient cache for 4 transient cores
   [junit4]   2> 1736077 INFO  (zkCallback-2637-thread-1-processing-n:127.0.0.1:39949_fwin%2Ff) [n:127.0.0.1:39949_fwin%2Ff    ] o.a.s.c.c.ZkStateReader A cluster state change: [WatchedEvent state:SyncConnected type:NodeDataChanged path:/collections/control_collection/state.json] for collection [control_collection] has occurred - updating... (live nodes size: [1])
   [junit4]   2> 1736986 INFO  (qtp24986027-17953) [n:127.0.0.1:39949_fwin%2Ff c:control_collection s:shard1  x:control_collection_shard1_replica_n1] o.a.s.c.SolrConfig Using Lucene MatchVersion: 7.1.0
   [junit4]   2> 1736997 INFO  (qtp24986027-17953) [n:127.0.0.1:39949_fwin%2Ff c:control_collection s:shard1  x:control_collection_shard1_replica_n1] o.a.s.s.IndexSchema [control_collection_shard1_replica_n1] Schema name=test
   [junit4]   2> 1737082 INFO  (qtp24986027-17953) [n:127.0.0.1:39949_fwin%2Ff c:control_collection s:shard1  x:control_collection_shard1_replica_n1] o.a.s.s.IndexSchema Loaded schema test/1.0 with uniqueid field id
   [junit4]   2> 1737090 INFO  (qtp24986027-17953) [n:127.0.0.1:39949_fwin%2Ff c:control_collection s:shard1  x:control_collection_shard1_replica_n1] o.a.s.c.CoreContainer Creating SolrCore 'control_collection_shard1_replica_n1' using configuration from collection control_collection, trusted=true
   [junit4]   2> 1737090 INFO  (qtp24986027-17953) [n:127.0.0.1:39949_fwin%2Ff c:control_collection s:shard1  x:control_collection_shard1_replica_n1] o.a.s.m.r.SolrJmxReporter JMX monitoring for 'solr.core.control_collection.shard1.replica_n1' (registry 'solr.core.control_collection.shard1.replica_n1') enabled at server: com.sun.jmx.mbeanserver.JmxMBeanServer@7970b7
   [junit4]   2> 1737090 INFO  (qtp24986027-17953) [n:127.0.0.1:39949_fwin%2Ff c:control_collection s:shard1  x:control_collection_shard1_replica_n1] o.a.s.c.SolrCore solr.RecoveryStrategy.Builder
   [junit4]   2> 1737090 INFO  (qtp24986027-17953) [n:127.0.0.1:39949_fwin%2Ff c:control_collection s:shard1  x:control_collection_shard1_replica_n1] o.a.s.c.SolrCore [[control_collection_shard1_replica_n1] ] Opening new SolrCore at [/home/jenkins/workspace/Lucene-Solr-7.x-Linux/solr/build/solr-core/test/J2/temp/solr.cloud.HttpPartitionTest_AC5C69CB3F0CD5EC-001/control-001/cores/control_collection_shard1_replica_n1], dataDir=[/home/jenkins/workspace/Lucene-Solr-7.x-Linux/solr/build/solr-core/test/J2/temp/solr.cloud.HttpPartitionTest_AC5C69CB3F0CD5EC-001/control-001/cores/control_collection_shard1_replica_n1/data/]
   [junit4]   2> 1737093 INFO  (qtp24986027-17953) [n:127.0.0.1:39949_fwin%2Ff c:control_collection s:shard1  x:control_collection_shard1_replica_n1] o.a.s.u.RandomMergePolicy RandomMergePolicy wrapping class org.apache.lucene.index.LogByteSizeMergePolicy: [LogByteSizeMergePolicy: minMergeSize=1677721, mergeFactor=25, maxMergeSize=2147483648, maxMergeSizeForForcedMerge=9223372036854775807, calibrateSizeByDeletes=false, maxMergeDocs=2147483647, maxCFSSegmentSizeMB=8.796093022207999E12, noCFSRatio=0.0]
   [junit4]   2> 1737095 WARN  (qtp24986027-17953) [n:127.0.0.1:39949_fwin%2Ff c:control_collection s:shard1  x:control_collection_shard1_replica_n1] o.a.s.c.RequestHandlers INVALID paramSet a in requestHandler {type = requestHandler,name = /dump,class = DumpRequestHandler,attributes = {initParams=a, name=/dump, class=DumpRequestHandler},args = {defaults={a=A,b=B}}}
   [junit4]   2> 1737128 INFO  (qtp24986027-17953) [n:127.0.0.1:39949_fwin%2Ff c:control_collection s:shard1  x:control_collection_shard1_replica_n1] o.a.s.u.UpdateHandler Using UpdateLog implementation: org.apache.solr.update.UpdateLog
   [junit4]   2> 1737128 INFO  (qtp24986027-17953) [n:127.0.0.1:39949_fwin%2Ff c:control_collection s:shard1  x:control_collection_shard1_replica_n1] o.a.s.u.UpdateLog Initializing UpdateLog: dataDir= defaultSyncLevel=FLUSH numRecordsToKeep=100 maxNumLogsToKeep=10 numVersionBuckets=65536
   [junit4]   2> 1737129 INFO  (qtp24986027-17953) [n:127.0.0.1:39949_fwin%2Ff c:control_collection s:shard1  x:control_collection_shard1_replica_n1] o.a.s.u.CommitTracker Hard AutoCommit: disabled
   [junit4]   2> 1737129 INFO  (qtp24986027-17953) [n:127.0.0.1:39949_fwin%2Ff c:control_collection s:shard1  x:control_collection_shard1_replica_n1] o.a.s.u.CommitTracker Soft AutoCommit: disabled
   [junit4]   2> 1737130 INFO  (qtp24986027-17953) [n:127.0.0.1:39949_fwin%2Ff c:control_collection s:shard1  x:control_collection_shard1_replica_n1] o.a.s.u.RandomMergePolicy RandomMergePolicy wrapping class org.apache.lucene.index.TieredMergePolicy: [TieredMergePolicy: maxMergeAtOnce=40, maxMergeAtOnceExplicit=15, maxMergedSegmentMB=36.302734375, floorSegmentMB=1.1181640625, forceMergeDeletesPctAllowed=21.373243888006503, segmentsPerTier=32.0, maxCFSSegmentSizeMB=8.796093022207999E12, noCFSRatio=0.0
   [junit4]   2> 1737130 INFO  (qtp24986027-17953) [n:127.0.0.1:39949_fwin%2Ff c:control_collection s:shard1  x:control_collection_shard1_replica_n1] o.a.s.s.SolrIndexSearcher Opening [Searcher@369188[control_collection_shard1_replica_n1] main]
   [junit4]   2> 1737131 INFO  (qtp24986027-17953) [n:127.0.0.1:39949_fwin%2Ff c:control_collection s:shard1  x:control_collection_shard1_replica_n1] o.a.s.r.ManagedResourceStorage Configured ZooKeeperStorageIO with znodeBase: /configs/conf1
   [junit4]   2> 1737131 INFO  (qtp24986027-17953) [n:127.0.0.1:39949_fwin%2Ff c:control_collection s:shard1  x:control_collection_shard1_replica_n1] o.a.s.r.ManagedResourceStorage Loaded null at path _rest_managed.json using ZooKeeperStorageIO:path=/configs/conf1
   [junit4]   2> 1737132 INFO  (qtp24986027-17953) [n:127.0.0.1:39949_fwin%2Ff c:control_collection s:shard1  x:control_collection_shard1_replica_n1] o.a.s.h.ReplicationHandler Commits will be reserved for  10000
   [junit4]   2> 1737132 INFO  (qtp24986027-17953) [n:127.0.0.1:39949_fwin%2Ff c:control_collection s:shard1  x:control_collection_shard1_replica_n1] o.a.s.u.UpdateLog Could not find max version in index or recent updates, using new clock 1575965960145207296
   [junit4]   2> 1737133 INFO  (searcherExecutor-7388-thread-1-processing-n:127.0.0.1:39949_fwin%2Ff x:control_collection_shard1_replica_n1 s:shard1 c:control_collection) [n:127.0.0.1:39949_fwin%2Ff c:control_collection s:shard1  x:control_collection_shard1_replica_n1] o.a.s.c.SolrCore [control_collection_shard1_replica_n1] Registered new searcher Searcher@369188[control_collection_shard1_replica_n1] main{ExitableDirectoryReader(UninvertingDirectoryReader())}
   [junit4]   2> 1737135 INFO  (qtp24986027-17953) [n:127.0.0.1:39949_fwin%2Ff c:control_collection s:shard1  x:control_collection_shard1_replica_n1] o.a.s.c.ShardLeaderElectionContext Enough replicas found to continue.
   [junit4]   2> 1737135 INFO  (qtp24986027-17953) [n:127.0.0.1:39949_fwin%2Ff c:control_collection s:shard1  x:control_collection_shard1_replica_n1] o.a.s.c.ShardLeaderElectionContext I may be the new leader - try and sync
   [junit4]   2> 1737135 INFO  (qtp24986027-17953) [n:127.0.0.1:39949_fwin%2Ff c:control_collection s:shard1  x:control_collection_shard1_replica_n1] o.a.s.c.SyncStrategy Sync replicas to http://127.0.0.1:39949/fwin/f/control_collection_shard1_replica_n1/
   [junit4]   2> 1737135 INFO  (qtp24986027-17953) [n:127.0.0.1:39949_fwin%2Ff c:control_collection s:shard1  x:control_collection_shard1_replica_n1] o.a.s.c.SyncStrategy Sync Success - now sync replicas to me
   [junit4]   2> 1737135 INFO  (qtp24986027-17953) [n:127.0.0.1:39949_fwin%2Ff c:control_collection s:shard1  x:control_collection_shard1_replica_n1] o.a.s.c.SyncStrategy http://127.0.0.1:39949/fwin/f/control_collection_shard1_replica_n1/ has no replicas
   [junit4]   2> 1737135 INFO  (qtp24986027-17953) [n:127.0.0.1:39949_fwin%2Ff c:control_collection s:shard1  x:control_collection_shard1_replica_n1] o.a.s.c.ShardLeaderElectionContext Found all replicas participating in election, clear LIR
   [junit4]   2> 1737136 INFO  (qtp24986027-17953) [n:127.0.0.1:39949_fwin%2Ff c:control_collection s:shard1  x:control_collection_shard1_replica_n1] o.a.s.c.ShardLeaderElectionContext I am the new leader: http://127.0.0.1:39949/fwin/f/control_collection_shard1_replica_n1/ shard1
   [junit4]   2> 1737238 INFO  (zkCallback-2637-thread-1-processing-n:127.0.0.1:39949_fwin%2Ff) [n:127.0.0.1:39949_fwin%2Ff    ] o.a.s.c.c.ZkStateReader A cluster state change: [WatchedEvent state:SyncConnected type:NodeDataChanged path:/collections/control_collection/state.json] for collection [control_collection] has occurred - updating... (live nodes size: [1])
   [junit4]   2> 1737287 INFO  (qtp24986027-17953) [n:127.0.0.1:39949_fwin%2Ff c:control_collection s:shard1  x:control_collection_shard1_replica_n1] o.a.s.c.ZkController I am the leader, no recovery necessary
   [junit4]   2> 1737288 INFO  (qtp24986027-17953) [n:127.0.0.1:39949_fwin%2Ff c:control_collection s:shard1  x:control_collection_shard1_replica_n1] o.a.s.s.HttpSolrCall [admin] webapp=null path=/admin/cores params={qt=/admin/cores&collection.configName=conf1&newCollection=true&name=control_collection_shard1_replica_n1&action=CREATE&numShards=1&collection=control_collection&shard=shard1&wt=javabin&version=2&replicaType=NRT} status=0 QTime=1316
   [junit4]   2> 1737291 INFO  (qtp24986027-17951) [n:127.0.0.1:39949_fwin%2Ff    ] o.a.s.h.a.CollectionsHandler Wait for new collection to be active for at most 30 seconds. Check all shard replicas
   [junit4]   2> 1737392 INFO  (zkCallback-2637-thread-1-processing-n:127.0.0.1:39949_fwin%2Ff) [n:127.0.0.1:39949_fwin%2Ff    ] o.a.s.c.c.ZkStateReader A cluster state change: [WatchedEvent state:SyncConnected type:NodeDataChanged path:/collections/control_collection/state.json] for collection [control_collection] has occurred - updating... (live nodes size: [1])
   [junit4]   2> 1737869 INFO  (OverseerCollectionConfigSetProcessor-98497872402579460-127.0.0.1:39949_fwin%2Ff-n_0000000000) [n:127.0.0.1:39949_fwin%2Ff    ] o.a.s.c.OverseerTaskQueue Response ZK path: /overseer/collection-queue-work/qnr-0000000000 doesn't exist.  Requestor may have disconnected from ZooKeeper
   [junit4]   2> 1738291 INFO  (qtp24986027-17951) [n:127.0.0.1:39949_fwin%2Ff    ] o.a.s.s.HttpSolrCall [admin] webapp=null path=/admin/collections params={replicationFactor=1&collection.configName=conf1&name=control_collection&nrtReplicas=1&action=CREATE&numShards=1&createNodeSet=127.0.0.1:39949_fwin%252Ff&wt=javabin&version=2} status=0 QTime=2424
   [junit4]   2> 1738296 INFO  (TEST-HttpPartitionTest.test-seed#[AC5C69CB3F0CD5EC]) [    ] o.a.s.c.c.ZkStateReader Updated live nodes from ZooKeeper... (0) -> (1)
   [junit4]   2> 1738297 INFO  (TEST-HttpPartitionTest.test-seed#[AC5C69CB3F0CD5EC]) [    ] o.a.s.c.s.i.ZkClientClusterStateProvider Cluster at 127.0.0.1:33213/solr ready
   [junit4]   2> 1738297 INFO  (TEST-HttpPartitionTest.test-seed#[AC5C69CB3F0CD5EC]) [    ] o.a.s.c.ChaosMonkey monkey: init - expire sessions:false cause connection loss:false
   [junit4]   2> 1738297 INFO  (SocketProxy-Acceptor-39949) [    ] o.a.s.c.SocketProxy accepted Socket[addr=/127.0.0.1,port=47960,localport=39949], receiveBufferSize:531000
   [junit4]   2> 1738297 INFO  (SocketProxy-Acceptor-39949) [    ] o.a.s.c.SocketProxy proxy connection Socket[addr=/127.0.0.1,port=41053,localport=41044], receiveBufferSize=530904
   [junit4]   2> 1738297 INFO  (qtp24986027-17951) [n:127.0.0.1:39949_fwin%2Ff    ] o.a.s.h.a.CollectionsHandler Invoked Collection Action :create with params replicationFactor=1&collection.configName=conf1&name=collection1&nrtReplicas=1&action=CREATE&numShards=2&createNodeSet=&stateFormat=2&wt=javabin&version=2 and sendToOCPQueue=true
   [junit4]   2> 1738299 INFO  (OverseerThreadFactory-7385-thread-2-processing-n:127.0.0.1:39949_fwin%2Ff) [n:127.0.0.1:39949_fwin%2Ff    ] o.a.s.c.CreateCollectionCmd Create collection collection1
   [junit4]   2> 1738299 WARN  (OverseerThreadFactory-7385-thread-2-processing-n:127.0.0.1:39949_fwin%2Ff) [n:127.0.0.1:39949_fwin%2Ff    ] o.a.s.c.CreateCollectionCmd It is unusual to create a collection (collection1) without cores.
   [junit4]   2> 1738502 INFO  (qtp24986027-17951) [n:127.0.0.1:39949_fwin%2Ff    ] o.a.s.h.a.CollectionsHandler Wait for new collection to be active for at most 30 seconds. Check all shard replicas
   [junit4]   2> 1738502 INFO  (qtp24986027-17951) [n:127.0.0.1:39949_fwin%2Ff    ] o.a.s.s.HttpSolrCall [admin] webapp=null path=/admin/collections params={replicationFactor=1&collection.configName=conf1&name=collection1&nrtReplicas=1&action=CREATE&numShards=2&createNodeSet=&stateFormat=2&wt=javabin&version=2} status=0 QTime=204
   [junit4]   2> 1738585 INFO  (TEST-HttpPartitionTest.test-seed#[AC5C69CB3F0CD5EC]) [    ] o.a.s.c.AbstractFullDistribZkTestBase create jetty 1 in directory /home/jenkins/workspace/Lucene-Solr-7.x-Linux/solr/build/solr-core/test/J2/temp/solr.cloud.HttpPartitionTest_AC5C69CB3F0CD5EC-001/shard-1-001 of type TLOG
   [junit4]   2> 1738586 INFO  (TEST-HttpPartitionTest.test-seed#[AC5C69CB3F0CD5EC]) [    ] o.e.j.s.Server jetty-9.3.14.v20161028
   [junit4]   2> 1738587 INFO  (TEST-HttpPartitionTest.test-seed#[AC5C69CB3F0CD5EC]) [    ] o.e.j.s.h.ContextHandler Started o.e.j.s.ServletContextHandler@dbb617{/fwin/f,null,AVAILABLE}
   [junit4]   2> 1738587 INFO  (TEST-HttpPartitionTest.test-seed#[AC5C69CB3F0CD5EC]) [    ] o.e.j.s.AbstractConnector Started ServerConnector@f0057f{HTTP/1.1,[http/1.1]}{127.0.0.1:34451}
   [junit4]   2> 1738587 INFO  (TEST-HttpPartitionTest.test-seed#[AC5C69CB3F0CD5EC]) [    ] o.e.j.s.Server Started @1740058ms
   [junit4]   2> 1738587 INFO  (TEST-HttpPartitionTest.test-seed#[AC5C69CB3F0CD5EC]) [    ] o.a.s.c.s.e.JettySolrRunner Jetty properties: {solr.data.dir=/home/jenkins/workspace/Lucene-Solr-7.x-Linux/solr/build/solr-core/test/J2/temp/solr.cloud.HttpPartitionTest_AC5C69CB3F0CD5EC-001/tempDir-001/jetty1, replicaType=TLOG, solrconfig=solrconfig.xml, hostContext=/fwin/f, hostPort=37959, coreRootDirectory=/home/jenkins/workspace/Lucene-Solr-7.x-Linux/solr/build/solr-core/test/J2/temp/solr.cloud.HttpPartitionTest_AC5C69CB3F0CD5EC-001/shard-1-001/cores}
   [junit4]   2> 1738587 ERROR (TEST-HttpPartitionTest.test-seed#[AC5C69CB3F0CD5EC]) [    ] o.a.s.s.StartupLoggingUtils Missing Java Option solr.log.dir. Logging may be missing or incomplete.
   [junit4]   2> 1738587 INFO  (TEST-HttpPartitionTest.test-seed#[AC5C69CB3F0CD5EC]) [    ] o.a.s.s.SolrDispatchFilter  ___      _       Welcome to Apache Solr? version 7.1.0
   [junit4]   2> 1738587 INFO  (TEST-HttpPartitionTest.test-seed#[AC5C69CB3F0CD5EC]) [    ] o.a.s.s.SolrDispatchFilter / __| ___| |_ _   Starting in cloud mode on port null
   [junit4]   2> 1738587 INFO  (TEST-HttpPartitionTest.test-seed#[AC5C69CB3F0CD5EC]) [    ] o.a.s.s.SolrDispatchFilter \__ \/ _ \ | '_|  Install dir: null, Default config dir: null
   [junit4]   2> 1738587 INFO  (TEST-HttpPartitionTest.test-seed#[AC5C69CB3F0CD5EC]) [    ] o.a.s.s.SolrDispatchFilter |___/\___/_|_|    Start time: 2017-08-17T08:24:21.176Z
   [junit4]   2> 1738590 INFO  (TEST-HttpPartitionTest.test-seed#[AC5C69CB3F0CD5EC]) [    ] o.a.s.s.SolrDispatchFilter Loading solr.xml from SolrHome (not found in ZooKeeper)
   [junit4]   2> 1738590 INFO  (TEST-HttpPartitionTest.test-seed#[AC5C69CB3F0CD5EC]) [    ] o.a.s.c.SolrXmlConfig Loading container configuration from /home/jenkins/workspace/Lucene-Solr-7.x-Linux/solr/build/solr-core/test/J2/temp/solr.cloud.HttpPartitionTest_AC5C69CB3F0CD5EC-001/shard-1-001/solr.xml
   [junit4]   2> 1738593 INFO  (TEST-HttpPartitionTest.test-seed#[AC5C69CB3F0CD5EC]) [    ] o.a.s.c.SolrXmlConfig MBean server found: com.sun.jmx.mbeanserver.JmxMBeanServer@7970b7, but no JMX reporters were configured - adding default JMX reporter.
   [junit4]   2> 1738596 INFO  (TEST-HttpPartitionTest.test-seed#[AC5C69CB3F0CD5EC]) [    ] o.a.s.c.ZkContainer Zookeeper client=127.0.0.1:33213/solr
   [junit4]   2> 1738600 INFO  (TEST-HttpPartitionTest.test-seed#[AC5C69CB3F0CD5EC]) [n:127.0.0.1:37959_fwin%2Ff    ] o.a.s.c.c.ZkStateReader Updated live nodes from ZooKeeper... (0) -> (1)
   [junit4]   2> 1738601 INFO  (TEST-HttpPartitionTest.test-seed#[AC5C69CB3F0CD5EC]) [n:127.0.0.1:37959_fwin%2Ff    ] o.a.s.c.Overseer Overseer (id=null) closing
   [junit4]   2> 1738602 INFO  (TEST-HttpPartitionTest.test-seed#[AC5C69CB3F0CD5EC]) [n:127.0.0.1:37959_fwin%2Ff    ] o.a.s.c.ZkController Register node as live in ZooKeeper:/live_nodes/127.0.0.1:37959_fwin%2Ff
   [junit4]   2> 1738602 INFO  (zkCallback-2644-thread-1) [    ] o.a.s.c.c.ZkStateReader Updated live nodes from ZooKeeper... (1) -> (2)
   [junit4]   2> 1738602 INFO  (zkCallback-2637-thread-1-processing-n:127.0.0.1:39949_fwin%2Ff) [n:127.0.0.1:39949_fwin%2Ff    ] o.a.s.c.c.ZkStateReader Updated live nodes from ZooKeeper... (1) -> (2)
   [junit4]   2> 1738602 INFO  (zkCallback-2649-thread-1-processing-n:127.0.0.1:37959_fwin%2Ff) [n:127.0.0.1:37959_fwin%2Ff    ] o.a.s.c.c.ZkStateReader Updated live nodes from ZooKeeper... (1) -> (2)
   [junit4]   2> 1738677 INFO  (TEST-HttpPartitionTest.test-seed#[AC5C69CB3F0CD5EC]) [n:127.0.0.1:37959_fwin%2Ff    ] o.a.s.m.r.SolrJmxReporter JMX monitoring for 'solr.node' (registry 'solr.node') enabled at server: com.sun.jmx.mbeanserver.JmxMBeanServer@7970b7
   [junit4]   2> 1738686 INFO  (TEST-HttpPartitionTest.test-seed#[AC5C69CB3F0CD5EC]) [n:127.0.0.1:37959_fwin%2Ff    ] o.a.s.m.r.SolrJmxReporter JMX monitoring for 'solr.jvm' (registry 'solr.jvm') enabled at server: com.sun.jmx.mbeanserver.JmxMBeanServer@7970b7
   [junit4]   2> 1738686 INFO  (TEST-HttpPartitionTest.test-seed#[AC5C69CB3F0CD5EC]) [n:127.0.0.1:37959_fwin%2Ff    ] o.a.s.m.r.SolrJmxReporter JMX monitoring for 'solr.jetty' (registry 'solr.jetty') enabled at server: com.sun.jmx.mbeanserver.JmxMBeanServer@7970b7
   [junit4]   2> 1738687 INFO  (TEST-HttpPartitionTest.test-seed#[AC5C69CB3F0CD5EC]) [n:127.0.0.1:37959_fwin%2Ff    ] o.a.s.c.CorePropertiesLocator Found 0 core definitions underneath /home/jenkins/workspace/Lucene-Solr-7.x-Linux/solr/build/solr-core/test/J2/temp/solr.cloud.HttpPartitionTest_AC5C69CB3F0CD5EC-001/shard-1-001/cores
   [junit4]   2> 1738704 INFO  (qtp24986027-17952) [n:127.0.0.1:39949_fwin%2Ff    ] o.a.s.h.a.CollectionsHandler Invoked Collection Action :addreplica with params node=127.0.0.1:37959_fwin%252Ff&action=ADDREPLICA&collection=collection1&shard=shard2&type=TLOG&wt=javabin&version=2 and sendToOCPQueue=true
   [junit4]   2> 1738705 INFO  (OverseerCollectionConfigSetProcessor-98497872402579460-127.0.0.1:39949_fwin%2Ff-n_0000000000) [n:127.0.0.1:39949_fwin%2Ff    ] o.a.s.c.OverseerTaskQueue Response ZK path: /overseer/collection-queue-work/qnr-0000000002 doesn't exist.  Requestor may have disconnected from ZooKeeper
   [junit4]   2> 1738705 INFO  (OverseerThreadFactory-7385-thread-3-processing-n:127.0.0.1:39949_fwin%2Ff) [n:127.0.0.1:39949_fwin%2Ff    ] o.a.s.c.AddReplicaCmd Node Identified 127.0.0.1:37959_fwin%2Ff for creating new replica
   [junit4]   2> 1738706 INFO  (SocketProxy-Acceptor-37959) [    ] o.a.s.c.SocketProxy accepted Socket[addr=/127.0.0.1,port=41856,localport=37959], receiveBufferSize:531000
   [junit4]   2> 1738706 INFO  (SocketProxy-Acceptor-37959) [    ] o.a.s.c.SocketProxy proxy connection Socket[addr=/127.0.0.1,port=34451,localport=37622], receiveBufferSize=530904
   [junit4]   2> 1738706 INFO  (qtp24422888-17999) [n:127.0.0.1:37959_fwin%2Ff    ] o.a.s.h.a.CoreAdminOperation core create command qt=/admin/cores&collection.configName=conf1&name=collection1_shard2_replica_t41&action=CREATE&collection=collection1&shard=shard2&wt=javabin&version=2&replicaType=TLOG
   [junit4]   2> 1738706 INFO  (qtp24422888-17999) [n:127.0.0.1:37959_fwin%2Ff    ] o.a.s.c.TransientSolrCoreCacheDefault Allocating transient cache for 4 transient cores
   [junit4]   2> 1738809 INFO  (zkCallback-2649-thread-1-processing-n:127.0.0.1:37959_fwin%2Ff) [n:127.0.0.1:37959_fwin%2Ff    ] o.a.s.c.c.ZkStateReader A cluster state change: [WatchedEvent state:SyncConnected type:NodeDataChanged path:/collections/collection1/state.json] for collection [collection1] has occurred - updating... (live nodes size: [2])
   [junit4]   2> 1739718 INFO  (qtp24422888-17999) [n:127.0.0.1:37959_fwin%2Ff c:collection1 s:shard2  x:collection1_shard2_replica_t41] o.a.s.c.SolrConfig Using Lucene MatchVersion: 7.1.0
   [junit4]   2> 1739737 INFO  (qtp24422888-17999) [n:127.0.0.1:37959_fwin%2Ff c:collection1 s:shard2  x:collection1_shard2_replica_t41] o.a.s.s.IndexSchema [collection1_shard2_replica_t41] Schema name=test
   [junit4]   2> 1739823 INFO  (qtp24422888-17999) [n:127.0.0.1:37959_fwin%2Ff c:collection1 s:shard2  x:collection1_shard2_replica_t41] o.a.s.s.IndexSchema Loaded schema test/1.0 with uniqueid field id
   [junit4]   2> 1739831 INFO  (qtp24422888-17999) [n:127.0.0.1:37959_fwin%2Ff c:collection1 s:shard2  x:collection1_shard2_replica_t41] o.a.s.c.CoreContainer Creating SolrCore 'collection1_shard2_replica_t41' using configuration from collection collection1, trusted=true
   [junit4]   2> 1739831 INFO  (qtp24422888-17999) [n:127.0.0.1:37959_fwin%2Ff c:collection1 s:shard2  x:collection1_shard2_replica_t41] o.a.s.m.r.SolrJmxReporter JMX monitoring for 'solr.core.collection1.shard2.replica_t41' (registry 'solr.core.collection1.shard2.replica_t41') enabled at server: com.sun.jmx.mbeanserver.JmxMBeanServer@7970b7
   [junit4]   2> 1739831 INFO  (qtp24422888-17999) [n:127.0.0.1:37959_fwin%2Ff c:collection1 s:shard2  x:collection1_shard2_replica_t41] o.a.s.c.SolrCore solr.RecoveryStrategy.Builder
   [junit4]   2> 1739831 INFO  (qtp24422888-17999) [n:127.0.0.1:37959_fwin%2Ff c:collection1 s:shard2  x:collection1_shard2_replica_t41] o.a.s.c.SolrCore [[collection1_shard2_replica_t41] ] Opening new SolrCore at [/home/jenkins/workspace/Lucene-Solr-7.x-Linux/solr/build/solr-core/test/J2/temp/solr.cloud.HttpPartitionTest_AC5C69CB3F0CD5EC-001/shard-1-001/cores/collection1_shard2_replica_t41], dataDir=[/home/jenkins/workspace/Lucene-Solr-7.x-Linux/solr/build/solr-core/test/J2/temp/solr.cloud.HttpPartitionTest_AC5C69CB3F0CD5EC-001/shard-1-001/cores/collection1_shard2_replica_t41/data/]
   [junit4]   2> 1739834 INFO  (qtp24422888-17999) [n:127.0.0.1:37959_fwin%2Ff c:collection1 s:shard2  x:collection1_shard2_replica_t41] o.a.s.u.RandomMergePolicy RandomMergePolicy wrapping class org.apache.lucene.index.LogByteSizeMergePolicy: [LogByteSizeMergePolicy: minMergeSize=1677721, mergeFactor=25, maxMergeSize=2147483648, maxMergeSizeForForcedMerge=9223372036854775807, calibrateSizeByDeletes=false, maxMergeDocs=2147483647, maxCFSSegmentSizeMB=8.796093022207999E12, noCFSRatio=0.0]
   [junit4]   2> 1739835 WARN  (qtp24422888-17999) [n:127.0.0.1:37959_fwin%2Ff c:collection1 s:shard2  x:collection1_shard2_replica_t41] o.a.s.c.RequestHandlers INVALID paramSet a in requestHandler {type = requestHandler,name = /dump,class = DumpRequestHandler,attributes = {initParams=a, name=/dump, class=DumpRequestHandler},args = {defaults={a=A,b=B}}}
   [junit4]   2> 1739867 INFO  (qtp24422888-17999) [n:127.0.0.1:37959_fwin%2Ff c:collection1 s:shard2  x:collection1_shard2_replica_t41] o.a.s.u.UpdateHandler Using UpdateLog implementation: org.apache.solr.update.UpdateLog
   [junit4]   2> 1739867 INFO  (qtp24422888-17999) [n:127.0.0.1:37959_fwin%2Ff c:collection1 s:shard2  x:collection1_shard2_replica_t41] o.a.s.u.UpdateLog Initializing UpdateLog: dataDir= defaultSyncLevel=FLUSH numRecordsToKeep=100 maxNumLogsToKeep=10 numVersionBuckets=65536
   [junit4]   2> 1739868 INFO  (qtp24422888-17999) [n:127.0.0.1:37959_fwin%2Ff c:collection1 s:shard2  x:collection1_shard2_replica_t41] o.a.s.u.CommitTracker Hard AutoCommit: disabled
   [junit4]   2> 1739868 INFO  (qtp24422888-17999) [n:127.0.0.1:37959_fwin%2Ff c:collection1 s:shard2  x:collection1_shard2_replica_t41] o.a.s.u.CommitTracker Soft AutoCommit: disabled
   [junit4]   2> 1739869 INFO  (qtp24422888-17999) [n:127.0.0.1:37959_fwin%2Ff c:collection1 s:shard2  x:collection1_shard2_replica_t41] o.a.s.u.RandomMergePolicy RandomMergePolicy wrapping class org.apache.lucene.index.TieredMergePolicy: [TieredMergePolicy: maxMergeAtOnce=40, maxMergeAtOnceExplicit=15, maxMergedSegmentMB=36.302734375, floorSegmentMB=1.1181640625, forceMergeDeletesPctAllowed=21.373243888006503, segmentsPerTier=32.0, maxCFSSegmentSizeMB=8.796093022207999E12, noCFSRatio=0.0
   [junit4]   2> 1739869 INFO  (qtp24422888-17999) [n:127.0.0.1:37959_fwin%2Ff c:collection1 s:shard2  x:collection1_shard2_replica_t41] o.a.s.s.SolrIndexSearcher Opening [Searcher@1212457[collection1_shard2_replica_t41] main]
   [junit4]   2> 1739870 INFO  (qtp24422888-17999) [n:127.0.0.1:37959_fwin%2Ff c:collection1 s:shard2  x:collection1_shard2_replica_t41] o.a.s.r.ManagedResourceStorage Configured ZooKeeperStorageIO with znodeBase: /configs/conf1
   [junit4]   2> 1739870 INFO  (qtp24422888-17999) [n:127.0.0.1:37959_fwin%2Ff c:collection1 s:shard2  x:collection1_shard2_replica_t41] o.a.s.r.ManagedResourceStorage Loaded null at path _rest_managed.json using ZooKeeperStorageIO:path=/configs/conf1
   [junit4]   2> 1739870 INFO  (qtp24422888-17999) [n:127.0.0.1:37959_fwin%2Ff c:collection1 s:shard2  x:collection1_shard2_replica_t41] o.a.s.h.ReplicationHandler Commits will be reserved for  10000
   [junit4]   2> 1739871 INFO  (searcherExecutor-7399-thread-1-processing-n:127.0.0.1:37959_fwin%2Ff x:collection1_shard2_replica_t41 s:shard2 c:collection1) [n:127.0.0.1:37959_fwin%2Ff c:collection1 s:shard2  x:collection1_shard2_replica_t41] o.a.s.c.SolrCore [collection1_shard2_replica_t41] Registered new searcher Searcher@1212457[collection1_shard2_replica_t41] main{ExitableDirectoryReader(UninvertingDirectoryReader())}
   [junit4]   2> 1739871 INFO  (qtp24422888-17999) [n:127.0.0.1:37959_fwin%2Ff c:collection1 s:shard2  x:collection1_shard2_replica_t41] o.a.s.u.UpdateLog Could not find max version in index or recent updates, using new clock 1575965963017256960
   [junit4]   2> 1739875 INFO  (qtp24422888-17999) [n:127.0.0.1:37959_fwin%2Ff c:collection1 s:shard2  x:collection1_shard2_replica_t41] o.a.s.c.ShardLeaderElectionContext Enough replicas found to continue.
   [junit4]   2> 1739875 INFO  (qtp24422888-17999) [n:127.0.0.1:37959_fwin%2Ff c:collection1 s:shard2  x:collection1_shard2_replica_t41] o.a.s.c.ShardLeaderElectionContext I may be the new leader - try and sync
   [junit4]   2> 1739875 INFO  (qtp24422888-17999) [n:127.0.0.1:37959_fwin%2Ff c:collection1 s:shard2  x:collection1_shard2_replica_t41] o.a.s.c.SyncStrategy Sync replicas to http://127.0.0.1:37959/fwin/f/collection1_shard2_replica_t41/
   [junit4]   2> 1739875 INFO  (qtp24422888-17999) [n:127.0.0.1:37959_fwin%2Ff c:collection1 s:shard2  x:collection1_shard2_replica_t41] o.a.s.c.SyncStrategy Sync Success - now sync replicas to me
   [junit4]   2> 1739875 INFO  (qtp24422888-17999) [n:127.0.0.1:37959_fwin%2Ff c:collection1 s:shard2  x:collection1_shard2_replica_t41] o.a.s.c.SyncStrategy http://127.0.0.1:37959/fwin/f/collection1_shard2_replica_t41/ has no replicas
   [junit4]   2> 1739875 INFO  (qtp24422888-17999) [n:127.0.0.1:37959_fwin%2Ff c:collection1 s:shard2  x:collection1_shard2_replica_t41] o.a.s.c.ShardLeaderElectionContext Found all replicas participating in election, clear LIR
   [junit4]   2> 1739875 INFO  (qtp24422888-17999) [n:127.0.0.1:37959_fwin%2Ff c:collection1 s:shard2  x:collection1_shard2_replica_t41] o.a.s.c.ZkController collection1_shard2_replica_t41 stopping background replication from leader
   [junit4]   2> 1739876 INFO  (qtp24422888-17999) [n:127.0.0.1:37959_fwin%2Ff c:collection1 s:shard2  x:collection1_shard2_replica_t41] o.a.s.c.ShardLeaderElectionContext I am the new leader: http://127.0.0.1:37959/fwin/f/collection1_shard2_replica_t41/ shard2
   [junit4]   2> 1739977 INFO  (zkCallback-2649-thread-1-processing-n:127.0.0.1:37959_fwin%2Ff) [n:127.0.0.1:37959_fwin%2Ff    ] o.a.s.c.c.ZkStateReader A cluster state change: [WatchedEvent state:SyncConnected type:NodeDataChanged path:/collections/collection1/state.json] for collection [collection1] has occurred - updating... (live nodes size: [2])
   [junit4]   2> 1740027 INFO  (qtp24422888-17999) [n:127.0.0.1:37959_fwin%2Ff c:collection1 s:shard2  x:collection1_shard2_replica_t41] o.a.s.c.ZkController I am the leader, no recovery necessary
   [junit4]   2> 1740028 INFO  (qtp24422888-17999) [n:127.0.0.1:37959_fwin%2Ff c:collection1 s:shard2  x:collection1_shard2_replica_t41] o.a.s.s.HttpSolrCall [admin] webapp=null path=/admin/cores params={qt=/admin/cores&collection.configName=conf1&name=collection1_shard2_replica_t41&action=CREATE&collection=collection1&shard=shard2&wt=javabin&version=2&replicaType=TLOG} status=0 QTime=1321
   [junit4]   2> 1740029 INFO  (qtp24986027-17952) [n:127.0.0.1:39949_fwin%2Ff    ] o.a.s.s.HttpSolrCall [admin] webapp=null path=/admin/collections params={node=127.0.0.1:37959_fwin%252Ff&action=ADDREPLICA&collection=collection1&shard=shard2&type=TLOG&wt=javabin&version=2} status=0 QTime=1325
   [junit4]   2> 1740115 INFO  (TEST-HttpPartitionTest.test-seed#[AC5C69CB3F0CD5EC]) [    ] o.a.s.c.AbstractFullDistribZkTestBase create jetty 2 in directory /home/jenkins/workspace/Lucene-Solr-7.x-Linux/solr/build/solr-core/test/J2/temp/solr.cloud.HttpPartitionTest_AC5C69CB3F0CD5EC-001/shard-2-001 of type TLOG
   [junit4]   2> 1740116 INFO  (TEST-HttpPartitionTest.test-seed#[AC5C69CB3F0CD5EC]) [    ] o.e.j.s.Server jetty-9.3.14.v20161028
   [junit4]   2> 1740117 INFO  (TEST-HttpPartitionTest.test-seed#[AC5C69CB3F0CD5EC]) [    ] o.e.j.s.h.ContextHandler Started o.e.j.s.ServletContextHandler@1f0614d{/fwin/f,null,AVAILABLE}
   [junit4]   2> 1740117 INFO  (TEST-HttpPartitionTest.test-seed#[AC5C69CB3F0CD5EC]) [    ] o.e.j.s.AbstractConnector Started ServerConnector@ff26da{HTTP/1.1,[http/1.1]}{127.0.0.1:37223}
   [junit4]   2> 1740117 INFO  (TEST-HttpPartitionTest.test-seed#[AC5C69CB3F0CD5EC]) [    ] o.e.j.s.Server Started @1741588ms
   [junit4]   2> 1740117 INFO  (TEST-HttpPartitionTest.test-seed#[AC5C69CB3F0CD5EC]) [    ] o.a.s.c.s.e.JettySolrRunner Jetty properties: {solr.data.dir=/home/jenkins/workspace/Lucene-Solr-7.x-Linux/solr/build/solr-core/test/J2/temp/solr.cloud.HttpPartitionTest_AC5C69CB3F0CD5EC-001/tempDir-001/jetty2, replicaType=TLOG, solrconfig=solrconfig.xml, hostContext=/fwin/f, hostPort=44425, coreRootDirectory=/home/jenkins/workspace/Lucene-Solr-7.x-Linux/solr/build/solr-core/test/J2/temp/solr.cloud.HttpPartitionTest_AC5C69CB3F0CD5EC-001/shard-2-001/cores}
   [junit4]   2> 1740117 ERROR (TEST-HttpPartitionTest.test-seed#[AC5C69CB3F0CD5EC]) [    ] o.a.s.s.StartupLoggingUtils Missing Java Option solr.log.dir. Logging may be missing or incomplete.
   [junit4]   2> 1740117 INFO  (TEST-HttpPartitionTest.test-seed#[AC5C69CB3F0CD5EC]) [    ] o.a.s.s.SolrDispatchFilter  ___      _       Welcome to Apache Solr? version 7.1.0
   [junit4]   2> 1740117 INFO  (TEST-HttpPartitionTest.test-seed#[AC5C69CB3F0CD5EC]) [    ] o.a.s.s.SolrDispatchFilter / __| ___| |_ _   Starting in cloud mode on port null
   [junit4]   2> 1740117 INFO  (TEST-HttpPartitionTest.test-seed#[AC5C69CB3F0CD5EC]) [    ] o.a.s.s.SolrDispatchFilter \__ \/ _ \ | '_|  Install dir: null, Default config dir: null
   [junit4]   2> 1740118 INFO  (TEST-HttpPartitionTest.test-seed#[AC5C69CB3F0CD5EC]) [    ] o.a.s.s.SolrDispatchFilter |___/\___/_|_|    Start time: 2017-08-17T08:24:22.707Z
   [junit4]   2> 1740119 INFO  (TEST-HttpPartitionTest.test-seed#[AC5C69CB3F0CD5EC]) [    ] o.a.s.s.SolrDispatchFilter Loading solr.xml from SolrHome (not found in ZooKeeper)
   [junit4]   2> 1740120 INFO  (TEST-HttpPartitionTest.test-seed#[AC5C69CB3F0CD5EC]) [    ] o.a.s.c.SolrXmlConfig Loading container configuration from /home/jenkins/workspace/Lucene-Solr-7.x-Linux/solr/build/solr-core/test/J2/temp/solr.cloud.HttpPartitionTest_AC5C69CB3F0CD5EC-001/shard-2-001/solr.xml
   [junit4]   2> 1740123 INFO  (TEST-HttpPartitionTest.test-seed#[AC5C69CB3F0CD5EC]) [    ] o.a.s.c.SolrXmlConfig MBean server found: com.sun.jmx.mbeanserver.JmxMBeanServer@7970b7, but no JMX reporters were configured - adding default JMX reporter.
   [junit4]   2> 1740125 INFO  (TEST-HttpPartitionTest.test-seed#[AC5C69CB3F0CD5EC]) [    ] o.a.s.c.ZkContainer Zookeeper client=127.0.0.1:33213/solr
   [junit4]   2> 1740129 INFO  (zkCallback-2649-thread-1-processing-n:127.0.0.1:37959_fwin%2Ff) [n:127.0.0.1:37959_fwin%2Ff    ] o.a.s.c.c.ZkStateReader A cluster state change: [WatchedEvent state:SyncConnected type:NodeDataChanged path:/collections/collection1/state.json] for collection [collection1] has occurred - updating... (live nodes size: [2])
   [junit4]   2> 1740130 INFO  (TEST-HttpPartitionTest.test-seed#[AC5C69CB3F0CD5EC]) [n:127.0.0.1:44425_fwin%2Ff    ] o.a.s.c.c.ZkStateReader Updated live nodes from ZooKeeper... (0) -> (2)
   [junit4]   2> 1740131 INFO  (TEST-HttpPartitionTest.test-seed#[AC5C69CB3F0CD5EC]) [n:127.0.0.1:44425_fwin%2Ff    ] o.a.s.c.Overseer Overseer (id=null) closing
   [junit4]   2> 1740132 INFO  (TEST-HttpPartitionTest.test-seed#[AC5C69CB3F0CD5EC]) [n:127.0.0.1:44425_fwin%2Ff    ] o.a.s.c.ZkController Register node as live in ZooKeeper:/live_nodes/127.0.0.1:44425_fwin%2Ff
   [junit4]   2> 1740132 INFO  (zkCallback-2649-thread-1-processing-n:127.0.0.1:37959_fwin%2Ff) [n:127.0.0.1:37959_fwin%2Ff    ] o.a.s.c.c.ZkStateReader Updated live nodes from ZooKeeper... (2) -> (3)
   [junit4]   2> 1740132 INFO  (zkCallback-2637-thread-2-processing-n:127.0.0.1:39949_fwin%2Ff) [n:127.0.0.1:39949_fwin%2Ff    ] o.a.s.c.c.ZkStateReader Updated live nodes from ZooKeeper... (2) -> (3)
   [junit4]   2> 1740132 INFO  (zkCallback-2644-thread-1) [    ] o.a.s.c.c.ZkStateReader Updated live nodes from ZooKeeper... (2) -> (3)
   [junit4]   2> 1740132 INFO  (zkCallback-2655-thread-1-processing-n:127.0.0.1:44425_fwin%2Ff) [n:127.0.0.1:44425_fwin%2Ff    ] o.a.s.c.c.ZkStateReader Updated live nodes from ZooKeeper... (2) -> (3)
   [junit4]   2> 1740216 INFO  (TEST-HttpPartitionTest.test-seed#[AC5C69CB3F0CD5EC]) [n:127.0.0.1:44425_fwin%2Ff    ] o.a.s.m.r.SolrJmxReporter JMX monitoring for 'solr.node' (registry 'solr.node') enabled at server: com.sun.jmx.mbeanserver.JmxMBeanServer@7970b7
   [junit4]   2> 1740224 INFO  (TEST-HttpPartitionTest.test-seed#[AC5C69CB3F0CD5EC]) [n:127.0.0.1:44425_fwin%2Ff    ] o.a.s.m.r.SolrJmxReporter JMX monitoring for 'solr.jvm' (registry 'solr.jvm') enabled at server: com.sun.jmx.mbeanserver.JmxMBeanServer@7970b7
   [junit4]   2> 1740224 INFO  (TEST-HttpPartitionTest.test-seed#[AC5C69CB3F0CD5EC]) [n:127.0.0.1:44425_fwin%2Ff    ] o.a.s.m.r.SolrJmxReporter JMX monitoring for 'solr.jetty' (registry 'solr.jetty') enabled at server: com.sun.jmx.mbeanserver.JmxMBeanServer@7970b7
   [junit4]   2> 1740225 INFO  (TEST-HttpPartitionTest.test-seed#[AC5C69CB3F0CD5EC]) [n:127.0.0.1:44425_fwin%2Ff    ] o.a.s.c.CorePropertiesLocator Found 0 core definitions underneath /home/jenkins/workspace/Lucene-Solr-7.x-Linux/solr/build/solr-core/test/J2/temp/solr.cloud.HttpPartitionTest_AC5C69CB3F0CD5EC-001/shard-2-001/cores
   [junit4]   2> 1740247 INFO  (SocketProxy-Acceptor-44425) [    ] o.a.s.c.SocketProxy accepted Socket[addr=/127.0.0.1,port=40542,localport=44425], receiveBufferSize:531000
   [junit4]   2> 1740247 INFO  (SocketProxy-Acceptor-44425) [    ] o.a.s.c.SocketProxy proxy connection Socket[addr=/127.0.0.1,port=37223,localport=53718], receiveBufferSize=530904
   [junit4]   2> 1740248 INFO  (qtp6686608-18032) [n:127.0.0.1:44425_fwin%2Ff    ] o.a.s.h.a.CollectionsHandler Invoked Collection Action :addreplica with params node=127.0.0.1:44425_fwin%252Ff&action=ADDREPLICA&collection=collection1&shard=shard1&type=TLOG&wt=javabin&version=2 and sendToOCPQueue=true
   [junit4]   2> 1740249 INFO  (OverseerCollectionConfigSetProcessor-98497872402579460-127.0.0.1:39949_fwin%2Ff-n_0000000000) [n:127.0.0.1:39949_fwin%2Ff    ] o.a.s.c.OverseerTaskQueue Response ZK path: /overseer/collection-queue-work/qnr-0000000004 doesn't exist.  Requestor may have disconnected from ZooKeeper
   [junit4]   2> 1740249 INFO  (OverseerThreadFactory-7385-thread-4-processing-n:127.0.0.1:39949_fwin%2Ff) [n:127.0.0.1:39949_fwin%2Ff    ] o.a.s.c.AddReplicaCmd Node Identified 127.0.0.1:44425_fwin%2Ff for creating new replica
   [junit4]   2> 1740250 INFO  (SocketProxy-Acceptor-44425) [    ] o.a.s.c.SocketProxy accepted Socket[addr=/127.0.0.1,port=40546,localport=44425], receiveBufferSize:531000
   [junit4]   2> 1740250 INFO  (SocketProxy-Acceptor-44425) [    ] o.a.s.c.SocketProxy proxy connection Socket[addr=/127.0.0.1,port=37223,localport=53722], receiveBufferSize=530904
   [junit4]   2> 1740250 INFO  (qtp6686608-18034) [n:127.0.0.1:44425_fwin%2Ff    ] o.a.s.h.a.CoreAdminOperation core create command qt=/admin/cores&collection.configName=conf1&name=collection1_shard1_replica_t43&action=CREATE&collection=collection1&shard=shard1&wt=javabin&version=2&replicaType=TLOG
   [junit4]   2> 1740250 INFO  (qtp6686608-18034) [n:127.0.0.1:44425_fwin%2Ff    ] o.a.s.c.TransientSolrCoreCacheDefault Allocating transient cache for 4 transient cores
   [junit4]   2> 1740352 INFO  (zkCallback-2649-thread-1-processing-n:127.0.0.1:37959_fwin%2Ff) [n:127.0.0.1:37959_fwin%2Ff    ] o.a.s.c.c.ZkStateReader A cluster state change: [WatchedEvent state:SyncConnected type:NodeDataChanged path:/collections/collection1/state.json] for collection [collection1] has occurred - updating... (live nodes size: [3])
   [junit4]   2> 1740352 INFO  (zkCallback-2655-thread-1-processing-n:127.0.0.1:44425_fwin%2Ff) [n:127.0.0.1:44425_fwin%2Ff    ] o.a.s.c.c.ZkStateReader A cluster state change: [WatchedEvent state:SyncConnected type:NodeDataChanged path:/collections/collection1/state.json] for collection [collection1] has occurred - updating... (live nodes size: [3])
   [junit4]   2> 1741261 INFO  (qtp6686608-18034) [n:127.0.0.1:44425_fwin%2Ff c:collection1 s:shard1  x:collection1_shard1_replica_t43] o.a.s.c.SolrConfig Using Lucene MatchVersion: 7.1.0
   [junit4]   2> 1741272 INFO  (qtp6686608-18034) [n:127.0.0.1:44425_fwin%2Ff c:collection1 s:shard1  x:collection1_shard1_replica_t43] o.a.s.s.IndexSchema [collection1_shard1_replica_t43] Schema name=test
   [junit4]   2> 1741357 INFO  (qtp6686608-18034) [n:127.0.0.1:44425_fwin%2Ff c:collection1 s:shard1  x:collection1_shard1_replica_t43] o.a.s.s.IndexSchema Loaded schema test/1.0 with uniqueid field id
   [junit4]   2> 1741365 INFO  (qtp6686608-18034) [n:127.0.0.1:44425_fwin%2Ff c:collection1 s:shard1  x:collection1_shard1_replica_t43] o.a.s.c.CoreContainer Creating SolrCore 'collection1_shard1_replica_t43' using configuration from collection collection1, trusted=true
   [junit4]   2> 1741365 INFO  (qtp6686608-18034) [n:127.0.0.1:44425_fwin%2Ff c:collection1 s:shard1  x:collection1_shard1_replica_t43] o.a.s.m.r.SolrJmxReporter JMX monitoring for 'solr.core.collection1.shard1.replica_t43' (registry 'solr.core.collection1.shard1.replica_t43') enabled at server: com.sun.jmx.mbeanserver.JmxMBeanServer@7970b7
   [junit4]   2> 1741365 INFO  (qtp6686608-18034) [n:127.0.0.1:44425_fwin%2Ff c:collection1 s:shard1  x:collection1_shard1_replica_t43] o.a.s.c.SolrCore solr.RecoveryStrategy.Builder
   [junit4]   2> 1741365 INFO  (qtp6686608-18034) [n:127.0.0.1:44425_fwin%2Ff c:collection1 s:shard1  x:collection1_shard1_replica_t43] o.a.s.c.SolrCore [[collection1_shard1_replica_t43] ] Opening new SolrCore at [/home/jenkins/workspace/Lucene-Solr-7.x-Linux/solr/build/solr-core/test/J2/temp/solr.cloud.HttpPartitionTest_AC5C69CB3F0CD5EC-001/shard-2-001/cores/collection1_shard1_replica_t43], dataDir=[/home/jenkins/workspace/Lucene-Solr-7.x-Linux/solr/build/solr-core/test/J2/temp/solr.cloud.HttpPartitionTest_AC5C69CB3F0CD5EC-001/shard-2-001/cores/collection1_shard1_replica_t43/data/]
   [junit4]   2> 1741368 INFO  (qtp6686608-18034) [n:127.0.0.1:44425_fwin%2Ff c:collection1 s:shard1  x:collection1_shard1_replica_t43] o.a.s.u.RandomMergePolicy RandomMergePolicy wrapping class org.apache.lucene.index.LogByteSizeMergePolicy: [LogByteSizeMergePolicy: minMergeSize=1677721, mergeFactor=25, maxMergeSize=2147483648, maxMergeSizeForForcedMerge=9223372036854775807, calibrateSizeByDeletes=false, maxMergeDocs=2147483647, maxCFSSegmentSizeMB=8.796093022207999E12, noCFSRatio=0.0]
   [junit4]   2> 1741369 WARN  (qtp6686608-18034) [n:127.0.0.1:44425_fwin%2Ff c:collection1 s:shard1  x:collection1_shard1_replica_t43] o.a.s.c.RequestHandlers INVALID paramSet a in requestHandler {type = requestHandler,name = /dump,class = DumpRequestHandler,attributes = {initParams=a, name=/dump, class=DumpRequestHandler},args = {defaults={a=A,b=B}}}
   [junit4]   2> 1741405 INFO  (qtp6686608-18034) [n:127.0.0.1:44425_fwin%2Ff c:collection1 s:shard1  x:collection1_shard1_replica_t43] o.a.s.u.UpdateHandler Using UpdateLog implementation: org.apache.solr.update.UpdateLog
   [junit4]   2> 1741406 INFO  (qtp6686608-18034) [n:127.0.0.1:44425_fwin%2Ff c:collection1 s:shard1  x:collection1_shard1_replica_t43] o.a.s.u.UpdateLog Initializing UpdateLog: dataDir= defaultSyncLevel=FLUSH numRecordsToKeep=100 maxNumLogsToKeep=10 numVersionBuckets=65536
   [junit4]   2> 1741406 INFO  (qtp6686608-18034) [n:127.0.0.1:44425_fwin%2Ff c:collection1 s:shard1  x:collection1_shard1_replica_t43] o.a.s.u.CommitTracker Hard AutoCommit: disabled
   [junit4]   2> 1741407 INFO  (qtp6686608-18034) [n:127.0.0.1:44425_fwin%2Ff c:collection1 s:shard1  x:collection1_shard1_replica_t43] o.a.s.u.CommitTracker Soft AutoCommit: disabled
   [junit4]   2> 1741408 INFO  (qtp6686608-18034) [n:127.0.0.1:44425_fwin%2Ff c:collection1 s:shard1  x:collection1_shard1_replica_t43] o.a.s.u.RandomMergePolicy RandomMergePolicy wrapping class org.apache.lucene.index.TieredMergePolicy: [TieredMergePolicy: maxMergeAtOnce=40, maxMergeAtOnceExplicit=15, maxMergedSegmentMB=36.302734375, floorSegmentMB=1.1181640625, forceMergeDeletesPctAllowed=21.373243888006503, segmentsPerTier=32.0, maxCFSSegmentSizeMB=8.796093022207999E12, noCFSRatio=0.0
   [junit4]   2> 1741408 INFO  (qtp6686608-18034) [n:127.0.0.1:44425_fwin%2Ff c:collection1 s:shard1  x:collection1_shard1_replica_t43] o.a.s.s.SolrIndexSearcher Opening [Searcher@1ef1813[collection1_shard1_replica_t43] main]
   [junit4]   2> 1741409 INFO  (qtp6686608-18034) [n:127.0.0.1:44425_fwin%2Ff c:collection1 s:shard1  x:collection1_shard1_replica_t43] o.a.s.r.ManagedResourceStorage Configured ZooKeeperStorageIO with znodeBase: /configs/conf1
   [junit4]   2> 1741409 INFO  (qtp6686608-18034) [n:127.0.0.1:44425_fwin%2Ff c:collection1 s:shard1  x:collection1_shard1_replica_t43] o.a.s.r.ManagedResourceStorage Loaded null at path _rest_managed.json using ZooKeeperStorageIO:path=/configs/conf1
   [junit4]   2> 1741410 INFO  (qtp6686608-18034) [n:127.0.0.1:44425_fwin%2Ff c:collection1 s:shard1  x:collection1_shard1_replica_t43] o.a.s.h.ReplicationHandler Commits will be reserved for  10000
   [junit4]   2> 1741412 INFO  (searcherExecutor-7410-thread-1-processing-n:127.0.0.1:44425_fwin%2Ff x:collection1_shard1_replica_t43 s:shard1 c:collection1) [n:127.0.0.1:44425_fwin%2Ff c:collection1 s:shard1  x:collection1_shard1_replica_t43] o.a.s.c.SolrCore [collection1_shard1_replica_t43] Registered new searcher Searcher@1ef1813[collection1_shard1_replica_t43] main{ExitableDirectoryReader(UninvertingDirectoryReader())}
   [junit4]   2> 1741412 INFO  (qtp6686608-18034) [n:127.0.0.1:44425_fwin%2Ff c:collection1 s:shard1  x:collection1_shard1_replica_t43] o.a.s.u.UpdateLog Could not find max version in index or recent updates, using new clock 1575965964633112576
   [junit4]   2> 1741415 INFO  (qtp6686608-18034) [n:127.0.0.1:44425_fwin%2Ff c:collection1 s:shard1  x:collection1_shard1_replica_t43] o.a.s.c.ShardLeaderElectionContext Enough replicas found to continue.
   [junit4]   2> 1741415 INFO  (qtp6686608-18034) [n:127.0.0.1:44425_fwin%2Ff c:collection1 s:shard1  x:collection1_shard1_replica_t43] o.a.s.c.ShardLeaderElectionContext I may be the new leader - try and sync
   [junit4]   2> 1741415 INFO  (qtp6686608-18034) [n:127.0.0.1:44425_fwin%2Ff c:collection1 s:shard1  x:collection1_shard1_replica_t43] o.a.s.c.SyncStrategy Sync replicas to http://127.0.0.1:44425/fwin/f/collection1_shard1_replica_t43/
   [junit4]   2> 1741415 INFO  (qtp6686608-18034) [n:127.0.0.1:44425_fwin%2Ff c:collection1 s:shard1  x:collection1_shard1_replica_t43] o.a.s.c.SyncStrategy Sync Success - now sync replicas to me
   [junit4]   2> 1741415 INFO  (qtp6686608-18034) [n:127.0.0.1:44425_fwin%2Ff c:collection1 s:shard1  x:collection1_shard1_replica_t43] o.a.s.c.SyncStrategy http://127.0.0.1:44425/fwin/f/collection1_shard1_replica_t43/ has no replicas
   [junit4]   2> 1741415 INFO  (qtp6686608-18034) [n:127.0.0.1:44425_fwin%2Ff c:collection1 s:shard1  x:collection1_shard1_replica_t43] o.a.s.c.ShardLeaderElectionContext Found all replicas participating in election, clear LIR
   [junit4]   2> 1741416 INFO  (qtp6686608-18034) [n:127.0.0.1:44425_fwin%2Ff c:collection1 s:shard1  x:collection1_shard1_replica_t43] o.a.s.c.ZkController collection1_shard1_replica_t43 stopping background replication from leader
   [junit4]   2> 1741416 INFO  (qtp6686608-18034) [n:127.0.0.1:44425_fwin%2Ff c:collection1 s:shard1  x:collection1_shard1_replica_t43] o.a.s.c.ShardLeaderElectionContext I am the new leader: http://127.0.0.1:44425/fwin/f/collection1_shard1_replica_t43/ shard1
   [junit4]   2> 1741518 INFO  (zkCallback-2649-thread-1-processing-n:127.0.0.1:37959_fwin%2Ff) [n:127.0.0.1:37959_fwin%2Ff    ] o.a.s.c.c.ZkStateReader A cluster state change: [WatchedEvent state:SyncConnected type:NodeDataChanged path:/collections/collection1/state.json] for collection [collection1] has occurred - updating... (live nodes size: [3])
   [junit4]   2> 1741518 INFO  (zkCallback-2655-thread-1-processing-n:127.0.0.1:44425_fwin%2Ff) [n:127.0.0.1:44425_fwin%2Ff    ] o.a.s.c.c.ZkStateReader A cluster state change: [WatchedEvent state:SyncConnected type:NodeDataChanged path:/collections/collection1/state.json] for collection [collection1] has occurred - updating... (live nodes size: [3])
   [junit4]   2> 1741567 INFO  (qtp6686608-18034) [n:127.0.0.1:44425_fwin%2Ff c:collection1 s:shard1  x:collection1_shard1_replica_t43] o.a.s.c.ZkController I am the leader, no recovery necessary
   [junit4]   2> 1741568 INFO  (qtp6686608-18034) [n:127.0.0.1:44425_fwin%2Ff c:collection1 s:shard1  x:collection1_shard1_replica_t43] o.a.s.s.HttpSolrCall [admin] webapp=null path=/admin/cores params={qt=/admin/cores&collection.configName=conf1&name=collection1_shard1_replica_t43&action=CREATE&collection=collection1&shard=shard1&wt=javabin&version=2&replicaType=TLOG} status=0 QTime=1318
   [junit4]   2> 1741570 INFO  (qtp6686608-18032) [n:127.0.0.1:44425_fwin%2Ff    ] o.a.s.s.HttpSolrCall [admin] webapp=null path=/admin/collections params={node=127.0.0.1:44425_fwin%252Ff&action=ADDREPLICA&collection=collection1&shard=shard1&type=TLOG&wt=javabin&version=2} status=0 QTime=1322
   [junit4]   2> 1741640 INFO  (TEST-HttpPartitionTest.test-seed#[AC5C69CB3F0CD5EC]) [    ] o.a.s.c.AbstractFullDistribZkTestBase create jetty 3 in directory /home/jenkins/workspace/Lucene-Solr-7.x-Linux/solr/build/solr-core/test/J2/temp/solr.cloud.HttpPartitionTest_AC5C69CB3F0CD5EC-001/shard-3-001 of type TLOG
   [junit4]   2> 1741640 INFO  (TEST-HttpPartitionTest.test-seed#[AC5C69CB3F0CD5EC]) [    ] o.e.j.s.Server jetty-9.3.14.v20161028
   [junit4]   2> 1741640 INFO  (TEST-HttpPartitionTest.test-seed#[AC5C69CB3F0CD5EC]) [    ] o.e.j.s.h.ContextHandler Started o.e.j.s.ServletContextHandler@4de49c{/fwin/f,null,AVAILABLE}
   [junit4]   2> 1741641 INFO  (TEST-HttpPartitionTest.test-seed#[AC5C69CB3F0CD5EC]) [    ] o.e.j.s.AbstractConnector Started ServerConnector@1d9dfe4{HTTP/1.1,[http/1.1]}{127.0.0.1:41055}
   [junit4]   2> 1741641 INFO  (TEST-HttpPartitionTest.test-seed#[AC5C69CB3F0CD5EC]) [    ] o.e.j.s.Server Started @1743112ms
   [junit4]   2> 1741641 INFO  (TEST-HttpPartitionTest.test-seed#[AC5C69CB3F0CD5EC]) [    ] o.a.s.c.s.e.JettySolrRunner Jetty properties: {solr.data.dir=/home/jenkins/workspace/Lucene-Solr-7.x-Linux/solr/build/solr-core/test/J2/temp/solr.cloud.HttpPartitionTest_AC5C69CB3F0CD5EC-001/tempDir-001/jetty3, replicaType=TLOG, solrconfig=solrconfig.xml, hostContext=/fwin/f, hostPort=37895, coreRootDirectory=/home/jenkins/workspace/Lucene-Solr-7.x-Linux/solr/build/solr-core/test/J2/temp/solr.cloud.HttpPartitionTest_AC5C69CB3F0CD5EC-001/shard-3-001/cores}
   [junit4]   2> 1741641 ERROR (TEST-HttpPartitionTest.test-seed#[AC5C69CB3F0CD5EC]) [    ] o.a.s.s.StartupLoggingUtils Missing Java Option solr.log.dir. Logging may be missing or incomplete.
   [junit4]   2> 1741641 INFO  (TEST-HttpPartitionTest.test-seed#[AC5C69CB3F0CD5EC]) [    ] o.a.s.s.SolrDispatchFilter  ___      _       Welcome to Apache Solr? version 7.1.0
   [junit4]   2> 1741641 INFO  (TEST-HttpPartitionTest.test-seed#[AC5C69CB3F0CD5EC]) [    ] o.a.s.s.SolrDispatchFilter / __| ___| |_ _   Starting in cloud mode on port null
   [junit4]   2> 1741641 INFO  (TEST-HttpPartitionTest.test-seed#[AC5C69CB3F0CD5EC]) [    ] o.a.s.s.SolrDispatchFilter \__ \/ _ \ | '_|  Install dir: null, Default config dir: null
   [junit4]   2> 1741641 INFO  (TEST-HttpPartitionTest.test-seed#[AC5C69CB3F0CD5EC]) [    ] o.a.s.s.SolrDispatchFilter |___/\___/_|_|    Start time: 2017-08-17T08:24:24.230Z
   [junit4]   2> 1741642 WARN  (NIOServerCxn.Factory:0.0.0.0/0.0.0.0:0) [    ] o.a.z.s.NIOServerCnxn caught end of stream exception
   [junit4]   2> EndOfStreamException: Unable to read additional data from client sessionid 0x15def4b07b0000d, likely client has closed socket
   [junit4]   2> 	at org.apache.zookeeper.server.NIOServerCnxn.doIO(NIOServerCnxn.java:239)
   [junit4]   2> 	at org.apache.zookeeper.server.NIOServerCnxnFactory.run(NIOServerCnxnFactory.java:203)
   [junit4]   2> 	at java.lang.Thread.run(Thread.java:748)
   [junit4]   2> 1741642 INFO  (TEST-HttpPartitionTest.test-seed#[AC5C69CB3F0CD5EC]) [    ] o.a.s.s.SolrDispatchFilter Loading solr.xml from SolrHome (not found in ZooKeeper)
   [junit4]   2> 1741643 INFO  (TEST-HttpPartitionTest.test-seed#[AC5C69CB3F0CD5EC]) [    ] o.a.s.c.SolrXmlConfig Loading container configuration from /home/jenkins/workspace/Lucene-Solr-7.x-Linux/solr/build/solr-core/test/J2/temp/solr.cloud.HttpPartitionTest_AC5C69CB3F0CD5EC-001/shard-3-001/solr.xml
   [junit4]   2> 1741645 INFO  (TEST-HttpPartitionTest.test-seed#[AC5C69CB3F0CD5EC]) [    ] o.a.s.c.SolrXmlConfig MBean server found: com.sun.jmx.mbeanserver.JmxMBeanServer@7970b7, but no JMX reporters were configured - adding default JMX reporter.
   [junit4]   2> 1741647 INFO  (TEST-HttpPartitionTest.test-seed#[AC5C69CB3F0CD5EC]) [    ] o.a.s.c.ZkContainer Zookeeper client=127.0.0.1:33213/solr
   [junit4]   2> 1741651 INFO  (TEST-HttpPartitionTest.test-seed#[AC5C69CB3F0CD5EC]) [n:127.0.0.1:37895_fwin%2Ff    ] o.a.s.c.c.ZkStateReader Updated live nodes from ZooKeeper... (0) -> (3)
   [junit4]   2> 1741652 INFO  (TEST-HttpPartitionTest.test-seed#[AC5C69CB3F0CD5EC]) [n:127.0.0.1:37895_fwin%2Ff    ] o.a.s.c.Overseer Overseer (id=null) closing
   [junit4]   2> 1741652 INFO  (TEST-HttpPartitionTest.test-seed#[AC5C69CB3F0CD5EC]) [n:127.0.0.1:37895_fwin%2Ff    ] o.a.s.c.ZkController Register node as live in ZooKeeper:/live_nodes/127.0.0.1:37895_fwin%2Ff
   [junit4]   2> 1741653 INFO  (zkCallback-2661-thread-1-processing-n:127.0.0.1:37895_fwin%2Ff) [n:127.0.0.1:37895_fwin%2Ff    ] o.a.s.c.c.ZkStateReader Updated live nodes from ZooKeeper... (3) -> (4)
   [junit4]   2> 1741653 INFO  (zkCallback-2644-thread-1) [    ] o.a.s.c.c.ZkStateReader Updated live nodes from ZooKeeper... (3) -> (4)
   [junit4]   2> 1741653 INFO  (zkCallback-2649-thread-1-processing-n:127.0.0.1:37959_fwin%2Ff) [n:127.0.0.1:37959_fwin%2Ff    ] o.a.s.c.c.ZkStateReader Updated live nodes from ZooKeeper... (3) -> (4)
   [junit4]   2> 1741653 INFO  (zkCallback-2637-thread-2-processing-n:127.0.0.1:39949_fwin%2Ff) [n:127.0.0.1:39949_fwin%2Ff    ] o.a.s.c.c.ZkStateReader Updated live nodes from ZooKeeper... (3) -> (4)
   [junit4]   2> 1741653 INFO  (zkCallback-2655-thread-1-processing-n:127.0.0.1:44425_fwin%2Ff) [n:127.0.0.1:44425_fwin%2Ff    ] o.a.s.c.c.ZkStateReader Updated live nodes from ZooKeeper... (3) -> (4)
   [junit4]   2> 1741702 INFO  (TEST-HttpPartitionTest.test-seed#[AC5C69CB3F0CD5EC]) [n:127.0.0.1:37895_fwin%2Ff    ] o.a.s.m.r.SolrJmxReporter JMX monitoring for 'solr.node' (registry 'solr.node') enabled at server: com.sun.jmx.mbeanserver.JmxMBeanServer@7970b7
   [junit4]   2> 1741709 INFO  (TEST-HttpPartitionTest.test-seed#[AC5C69CB3F0CD5EC]) [n:127.0.0.1:37895_fwin%2Ff    ] o.a.s.m.r.SolrJmxReporter JMX monitoring for 'solr.jvm' (registry 'solr.jvm') enabled at server: com.sun.jmx.mbeanserver.JmxMBeanServer@7970b7
   [junit4]   2> 1741709 INFO  (TEST-HttpPartitionTest.test-seed#[AC5C69CB3F0CD5EC]) [n:127.0.0.1:37895_fwin%2Ff    ] o.a.s.m.r.SolrJmxReporter JMX monitoring for 'solr.jetty' (registry 'solr.jetty') enabled at server: com.sun.jmx.mbeanserver.JmxMBeanServer@7970b7
   [junit4]   2> 1741710 INFO  (TEST-HttpPartitionTest.test-seed#[AC5C69CB3F0CD5EC]) [n:127.0.0.1:37895_fwin%2Ff    ] o.a.s.c.CorePropertiesLocator Found 0 core definitions underneath /home/jenkins/workspace/Lucene-Solr-7.x-Linux/solr/build/solr-core/test/J2/temp/solr.cloud.HttpPartitionTest_AC5C69CB3F0CD5EC-001/shard-3-001/cores
   [junit4]   2> 1741738 INFO  (qtp6686608-18033) [n:127.0.0.1:44425_fwin%2Ff    ] o.a.s.h.a.CollectionsHandler Invoked Collection Action :addreplica with params node=127.0.0.1:37895_fwin%252Ff&action=ADDREPLICA&collection=collection1&shard=shard2&type=TLOG&wt=javabin&version=2 and sendToOCPQueue=true
   [junit4]   2> 1741739 INFO  (OverseerCollectionConfigSetProcessor-98497872402579460-127.0.0.1:39949_fwin%2Ff-n_0000000000) [n:127.0.0.1:39949_fwin%2Ff    ] o.a.s.c.OverseerTaskQueue Response ZK path: /overseer/collection-queue-work/qnr-0000000006 doesn't exist.  Requestor may have disconnected from ZooKeeper
   [junit4]   2> 1741739 INFO  (OverseerThreadFactory-7385-thread-5-processing-n:127.0.0.1:39949_fwin%2Ff) [n:127.0.0.1:39949_fwin%2Ff    ] o.a.s.c.AddReplicaCmd Node Identified 127.0.0.1:37895_fwin%2Ff for creating new replica
   [junit4]   2> 1741740 INFO  (SocketProxy-Acceptor-37895) [    ] o.a.s.c.SocketProxy accepted Socket[addr=/127.0.0.1,port=43356,localport=37895], receiveBufferSize:531000
   [junit4]   2> 1741740 INFO  (SocketProxy-Acceptor-37895) [    ] o.a.s.c.SocketProxy proxy connection Socket[addr=/127.0.0.1,port=41055,localport=44746], receiveBufferSize=530904
   [junit4]   2> 1741740 INFO  (qtp13882782-18066) [n:127.0.0.1:37895_fwin%2Ff    ] o.a.s.h.a.CoreAdminOperation core create command qt=/admin/cores&collection.configName=conf1&name=collection1_shard2_replica_t45&action=CREATE&collection=collection1&shard=shard2&wt=javabin&version=2&replicaType=TLOG
   [junit4]   2> 1741740 INFO  (qtp13882782-18066) [n:127.0.0.1:37895_fwin%2Ff    ] o.a.s.c.TransientSolrCoreCacheDefault Allocating transient cache for 4 transient cores
   [junit4]   2> 1741843 INFO  (zkCallback-2649-thread-1-processing-n:127.0.0.1:37959_fwin%2Ff) [n:127.0.0.1:37959_fwin%2Ff    ] o.a.s.c.c.ZkStateReader A cluster state change: [WatchedEvent state:SyncConnected type:NodeDataChanged path:/collections/collection1/state.json] for collection [collection1] has occurred - updating... (live nodes size: [4])
   [junit4]   2> 1741843 INFO  (zkCallback-2655-thread-1-processing-n:127.0.0.1:44425_fwin%2Ff) [n:127.0.0.1:44425_fwin%2Ff    ] o.a.s.c.c.ZkStateReader A cluster state change: [WatchedEvent state:SyncConnected type:NodeDataChanged path:/collections/collection1/state.json] for collection [collection1] has occurred - updating... (live nodes size: [4])
   [junit4]   2> 1741843 INFO  (zkCallback-2661-thread-1-processing-n:127.0.0.1:37895_fwin%2Ff) [n:127.0.0.1:37895_fwin%2Ff    ] o.a.s.c.c.ZkStateReader A cluster state change: [WatchedEvent state:SyncConnected type:NodeDataChanged path:/collections/collection1/state.json] for collection [collection1] has occurred - updating... (live nodes size: [4])
   [junit4]   2> 1742752 INFO  (qtp13882782-18066) [n:127.0.0.1:37895_fwin%2Ff c:collection1 s:shard2  x:collection1_shard2_replica_t45] o.a.s.c.SolrConfig Using Lucene MatchVersion: 7.1.0
   [junit4]   2> 1742763 INFO  (qtp13882782-18066) [n:127.0.0.1:37895_fwin%2Ff c:collection1 s:shard2  x:collection1_shard2_replica_t45] o.a.s.s.IndexSchema [collection1_shard2_replica_t45] Schema name=test
   [junit4]   2> 1742852 INFO  (qtp13882782-18066) [n:127.0.0.1:37895_fwin%2Ff c:collection1 s:shard2  x:collection1_shard2_replica_t45] o.a.s.s.IndexSchema Loaded schema test/1.0 with uniqueid field id
   [junit4]   2> 1742860 INFO  (qtp13882782-18066) [n:127.0.0.1:37895_fwin%2Ff c:collection1 s:shard2  x:collection1_shard2_replica_t45] o.a.s.c.CoreContainer Creating SolrCore 'collection1_shard2_replica_t45' using configuration from collection collection1, trusted=true
   [junit4]   2> 1742860 INFO  (qtp13882782-18066) [n:127.0.0.1:37895_fwin%2Ff c:collection1 s:shard2  x:collection1_shard2_replica_t45] o.a.s.m.r.SolrJmxReporter JMX monitoring for 'solr.core.collection1.shard2.replica_t45' (registry 'solr.core.collection1.shard2.replica_t45') enabled at server: com.sun.jmx.mbeanserver.JmxMBeanServer@7970b7
   [junit4]   2> 1742860 INFO  (qtp13882782-18066) [n:127.0.0.1:37895_fwin%2Ff c:collection1 s:shard2  x:collection1_shard2_replica_t45] o.a.s.c.SolrCore solr.RecoveryStrategy.Builder
   [junit4]   2> 1742860 INFO  (qtp13882782-18066) [n:127.0.0.1:37895_fwin%2Ff c:collection1 s:shard2  x:collection1_shard2_replica_t45] o.a.s.c.SolrCore [[collection1_shard2_replica_t45] ] Opening new SolrCore at [/home/jenkins/workspace/Lucene-Solr-7.x-Linux/solr/build/solr-core/test/J2/temp/solr.cloud.HttpPartitionTest_AC5C69CB3F0CD5EC-001/shard-3-001/cores/collection1_shard2_replica_t45], dataDir=[/home/jenkins/workspace/Lucene-Solr-7.x-Linux/solr/build/solr-core/test/J2/temp/solr.cloud.HttpPartitionTest_AC5C69CB3F0CD5EC-001/shard-3-001/cores/collection1_shard2_replica_t45/data/]
   [junit4]   2> 1742863 INFO  (qtp13882782-18066) [n:127.0.0.1:37895_fwin%2Ff c:collection1 s:shard2  x:collection1_shard2_replica_t45] o.a.s.u.RandomMergePolicy RandomMergePolicy wrapping class org.apache.lucene.index.LogByteSizeMergePolicy: [LogByteSizeMergePolicy: minMergeSize=1677721, mergeFactor=25, maxMergeSize=2147483648, maxMergeSizeForForcedMerge=9223372036854775807, calibrateSizeByDeletes=false, maxMergeDocs=2147483647, maxCFSSegmentSizeMB=8.796093022207999E12, noCFSRatio=0.0]
   [junit4]   2> 1742864 WARN  (qtp13882782-18066) [n:127.0.0.1:37895_fwin%2Ff c:collection1 s:shard2  x:collection1_shard2_replica_t45] o.a.s.c.RequestHandlers INVALID paramSet a in requestHandler {type = requestHandler,name = /dump,class = DumpRequestHandler,attributes = {initParams=a, name=/dump, class=DumpRequestHandler},args = {defaults={a=A,b=B}}}
   [junit4]   2> 1742895 INFO  (qtp13882782-18066) [n:127.0.0.1:37895_fwin%2Ff c:collection1 s:shard2  x:collection1_shard2_replica_t45] o.a.s.u.UpdateHandler Using UpdateLog implementation: org.apache.solr.update.UpdateLog
   [junit4]   2> 1742896 INFO  (qtp13882782-18066) [n:127.0.0.1:37895_fwin%2Ff c:collection1 s:shard2  x:collection1_shard2_replica_t45] o.a.s.u.UpdateLog Initializing UpdateLog: dataDir= defaultSyncLevel=FLUSH numRecordsToKeep=100 maxNumLogsToKeep=10 numVersionBuckets=65536
   [junit4]   2> 1742896 INFO  (qtp13882782-18066) [n:127.0.0.1:37895_fwin%2Ff c:collection1 s:shard2  x:collection1_shard2_replica_t45] o.a.s.u.CommitTracker Hard AutoCommit: disabled
   [junit4]   2> 1742896 INFO  (qtp13882782-18066) [n:127.0.0.1:37895_fwin%2Ff c:collection1 s:shard2  x:collection1_shard2_replica_t45] o.a.s.u.CommitTracker Soft AutoCommit: disabled
   [junit4]   2> 1742897 INFO  (qtp13882782-18066) [n:127.0.0.1:37895_fwin%2Ff c:collection1 s:shard2  x:collection1_shard2_replica_t45] o.a.s.u.RandomMergePolicy RandomMergePolicy wrapping class org.apache.lucene.index.TieredMergePolicy: [TieredMergePolicy: maxMergeAtOnce=40, maxMergeAtOnceExplicit=15, maxMergedSegmentMB=36.302734375, floorSegmentMB=1.1181640625, forceMergeDeletesPctAllowed=21.373243888006503, segmentsPerTier=32.0, maxCFSSegmentSizeMB=8.796093022207999E12, noCFSRatio=0.0
   [junit4]   2> 1742898 INFO  (qtp13882782-18066) [n:127.0.0.1:37895_fwin%2Ff c:collection1 s:shard2  x:collection1_shard2_replica_t45] o.a.s.s.SolrIndexSearcher Opening [Searcher@1ff2c41[collection1_shard2_replica_t45] main]
   [junit4]   2> 1742898 INFO  (qtp13882782-18066) [n:127.0.0.1:37895_fwin%2Ff c:collection1 s:shard2  x:collection1_shard2_replica_t45] o.a.s.r.ManagedResourceStorage Configured ZooKeeperStorageIO with znodeBase: /configs/conf1
   [junit4]   2> 1742899 INFO  (qtp13882782-18066) [n:127.0.0.1:37895_fwin%2Ff c:collection1 s:shard2  x:collection1_shard2_replica_t45] o.a.s.r.ManagedResourceStorage Loaded null at path _rest_managed.json using ZooKeeperStorageIO:path=/configs/conf1
   [junit4]   2> 1742899 INFO  (qtp13882782-18066) [n:127.0.0.1:37895_fwin%2Ff c:collection1 s:shard2  x:collection1_shard2_replica_t45] o.a.s.h.ReplicationHandler Commits will be reserved for  10000
   [junit4]   2> 1742900 INFO  (searcherExecutor-7421-thread-1-processing-n:127.0.0.1:37895_fwin%2Ff x:collection1_shard2_replica_t45 s:shard2 c:collection1) [n:127.0.0.1:37895_fwin%2Ff c:collection1 s:shard2  x:collection1_shard2_replica_t45] o.a.s.c.SolrCore [collection1_shard2_replica_t45] Registered new searcher Searcher@1ff2c41[collection1_shard2_replica_t45] main{ExitableDirectoryReader(UninvertingDirectoryReader())}
   [junit4]   2> 1742900 INFO  (qtp13882782-18066) [n:127.0.0.1:37895_fwin%2Ff c:collection1 s:shard2  x:collection1_shard2_replica_t45] o.a.s.u.UpdateLog Could not find max version in index or recent updates, using new clock 1575965966193393664
   [junit4]   2> 1742903 INFO  (qtp13882782-18066) [n:127.0.0.1:37895_fwin%2Ff c:collection1 s:shard2  x:collection1_shard2_replica_t45] o.a.s.c.ZkController Core needs to recover:collection1_shard2_replica_t45
   [junit4]   2> 1742903 INFO  (updateExecutor-2658-thread-1-processing-n:127.0.0.1:37895_fwin%2Ff x:collection1_shard2_replica_t45 s:shard2 c:collection1) [n:127.0.0.1:37895_fwin%2Ff c:collection1 s:shard2 r:core_node46 x:collection1_shard2_replica_t45] o.a.s.u.DefaultSolrCoreState Running recovery
   [junit4]   2> 1742903 INFO  (qtp13882782-18066) [n:127.0.0.1:37895_fwin%2Ff c:collection1 s:shard2  x:collection1_shard2_replica_t45] o.a.s.s.HttpSolrCall [admin] webapp=null path=/admin/cores params={qt=/admin/cores&collection.configName=conf1&name=collection1_shard2_replica_t45&action=CREATE&collection=collection1&shard=shard2&wt=javabin&version=2&replicaType=TLOG} status=0 QTime=1162
   [junit4]   2> 1742903 INFO  (recoveryExecutor-2659-thread-1-processing-n:127.0.0.1:37895_fwin%2Ff x:collection1_shard2_replica_t45 s:shard2 c:collection1 r:core_node46) [n:127.0.0.1:37895_fwin%2Ff c:collection1 s:shard2 r:core_node46 x:collection1_shard2_replica_t45] o.a.s.c.RecoveryStrategy Starting recovery process. recoveringAfterStartup=true
   [junit4]   2> 1742903 INFO  (recoveryExecutor-2659-thread-1-processing-n:127.0.0.1:37895_fwin%2Ff x:collection1_shard2_replica_t45 s:shard2 c:collection1 r:core_node46) [n:127.0.0.1:37895_fwin%2Ff c:collection1 s:shard2 r:core_node46 x:collection1_shard2_replica_t45] o.a.s.c.RecoveryStrategy ###### startupVersions=[[]]
   [junit4]   2> 1742903 INFO  (recoveryExecutor-2659-thread-1-processing-n:127.0.0.1:37895_fwin%2Ff x:collection1_shard2_replica_t45 s:shard2 c:collection1 r:core_node46) [n:127.0.0.1:37895_fwin%2Ff c:collection1 s:shard2 r:core_node46 x:collection1_shard2_replica_t45] o.a.s.c.ZkController collection1_shard2_replica_t45 stopping background replication from leader
   [junit4]   2> 1742903 INFO  (recoveryExecutor-2659-thread-1-processing-n:127.0.0.1:37895_fwin%2Ff x:collection1_shard2_replica_t45 s:shard2 c:collection1 r:core_node46) [n:127.0.0.1:37895_fwin%2Ff c:collection1 s:shard2 r:core_node46 x:collection1_shard2_replica_t45] o.a.s.c.RecoveryStrategy Begin buffering updates. core=[collection1_shard2_replica_t45]
   [junit4]   2> 1742903 INFO  (recoveryExecutor-2659-thread-1-processing-n:127.0.0.1:37895_fwin%2Ff x:collection1_shard2_replica_t45 s:shard2 c:collection1 r:core_node46) [n:127.0.0.1:37895_fwin%2Ff c:collection1 s:shard2 r:core_node46 x:collection1_shard2_replica_t45] o.a.s.u.UpdateLog Starting to buffer updates. FSUpdateLog{state=ACTIVE, tlog=null}
   [junit4]   2> 1742903 INFO  (recoveryExecutor-2659-thread-1-processing-n:127.0.0.1:37895_fwin%2Ff x:collection1_shard2_replica_t45 s:shard2 c:collection1 r:core_node46) [n:127.0.0.1:37895_fwin%2Ff c:collection1 s:shard2 r:core_node46 x:collection1_shard2_replica_t45] o.a.s.c.RecoveryStrategy Publishing state of core [collection1_shard2_replica_t45] as recovering, leader is [http://127.0.0.1:37959/fwin/f/collection1_shard2_replica_t41/] and I am [http://127.0.0.1:37895/fwin/f/collection1_shard2_replica_t45/]
   [junit4]   2> 1742904 INFO  (qtp6686608-18033) [n:127.0.0.1:44425_fwin%2Ff    ] o.a.s.s.HttpSolrCall [admin] webapp=null path=/admin/collections params={node=127.0.0.1:37895_fwin%252Ff&action=ADDREPLICA&collection=collection1&shard=shard2&type=TLOG&wt=javabin&version=2} status=0 QTime=1166
   [junit4]   2> 1742905 INFO  (recoveryExecutor-2659-thread-1-processing-n:127.0.0.1:37895_fwin%2Ff x:collection1_shard2_replica_t45 s:shard2 c:collection1 r:core_node46) [n:127.0.0.1:37895_fwin%2Ff c:collection1 s:shard2 r:core_node46 x:collection1_shard2_replica_t45] o.a.s.c.RecoveryStrategy Sending prep recovery command to [http://127.0.0.1:37959/fwin/f]; [WaitForState: action=PREPRECOVERY&core=collection1_shard2_replica_t41&nodeName=127.0.0.1:37895_fwin%252Ff&coreNodeName=core_node46&state=recovering&checkLive=true&onlyIfLeader=true&onlyIfLeaderActive=true]
   [junit4]   2> 1742905 INFO  (SocketProxy-Acceptor-37959) [    ] o.a.s.c.SocketProxy accepted Socket[addr=/127.0.0.1,port=41914,localport=37959], receiveBufferSize:531000
   [junit4]   2> 1742906 INFO  (SocketProxy-Acceptor-37959) [    ] o.a.s.c.SocketProxy proxy connection Socket[addr=/127.0.0.1,port=34451,localport=37680], receiveBufferSize=530904
   [junit4]   2> 1742906 INFO  (qtp24422888-18001) [n:127.0.0.1:37959_fwin%2Ff    ] o.a.s.h.a.PrepRecoveryOp Going to wait for coreNodeName: core_node46, state: recovering, checkLive: true, onlyIfLeader: true, onlyIfLeaderActive: true, maxTime: 183 s
   [junit4]   2> 1742906 INFO  (qtp24422888-18001) [n:127.0.0.1:37959_fwin%2Ff    ] o.a.s.h.a.PrepRecoveryOp In WaitForState(recovering): collection=collection1, shard=shard2, thisCore=collection1_shard2_replica_t41, leaderDoesNotNeedRecovery=false, isLeader? true, live=true, checkLive=true, currentState=down, localState=active, nodeName=127.0.0.1:37895_fwin%2Ff, coreNodeName=core_node46, onlyIfActiveCheckResult=false, nodeProps: core_node46:{"core":"collection1_shard2_replica_t45","base_url":"http://127.0.0.1:37895/fwin/f","node_name":"127.0.0.1:37895_fwin%2Ff","state":"down","type":"TLOG"}
   [junit4]   2> 1742907 INFO  (TEST-HttpPartitionTest.test-seed#[AC5C69CB3F0CD5EC]) [    ] o.a.s.SolrTestCaseJ4 ###Starting test
   [junit4]   2> 1742907 INFO  (TEST-HttpPartitionTest.test-seed#[AC5C69CB3F0CD5EC]) [    ] o.a.s.c.AbstractFullDistribZkTestBase Wait for recoveries to finish - wait 30000 for each attempt
   [junit4]   2> 1742907 INFO  (TEST-HttpPartitionTest.test-seed#[AC5C69CB3F0CD5EC]) [    ] o.a.s.c.AbstractDistribZkTestBase Wait for recoveries to finish - collection: collection1 failOnTimeout:true timeout (sec):30000
   [junit4]   2> 1743005 INFO  (zkCallback-2661-thread-1-processing-n:127.0.0.1:37895_fwin%2Ff) [n:127.0.0.1:37895_fwin%2Ff    ] o.a.s.c.c.ZkStateReader A cluster state change: [WatchedEvent state:SyncConnected type:NodeDataChanged path:/collections/collection1/state.json] for collection [collection1] has occurred - updating... (live nodes size: [4])
   [junit4]   2> 1743005 INFO  (zkCallback-2655-thread-1-processing-n:127.0.0.1:44425_fwin%2Ff) [n:127.0.0.1:44425_fwin%2Ff    ] o.a.s.c.c.ZkStateReader A cluster state change: [WatchedEvent state:SyncConnected type:NodeDataChanged path:/collections/collection1/state.json] for collection [collection1] has occurred - updating... (live nodes size: [4])
   [junit4]   2> 1743005 INFO  (zkCallback-2649-thread-1-processing-n:127.0.0.1:37959_fwin%2Ff) [n:127.0.0.1:37959_fwin%2Ff    ] o.a.s.c.c.ZkStateReader A cluster state change: [WatchedEvent state:SyncConnected type:NodeDataChanged path:/collections/collection1/state.json] for collection [collection1] has occurred - updating... (live nodes size: [4])
   [junit4]   2> 1743741 INFO  (OverseerCollectionConfigSetProcessor-98497872402579460-127.0.0.1:39949_fwin%2Ff-n_0000000000) [n:127.0.0.1:39949_fwin%2Ff    ] o.a.s.c.OverseerTaskQueue Response ZK path: /overseer/collection-queue-work/qnr-0000000008 doesn't exist.  Requestor may have disconnected from ZooKeeper
   [junit4]   2> 1743906 INFO  (qtp24422888-18001) [n:127.0.0.1:37959_fwin%2Ff    ] o.a.s.h.a.PrepRecoveryOp In WaitForState(recovering): collection=collection1, shard=shard2, thisCore=collection1_shard2_replica_t41, leaderDoesNotNeedRecovery=false, isLeader? true, live=true, checkLive=true, currentState=recovering, localState=active, nodeName=127.0.0.1:37895_fwin%2Ff, coreNodeName=core_node46, onlyIfActiveCheckResult=false, nodeProps: core_node46:{"core":"collection1_shard2_replica_t45","base_url":"http://127.0.0.1:37895/fwin/f","node_name":"127.0.0.1:37895_fwin%2Ff","state":"recovering","type":"TLOG"}
   [junit4]   2> 1743906 INFO  (qtp24422888-18001) [n:127.0.0.1:37959_fwin%2Ff    ] o.a.s.h.a.PrepRecoveryOp Waited coreNodeName: core_node46, state: recovering, checkLive: true, onlyIfLeader: true for: 1 seconds.
   [junit4]   2> 1743906 INFO  (qtp24422888-18001) [n:127.0.0.1:37959_fwin%2Ff    ] o.a.s.s.HttpSolrCall [admin] webapp=null path=/admin/cores params={nodeName=127.0.0.1:37895_fwin%252Ff&onlyIfLeaderActive=true&core=collection1_shard2_replica_t41&coreNodeName=core_node46&action=PREPRECOVERY&checkLive=true&state=recovering&onlyIfLeader=true&wt=javabin&version=2} status=0 QTime=1000
   [junit4]   2> 1744407 INFO  (recoveryExecutor-2659-thread-1-processing-n:127.0.0.1:37895_fwin%2Ff x:collection1_shard2_replica_t45 s:shard2 c:collection1 r:core_node46) [n:127.0.0.1:37895_fwin%2Ff c:collection1 s:shard2 r:core_node46 x:collection1_shard2_replica_t45] o.a.s.c.RecoveryStrategy Starting Replication Recovery.
   [junit4]   2> 1744407 INFO  (recoveryExecutor-2659-thread-1-processing-n:127.0.0.1:37895_fwin%2Ff x:collection1_shard2_replica_t45 s:shard2 c:collection1 r:core_node46) [n:127.0.0.1:37895_fwin%2Ff c:collection1 s:shard2 r:core_node46 x:collection1_shard2_replica_t45] o.a.s.c.RecoveryStrategy Attempting to replicate from [http://127.0.0.1:37959/fwin/f/collection1_shard2_replica_t41/].
   [junit4]   2> 1744408 INFO  (SocketProxy-Acceptor-37959) [    ] o.a.s.c.SocketProxy accepted Socket[addr=/127.0.0.1,port=41926,localport=37959], receiveBufferSize:531000
   [junit4]   2> 1744409 INFO  (SocketProxy-Acceptor-37959) [    ] o.a.s.c.SocketProxy proxy connection Socket[addr=/127.0.0.1,port=34451,localport=37692], receiveBufferSize=530904
   [junit4]   2> 1744409 INFO  (qtp24422888-18001) [n:127.0.0.1:37959_fwin%2Ff c:collection1 s:shard2 r:core_node42 x:collection1_shard2_replica_t41] o.a.s.u.DirectUpdateHandler2 start commit{_version_=1575965967775694848,optimize=false,openSearcher=false,waitSearcher=true,expungeDeletes=false,softCommit=false,prepareCommit=false}
   [junit4]   2> 1744409 INFO  (qtp24422888-18001) [n:127.0.0.1:37959_fwin%2Ff c:collection1 s:shard2 r:core_node42 x:collection1_shard2_replica_t41] o.a.s.u.DirectUpdateHandler2 No uncommitted changes. Skipping IW.commit.
   [junit4]   2> 1744409 INFO  (qtp24422888-18001) [n:127.0.0.1:37959_fwin%2Ff c:collection1 s:shard2 r:core_node42 x:collection1_shard2_replica_t41] o.a.s.u.DirectUpdateHandler2 end_commit_flush
   [junit4]   2> 1744409 INFO  (qtp24422888-18001) [n:127.0.0.1:37959_fwin%2Ff c:collection1 s:shard2 r:core_node42 x:collection1_shard2_replica_t41] o.a.s.u.p.LogUpdateProcessorFactory [collection1_shard2_replica_t41]  webapp=/fwin/f path=/update params={waitSearcher=true&openSearcher=false&commit=true&softCommit=false&commit_end_point=true&wt=javabin&version=2}{commit=} 0 0
   [junit4]   2> 1744410 INFO  (SocketProxy-Acceptor-37959) [    ] o.a.s.c.SocketProxy accepted Socket[addr=/127.0.0.1,port=41930,localport=37959], receiveBufferSize:531000
   [junit4]   2> 1744410 INFO  (SocketProxy-Acceptor-37959) [    ] o.a.s.c.SocketProxy proxy connection So

[...truncated too long message...]

tateUpdate-98497872402579471-127.0.0.1:37895_fwin%2Ff-n_0000000003) [n:127.0.0.1:37895_fwin%2Ff    ] o.a.s.c.Overseer Overseer Loop exiting : 127.0.0.1:37895_fwin%2Ff
   [junit4]   2> 1765868 WARN  (zkCallback-2661-thread-1-processing-n:127.0.0.1:37895_fwin%2Ff) [n:127.0.0.1:37895_fwin%2Ff    ] o.a.s.c.c.ZkStateReader ZooKeeper watch triggered, but Solr cannot talk to ZK: [KeeperErrorCode = Session expired for /live_nodes]
   [junit4]   2> 1765869 INFO  (TEST-HttpPartitionTest.test-seed#[AC5C69CB3F0CD5EC]) [    ] o.e.j.s.AbstractConnector Stopped ServerConnector@1d9dfe4{HTTP/1.1,[http/1.1]}{127.0.0.1:0}
   [junit4]   2> 1765869 INFO  (TEST-HttpPartitionTest.test-seed#[AC5C69CB3F0CD5EC]) [    ] o.e.j.s.h.ContextHandler Stopped o.e.j.s.ServletContextHandler@4de49c{/fwin/f,null,UNAVAILABLE}
   [junit4]   2> 1765870 ERROR (TEST-HttpPartitionTest.test-seed#[AC5C69CB3F0CD5EC]) [    ] o.a.z.s.ZooKeeperServer ZKShutdownHandler is not registered, so ZooKeeper server won't take any action on ERROR or SHUTDOWN server state changes
   [junit4]   2> 1765870 INFO  (TEST-HttpPartitionTest.test-seed#[AC5C69CB3F0CD5EC]) [    ] o.a.s.c.ZkTestServer connecting to 127.0.0.1:33213 33213
   [junit4]   2> 1767049 INFO  (Thread-6043) [    ] o.a.s.c.ZkTestServer connecting to 127.0.0.1:33213 33213
   [junit4]   2> 1767050 WARN  (Thread-6043) [    ] o.a.s.c.ZkTestServer Watch limit violations: 
   [junit4]   2> Maximum concurrent create/delete watches above limit:
   [junit4]   2> 
   [junit4]   2> 	6	/solr/aliases.json
   [junit4]   2> 	4	/solr/security.json
   [junit4]   2> 	4	/solr/configs/conf1
   [junit4]   2> 
   [junit4]   2> Maximum concurrent data watches above limit:
   [junit4]   2> 
   [junit4]   2> 	6	/solr/clusterprops.json
   [junit4]   2> 	6	/solr/clusterstate.json
   [junit4]   2> 	3	/solr/collections/collection1/state.json
   [junit4]   2> 	3	/solr/collections/collMinRf_1x3/state.json
   [junit4]   2> 	2	/solr/collections/c8n_crud_1x2/state.json
   [junit4]   2> 
   [junit4]   2> Maximum concurrent children watches above limit:
   [junit4]   2> 
   [junit4]   2> 	6	/solr/live_nodes
   [junit4]   2> 	6	/solr/collections
   [junit4]   2> 	4	/solr/overseer/queue
   [junit4]   2> 	4	/solr/overseer/collection-queue-work
   [junit4]   2> 
   [junit4]   2> 1767050 WARN  (TEST-HttpPartitionTest.test-seed#[AC5C69CB3F0CD5EC]) [    ] o.a.s.c.SocketProxy Closing 6 connections to: http://127.0.0.1:39949/fwin/f, target: http://127.0.0.1:41053/fwin/f
   [junit4]   2> 1767050 WARN  (TEST-HttpPartitionTest.test-seed#[AC5C69CB3F0CD5EC]) [    ] o.a.s.c.SocketProxy Closing 3 connections to: http://127.0.0.1:37895/fwin/f, target: http://127.0.0.1:41055/fwin/f
   [junit4]   2> 1767050 WARN  (TEST-HttpPartitionTest.test-seed#[AC5C69CB3F0CD5EC]) [    ] o.a.s.c.SocketProxy Closing 2 connections to: http://127.0.0.1:44425/fwin/f, target: http://127.0.0.1:37223/fwin/f
   [junit4]   2> 1767050 WARN  (TEST-HttpPartitionTest.test-seed#[AC5C69CB3F0CD5EC]) [    ] o.a.s.c.SocketProxy Closing 15 connections to: http://127.0.0.1:37959/fwin/f, target: http://127.0.0.1:34451/fwin/f
   [junit4]   2> NOTE: reproduce with: ant test  -Dtestcase=HttpPartitionTest -Dtests.method=test -Dtests.seed=AC5C69CB3F0CD5EC -Dtests.multiplier=3 -Dtests.slow=true -Dtests.locale=zh-SG -Dtests.timezone=America/St_Kitts -Dtests.asserts=true -Dtests.file.encoding=ISO-8859-1
   [junit4] FAILURE 31.5s J2 | HttpPartitionTest.test <<<
   [junit4]    > Throwable #1: java.lang.AssertionError: Doc with id=1 not found in http://127.0.0.1:39949/fwin/f/collMinRf_1x3 due to: Path not found: /id; rsp={doc=null}
   [junit4]    > 	at __randomizedtesting.SeedInfo.seed([AC5C69CB3F0CD5EC:2408561191F0B814]:0)
   [junit4]    > 	at org.apache.solr.cloud.HttpPartitionTest.assertDocExists(HttpPartitionTest.java:603)
   [junit4]    > 	at org.apache.solr.cloud.HttpPartitionTest.assertDocsExistInAllReplicas(HttpPartitionTest.java:558)
   [junit4]    > 	at org.apache.solr.cloud.HttpPartitionTest.testMinRf(HttpPartitionTest.java:249)
   [junit4]    > 	at org.apache.solr.cloud.HttpPartitionTest.test(HttpPartitionTest.java:127)
   [junit4]    > 	at org.apache.solr.BaseDistributedSearchTestCase$ShardsRepeatRule$ShardsFixedStatement.callStatement(BaseDistributedSearchTestCase.java:993)
   [junit4]    > 	at org.apache.solr.BaseDistributedSearchTestCase$ShardsRepeatRule$ShardsStatement.evaluate(BaseDistributedSearchTestCase.java:968)
   [junit4]    > 	at java.lang.Thread.run(Thread.java:748)
   [junit4]   2> NOTE: leaving temporary files on disk at: /home/jenkins/workspace/Lucene-Solr-7.x-Linux/solr/build/solr-core/test/J2/temp/solr.cloud.HttpPartitionTest_AC5C69CB3F0CD5EC-001
   [junit4]   2> NOTE: test params are: codec=Asserting(Lucene70): {multiDefault=Lucene50(blocksize=128), a_t=PostingsFormat(name=LuceneFixedGap), id=PostingsFormat(name=MockRandom), text=TestBloomFilteredLucenePostings(BloomFilteringPostingsFormat(Lucene50(blocksize=128)))}, docValues:{range_facet_l_dv=DocValuesFormat(name=Memory), _version_=DocValuesFormat(name=Asserting), range_facet_i_dv=DocValuesFormat(name=Asserting), intDvoDefault=DocValuesFormat(name=Lucene70), timestamp=DocValuesFormat(name=Asserting)}, maxPointsInLeafNode=1796, maxMBSortInHeap=5.445279466384292, sim=RandomSimilarity(queryNorm=true): {}, locale=zh-SG, timezone=America/St_Kitts
   [junit4]   2> NOTE: Linux 4.10.0-27-generic i386/Oracle Corporation 1.8.0_144 (32-bit)/cpus=8,threads=1,free=197356192,total=500957184
   [junit4]   2> NOTE: All tests run in this JVM: [TestBlendedInfixSuggestions, TestQueryUtils, TestStressReorder, TestSubQueryTransformer, MinimalSchemaTest, TestTolerantSearch, TestLFUCache, DirectUpdateHandlerOptimizeTest, RequestLoggingTest, TestFieldCacheWithThreads, PathHierarchyTokenizerFactoryTest, OutOfBoxZkACLAndCredentialsProvidersTest, LeaderElectionTest, AddSchemaFieldsUpdateProcessorFactoryTest, TestSolrCoreProperties, HdfsRecoveryZkTest, TestRequestForwarding, TestSuggestSpellingConverter, TestPKIAuthenticationPlugin, HdfsThreadLeakTest, BigEndianAscendingWordDeserializerTest, PreAnalyzedFieldTest, TestNumericRangeQuery32, ShufflingReplicaListTransformerTest, JavabinLoaderTest, RestartWhileUpdatingTest, TestBulkSchemaAPI, TestExceedMaxTermLength, SearchHandlerTest, TestFoldingMultitermQuery, AutoCommitTest, TestDynamicFieldResource, TestDelegationWithHadoopAuth, StatsComponentTest, HdfsWriteToMultipleCollectionsTest, DocValuesNotIndexedTest, CloneFieldUpdateProcessorFactoryTest, TestTrie, DirectUpdateHandlerTest, TestExportWriter, ResponseLogComponentTest, TestExactStatsCache, CoreSorterTest, TestFastWriter, CoreAdminCreateDiscoverTest, TestRawTransformer, TestSystemCollAutoCreate, ParsingFieldUpdateProcessorsTest, OverseerTest, LeaderInitiatedRecoveryOnCommitTest, DateFieldTest, SolrCloudExampleTest, TermsComponentTest, TestFieldCacheSort, TestShardHandlerFactory, OverseerTaskQueueTest, RuleEngineTest, ZkStateReaderTest, BufferStoreTest, TestJettySolrRunner, TestConfigSetsAPIZkFailure, TestCloudSearcherWarming, CollectionReloadTest, HdfsDirectoryFactoryTest, SolrInfoBeanTest, TestIndexSearcher, BasicAuthStandaloneTest, MultiTermTest, TemplateUpdateProcessorTest, TestReRankQParserPlugin, RecoveryZkTest, ConjunctionSolrSpellCheckerTest, SecurityConfHandlerTest, TestMissingGroups, TestCollectionsAPIViaSolrCloudCluster, TestCloudPivotFacet, TestGroupingSearch, TestComplexPhraseQParserPlugin, TestZkAclsWithHadoopAuth, ShowFileRequestHandlerTest, CircularListTest, URLClassifyProcessorTest, TestManagedSynonymFilterFactory, HdfsCollectionsAPIDistributedZkTest, TestLeaderInitiatedRecoveryThread, TestDocTermOrds, DocumentBuilderTest, HLLUtilTest, TestScoreJoinQPScore, TestReload, TestDistributedMissingSort, TestXmlQParser, BadIndexSchemaTest, TestLegacyNumericUtils, SuggesterTest, TestStandardQParsers, CollectionsAPIAsyncDistributedZkTest, TestAnalyzedSuggestions, SignatureUpdateProcessorFactoryTest, TestCloudSchemaless, TimeZoneUtilsTest, TestUseDocValuesAsStored, OverseerModifyCollectionTest, TestDefaultStatsCache, PrimitiveFieldTypeTest, TestSolrXml, TestObjectReleaseTracker, TestJsonFacets, InfoHandlerTest, TestReversedWildcardFilterFactory, AutoScalingHandlerTest, SuggestComponentTest, AnalyticsQueryTest, TestManagedSchema, TestAddFieldRealTimeGet, MissingSegmentRecoveryTest, CheckHdfsIndexTest, ChaosMonkeySafeLeaderTest, UnloadDistributedZkTest, ShardRoutingTest, FullSolrCloudDistribCmdsTest, TestReplicationHandler, TestZkChroot, TestRandomDVFaceting, TestDistributedSearch, TestRecovery, DistributedSpellCheckComponentTest, TermVectorComponentDistributedTest, TestJoin, SolrIndexSplitterTest, TestExtendedDismaxParser, SuggesterFSTTest, SolrRequestParserTest, PolyFieldTest, TestPseudoReturnFields, FieldMutatingUpdateProcessorTest, TestWordDelimiterFilterFactory, DefaultValueUpdateProcessorTest, DocValuesMultiTest, DistanceFunctionTest, TestSurroundQueryParser, XmlUpdateRequestHandlerTest, RequiredFieldsTest, FastVectorHighlighterTest, RegexBoostProcessorTest, IndexSchemaTest, ReturnFieldsTest, QueryParsingTest, TestPHPSerializedResponseWriter, SOLR749Test, TestQuerySenderListener, UpdateParamsTest, TestSolrIndexConfig, TestQuerySenderNoQuery, CopyFieldTest, BadComponentTest, TestStressRecovery, TestSystemIdResolver, ClusterStateTest, TestUtils, TestDocumentBuilder, SliceStateTest, TestRTGBase, SolrTestCaseJ4Test, TestCrossCoreJoin, TestHighlightDedupGrouping, TestSimpleTrackingShardHandler, TestEmbeddedSolrServerConstructors, AliasIntegrationTest, AssignBackwardCompatibilityTest, AsyncCallRequestStatusResponseTest, CdcrReplicationDistributedZkTest, CdcrReplicationHandlerTest, CdcrVersionReplicationTest, ChaosMonkeySafeLeaderWithPullReplicasTest, ConfigSetsAPITest, ConnectionManagerTest, CustomCollectionTest, DeleteReplicaTest, DistribCursorPagingTest, DistribJoinFromCollectionTest, DistributedVersionInfoTest, HttpPartitionTest]
   [junit4] Completed [491/729 (1!)] on J2 in 31.57s, 1 test, 1 failure <<< FAILURES!

[...truncated 40210 lines...]

Mime
View raw message