lucene-dev mailing list archives

Site index · List index
Message view « Date » · « Thread »
Top « Date » · « Thread »
From Policeman Jenkins Server <jenk...@thetaphi.de>
Subject [JENKINS] Lucene-Solr-7.0-Linux (64bit/jdk1.8.0_141) - Build # 138 - Unstable!
Date Thu, 03 Aug 2017 18:53:53 GMT
Build: https://jenkins.thetaphi.de/job/Lucene-Solr-7.0-Linux/138/
Java: 64bit/jdk1.8.0_141 -XX:-UseCompressedOops -XX:+UseParallelGC

3 tests failed.
FAILED:  junit.framework.TestSuite.org.apache.solr.analytics.facet.FieldFacetExtrasCloudTest

Error Message:
Could not find collection:collection1

Stack Trace:
java.lang.AssertionError: Could not find collection:collection1
	at __randomizedtesting.SeedInfo.seed([D6A92C496610243E]:0)
	at org.junit.Assert.fail(Assert.java:93)
	at org.junit.Assert.assertTrue(Assert.java:43)
	at org.junit.Assert.assertNotNull(Assert.java:526)
	at org.apache.solr.cloud.AbstractDistribZkTestBase.waitForRecoveriesToFinish(AbstractDistribZkTestBase.java:155)
	at org.apache.solr.analytics.facet.AbstractAnalyticsFacetCloudTest.setupCluster(AbstractAnalyticsFacetCloudTest.java:59)
	at org.apache.solr.analytics.facet.FieldFacetExtrasCloudTest.beforeClass(FieldFacetExtrasCloudTest.java:47)
	at sun.reflect.NativeMethodAccessorImpl.invoke0(Native Method)
	at sun.reflect.NativeMethodAccessorImpl.invoke(NativeMethodAccessorImpl.java:62)
	at sun.reflect.DelegatingMethodAccessorImpl.invoke(DelegatingMethodAccessorImpl.java:43)
	at java.lang.reflect.Method.invoke(Method.java:498)
	at com.carrotsearch.randomizedtesting.RandomizedRunner.invoke(RandomizedRunner.java:1713)
	at com.carrotsearch.randomizedtesting.RandomizedRunner$6.evaluate(RandomizedRunner.java:847)
	at com.carrotsearch.randomizedtesting.RandomizedRunner$7.evaluate(RandomizedRunner.java:863)
	at com.carrotsearch.randomizedtesting.rules.StatementAdapter.evaluate(StatementAdapter.java:36)
	at com.carrotsearch.randomizedtesting.rules.SystemPropertiesRestoreRule$1.evaluate(SystemPropertiesRestoreRule.java:57)
	at org.apache.lucene.util.AbstractBeforeAfterRule$1.evaluate(AbstractBeforeAfterRule.java:45)
	at com.carrotsearch.randomizedtesting.rules.StatementAdapter.evaluate(StatementAdapter.java:36)
	at org.apache.lucene.util.TestRuleStoreClassName$1.evaluate(TestRuleStoreClassName.java:41)
	at com.carrotsearch.randomizedtesting.rules.NoShadowingOrOverridesOnMethodsRule$1.evaluate(NoShadowingOrOverridesOnMethodsRule.java:40)
	at com.carrotsearch.randomizedtesting.rules.NoShadowingOrOverridesOnMethodsRule$1.evaluate(NoShadowingOrOverridesOnMethodsRule.java:40)
	at com.carrotsearch.randomizedtesting.rules.StatementAdapter.evaluate(StatementAdapter.java:36)
	at com.carrotsearch.randomizedtesting.rules.StatementAdapter.evaluate(StatementAdapter.java:36)
	at com.carrotsearch.randomizedtesting.rules.StatementAdapter.evaluate(StatementAdapter.java:36)
	at org.apache.lucene.util.TestRuleAssertionsRequired$1.evaluate(TestRuleAssertionsRequired.java:53)
	at org.apache.lucene.util.TestRuleMarkFailure$1.evaluate(TestRuleMarkFailure.java:47)
	at org.apache.lucene.util.TestRuleIgnoreAfterMaxFailures$1.evaluate(TestRuleIgnoreAfterMaxFailures.java:64)
	at org.apache.lucene.util.TestRuleIgnoreTestSuites$1.evaluate(TestRuleIgnoreTestSuites.java:54)
	at com.carrotsearch.randomizedtesting.rules.StatementAdapter.evaluate(StatementAdapter.java:36)
	at com.carrotsearch.randomizedtesting.ThreadLeakControl$StatementRunner.run(ThreadLeakControl.java:368)
	at java.lang.Thread.run(Thread.java:748)


FAILED:  org.apache.solr.cloud.LeaderFailoverAfterPartitionTest.test

Error Message:
Expected 2 of 3 replicas to be active but only found 1; [core_node3:{"core":"c8n_1x3_lf_shard1_replica_t3","base_url":"http://127.0.0.1:37319","node_name":"127.0.0.1:37319_","state":"active","type":"TLOG","leader":"true"}]; clusterState: DocCollection(c8n_1x3_lf//clusterstate.json/26)={   "pullReplicas":"0",   "replicationFactor":"1",   "shards":{"shard1":{       "range":"80000000-7fffffff",       "state":"active",       "replicas":{         "core_node1":{           "state":"down",           "base_url":"http://127.0.0.1:40833",           "core":"c8n_1x3_lf_shard1_replica_t1",           "node_name":"127.0.0.1:40833_",           "type":"TLOG"},         "core_node2":{           "core":"c8n_1x3_lf_shard1_replica_t2",           "base_url":"http://127.0.0.1:34241",           "node_name":"127.0.0.1:34241_",           "state":"down",           "type":"TLOG"},         "core_node3":{           "core":"c8n_1x3_lf_shard1_replica_t3",           "base_url":"http://127.0.0.1:37319",           "node_name":"127.0.0.1:37319_",           "state":"active",           "type":"TLOG",           "leader":"true"}}}},   "router":{"name":"compositeId"},   "maxShardsPerNode":"1",   "autoAddReplicas":"false",   "nrtReplicas":"0",   "tlogReplicas":"3"}

Stack Trace:
java.lang.AssertionError: Expected 2 of 3 replicas to be active but only found 1; [core_node3:{"core":"c8n_1x3_lf_shard1_replica_t3","base_url":"http://127.0.0.1:37319","node_name":"127.0.0.1:37319_","state":"active","type":"TLOG","leader":"true"}]; clusterState: DocCollection(c8n_1x3_lf//clusterstate.json/26)={
  "pullReplicas":"0",
  "replicationFactor":"1",
  "shards":{"shard1":{
      "range":"80000000-7fffffff",
      "state":"active",
      "replicas":{
        "core_node1":{
          "state":"down",
          "base_url":"http://127.0.0.1:40833",
          "core":"c8n_1x3_lf_shard1_replica_t1",
          "node_name":"127.0.0.1:40833_",
          "type":"TLOG"},
        "core_node2":{
          "core":"c8n_1x3_lf_shard1_replica_t2",
          "base_url":"http://127.0.0.1:34241",
          "node_name":"127.0.0.1:34241_",
          "state":"down",
          "type":"TLOG"},
        "core_node3":{
          "core":"c8n_1x3_lf_shard1_replica_t3",
          "base_url":"http://127.0.0.1:37319",
          "node_name":"127.0.0.1:37319_",
          "state":"active",
          "type":"TLOG",
          "leader":"true"}}}},
  "router":{"name":"compositeId"},
  "maxShardsPerNode":"1",
  "autoAddReplicas":"false",
  "nrtReplicas":"0",
  "tlogReplicas":"3"}
	at __randomizedtesting.SeedInfo.seed([3E8984F5327246DA:B6DDBB2F9C8E2B22]:0)
	at org.junit.Assert.fail(Assert.java:93)
	at org.junit.Assert.assertTrue(Assert.java:43)
	at org.apache.solr.cloud.LeaderFailoverAfterPartitionTest.testRf3WithLeaderFailover(LeaderFailoverAfterPartitionTest.java:169)
	at org.apache.solr.cloud.LeaderFailoverAfterPartitionTest.test(LeaderFailoverAfterPartitionTest.java:56)
	at sun.reflect.NativeMethodAccessorImpl.invoke0(Native Method)
	at sun.reflect.NativeMethodAccessorImpl.invoke(NativeMethodAccessorImpl.java:62)
	at sun.reflect.DelegatingMethodAccessorImpl.invoke(DelegatingMethodAccessorImpl.java:43)
	at java.lang.reflect.Method.invoke(Method.java:498)
	at com.carrotsearch.randomizedtesting.RandomizedRunner.invoke(RandomizedRunner.java:1713)
	at com.carrotsearch.randomizedtesting.RandomizedRunner$8.evaluate(RandomizedRunner.java:907)
	at com.carrotsearch.randomizedtesting.RandomizedRunner$9.evaluate(RandomizedRunner.java:943)
	at com.carrotsearch.randomizedtesting.RandomizedRunner$10.evaluate(RandomizedRunner.java:957)
	at org.apache.solr.BaseDistributedSearchTestCase$ShardsRepeatRule$ShardsFixedStatement.callStatement(BaseDistributedSearchTestCase.java:993)
	at org.apache.solr.BaseDistributedSearchTestCase$ShardsRepeatRule$ShardsStatement.evaluate(BaseDistributedSearchTestCase.java:968)
	at com.carrotsearch.randomizedtesting.rules.SystemPropertiesRestoreRule$1.evaluate(SystemPropertiesRestoreRule.java:57)
	at org.apache.lucene.util.TestRuleSetupTeardownChained$1.evaluate(TestRuleSetupTeardownChained.java:49)
	at org.apache.lucene.util.AbstractBeforeAfterRule$1.evaluate(AbstractBeforeAfterRule.java:45)
	at org.apache.lucene.util.TestRuleThreadAndTestName$1.evaluate(TestRuleThreadAndTestName.java:48)
	at org.apache.lucene.util.TestRuleIgnoreAfterMaxFailures$1.evaluate(TestRuleIgnoreAfterMaxFailures.java:64)
	at org.apache.lucene.util.TestRuleMarkFailure$1.evaluate(TestRuleMarkFailure.java:47)
	at com.carrotsearch.randomizedtesting.rules.StatementAdapter.evaluate(StatementAdapter.java:36)
	at com.carrotsearch.randomizedtesting.ThreadLeakControl$StatementRunner.run(ThreadLeakControl.java:368)
	at com.carrotsearch.randomizedtesting.ThreadLeakControl.forkTimeoutingTask(ThreadLeakControl.java:817)
	at com.carrotsearch.randomizedtesting.ThreadLeakControl$3.evaluate(ThreadLeakControl.java:468)
	at com.carrotsearch.randomizedtesting.RandomizedRunner.runSingleTest(RandomizedRunner.java:916)
	at com.carrotsearch.randomizedtesting.RandomizedRunner$5.evaluate(RandomizedRunner.java:802)
	at com.carrotsearch.randomizedtesting.RandomizedRunner$6.evaluate(RandomizedRunner.java:852)
	at com.carrotsearch.randomizedtesting.RandomizedRunner$7.evaluate(RandomizedRunner.java:863)
	at com.carrotsearch.randomizedtesting.rules.StatementAdapter.evaluate(StatementAdapter.java:36)
	at com.carrotsearch.randomizedtesting.rules.SystemPropertiesRestoreRule$1.evaluate(SystemPropertiesRestoreRule.java:57)
	at org.apache.lucene.util.AbstractBeforeAfterRule$1.evaluate(AbstractBeforeAfterRule.java:45)
	at com.carrotsearch.randomizedtesting.rules.StatementAdapter.evaluate(StatementAdapter.java:36)
	at org.apache.lucene.util.TestRuleStoreClassName$1.evaluate(TestRuleStoreClassName.java:41)
	at com.carrotsearch.randomizedtesting.rules.NoShadowingOrOverridesOnMethodsRule$1.evaluate(NoShadowingOrOverridesOnMethodsRule.java:40)
	at com.carrotsearch.randomizedtesting.rules.NoShadowingOrOverridesOnMethodsRule$1.evaluate(NoShadowingOrOverridesOnMethodsRule.java:40)
	at com.carrotsearch.randomizedtesting.rules.StatementAdapter.evaluate(StatementAdapter.java:36)
	at com.carrotsearch.randomizedtesting.rules.StatementAdapter.evaluate(StatementAdapter.java:36)
	at com.carrotsearch.randomizedtesting.rules.StatementAdapter.evaluate(StatementAdapter.java:36)
	at org.apache.lucene.util.TestRuleAssertionsRequired$1.evaluate(TestRuleAssertionsRequired.java:53)
	at org.apache.lucene.util.TestRuleMarkFailure$1.evaluate(TestRuleMarkFailure.java:47)
	at org.apache.lucene.util.TestRuleIgnoreAfterMaxFailures$1.evaluate(TestRuleIgnoreAfterMaxFailures.java:64)
	at org.apache.lucene.util.TestRuleIgnoreTestSuites$1.evaluate(TestRuleIgnoreTestSuites.java:54)
	at com.carrotsearch.randomizedtesting.rules.StatementAdapter.evaluate(StatementAdapter.java:36)
	at com.carrotsearch.randomizedtesting.ThreadLeakControl$StatementRunner.run(ThreadLeakControl.java:368)
	at java.lang.Thread.run(Thread.java:748)


FAILED:  org.apache.solr.cloud.TestSolrCloudWithDelegationTokens.testDelegationTokenRenew

Error Message:
expected:<200> but was:<403>

Stack Trace:
java.lang.AssertionError: expected:<200> but was:<403>
	at __randomizedtesting.SeedInfo.seed([3E8984F5327246DA:91270EB0ABE9B7E]:0)
	at org.junit.Assert.fail(Assert.java:93)
	at org.junit.Assert.failNotEquals(Assert.java:647)
	at org.junit.Assert.assertEquals(Assert.java:128)
	at org.junit.Assert.assertEquals(Assert.java:472)
	at org.junit.Assert.assertEquals(Assert.java:456)
	at org.apache.solr.cloud.TestSolrCloudWithDelegationTokens.renewDelegationToken(TestSolrCloudWithDelegationTokens.java:130)
	at org.apache.solr.cloud.TestSolrCloudWithDelegationTokens.verifyDelegationTokenRenew(TestSolrCloudWithDelegationTokens.java:316)
	at org.apache.solr.cloud.TestSolrCloudWithDelegationTokens.testDelegationTokenRenew(TestSolrCloudWithDelegationTokens.java:333)
	at sun.reflect.NativeMethodAccessorImpl.invoke0(Native Method)
	at sun.reflect.NativeMethodAccessorImpl.invoke(NativeMethodAccessorImpl.java:62)
	at sun.reflect.DelegatingMethodAccessorImpl.invoke(DelegatingMethodAccessorImpl.java:43)
	at java.lang.reflect.Method.invoke(Method.java:498)
	at com.carrotsearch.randomizedtesting.RandomizedRunner.invoke(RandomizedRunner.java:1713)
	at com.carrotsearch.randomizedtesting.RandomizedRunner$8.evaluate(RandomizedRunner.java:907)
	at com.carrotsearch.randomizedtesting.RandomizedRunner$9.evaluate(RandomizedRunner.java:943)
	at com.carrotsearch.randomizedtesting.RandomizedRunner$10.evaluate(RandomizedRunner.java:957)
	at com.carrotsearch.randomizedtesting.rules.SystemPropertiesRestoreRule$1.evaluate(SystemPropertiesRestoreRule.java:57)
	at org.apache.lucene.util.TestRuleSetupTeardownChained$1.evaluate(TestRuleSetupTeardownChained.java:49)
	at org.apache.lucene.util.AbstractBeforeAfterRule$1.evaluate(AbstractBeforeAfterRule.java:45)
	at org.apache.lucene.util.TestRuleThreadAndTestName$1.evaluate(TestRuleThreadAndTestName.java:48)
	at org.apache.lucene.util.TestRuleIgnoreAfterMaxFailures$1.evaluate(TestRuleIgnoreAfterMaxFailures.java:64)
	at org.apache.lucene.util.TestRuleMarkFailure$1.evaluate(TestRuleMarkFailure.java:47)
	at com.carrotsearch.randomizedtesting.rules.StatementAdapter.evaluate(StatementAdapter.java:36)
	at com.carrotsearch.randomizedtesting.ThreadLeakControl$StatementRunner.run(ThreadLeakControl.java:368)
	at com.carrotsearch.randomizedtesting.ThreadLeakControl.forkTimeoutingTask(ThreadLeakControl.java:817)
	at com.carrotsearch.randomizedtesting.ThreadLeakControl$3.evaluate(ThreadLeakControl.java:468)
	at com.carrotsearch.randomizedtesting.RandomizedRunner.runSingleTest(RandomizedRunner.java:916)
	at com.carrotsearch.randomizedtesting.RandomizedRunner$5.evaluate(RandomizedRunner.java:802)
	at com.carrotsearch.randomizedtesting.RandomizedRunner$6.evaluate(RandomizedRunner.java:852)
	at com.carrotsearch.randomizedtesting.RandomizedRunner$7.evaluate(RandomizedRunner.java:863)
	at com.carrotsearch.randomizedtesting.rules.StatementAdapter.evaluate(StatementAdapter.java:36)
	at com.carrotsearch.randomizedtesting.rules.SystemPropertiesRestoreRule$1.evaluate(SystemPropertiesRestoreRule.java:57)
	at org.apache.lucene.util.AbstractBeforeAfterRule$1.evaluate(AbstractBeforeAfterRule.java:45)
	at com.carrotsearch.randomizedtesting.rules.StatementAdapter.evaluate(StatementAdapter.java:36)
	at org.apache.lucene.util.TestRuleStoreClassName$1.evaluate(TestRuleStoreClassName.java:41)
	at com.carrotsearch.randomizedtesting.rules.NoShadowingOrOverridesOnMethodsRule$1.evaluate(NoShadowingOrOverridesOnMethodsRule.java:40)
	at com.carrotsearch.randomizedtesting.rules.NoShadowingOrOverridesOnMethodsRule$1.evaluate(NoShadowingOrOverridesOnMethodsRule.java:40)
	at com.carrotsearch.randomizedtesting.rules.StatementAdapter.evaluate(StatementAdapter.java:36)
	at com.carrotsearch.randomizedtesting.rules.StatementAdapter.evaluate(StatementAdapter.java:36)
	at com.carrotsearch.randomizedtesting.rules.StatementAdapter.evaluate(StatementAdapter.java:36)
	at org.apache.lucene.util.TestRuleAssertionsRequired$1.evaluate(TestRuleAssertionsRequired.java:53)
	at org.apache.lucene.util.TestRuleMarkFailure$1.evaluate(TestRuleMarkFailure.java:47)
	at org.apache.lucene.util.TestRuleIgnoreAfterMaxFailures$1.evaluate(TestRuleIgnoreAfterMaxFailures.java:64)
	at org.apache.lucene.util.TestRuleIgnoreTestSuites$1.evaluate(TestRuleIgnoreTestSuites.java:54)
	at com.carrotsearch.randomizedtesting.rules.StatementAdapter.evaluate(StatementAdapter.java:36)
	at com.carrotsearch.randomizedtesting.ThreadLeakControl$StatementRunner.run(ThreadLeakControl.java:368)
	at java.lang.Thread.run(Thread.java:748)




Build Log:
[...truncated 11635 lines...]
   [junit4] Suite: org.apache.solr.cloud.LeaderFailoverAfterPartitionTest
   [junit4]   2> Creating dataDir: /home/jenkins/workspace/Lucene-Solr-7.0-Linux/solr/build/solr-core/test/J2/temp/solr.cloud.LeaderFailoverAfterPartitionTest_3E8984F5327246DA-001/init-core-data-001
   [junit4]   2> 736320 INFO  (SUITE-LeaderFailoverAfterPartitionTest-seed#[3E8984F5327246DA]-worker) [    ] o.a.s.SolrTestCaseJ4 Using PointFields (NUMERIC_POINTS_SYSPROP=true) w/NUMERIC_DOCVALUES_SYSPROP=true
   [junit4]   2> 736321 INFO  (SUITE-LeaderFailoverAfterPartitionTest-seed#[3E8984F5327246DA]-worker) [    ] o.a.s.SolrTestCaseJ4 Randomized ssl (false) and clientAuth (false) via: @org.apache.solr.SolrTestCaseJ4$SuppressSSL(bugUrl=https://issues.apache.org/jira/browse/SOLR-5776)
   [junit4]   2> 736321 INFO  (SUITE-LeaderFailoverAfterPartitionTest-seed#[3E8984F5327246DA]-worker) [    ] o.a.s.BaseDistributedSearchTestCase Setting hostContext system property: /
   [junit4]   2> 736322 INFO  (TEST-LeaderFailoverAfterPartitionTest.test-seed#[3E8984F5327246DA]) [    ] o.a.s.c.ZkTestServer STARTING ZK TEST SERVER
   [junit4]   2> 736322 INFO  (Thread-1528) [    ] o.a.s.c.ZkTestServer client port:0.0.0.0/0.0.0.0:0
   [junit4]   2> 736322 INFO  (Thread-1528) [    ] o.a.s.c.ZkTestServer Starting server
   [junit4]   2> 736323 ERROR (Thread-1528) [    ] o.a.z.s.ZooKeeperServer ZKShutdownHandler is not registered, so ZooKeeper server won't take any action on ERROR or SHUTDOWN server state changes
   [junit4]   2> 736422 INFO  (TEST-LeaderFailoverAfterPartitionTest.test-seed#[3E8984F5327246DA]) [    ] o.a.s.c.ZkTestServer start zk server on port:37709
   [junit4]   2> 736433 INFO  (TEST-LeaderFailoverAfterPartitionTest.test-seed#[3E8984F5327246DA]) [    ] o.a.s.c.AbstractZkTestCase put /home/jenkins/workspace/Lucene-Solr-7.0-Linux/solr/core/src/test-files/solr/collection1/conf/solrconfig-tlog.xml to /configs/conf1/solrconfig.xml
   [junit4]   2> 736434 INFO  (TEST-LeaderFailoverAfterPartitionTest.test-seed#[3E8984F5327246DA]) [    ] o.a.s.c.AbstractZkTestCase put /home/jenkins/workspace/Lucene-Solr-7.0-Linux/solr/core/src/test-files/solr/collection1/conf/schema.xml to /configs/conf1/schema.xml
   [junit4]   2> 736435 INFO  (TEST-LeaderFailoverAfterPartitionTest.test-seed#[3E8984F5327246DA]) [    ] o.a.s.c.AbstractZkTestCase put /home/jenkins/workspace/Lucene-Solr-7.0-Linux/solr/core/src/test-files/solr/collection1/conf/solrconfig.snippet.randomindexconfig.xml to /configs/conf1/solrconfig.snippet.randomindexconfig.xml
   [junit4]   2> 736436 INFO  (TEST-LeaderFailoverAfterPartitionTest.test-seed#[3E8984F5327246DA]) [    ] o.a.s.c.AbstractZkTestCase put /home/jenkins/workspace/Lucene-Solr-7.0-Linux/solr/core/src/test-files/solr/collection1/conf/stopwords.txt to /configs/conf1/stopwords.txt
   [junit4]   2> 736436 INFO  (TEST-LeaderFailoverAfterPartitionTest.test-seed#[3E8984F5327246DA]) [    ] o.a.s.c.AbstractZkTestCase put /home/jenkins/workspace/Lucene-Solr-7.0-Linux/solr/core/src/test-files/solr/collection1/conf/protwords.txt to /configs/conf1/protwords.txt
   [junit4]   2> 736437 INFO  (TEST-LeaderFailoverAfterPartitionTest.test-seed#[3E8984F5327246DA]) [    ] o.a.s.c.AbstractZkTestCase put /home/jenkins/workspace/Lucene-Solr-7.0-Linux/solr/core/src/test-files/solr/collection1/conf/currency.xml to /configs/conf1/currency.xml
   [junit4]   2> 736438 INFO  (TEST-LeaderFailoverAfterPartitionTest.test-seed#[3E8984F5327246DA]) [    ] o.a.s.c.AbstractZkTestCase put /home/jenkins/workspace/Lucene-Solr-7.0-Linux/solr/core/src/test-files/solr/collection1/conf/enumsConfig.xml to /configs/conf1/enumsConfig.xml
   [junit4]   2> 736438 INFO  (TEST-LeaderFailoverAfterPartitionTest.test-seed#[3E8984F5327246DA]) [    ] o.a.s.c.AbstractZkTestCase put /home/jenkins/workspace/Lucene-Solr-7.0-Linux/solr/core/src/test-files/solr/collection1/conf/open-exchange-rates.json to /configs/conf1/open-exchange-rates.json
   [junit4]   2> 736439 INFO  (TEST-LeaderFailoverAfterPartitionTest.test-seed#[3E8984F5327246DA]) [    ] o.a.s.c.AbstractZkTestCase put /home/jenkins/workspace/Lucene-Solr-7.0-Linux/solr/core/src/test-files/solr/collection1/conf/mapping-ISOLatin1Accent.txt to /configs/conf1/mapping-ISOLatin1Accent.txt
   [junit4]   2> 736440 INFO  (TEST-LeaderFailoverAfterPartitionTest.test-seed#[3E8984F5327246DA]) [    ] o.a.s.c.AbstractZkTestCase put /home/jenkins/workspace/Lucene-Solr-7.0-Linux/solr/core/src/test-files/solr/collection1/conf/old_synonyms.txt to /configs/conf1/old_synonyms.txt
   [junit4]   2> 736440 INFO  (TEST-LeaderFailoverAfterPartitionTest.test-seed#[3E8984F5327246DA]) [    ] o.a.s.c.AbstractZkTestCase put /home/jenkins/workspace/Lucene-Solr-7.0-Linux/solr/core/src/test-files/solr/collection1/conf/synonyms.txt to /configs/conf1/synonyms.txt
   [junit4]   2> 736441 INFO  (TEST-LeaderFailoverAfterPartitionTest.test-seed#[3E8984F5327246DA]) [    ] o.a.s.c.AbstractFullDistribZkTestBase Will use TLOG replicas unless explicitly asked otherwise
   [junit4]   2> 736504 INFO  (TEST-LeaderFailoverAfterPartitionTest.test-seed#[3E8984F5327246DA]) [    ] o.e.j.s.Server jetty-9.3.14.v20161028
   [junit4]   2> 736510 INFO  (TEST-LeaderFailoverAfterPartitionTest.test-seed#[3E8984F5327246DA]) [    ] o.e.j.s.h.ContextHandler Started o.e.j.s.ServletContextHandler@28ded50c{/,null,AVAILABLE}
   [junit4]   2> 736511 INFO  (TEST-LeaderFailoverAfterPartitionTest.test-seed#[3E8984F5327246DA]) [    ] o.e.j.s.AbstractConnector Started ServerConnector@7257a92c{HTTP/1.1,[http/1.1]}{127.0.0.1:37589}
   [junit4]   2> 736512 INFO  (TEST-LeaderFailoverAfterPartitionTest.test-seed#[3E8984F5327246DA]) [    ] o.e.j.s.Server Started @737746ms
   [junit4]   2> 736512 INFO  (TEST-LeaderFailoverAfterPartitionTest.test-seed#[3E8984F5327246DA]) [    ] o.a.s.c.s.e.JettySolrRunner Jetty properties: {solr.data.dir=/home/jenkins/workspace/Lucene-Solr-7.0-Linux/solr/build/solr-core/test/J2/temp/solr.cloud.LeaderFailoverAfterPartitionTest_3E8984F5327246DA-001/tempDir-001/control/data, hostContext=/, hostPort=43353, coreRootDirectory=/home/jenkins/workspace/Lucene-Solr-7.0-Linux/solr/build/solr-core/test/J2/temp/solr.cloud.LeaderFailoverAfterPartitionTest_3E8984F5327246DA-001/control-001/cores}
   [junit4]   2> 736512 ERROR (TEST-LeaderFailoverAfterPartitionTest.test-seed#[3E8984F5327246DA]) [    ] o.a.s.s.StartupLoggingUtils Missing Java Option solr.log.dir. Logging may be missing or incomplete.
   [junit4]   2> 736512 INFO  (TEST-LeaderFailoverAfterPartitionTest.test-seed#[3E8984F5327246DA]) [    ] o.a.s.s.SolrDispatchFilter  ___      _       Welcome to Apache Solr™ version 7.0.0
   [junit4]   2> 736512 INFO  (TEST-LeaderFailoverAfterPartitionTest.test-seed#[3E8984F5327246DA]) [    ] o.a.s.s.SolrDispatchFilter / __| ___| |_ _   Starting in cloud mode on port null
   [junit4]   2> 736512 INFO  (TEST-LeaderFailoverAfterPartitionTest.test-seed#[3E8984F5327246DA]) [    ] o.a.s.s.SolrDispatchFilter \__ \/ _ \ | '_|  Install dir: null, Default config dir: null
   [junit4]   2> 736512 INFO  (TEST-LeaderFailoverAfterPartitionTest.test-seed#[3E8984F5327246DA]) [    ] o.a.s.s.SolrDispatchFilter |___/\___/_|_|    Start time: 2017-08-03T18:09:06.099Z
   [junit4]   2> 736514 INFO  (TEST-LeaderFailoverAfterPartitionTest.test-seed#[3E8984F5327246DA]) [    ] o.a.s.s.SolrDispatchFilter Loading solr.xml from SolrHome (not found in ZooKeeper)
   [junit4]   2> 736514 INFO  (TEST-LeaderFailoverAfterPartitionTest.test-seed#[3E8984F5327246DA]) [    ] o.a.s.c.SolrXmlConfig Loading container configuration from /home/jenkins/workspace/Lucene-Solr-7.0-Linux/solr/build/solr-core/test/J2/temp/solr.cloud.LeaderFailoverAfterPartitionTest_3E8984F5327246DA-001/control-001/solr.xml
   [junit4]   2> 736518 INFO  (TEST-LeaderFailoverAfterPartitionTest.test-seed#[3E8984F5327246DA]) [    ] o.a.s.c.SolrXmlConfig MBean server found: com.sun.jmx.mbeanserver.JmxMBeanServer@7e91d102, but no JMX reporters were configured - adding default JMX reporter.
   [junit4]   2> 736520 INFO  (TEST-LeaderFailoverAfterPartitionTest.test-seed#[3E8984F5327246DA]) [    ] o.a.s.c.ZkContainer Zookeeper client=127.0.0.1:37709/solr
   [junit4]   2> 736547 INFO  (TEST-LeaderFailoverAfterPartitionTest.test-seed#[3E8984F5327246DA]) [n:127.0.0.1:43353_    ] o.a.s.c.Overseer Overseer (id=null) closing
   [junit4]   2> 736548 INFO  (TEST-LeaderFailoverAfterPartitionTest.test-seed#[3E8984F5327246DA]) [n:127.0.0.1:43353_    ] o.a.s.c.OverseerElectionContext I am going to be the leader 127.0.0.1:43353_
   [junit4]   2> 736548 INFO  (TEST-LeaderFailoverAfterPartitionTest.test-seed#[3E8984F5327246DA]) [n:127.0.0.1:43353_    ] o.a.s.c.Overseer Overseer (id=98420899571957764-127.0.0.1:43353_-n_0000000000) starting
   [junit4]   2> 736549 INFO  (TEST-LeaderFailoverAfterPartitionTest.test-seed#[3E8984F5327246DA]) [n:127.0.0.1:43353_    ] o.a.s.c.ZkController Register node as live in ZooKeeper:/live_nodes/127.0.0.1:43353_
   [junit4]   2> 736550 INFO  (zkCallback-1290-thread-1-processing-n:127.0.0.1:43353_) [n:127.0.0.1:43353_    ] o.a.s.c.c.ZkStateReader Updated live nodes from ZooKeeper... (0) -> (1)
   [junit4]   2> 736595 INFO  (TEST-LeaderFailoverAfterPartitionTest.test-seed#[3E8984F5327246DA]) [n:127.0.0.1:43353_    ] o.a.s.m.r.SolrJmxReporter JMX monitoring for 'solr.node' (registry 'solr.node') enabled at server: com.sun.jmx.mbeanserver.JmxMBeanServer@7e91d102
   [junit4]   2> 736597 INFO  (TEST-LeaderFailoverAfterPartitionTest.test-seed#[3E8984F5327246DA]) [n:127.0.0.1:43353_    ] o.a.s.m.r.SolrJmxReporter JMX monitoring for 'solr.jvm' (registry 'solr.jvm') enabled at server: com.sun.jmx.mbeanserver.JmxMBeanServer@7e91d102
   [junit4]   2> 736597 INFO  (TEST-LeaderFailoverAfterPartitionTest.test-seed#[3E8984F5327246DA]) [n:127.0.0.1:43353_    ] o.a.s.m.r.SolrJmxReporter JMX monitoring for 'solr.jetty' (registry 'solr.jetty') enabled at server: com.sun.jmx.mbeanserver.JmxMBeanServer@7e91d102
   [junit4]   2> 736598 INFO  (TEST-LeaderFailoverAfterPartitionTest.test-seed#[3E8984F5327246DA]) [n:127.0.0.1:43353_    ] o.a.s.c.CorePropertiesLocator Found 0 core definitions underneath /home/jenkins/workspace/Lucene-Solr-7.0-Linux/solr/build/solr-core/test/J2/temp/solr.cloud.LeaderFailoverAfterPartitionTest_3E8984F5327246DA-001/control-001/cores
   [junit4]   2> 736606 INFO  (TEST-LeaderFailoverAfterPartitionTest.test-seed#[3E8984F5327246DA]) [    ] o.a.s.c.c.ZkStateReader Updated live nodes from ZooKeeper... (0) -> (1)
   [junit4]   2> 736607 INFO  (TEST-LeaderFailoverAfterPartitionTest.test-seed#[3E8984F5327246DA]) [    ] o.a.s.c.s.i.ZkClientClusterStateProvider Cluster at 127.0.0.1:37709/solr ready
   [junit4]   2> 736607 INFO  (SocketProxy-Acceptor-43353) [    ] o.a.s.c.SocketProxy accepted Socket[addr=/127.0.0.1,port=37926,localport=43353], receiveBufferSize:531000
   [junit4]   2> 736607 INFO  (SocketProxy-Acceptor-43353) [    ] o.a.s.c.SocketProxy proxy connection Socket[addr=/127.0.0.1,port=37589,localport=38880], receiveBufferSize=530904
   [junit4]   2> 736608 INFO  (qtp1380893681-7060) [n:127.0.0.1:43353_    ] o.a.s.h.a.CollectionsHandler Invoked Collection Action :create with params replicationFactor=1&collection.configName=conf1&name=control_collection&nrtReplicas=1&action=CREATE&numShards=1&createNodeSet=127.0.0.1:43353_&wt=javabin&version=2 and sendToOCPQueue=true
   [junit4]   2> 736609 INFO  (OverseerThreadFactory-3171-thread-1-processing-n:127.0.0.1:43353_) [n:127.0.0.1:43353_    ] o.a.s.c.CreateCollectionCmd Create collection control_collection
   [junit4]   2> 736710 INFO  (SocketProxy-Acceptor-43353) [    ] o.a.s.c.SocketProxy accepted Socket[addr=/127.0.0.1,port=37930,localport=43353], receiveBufferSize:531000
   [junit4]   2> 736711 INFO  (SocketProxy-Acceptor-43353) [    ] o.a.s.c.SocketProxy proxy connection Socket[addr=/127.0.0.1,port=37589,localport=38884], receiveBufferSize=530904
   [junit4]   2> 736711 INFO  (qtp1380893681-7062) [n:127.0.0.1:43353_    ] o.a.s.h.a.CoreAdminOperation core create command qt=/admin/cores&collection.configName=conf1&newCollection=true&name=control_collection_shard1_replica_n1&action=CREATE&numShards=1&collection=control_collection&shard=shard1&wt=javabin&version=2&replicaType=NRT
   [junit4]   2> 736712 INFO  (qtp1380893681-7062) [n:127.0.0.1:43353_    ] o.a.s.c.TransientSolrCoreCacheDefault Allocating transient cache for 4 transient cores
   [junit4]   2> 736815 INFO  (zkCallback-1290-thread-1-processing-n:127.0.0.1:43353_) [n:127.0.0.1:43353_    ] o.a.s.c.c.ZkStateReader A cluster state change: [WatchedEvent state:SyncConnected type:NodeDataChanged path:/collections/control_collection/state.json] for collection [control_collection] has occurred - updating... (live nodes size: [1])
   [junit4]   2> 737722 INFO  (qtp1380893681-7062) [n:127.0.0.1:43353_ c:control_collection s:shard1  x:control_collection_shard1_replica_n1] o.a.s.c.SolrConfig Using Lucene MatchVersion: 7.0.0
   [junit4]   2> 737731 INFO  (qtp1380893681-7062) [n:127.0.0.1:43353_ c:control_collection s:shard1  x:control_collection_shard1_replica_n1] o.a.s.s.IndexSchema [control_collection_shard1_replica_n1] Schema name=test
   [junit4]   2> 737862 INFO  (qtp1380893681-7062) [n:127.0.0.1:43353_ c:control_collection s:shard1  x:control_collection_shard1_replica_n1] o.a.s.s.IndexSchema Loaded schema test/1.0 with uniqueid field id
   [junit4]   2> 737871 INFO  (qtp1380893681-7062) [n:127.0.0.1:43353_ c:control_collection s:shard1  x:control_collection_shard1_replica_n1] o.a.s.c.CoreContainer Creating SolrCore 'control_collection_shard1_replica_n1' using configuration from collection control_collection, trusted=true
   [junit4]   2> 737871 INFO  (qtp1380893681-7062) [n:127.0.0.1:43353_ c:control_collection s:shard1  x:control_collection_shard1_replica_n1] o.a.s.m.r.SolrJmxReporter JMX monitoring for 'solr.core.control_collection.shard1.replica_n1' (registry 'solr.core.control_collection.shard1.replica_n1') enabled at server: com.sun.jmx.mbeanserver.JmxMBeanServer@7e91d102
   [junit4]   2> 737872 INFO  (qtp1380893681-7062) [n:127.0.0.1:43353_ c:control_collection s:shard1  x:control_collection_shard1_replica_n1] o.a.s.c.SolrCore solr.RecoveryStrategy.Builder
   [junit4]   2> 737872 INFO  (qtp1380893681-7062) [n:127.0.0.1:43353_ c:control_collection s:shard1  x:control_collection_shard1_replica_n1] o.a.s.c.SolrCore [[control_collection_shard1_replica_n1] ] Opening new SolrCore at [/home/jenkins/workspace/Lucene-Solr-7.0-Linux/solr/build/solr-core/test/J2/temp/solr.cloud.LeaderFailoverAfterPartitionTest_3E8984F5327246DA-001/control-001/cores/control_collection_shard1_replica_n1], dataDir=[/home/jenkins/workspace/Lucene-Solr-7.0-Linux/solr/build/solr-core/test/J2/temp/solr.cloud.LeaderFailoverAfterPartitionTest_3E8984F5327246DA-001/control-001/cores/control_collection_shard1_replica_n1/data/]
   [junit4]   2> 737874 INFO  (qtp1380893681-7062) [n:127.0.0.1:43353_ c:control_collection s:shard1  x:control_collection_shard1_replica_n1] o.a.s.u.RandomMergePolicy RandomMergePolicy wrapping class org.apache.lucene.index.TieredMergePolicy: [TieredMergePolicy: maxMergeAtOnce=34, maxMergeAtOnceExplicit=42, maxMergedSegmentMB=38.7080078125, floorSegmentMB=1.7412109375, forceMergeDeletesPctAllowed=18.225739266777197, segmentsPerTier=32.0, maxCFSSegmentSizeMB=8.796093022207999E12, noCFSRatio=0.8995008669461599
   [junit4]   2> 737876 WARN  (qtp1380893681-7062) [n:127.0.0.1:43353_ c:control_collection s:shard1  x:control_collection_shard1_replica_n1] o.a.s.c.RequestHandlers INVALID paramSet a in requestHandler {type = requestHandler,name = /dump,class = DumpRequestHandler,attributes = {initParams=a, name=/dump, class=DumpRequestHandler},args = {defaults={a=A,b=B}}}
   [junit4]   2> 737911 INFO  (qtp1380893681-7062) [n:127.0.0.1:43353_ c:control_collection s:shard1  x:control_collection_shard1_replica_n1] o.a.s.u.UpdateHandler Using UpdateLog implementation: org.apache.solr.update.UpdateLog
   [junit4]   2> 737911 INFO  (qtp1380893681-7062) [n:127.0.0.1:43353_ c:control_collection s:shard1  x:control_collection_shard1_replica_n1] o.a.s.u.UpdateLog Initializing UpdateLog: dataDir= defaultSyncLevel=FLUSH numRecordsToKeep=100 maxNumLogsToKeep=10 numVersionBuckets=65536
   [junit4]   2> 737912 INFO  (qtp1380893681-7062) [n:127.0.0.1:43353_ c:control_collection s:shard1  x:control_collection_shard1_replica_n1] o.a.s.u.CommitTracker Hard AutoCommit: disabled
   [junit4]   2> 737912 INFO  (qtp1380893681-7062) [n:127.0.0.1:43353_ c:control_collection s:shard1  x:control_collection_shard1_replica_n1] o.a.s.u.CommitTracker Soft AutoCommit: disabled
   [junit4]   2> 737913 INFO  (qtp1380893681-7062) [n:127.0.0.1:43353_ c:control_collection s:shard1  x:control_collection_shard1_replica_n1] o.a.s.u.RandomMergePolicy RandomMergePolicy wrapping class org.apache.lucene.index.LogDocMergePolicy: [LogDocMergePolicy: minMergeSize=1000, mergeFactor=18, maxMergeSize=9223372036854775807, maxMergeSizeForForcedMerge=9223372036854775807, calibrateSizeByDeletes=false, maxMergeDocs=2147483647, maxCFSSegmentSizeMB=8.796093022207999E12, noCFSRatio=1.0]
   [junit4]   2> 737913 INFO  (qtp1380893681-7062) [n:127.0.0.1:43353_ c:control_collection s:shard1  x:control_collection_shard1_replica_n1] o.a.s.s.SolrIndexSearcher Opening [Searcher@7a6aaaf2[control_collection_shard1_replica_n1] main]
   [junit4]   2> 737914 INFO  (qtp1380893681-7062) [n:127.0.0.1:43353_ c:control_collection s:shard1  x:control_collection_shard1_replica_n1] o.a.s.r.ManagedResourceStorage Configured ZooKeeperStorageIO with znodeBase: /configs/conf1
   [junit4]   2> 737914 INFO  (qtp1380893681-7062) [n:127.0.0.1:43353_ c:control_collection s:shard1  x:control_collection_shard1_replica_n1] o.a.s.r.ManagedResourceStorage Loaded null at path _rest_managed.json using ZooKeeperStorageIO:path=/configs/conf1
   [junit4]   2> 737914 INFO  (qtp1380893681-7062) [n:127.0.0.1:43353_ c:control_collection s:shard1  x:control_collection_shard1_replica_n1] o.a.s.h.ReplicationHandler Commits will be reserved for  10000
   [junit4]   2> 737915 INFO  (qtp1380893681-7062) [n:127.0.0.1:43353_ c:control_collection s:shard1  x:control_collection_shard1_replica_n1] o.a.s.u.UpdateLog Could not find max version in index or recent updates, using new clock 1574734394820657152
   [junit4]   2> 737915 INFO  (searcherExecutor-3174-thread-1-processing-n:127.0.0.1:43353_ x:control_collection_shard1_replica_n1 s:shard1 c:control_collection) [n:127.0.0.1:43353_ c:control_collection s:shard1  x:control_collection_shard1_replica_n1] o.a.s.c.SolrCore [control_collection_shard1_replica_n1] Registered new searcher Searcher@7a6aaaf2[control_collection_shard1_replica_n1] main{ExitableDirectoryReader(UninvertingDirectoryReader())}
   [junit4]   2> 737918 INFO  (qtp1380893681-7062) [n:127.0.0.1:43353_ c:control_collection s:shard1  x:control_collection_shard1_replica_n1] o.a.s.c.ShardLeaderElectionContext Enough replicas found to continue.
   [junit4]   2> 737918 INFO  (qtp1380893681-7062) [n:127.0.0.1:43353_ c:control_collection s:shard1  x:control_collection_shard1_replica_n1] o.a.s.c.ShardLeaderElectionContext I may be the new leader - try and sync
   [junit4]   2> 737918 INFO  (qtp1380893681-7062) [n:127.0.0.1:43353_ c:control_collection s:shard1  x:control_collection_shard1_replica_n1] o.a.s.c.SyncStrategy Sync replicas to http://127.0.0.1:43353/control_collection_shard1_replica_n1/
   [junit4]   2> 737918 INFO  (qtp1380893681-7062) [n:127.0.0.1:43353_ c:control_collection s:shard1  x:control_collection_shard1_replica_n1] o.a.s.c.SyncStrategy Sync Success - now sync replicas to me
   [junit4]   2> 737918 INFO  (qtp1380893681-7062) [n:127.0.0.1:43353_ c:control_collection s:shard1  x:control_collection_shard1_replica_n1] o.a.s.c.SyncStrategy http://127.0.0.1:43353/control_collection_shard1_replica_n1/ has no replicas
   [junit4]   2> 737918 INFO  (qtp1380893681-7062) [n:127.0.0.1:43353_ c:control_collection s:shard1  x:control_collection_shard1_replica_n1] o.a.s.c.ShardLeaderElectionContext Found all replicas participating in election, clear LIR
   [junit4]   2> 737919 INFO  (qtp1380893681-7062) [n:127.0.0.1:43353_ c:control_collection s:shard1  x:control_collection_shard1_replica_n1] o.a.s.c.ShardLeaderElectionContext I am the new leader: http://127.0.0.1:43353/control_collection_shard1_replica_n1/ shard1
   [junit4]   2> 738020 INFO  (zkCallback-1290-thread-1-processing-n:127.0.0.1:43353_) [n:127.0.0.1:43353_    ] o.a.s.c.c.ZkStateReader A cluster state change: [WatchedEvent state:SyncConnected type:NodeDataChanged path:/collections/control_collection/state.json] for collection [control_collection] has occurred - updating... (live nodes size: [1])
   [junit4]   2> 738070 INFO  (qtp1380893681-7062) [n:127.0.0.1:43353_ c:control_collection s:shard1  x:control_collection_shard1_replica_n1] o.a.s.c.ZkController I am the leader, no recovery necessary
   [junit4]   2> 738071 INFO  (qtp1380893681-7062) [n:127.0.0.1:43353_ c:control_collection s:shard1  x:control_collection_shard1_replica_n1] o.a.s.s.HttpSolrCall [admin] webapp=null path=/admin/cores params={qt=/admin/cores&collection.configName=conf1&newCollection=true&name=control_collection_shard1_replica_n1&action=CREATE&numShards=1&collection=control_collection&shard=shard1&wt=javabin&version=2&replicaType=NRT} status=0 QTime=1359
   [junit4]   2> 738072 INFO  (qtp1380893681-7060) [n:127.0.0.1:43353_    ] o.a.s.h.a.CollectionsHandler Wait for new collection to be active for at most 30 seconds. Check all shard replicas
   [junit4]   2> 738171 INFO  (zkCallback-1290-thread-1-processing-n:127.0.0.1:43353_) [n:127.0.0.1:43353_    ] o.a.s.c.c.ZkStateReader A cluster state change: [WatchedEvent state:SyncConnected type:NodeDataChanged path:/collections/control_collection/state.json] for collection [control_collection] has occurred - updating... (live nodes size: [1])
   [junit4]   2> 738609 INFO  (OverseerCollectionConfigSetProcessor-98420899571957764-127.0.0.1:43353_-n_0000000000) [n:127.0.0.1:43353_    ] o.a.s.c.OverseerTaskQueue Response ZK path: /overseer/collection-queue-work/qnr-0000000000 doesn't exist.  Requestor may have disconnected from ZooKeeper
   [junit4]   2> 739072 INFO  (qtp1380893681-7060) [n:127.0.0.1:43353_    ] o.a.s.s.HttpSolrCall [admin] webapp=null path=/admin/collections params={replicationFactor=1&collection.configName=conf1&name=control_collection&nrtReplicas=1&action=CREATE&numShards=1&createNodeSet=127.0.0.1:43353_&wt=javabin&version=2} status=0 QTime=2464
   [junit4]   2> 739075 INFO  (TEST-LeaderFailoverAfterPartitionTest.test-seed#[3E8984F5327246DA]) [    ] o.a.s.c.c.ZkStateReader Updated live nodes from ZooKeeper... (0) -> (1)
   [junit4]   2> 739076 INFO  (TEST-LeaderFailoverAfterPartitionTest.test-seed#[3E8984F5327246DA]) [    ] o.a.s.c.s.i.ZkClientClusterStateProvider Cluster at 127.0.0.1:37709/solr ready
   [junit4]   2> 739076 INFO  (TEST-LeaderFailoverAfterPartitionTest.test-seed#[3E8984F5327246DA]) [    ] o.a.s.c.ChaosMonkey monkey: init - expire sessions:false cause connection loss:false
   [junit4]   2> 739076 INFO  (SocketProxy-Acceptor-43353) [    ] o.a.s.c.SocketProxy accepted Socket[addr=/127.0.0.1,port=37964,localport=43353], receiveBufferSize:531000
   [junit4]   2> 739076 INFO  (qtp1380893681-7060) [n:127.0.0.1:43353_    ] o.a.s.h.a.CollectionsHandler Invoked Collection Action :create with params replicationFactor=1&collection.configName=conf1&name=collection1&nrtReplicas=1&action=CREATE&numShards=2&createNodeSet=&stateFormat=1&wt=javabin&version=2 and sendToOCPQueue=true
   [junit4]   2> 739077 INFO  (SocketProxy-Acceptor-43353) [    ] o.a.s.c.SocketProxy proxy connection Socket[addr=/127.0.0.1,port=37589,localport=38918], receiveBufferSize=530904
   [junit4]   2> 739077 INFO  (OverseerThreadFactory-3171-thread-2-processing-n:127.0.0.1:43353_) [n:127.0.0.1:43353_    ] o.a.s.c.CreateCollectionCmd Create collection collection1
   [junit4]   2> 739077 WARN  (OverseerThreadFactory-3171-thread-2-processing-n:127.0.0.1:43353_) [n:127.0.0.1:43353_    ] o.a.s.c.CreateCollectionCmd It is unusual to create a collection (collection1) without cores.
   [junit4]   2> 739280 INFO  (qtp1380893681-7060) [n:127.0.0.1:43353_    ] o.a.s.h.a.CollectionsHandler Wait for new collection to be active for at most 30 seconds. Check all shard replicas
   [junit4]   2> 739280 INFO  (qtp1380893681-7060) [n:127.0.0.1:43353_    ] o.a.s.s.HttpSolrCall [admin] webapp=null path=/admin/collections params={replicationFactor=1&collection.configName=conf1&name=collection1&nrtReplicas=1&action=CREATE&numShards=2&createNodeSet=&stateFormat=1&wt=javabin&version=2} status=0 QTime=203
   [junit4]   2> 739346 INFO  (TEST-LeaderFailoverAfterPartitionTest.test-seed#[3E8984F5327246DA]) [    ] o.a.s.c.AbstractFullDistribZkTestBase create jetty 1 in directory /home/jenkins/workspace/Lucene-Solr-7.0-Linux/solr/build/solr-core/test/J2/temp/solr.cloud.LeaderFailoverAfterPartitionTest_3E8984F5327246DA-001/shard-1-001 of type TLOG
   [junit4]   2> 739347 INFO  (TEST-LeaderFailoverAfterPartitionTest.test-seed#[3E8984F5327246DA]) [    ] o.e.j.s.Server jetty-9.3.14.v20161028
   [junit4]   2> 739347 INFO  (TEST-LeaderFailoverAfterPartitionTest.test-seed#[3E8984F5327246DA]) [    ] o.e.j.s.h.ContextHandler Started o.e.j.s.ServletContextHandler@1f300aa0{/,null,AVAILABLE}
   [junit4]   2> 739348 INFO  (TEST-LeaderFailoverAfterPartitionTest.test-seed#[3E8984F5327246DA]) [    ] o.e.j.s.AbstractConnector Started ServerConnector@58993a9d{HTTP/1.1,[http/1.1]}{127.0.0.1:39107}
   [junit4]   2> 739348 INFO  (TEST-LeaderFailoverAfterPartitionTest.test-seed#[3E8984F5327246DA]) [    ] o.e.j.s.Server Started @740583ms
   [junit4]   2> 739348 INFO  (TEST-LeaderFailoverAfterPartitionTest.test-seed#[3E8984F5327246DA]) [    ] o.a.s.c.s.e.JettySolrRunner Jetty properties: {solr.data.dir=/home/jenkins/workspace/Lucene-Solr-7.0-Linux/solr/build/solr-core/test/J2/temp/solr.cloud.LeaderFailoverAfterPartitionTest_3E8984F5327246DA-001/tempDir-001/jetty1, replicaType=TLOG, solrconfig=solrconfig.xml, hostContext=/, hostPort=37319, coreRootDirectory=/home/jenkins/workspace/Lucene-Solr-7.0-Linux/solr/build/solr-core/test/J2/temp/solr.cloud.LeaderFailoverAfterPartitionTest_3E8984F5327246DA-001/shard-1-001/cores}
   [junit4]   2> 739348 ERROR (TEST-LeaderFailoverAfterPartitionTest.test-seed#[3E8984F5327246DA]) [    ] o.a.s.s.StartupLoggingUtils Missing Java Option solr.log.dir. Logging may be missing or incomplete.
   [junit4]   2> 739348 INFO  (TEST-LeaderFailoverAfterPartitionTest.test-seed#[3E8984F5327246DA]) [    ] o.a.s.s.SolrDispatchFilter  ___      _       Welcome to Apache Solr™ version 7.0.0
   [junit4]   2> 739348 INFO  (TEST-LeaderFailoverAfterPartitionTest.test-seed#[3E8984F5327246DA]) [    ] o.a.s.s.SolrDispatchFilter / __| ___| |_ _   Starting in cloud mode on port null
   [junit4]   2> 739348 INFO  (TEST-LeaderFailoverAfterPartitionTest.test-seed#[3E8984F5327246DA]) [    ] o.a.s.s.SolrDispatchFilter \__ \/ _ \ | '_|  Install dir: null, Default config dir: null
   [junit4]   2> 739348 INFO  (TEST-LeaderFailoverAfterPartitionTest.test-seed#[3E8984F5327246DA]) [    ] o.a.s.s.SolrDispatchFilter |___/\___/_|_|    Start time: 2017-08-03T18:09:08.935Z
   [junit4]   2> 739354 INFO  (TEST-LeaderFailoverAfterPartitionTest.test-seed#[3E8984F5327246DA]) [    ] o.a.s.s.SolrDispatchFilter Loading solr.xml from SolrHome (not found in ZooKeeper)
   [junit4]   2> 739354 INFO  (TEST-LeaderFailoverAfterPartitionTest.test-seed#[3E8984F5327246DA]) [    ] o.a.s.c.SolrXmlConfig Loading container configuration from /home/jenkins/workspace/Lucene-Solr-7.0-Linux/solr/build/solr-core/test/J2/temp/solr.cloud.LeaderFailoverAfterPartitionTest_3E8984F5327246DA-001/shard-1-001/solr.xml
   [junit4]   2> 739356 INFO  (TEST-LeaderFailoverAfterPartitionTest.test-seed#[3E8984F5327246DA]) [    ] o.a.s.c.SolrXmlConfig MBean server found: com.sun.jmx.mbeanserver.JmxMBeanServer@7e91d102, but no JMX reporters were configured - adding default JMX reporter.
   [junit4]   2> 739358 INFO  (TEST-LeaderFailoverAfterPartitionTest.test-seed#[3E8984F5327246DA]) [    ] o.a.s.c.ZkContainer Zookeeper client=127.0.0.1:37709/solr
   [junit4]   2> 739363 INFO  (TEST-LeaderFailoverAfterPartitionTest.test-seed#[3E8984F5327246DA]) [n:127.0.0.1:37319_    ] o.a.s.c.c.ZkStateReader Updated live nodes from ZooKeeper... (0) -> (1)
   [junit4]   2> 739363 INFO  (TEST-LeaderFailoverAfterPartitionTest.test-seed#[3E8984F5327246DA]) [n:127.0.0.1:37319_    ] o.a.s.c.Overseer Overseer (id=null) closing
   [junit4]   2> 739364 INFO  (TEST-LeaderFailoverAfterPartitionTest.test-seed#[3E8984F5327246DA]) [n:127.0.0.1:37319_    ] o.a.s.c.ZkController Register node as live in ZooKeeper:/live_nodes/127.0.0.1:37319_
   [junit4]   2> 739369 INFO  (zkCallback-1290-thread-1-processing-n:127.0.0.1:43353_) [n:127.0.0.1:43353_    ] o.a.s.c.c.ZkStateReader Updated live nodes from ZooKeeper... (1) -> (2)
   [junit4]   2> 739369 INFO  (zkCallback-1297-thread-1) [    ] o.a.s.c.c.ZkStateReader Updated live nodes from ZooKeeper... (1) -> (2)
   [junit4]   2> 739371 INFO  (zkCallback-1302-thread-1-processing-n:127.0.0.1:37319_) [n:127.0.0.1:37319_    ] o.a.s.c.c.ZkStateReader Updated live nodes from ZooKeeper... (1) -> (2)
   [junit4]   2> 739424 INFO  (TEST-LeaderFailoverAfterPartitionTest.test-seed#[3E8984F5327246DA]) [n:127.0.0.1:37319_    ] o.a.s.m.r.SolrJmxReporter JMX monitoring for 'solr.node' (registry 'solr.node') enabled at server: com.sun.jmx.mbeanserver.JmxMBeanServer@7e91d102
   [junit4]   2> 739426 INFO  (TEST-LeaderFailoverAfterPartitionTest.test-seed#[3E8984F5327246DA]) [n:127.0.0.1:37319_    ] o.a.s.m.r.SolrJmxReporter JMX monitoring for 'solr.jvm' (registry 'solr.jvm') enabled at server: com.sun.jmx.mbeanserver.JmxMBeanServer@7e91d102
   [junit4]   2> 739426 INFO  (TEST-LeaderFailoverAfterPartitionTest.test-seed#[3E8984F5327246DA]) [n:127.0.0.1:37319_    ] o.a.s.m.r.SolrJmxReporter JMX monitoring for 'solr.jetty' (registry 'solr.jetty') enabled at server: com.sun.jmx.mbeanserver.JmxMBeanServer@7e91d102
   [junit4]   2> 739427 INFO  (TEST-LeaderFailoverAfterPartitionTest.test-seed#[3E8984F5327246DA]) [n:127.0.0.1:37319_    ] o.a.s.c.CorePropertiesLocator Found 0 core definitions underneath /home/jenkins/workspace/Lucene-Solr-7.0-Linux/solr/build/solr-core/test/J2/temp/solr.cloud.LeaderFailoverAfterPartitionTest_3E8984F5327246DA-001/shard-1-001/cores
   [junit4]   2> 739438 INFO  (SocketProxy-Acceptor-37319) [    ] o.a.s.c.SocketProxy accepted Socket[addr=/127.0.0.1,port=37062,localport=37319], receiveBufferSize:531000
   [junit4]   2> 739439 INFO  (SocketProxy-Acceptor-37319) [    ] o.a.s.c.SocketProxy proxy connection Socket[addr=/127.0.0.1,port=39107,localport=44506], receiveBufferSize=530904
   [junit4]   2> 739439 INFO  (qtp121424150-7108) [n:127.0.0.1:37319_    ] o.a.s.h.a.CollectionsHandler Invoked Collection Action :addreplica with params node=127.0.0.1:37319_&action=ADDREPLICA&collection=collection1&shard=shard2&type=TLOG&wt=javabin&version=2 and sendToOCPQueue=true
   [junit4]   2> 739440 INFO  (OverseerCollectionConfigSetProcessor-98420899571957764-127.0.0.1:43353_-n_0000000000) [n:127.0.0.1:43353_    ] o.a.s.c.OverseerTaskQueue Response ZK path: /overseer/collection-queue-work/qnr-0000000002 doesn't exist.  Requestor may have disconnected from ZooKeeper
   [junit4]   2> 739440 INFO  (OverseerThreadFactory-3171-thread-3-processing-n:127.0.0.1:43353_) [n:127.0.0.1:43353_    ] o.a.s.c.AddReplicaCmd Node Identified 127.0.0.1:37319_ for creating new replica
   [junit4]   2> 739440 INFO  (SocketProxy-Acceptor-37319) [    ] o.a.s.c.SocketProxy accepted Socket[addr=/127.0.0.1,port=37066,localport=37319], receiveBufferSize:531000
   [junit4]   2> 739441 INFO  (SocketProxy-Acceptor-37319) [    ] o.a.s.c.SocketProxy proxy connection Socket[addr=/127.0.0.1,port=39107,localport=44510], receiveBufferSize=530904
   [junit4]   2> 739441 INFO  (qtp121424150-7110) [n:127.0.0.1:37319_    ] o.a.s.h.a.CoreAdminOperation core create command qt=/admin/cores&collection.configName=conf1&name=collection1_shard2_replica_t0&action=CREATE&collection=collection1&shard=shard2&wt=javabin&version=2&replicaType=TLOG
   [junit4]   2> 739441 INFO  (qtp121424150-7110) [n:127.0.0.1:37319_    ] o.a.s.c.TransientSolrCoreCacheDefault Allocating transient cache for 4 transient cores
   [junit4]   2> 740449 INFO  (qtp121424150-7110) [n:127.0.0.1:37319_ c:collection1 s:shard2  x:collection1_shard2_replica_t0] o.a.s.c.SolrConfig Using Lucene MatchVersion: 7.0.0
   [junit4]   2> 740461 INFO  (qtp121424150-7110) [n:127.0.0.1:37319_ c:collection1 s:shard2  x:collection1_shard2_replica_t0] o.a.s.s.IndexSchema [collection1_shard2_replica_t0] Schema name=test
   [junit4]   2> 740523 INFO  (qtp121424150-7110) [n:127.0.0.1:37319_ c:collection1 s:shard2  x:collection1_shard2_replica_t0] o.a.s.s.IndexSchema Loaded schema test/1.0 with uniqueid field id
   [junit4]   2> 740530 INFO  (qtp121424150-7110) [n:127.0.0.1:37319_ c:collection1 s:shard2  x:collection1_shard2_replica_t0] o.a.s.c.CoreContainer Creating SolrCore 'collection1_shard2_replica_t0' using configuration from collection collection1, trusted=true
   [junit4]   2> 740530 INFO  (qtp121424150-7110) [n:127.0.0.1:37319_ c:collection1 s:shard2  x:collection1_shard2_replica_t0] o.a.s.m.r.SolrJmxReporter JMX monitoring for 'solr.core.collection1.shard2.replica_t0' (registry 'solr.core.collection1.shard2.replica_t0') enabled at server: com.sun.jmx.mbeanserver.JmxMBeanServer@7e91d102
   [junit4]   2> 740530 INFO  (qtp121424150-7110) [n:127.0.0.1:37319_ c:collection1 s:shard2  x:collection1_shard2_replica_t0] o.a.s.c.SolrCore solr.RecoveryStrategy.Builder
   [junit4]   2> 740530 INFO  (qtp121424150-7110) [n:127.0.0.1:37319_ c:collection1 s:shard2  x:collection1_shard2_replica_t0] o.a.s.c.SolrCore [[collection1_shard2_replica_t0] ] Opening new SolrCore at [/home/jenkins/workspace/Lucene-Solr-7.0-Linux/solr/build/solr-core/test/J2/temp/solr.cloud.LeaderFailoverAfterPartitionTest_3E8984F5327246DA-001/shard-1-001/cores/collection1_shard2_replica_t0], dataDir=[/home/jenkins/workspace/Lucene-Solr-7.0-Linux/solr/build/solr-core/test/J2/temp/solr.cloud.LeaderFailoverAfterPartitionTest_3E8984F5327246DA-001/shard-1-001/cores/collection1_shard2_replica_t0/data/]
   [junit4]   2> 740531 INFO  (qtp121424150-7110) [n:127.0.0.1:37319_ c:collection1 s:shard2  x:collection1_shard2_replica_t0] o.a.s.u.RandomMergePolicy RandomMergePolicy wrapping class org.apache.lucene.index.TieredMergePolicy: [TieredMergePolicy: maxMergeAtOnce=34, maxMergeAtOnceExplicit=42, maxMergedSegmentMB=38.7080078125, floorSegmentMB=1.7412109375, forceMergeDeletesPctAllowed=18.225739266777197, segmentsPerTier=32.0, maxCFSSegmentSizeMB=8.796093022207999E12, noCFSRatio=0.8995008669461599
   [junit4]   2> 740533 WARN  (qtp121424150-7110) [n:127.0.0.1:37319_ c:collection1 s:shard2  x:collection1_shard2_replica_t0] o.a.s.c.RequestHandlers INVALID paramSet a in requestHandler {type = requestHandler,name = /dump,class = DumpRequestHandler,attributes = {initParams=a, name=/dump, class=DumpRequestHandler},args = {defaults={a=A,b=B}}}
   [junit4]   2> 740552 INFO  (qtp121424150-7110) [n:127.0.0.1:37319_ c:collection1 s:shard2  x:collection1_shard2_replica_t0] o.a.s.u.UpdateHandler Using UpdateLog implementation: org.apache.solr.update.UpdateLog
   [junit4]   2> 740552 INFO  (qtp121424150-7110) [n:127.0.0.1:37319_ c:collection1 s:shard2  x:collection1_shard2_replica_t0] o.a.s.u.UpdateLog Initializing UpdateLog: dataDir= defaultSyncLevel=FLUSH numRecordsToKeep=100 maxNumLogsToKeep=10 numVersionBuckets=65536
   [junit4]   2> 740553 INFO  (qtp121424150-7110) [n:127.0.0.1:37319_ c:collection1 s:shard2  x:collection1_shard2_replica_t0] o.a.s.u.CommitTracker Hard AutoCommit: disabled
   [junit4]   2> 740553 INFO  (qtp121424150-7110) [n:127.0.0.1:37319_ c:collection1 s:shard2  x:collection1_shard2_replica_t0] o.a.s.u.CommitTracker Soft AutoCommit: disabled
   [junit4]   2> 740553 INFO  (qtp121424150-7110) [n:127.0.0.1:37319_ c:collection1 s:shard2  x:collection1_shard2_replica_t0] o.a.s.u.RandomMergePolicy RandomMergePolicy wrapping class org.apache.lucene.index.LogDocMergePolicy: [LogDocMergePolicy: minMergeSize=1000, mergeFactor=18, maxMergeSize=9223372036854775807, maxMergeSizeForForcedMerge=9223372036854775807, calibrateSizeByDeletes=false, maxMergeDocs=2147483647, maxCFSSegmentSizeMB=8.796093022207999E12, noCFSRatio=1.0]
   [junit4]   2> 740554 INFO  (qtp121424150-7110) [n:127.0.0.1:37319_ c:collection1 s:shard2  x:collection1_shard2_replica_t0] o.a.s.s.SolrIndexSearcher Opening [Searcher@5220f620[collection1_shard2_replica_t0] main]
   [junit4]   2> 740554 INFO  (qtp121424150-7110) [n:127.0.0.1:37319_ c:collection1 s:shard2  x:collection1_shard2_replica_t0] o.a.s.r.ManagedResourceStorage Configured ZooKeeperStorageIO with znodeBase: /configs/conf1
   [junit4]   2> 740555 INFO  (qtp121424150-7110) [n:127.0.0.1:37319_ c:collection1 s:shard2  x:collection1_shard2_replica_t0] o.a.s.r.ManagedResourceStorage Loaded null at path _rest_managed.json using ZooKeeperStorageIO:path=/configs/conf1
   [junit4]   2> 740555 INFO  (qtp121424150-7110) [n:127.0.0.1:37319_ c:collection1 s:shard2  x:collection1_shard2_replica_t0] o.a.s.h.ReplicationHandler Commits will be reserved for  10000
   [junit4]   2> 740555 INFO  (qtp121424150-7110) [n:127.0.0.1:37319_ c:collection1 s:shard2  x:collection1_shard2_replica_t0] o.a.s.u.UpdateLog Could not find max version in index or recent updates, using new clock 1574734397588897792
   [junit4]   2> 740556 INFO  (searcherExecutor-3185-thread-1-processing-n:127.0.0.1:37319_ x:collection1_shard2_replica_t0 s:shard2 c:collection1) [n:127.0.0.1:37319_ c:collection1 s:shard2  x:collection1_shard2_replica_t0] o.a.s.c.SolrCore [collection1_shard2_replica_t0] Registered new searcher Searcher@5220f620[collection1_shard2_replica_t0] main{ExitableDirectoryReader(UninvertingDirectoryReader())}
   [junit4]   2> 740558 INFO  (qtp121424150-7110) [n:127.0.0.1:37319_ c:collection1 s:shard2  x:collection1_shard2_replica_t0] o.a.s.c.ShardLeaderElectionContext Enough replicas found to continue.
   [junit4]   2> 740558 INFO  (qtp121424150-7110) [n:127.0.0.1:37319_ c:collection1 s:shard2  x:collection1_shard2_replica_t0] o.a.s.c.ShardLeaderElectionContext I may be the new leader - try and sync
   [junit4]   2> 740558 INFO  (qtp121424150-7110) [n:127.0.0.1:37319_ c:collection1 s:shard2  x:collection1_shard2_replica_t0] o.a.s.c.SyncStrategy Sync replicas to http://127.0.0.1:37319/collection1_shard2_replica_t0/
   [junit4]   2> 740558 INFO  (qtp121424150-7110) [n:127.0.0.1:37319_ c:collection1 s:shard2  x:collection1_shard2_replica_t0] o.a.s.c.SyncStrategy Sync Success - now sync replicas to me
   [junit4]   2> 740558 INFO  (qtp121424150-7110) [n:127.0.0.1:37319_ c:collection1 s:shard2  x:collection1_shard2_replica_t0] o.a.s.c.SyncStrategy http://127.0.0.1:37319/collection1_shard2_replica_t0/ has no replicas
   [junit4]   2> 740558 INFO  (qtp121424150-7110) [n:127.0.0.1:37319_ c:collection1 s:shard2  x:collection1_shard2_replica_t0] o.a.s.c.ShardLeaderElectionContext Found all replicas participating in election, clear LIR
   [junit4]   2> 740558 INFO  (qtp121424150-7110) [n:127.0.0.1:37319_ c:collection1 s:shard2  x:collection1_shard2_replica_t0] o.a.s.c.ZkController collection1_shard2_replica_t0 stopping background replication from leader
   [junit4]   2> 740559 INFO  (qtp121424150-7110) [n:127.0.0.1:37319_ c:collection1 s:shard2  x:collection1_shard2_replica_t0] o.a.s.c.ShardLeaderElectionContext I am the new leader: http://127.0.0.1:37319/collection1_shard2_replica_t0/ shard2
   [junit4]   2> 740709 INFO  (qtp121424150-7110) [n:127.0.0.1:37319_ c:collection1 s:shard2  x:collection1_shard2_replica_t0] o.a.s.c.ZkController I am the leader, no recovery necessary
   [junit4]   2> 740711 INFO  (qtp121424150-7110) [n:127.0.0.1:37319_ c:collection1 s:shard2  x:collection1_shard2_replica_t0] o.a.s.s.HttpSolrCall [admin] webapp=null path=/admin/cores params={qt=/admin/cores&collection.configName=conf1&name=collection1_shard2_replica_t0&action=CREATE&collection=collection1&shard=shard2&wt=javabin&version=2&replicaType=TLOG} status=0 QTime=1270
   [junit4]   2> 740712 INFO  (qtp121424150-7108) [n:127.0.0.1:37319_    ] o.a.s.s.HttpSolrCall [admin] webapp=null path=/admin/collections params={node=127.0.0.1:37319_&action=ADDREPLICA&collection=collection1&shard=shard2&type=TLOG&wt=javabin&version=2} status=0 QTime=1273
   [junit4]   2> 740779 INFO  (TEST-LeaderFailoverAfterPartitionTest.test-seed#[3E8984F5327246DA]) [    ] o.a.s.c.AbstractFullDistribZkTestBase create jetty 2 in directory /home/jenkins/workspace/Lucene-Solr-7.0-Linux/solr/build/solr-core/test/J2/temp/solr.cloud.LeaderFailoverAfterPartitionTest_3E8984F5327246DA-001/shard-2-001 of type TLOG
   [junit4]   2> 740779 INFO  (TEST-LeaderFailoverAfterPartitionTest.test-seed#[3E8984F5327246DA]) [    ] o.e.j.s.Server jetty-9.3.14.v20161028
   [junit4]   2> 740780 INFO  (TEST-LeaderFailoverAfterPartitionTest.test-seed#[3E8984F5327246DA]) [    ] o.e.j.s.h.ContextHandler Started o.e.j.s.ServletContextHandler@643d117c{/,null,AVAILABLE}
   [junit4]   2> 740780 INFO  (TEST-LeaderFailoverAfterPartitionTest.test-seed#[3E8984F5327246DA]) [    ] o.e.j.s.AbstractConnector Started ServerConnector@e682301{HTTP/1.1,[http/1.1]}{127.0.0.1:37503}
   [junit4]   2> 740780 INFO  (TEST-LeaderFailoverAfterPartitionTest.test-seed#[3E8984F5327246DA]) [    ] o.e.j.s.Server Started @742015ms
   [junit4]   2> 740780 INFO  (TEST-LeaderFailoverAfterPartitionTest.test-seed#[3E8984F5327246DA]) [    ] o.a.s.c.s.e.JettySolrRunner Jetty properties: {solr.data.dir=/home/jenkins/workspace/Lucene-Solr-7.0-Linux/solr/build/solr-core/test/J2/temp/solr.cloud.LeaderFailoverAfterPartitionTest_3E8984F5327246DA-001/tempDir-001/jetty2, replicaType=TLOG, solrconfig=solrconfig.xml, hostContext=/, hostPort=34241, coreRootDirectory=/home/jenkins/workspace/Lucene-Solr-7.0-Linux/solr/build/solr-core/test/J2/temp/solr.cloud.LeaderFailoverAfterPartitionTest_3E8984F5327246DA-001/shard-2-001/cores}
   [junit4]   2> 740781 ERROR (TEST-LeaderFailoverAfterPartitionTest.test-seed#[3E8984F5327246DA]) [    ] o.a.s.s.StartupLoggingUtils Missing Java Option solr.log.dir. Logging may be missing or incomplete.
   [junit4]   2> 740781 INFO  (TEST-LeaderFailoverAfterPartitionTest.test-seed#[3E8984F5327246DA]) [    ] o.a.s.s.SolrDispatchFilter  ___      _       Welcome to Apache Solr™ version 7.0.0
   [junit4]   2> 740781 INFO  (TEST-LeaderFailoverAfterPartitionTest.test-seed#[3E8984F5327246DA]) [    ] o.a.s.s.SolrDispatchFilter / __| ___| |_ _   Starting in cloud mode on port null
   [junit4]   2> 740781 INFO  (TEST-LeaderFailoverAfterPartitionTest.test-seed#[3E8984F5327246DA]) [    ] o.a.s.s.SolrDispatchFilter \__ \/ _ \ | '_|  Install dir: null, Default config dir: null
   [junit4]   2> 740781 INFO  (TEST-LeaderFailoverAfterPartitionTest.test-seed#[3E8984F5327246DA]) [    ] o.a.s.s.SolrDispatchFilter |___/\___/_|_|    Start time: 2017-08-03T18:09:10.368Z
   [junit4]   2> 740782 INFO  (TEST-LeaderFailoverAfterPartitionTest.test-seed#[3E8984F5327246DA]) [    ] o.a.s.s.SolrDispatchFilter Loading solr.xml from SolrHome (not found in ZooKeeper)
   [junit4]   2> 740782 INFO  (TEST-LeaderFailoverAfterPartitionTest.test-seed#[3E8984F5327246DA]) [    ] o.a.s.c.SolrXmlConfig Loading container configuration from /home/jenkins/workspace/Lucene-Solr-7.0-Linux/solr/build/solr-core/test/J2/temp/solr.cloud.LeaderFailoverAfterPartitionTest_3E8984F5327246DA-001/shard-2-001/solr.xml
   [junit4]   2> 740784 INFO  (TEST-LeaderFailoverAfterPartitionTest.test-seed#[3E8984F5327246DA]) [    ] o.a.s.c.SolrXmlConfig MBean server found: com.sun.jmx.mbeanserver.JmxMBeanServer@7e91d102, but no JMX reporters were configured - adding default JMX reporter.
   [junit4]   2> 740786 INFO  (TEST-LeaderFailoverAfterPartitionTest.test-seed#[3E8984F5327246DA]) [    ] o.a.s.c.ZkContainer Zookeeper client=127.0.0.1:37709/solr
   [junit4]   2> 740790 INFO  (TEST-LeaderFailoverAfterPartitionTest.test-seed#[3E8984F5327246DA]) [n:127.0.0.1:34241_    ] o.a.s.c.c.ZkStateReader Updated live nodes from ZooKeeper... (0) -> (2)
   [junit4]   2> 740790 INFO  (TEST-LeaderFailoverAfterPartitionTest.test-seed#[3E8984F5327246DA]) [n:127.0.0.1:34241_    ] o.a.s.c.Overseer Overseer (id=null) closing
   [junit4]   2> 740791 INFO  (TEST-LeaderFailoverAfterPartitionTest.test-seed#[3E8984F5327246DA]) [n:127.0.0.1:34241_    ] o.a.s.c.ZkController Register node as live in ZooKeeper:/live_nodes/127.0.0.1:34241_
   [junit4]   2> 740791 INFO  (zkCallback-1297-thread-1) [    ] o.a.s.c.c.ZkStateReader Updated live nodes from ZooKeeper... (2) -> (3)
   [junit4]   2> 740791 INFO  (zkCallback-1302-thread-1-processing-n:127.0.0.1:37319_) [n:127.0.0.1:37319_    ] o.a.s.c.c.ZkStateReader Updated live nodes from ZooKeeper... (2) -> (3)
   [junit4]   2> 740791 INFO  (zkCallback-1290-thread-1-processing-n:127.0.0.1:43353_) [n:127.0.0.1:43353_    ] o.a.s.c.c.ZkStateReader Updated live nodes from ZooKeeper... (2) -> (3)
   [junit4]   2> 740791 INFO  (zkCallback-1308-thread-1-processing-n:127.0.0.1:34241_) [n:127.0.0.1:34241_    ] o.a.s.c.c.ZkStateReader Updated live nodes from ZooKeeper... (2) -> (3)
   [junit4]   2> 740842 INFO  (TEST-LeaderFailoverAfterPartitionTest.test-seed#[3E8984F5327246DA]) [n:127.0.0.1:34241_    ] o.a.s.m.r.SolrJmxReporter JMX monitoring for 'solr.node' (registry 'solr.node') enabled at server: com.sun.jmx.mbeanserver.JmxMBeanServer@7e91d102
   [junit4]   2> 740845 INFO  (TEST-LeaderFailoverAfterPartitionTest.test-seed#[3E8984F5327246DA]) [n:127.0.0.1:34241_    ] o.a.s.m.r.SolrJmxReporter JMX monitoring for 'solr.jvm' (registry 'solr.jvm') enabled at server: com.sun.jmx.mbeanserver.JmxMBeanServer@7e91d102
   [junit4]   2> 740845 INFO  (TEST-LeaderFailoverAfterPartitionTest.test-seed#[3E8984F5327246DA]) [n:127.0.0.1:34241_    ] o.a.s.m.r.SolrJmxReporter JMX monitoring for 'solr.jetty' (registry 'solr.jetty') enabled at server: com.sun.jmx.mbeanserver.JmxMBeanServer@7e91d102
   [junit4]   2> 740846 INFO  (TEST-LeaderFailoverAfterPartitionTest.test-seed#[3E8984F5327246DA]) [n:127.0.0.1:34241_    ] o.a.s.c.CorePropertiesLocator Found 0 core definitions underneath /home/jenkins/workspace/Lucene-Solr-7.0-Linux/solr/build/solr-core/test/J2/temp/solr.cloud.LeaderFailoverAfterPartitionTest_3E8984F5327246DA-001/shard-2-001/cores
   [junit4]   2> 740864 INFO  (SocketProxy-Acceptor-34241) [    ] o.a.s.c.SocketProxy accepted Socket[addr=/127.0.0.1,port=44986,localport=34241], receiveBufferSize:531000
   [junit4]   2> 740865 INFO  (SocketProxy-Acceptor-34241) [    ] o.a.s.c.SocketProxy proxy connection Socket[addr=/127.0.0.1,port=37503,localport=50750], receiveBufferSize=530904
   [junit4]   2> 740865 INFO  (qtp1648904132-7142) [n:127.0.0.1:34241_    ] o.a.s.h.a.CollectionsHandler Invoked Collection Action :addreplica with params node=127.0.0.1:34241_&action=ADDREPLICA&collection=collection1&shard=shard1&type=TLOG&wt=javabin&version=2 and sendToOCPQueue=true
   [junit4]   2> 740866 INFO  (OverseerThreadFactory-3171-thread-4-processing-n:127.0.0.1:43353_) [n:127.0.0.1:43353_    ] o.a.s.c.AddReplicaCmd Node Identified 127.0.0.1:34241_ for creating new replica
   [junit4]   2> 740866 INFO  (OverseerCollectionConfigSetProcessor-98420899571957764-127.0.0.1:43353_-n_0000000000) [n:127.0.0.1:43353_    ] o.a.s.c.OverseerTaskQueue Response ZK path: /overseer/collection-queue-work/qnr-0000000004 doesn't exist.  Requestor may have disconnected from ZooKeeper
   [junit4]   2> 740867 INFO  (SocketProxy-Acceptor-34241) [    ] o.a.s.c.SocketProxy accepted Socket[addr=/127.0.0.1,port=44990,localport=34241], receiveBufferSize:531000
   [junit4]   2> 740867 INFO  (SocketProxy-Acceptor-34241) [    ] o.a.s.c.SocketProxy proxy connection Socket[addr=/127.0.0.1,port=37503,localport=50754], receiveBufferSize=530904
   [junit4]   2> 740867 INFO  (qtp1648904132-7144) [n:127.0.0.1:34241_    ] o.a.s.h.a.CoreAdminOperation core create command qt=/admin/cores&collection.configName=conf1&name=collection1_shard1_replica_t0&action=CREATE&collection=collection1&shard=shard1&wt=javabin&version=2&replicaType=TLOG
   [junit4]   2> 740867 INFO  (qtp1648904132-7144) [n:127.0.0.1:34241_    ] o.a.s.c.TransientSolrCoreCacheDefault Allocating transient cache for 4 transient cores
   [junit4]   2> 741878 INFO  (qtp1648904132-7144) [n:127.0.0.1:34241_ c:collection1 s:shard1  x:collection1_shard1_replica_t0] o.a.s.c.SolrConfig Using Lucene MatchVersion: 7.0.0
   [junit4]   2> 741890 INFO  (qtp1648904132-7144) [n:127.0.0.1:34241_ c:collection1 s:shard1  x:collection1_shard1_replica_t0] o.a.s.s.IndexSchema [collection1_shard1_replica_t0] Schema name=test
   [junit4]   2> 741997 INFO  (qtp1648904132-7144) [n:127.0.0.1:34241_ c:collection1 s:shard1  x:collection1_shard1_replica_t0] o.a.s.s.IndexSchema Loaded schema test/1.0 with uniqueid field id
   [junit4]   2> 742008 INFO  (qtp1648904132-7144) [n:127.0.0.1:34241_ c:collection1 s:shard1  x:collection1_shard1_replica_t0] o.a.s.c.CoreContainer Creating SolrCore 'collection1_shard1_replica_t0' using configuration from collection collection1, trusted=true
   [junit4]   2> 742009 INFO  (qtp1648904132-7144) [n:127.0.0.1:34241_ c:collection1 s:shard1  x:collection1_shard1_replica_t0] o.a.s.m.r.SolrJmxReporter JMX monitoring for 'solr.core.collection1.shard1.replica_t0' (registry 'solr.core.collection1.shard1.replica_t0') enabled at server: com.sun.jmx.mbeanserver.JmxMBeanServer@7e91d102
   [junit4]   2> 742009 INFO  (qtp1648904132-7144) [n:127.0.0.1:34241_ c:collection1 s:shard1  x:collection1_shard1_replica_t0] o.a.s.c.SolrCore solr.RecoveryStrategy.Builder
   [junit4]   2> 742009 INFO  (qtp1648904132-7144) [n:127.0.0.1:34241_ c:collection1 s:shard1  x:collection1_shard1_replica_t0] o.a.s.c.SolrCore [[collection1_shard1_replica_t0] ] Opening new SolrCore at [/home/jenkins/workspace/Lucene-Solr-7.0-Linux/solr/build/solr-core/test/J2/temp/solr.cloud.LeaderFailoverAfterPartitionTest_3E8984F5327246DA-001/shard-2-001/cores/collection1_shard1_replica_t0], dataDir=[/home/jenkins/workspace/Lucene-Solr-7.0-Linux/solr/build/solr-core/test/J2/temp/solr.cloud.LeaderFailoverAfterPartitionTest_3E8984F5327246DA-001/shard-2-001/cores/collection1_shard1_replica_t0/data/]
   [junit4]   2> 742011 INFO  (qtp1648904132-7144) [n:127.0.0.1:34241_ c:collection1 s:shard1  x:collection1_shard1_replica_t0] o.a.s.u.RandomMergePolicy RandomMergePolicy wrapping class org.apache.lucene.index.TieredMergePolicy: [TieredMergePolicy: maxMergeAtOnce=34, maxMergeAtOnceExplicit=42, maxMergedSegmentMB=38.7080078125, floorSegmentMB=1.7412109375, forceMergeDeletesPctAllowed=18.225739266777197, segmentsPerTier=32.0, maxCFSSegmentSizeMB=8.796093022207999E12, noCFSRatio=0.8995008669461599
   [junit4]   2> 742013 WARN  (qtp1648904132-7144) [n:127.0.0.1:34241_ c:collection1 s:shard1  x:collection1_shard1_replica_t0] o.a.s.c.RequestHandlers INVALID paramSet a in requestHandler {type = requestHandler,name = /dump,class = DumpRequestHandler,attributes = {initParams=a, name=/dump, class=DumpRequestHandler},args = {defaults={a=A,b=B}}}
   [junit4]   2> 742060 INFO  (qtp1648904132-7144) [n:127.0.0.1:34241_ c:collection1 s:shard1  x:collection1_shard1_replica_t0] o.a.s.u.UpdateHandler Using UpdateLog implementation: org.apache.solr.update.UpdateLog
   [junit4]   2> 742060 INFO  (qtp1648904132-7144) [n:127.0.0.1:34241_ c:collection1 s:shard1  x:collection1_shard1_replica_t0] o.a.s.u.UpdateLog Initializing UpdateLog: dataDir= defaultSyncLevel=FLUSH numRecordsToKeep=100 maxNumLogsToKeep=10 numVersionBuckets=65536
   [junit4]   2> 742061 INFO  (qtp1648904132-7144) [n:127.0.0.1:34241_ c:collection1 s:shard1  x:collection1_shard1_replica_t0] o.a.s.u.CommitTracker Hard AutoCommit: disabled
   [junit4]   2> 742061 INFO  (qtp1648904132-7144) [n:127.0.0.1:34241_ c:collection1 s:shard1  x:collection1_shard1_replica_t0] o.a.s.u.CommitTracker Soft AutoCommit: disabled
   [junit4]   2> 742063 INFO  (qtp1648904132-7144) [n:127.0.0.1:34241_ c:collection1 s:shard1  x:collection1_shard1_replica_t0] o.a.s.u.RandomMergePolicy RandomMergePolicy wrapping class org.apache.lucene.index.LogDocMergePolicy: [LogDocMergePolicy: minMergeSize=1000, mergeFactor=18, maxMergeSize=9223372036854775807, maxMergeSizeForForcedMerge=9223372036854775807, calibrateSizeByDeletes=false, maxMergeDocs=2147483647, maxCFSSegmentSizeMB=8.796093022207999E12, noCFSRatio=1.0]
   [junit4]   2> 742063 INFO  (qtp1648904132-7144) [n:127.0.0.1:34241_ c:collection1 s:shard1  x:collection1_shard1_replica_t0] o.a.s.s.SolrIndexSearcher Opening [Searcher@53ada036[collection1_shard1_replica_t0] main]
   [junit4]   2> 742065 INFO  (qtp1648904132-7144) [n:127.0.0.1:34241_ c:collection1 s:shard1  x:collection1_shard1_replica_t0] o.a.s.r.ManagedResourceStorage Configured ZooKeeperStorageIO with znodeBase: /configs/conf1
   [junit4]   2> 742065 INFO  (qtp1648904132-7144) [n:127.0.0.1:34241_ c:collection1 s:shard1  x:collection1_shard1_replica_t0] o.a.s.r.ManagedResourceStorage Loaded null at path _rest_managed.json using ZooKeeperStorageIO:path=/configs/conf1
   [junit4]   2> 742066 INFO  (qtp1648904132-7144) [n:127.0.0.1:34241_ c:collection1 s:shard1  x:collection1_shard1_replica_t0] o.a.s.h.ReplicationHandler Commits will be reserved for  10000
   [junit4]   2> 742067 INFO  (searcherExecutor-3196-thread-1-processing-n:127.0.0.1:34241_ x:collection1_shard1_replica_t0 s:shard1 c:collection1) [n:127.0.0.1:34241_ c:collection1 s:shard1  x:collection1_shard1_replica_t0] o.a.s.c.SolrCore [collection1_shard1_replica_t0] Registered new searcher Searcher@53ada036[collection1_shard1_replica_t0] main{ExitableDirectoryReader(UninvertingDirectoryReader())}
   [junit4]   2> 742068 INFO  (qtp1648904132-7144) [n:127.0.0.1:34241_ c:collection1 s:shard1  x:collection1_shard1_replica_t0] o.a.s.u.UpdateLog Could not find max version in index or recent updates, using new clock 1574734399175393280
   [junit4]   2> 742073 INFO  (qtp1648904132-7144) [n:127.0.0.1:34241_ c:collection1 s:shard1  x:collection1_shard1_replica_t0] o.a.s.c.ShardLeaderElectionContext Enough replicas found to continue.
   [junit4]   2> 742073 INFO  (qtp1648904132-7144) [n:127.0.0.1:34241_ c:collection1 s:shard1  x:collection1_shard1_replica_t0] o.a.s.c.ShardLeaderElectionContext I may be the new leader - try and sync
   [junit4]   2> 742073 INFO  (qtp1648904132-7144) [n:127.0.0.1:34241_ c:collection1 s:shard1  x:collection1_shard1_replica_t0] o.a.s.c.SyncStrategy Sync replicas to http://127.0.0.1:34241/collection1_shard1_replica_t0/
   [junit4]   2> 742073 INFO  (qtp1648904132-7144) [n:127.0.0.1:34241_ c:collection1 s:shard1  x:collection1_shard1_replica_t0] o.a.s.c.SyncStrategy Sync Success - now sync replicas to me
   [junit4]   2> 742073 INFO  (qtp1648904132-7144) [n:127.0.0.1:34241_ c:collection1 s:shard1  x:collection1_shard1_replica_t0] o.a.s.c.SyncStrategy http://127.0.0.1:34241/collection1_shard1_replica_t0/ has no replicas
   [junit4]   2> 742074 INFO  (qtp1648904132-7144) [n:127.0.0.1:34241_ c:collection1 s:shard1  x:collection1_shard1_replica_t0] o.a.s.c.ShardLeaderElectionContext Found all replicas participating in election, clear LIR
   [junit4]   2> 742074 INFO  (qtp1648904132-7144) [n:127.0.0.1:34241_ c:collection1 s:shard1  x:collection1_shard1_replica_t0] o.a.s.c.ZkController collection1_shard1_replica_t0 stopping background replication from leader
   [junit4]   2> 742076 INFO  (qtp1648904132-7144) [n:127.0.0.1:34241_ c:collection1 s:shard1  x:collection1_shard1_replica_t0] o.a.s.c.ShardLeaderElectionContext I am the new leader: http://127.0.0.1:34241/collection1_shard1_replica_t0/ shard1
   [junit4]   2> 742226 INFO  (qtp1648904132-7144) [n:127.0.0.1:34241_ c:collection1 s:shard1  x:collection1_shard1_replica_t0] o.a.s.c.ZkController I am the leader, no recovery necessary
   [junit4]   2> 742227 INFO  (qtp1648904132-7144) [n:127.0.0.1:34241_ c:collection1 s:shard1  x:collection1_shard1_replica_t0] o.a.s.s.HttpSolrCall [admin] webapp=null path=/admin/cores params={qt=/admin/cores&collection.configName=conf1&name=collection1_shard1_replica_t0&action=CREATE&collection=collection1&shard=shard1&wt=javabin&version=2&replicaType=TLOG} status=0 QTime=1360
   [junit4]   2> 742230 INFO  (qtp1648904132-7142) [n:127.0.0.1:34241_    ] o.a.s.s.HttpSolrCall [admin] webapp=null path=/admin/collections params={node=127.0.0.1:34241_&action=ADDREPLICA&collection=collection1&shard=shard1&type=TLOG&wt=javabin&version=2} status=0 QTime=1364
   [junit4]   2> 742233 INFO  (OverseerCollectionConfigSetProcessor-98420899571957764-127.0.0.1:43353_-n_0000000000) [n:127.0.0.1:43353_    ] o.a.s.c.OverseerTaskQueue Response ZK path: /overseer/collection-queue-work/qnr-0000000006 doesn't exist.  Requestor may have disconnected from ZooKeeper
   [junit4]   2> 742288 INFO  (TEST-LeaderFailoverAfterPartitionTest.test-seed#[3E8984F5327246DA]) [    ] o.a.s.c.AbstractFullDistribZkTestBase create jetty 3 in directory /home/jenkins/workspace/Lucene-Solr-7.0-Linux/solr/build/solr-core/test/J2/temp/solr.cloud.LeaderFailoverAfterPartitionTest_3E8984F5327246DA-001/shard-3-001 of type TLOG
   [junit4]   2> 742288 INFO  (TEST-LeaderFailoverAfterPartitionTest.test-seed#[3E8984F5327246DA]) [    ] o.e.j.s.Server jetty-9.3.14.v20161028
   [junit4]   2> 742290 INFO  (TEST-LeaderFailoverAfterPartitionTest.test-seed#[3E8984F5327246DA]) [    ] o.e.j.s.h.ContextHandler Started o.e.j.s.ServletContextHandler@537cd8c5{/,null,AVAILABLE}
   [junit4]   2> 742290 INFO  (TEST-LeaderFailoverAfterPartitionTest.test-seed#[3E8984F5327246DA]) [    ] o.e.j.s.AbstractConnector Started ServerConnector@37f1a7fb{HTTP/1.1,[http/1.1]}{127.0.0.1:33025}
   [junit4]   2> 742290 INFO  (TEST-LeaderFailoverAfterPartitionTest.test-seed#[3E8984F5327246DA]) [    ] o.e.j.s.Server Started @743525ms
   [junit4]   2> 742290 INFO  (TEST-LeaderFailoverAfterPartitionTest.test-seed#[3E8984F5327246DA]) [    ] o.a.s.c.s.e.JettySolrRunner Jetty properties: {solr.data.dir=/home/jenkins/workspace/Lucene-Solr-7.0-Linux/solr/build/solr-core/test/J2/temp/solr.cloud.LeaderFailoverAfterPartitionTest_3E8984F5327246DA-001/tempDir-001/jetty3, replicaType=TLOG, solrconfig=solrconfig.xml, hostContext=/, hostPort=40833, coreRootDirectory=/home/jenkins/workspace/Lucene-Solr-7.0-Linux/solr/build/solr-core/test/J2/temp/solr.cloud.LeaderFailoverAfterPartitionTest_3E8984F5327246DA-001/shard-3-001/cores}
   [junit4]   2> 742290 ERROR (TEST-LeaderFailoverAfterPartitionTest.test-seed#[3E8984F5327246DA]) [    ] o.a.s.s.StartupLoggingUtils Missing Java Option solr.log.dir. Logging may be missing or incomplete.
   [junit4]   2> 742290 INFO  (TEST-LeaderFailoverAfterPartitionTest.test-seed#[3E8984F5327246DA]) [    ] o.a.s.s.SolrDispatchFilter  ___      _       Welcome to Apache Solr™ version 7.0.0
   [junit4]   2> 742291 INFO  (TEST-LeaderFailoverAfterPartitionTest.test-seed#[3E8984F5327246DA]) [    ] o.a.s.s.SolrDispatchFilter / __| ___| |_ _   Starting in cloud mode on port null
   [junit4]   2> 742291 INFO  (TEST-LeaderFailoverAfterPartitionTest.test-seed#[3E8984F5327246DA]) [    ] o.a.s.s.SolrDispatchFilter \__ \/ _ \ | '_|  Install dir: null, Default config dir: null
   [junit4]   2> 742291 INFO  (TEST-LeaderFailoverAfterPartitionTest.test-seed#[3E8984F5327246DA]) [    ] o.a.s.s.SolrDispatchFilter |___/\___/_|_|    Start time: 2017-08-03T18:09:11.878Z
   [junit4]   2> 742298 INFO  (TEST-LeaderFailoverAfterPartitionTest.test-seed#[3E8984F5327246DA]) [    ] o.a.s.s.SolrDispatchFilter Loading solr.xml from SolrHome (not found in ZooKeeper)
   [junit4]   2> 742298 INFO  (TEST-LeaderFailoverAfterPartitionTest.test-seed#[3E8984F5327246DA]) [    ] o.a.s.c.SolrXmlConfig Loading container configuration from /home/jenkins/workspace/Lucene-Solr-7.0-Linux/solr/build/solr-core/test/J2/temp/solr.cloud.LeaderFailoverAfterPartitionTest_3E8984F5327246DA-001/shard-3-001/solr.xml
   [junit4]   2> 742302 INFO  (TEST-LeaderFailoverAfterPartitionTest.test-seed#[3E8984F5327246DA]) [    ] o.a.s.c.SolrXmlConfig MBean server found: com.sun.jmx.mbeanserver.JmxMBeanServer@7e91d102, but no JMX reporters were configured - adding default JMX reporter.
   [junit4]   2> 742303 INFO  (TEST-LeaderFailoverAfterPartitionTest.test-seed#[3E8984F5327246DA]) [    ] o.a.s.c.ZkContainer Zookeeper client=127.0.0.1:37709/solr
   [junit4]   2> 742312 INFO  (TEST-LeaderFailoverAfterPartitionTest.test-seed#[3E8984F5327246DA]) [n:127.0.0.1:40833_    ] o.a.s.c.c.ZkStateReader Updated live nodes from ZooKeeper... (0) -> (3)
   [junit4]   2> 742313 INFO  (TEST-LeaderFailoverAfterPartitionTest.test-seed#[3E8984F5327246DA]) [n:127.0.0.1:40833_    ] o.a.s.c.Overseer Overseer (id=null) closing
   [junit4]   2> 742314 INFO  (TEST-LeaderFailoverAfterPartitionTest.test-seed#[3E8984F5327246DA]) [n:127.0.0.1:40833_    ] o.a.s.c.ZkController Register node as live in ZooKeeper:/live_nodes/127.0.0.1:40833_
   [junit4]   2> 742315 INFO  (zkCallback-1314-thread-1-processing-n:127.0.0.1:40833_) [n:127.0.0.1:40833_    ] o.a.s.c.c.ZkStateReader Updated live nodes from ZooKeeper... (3) -> (4)
   [junit4]   2> 742315 INFO  (zkCallback-1297-thread-1) [    ] o.a.s.c.c.ZkStateReader Updated live nodes from ZooKeeper... (3) -> (4)
   [junit4]   2> 742315 INFO  (zkCallback-1302-thread-1-processing-n:127.0.0.1:37319_) [n:127.0.0.1:37319_    ] o.a.s.c.c.ZkStateReader Updated live nodes from ZooKeeper... (3) -> (4)
   [junit4]   2> 742315 INFO  (zkCallback-1308-thread-1-processing-n:127.0.0.1:34241_) [n:127.0.0.1:34241_    ] o.a.s.c.c.ZkStateReader Updated live nodes from ZooKeeper... (3) -> (4)
   [junit4]   2> 742315 INFO  (zkCallback-1290-thread-1-processing-n:127.0.0.1:43353_) [n:127.0.0.1:43353_    ] o.a.s.c.c.ZkStateReader Updated live nodes from ZooKeeper... (3) -> (4)
   [junit4]   2> 742352 INFO  (TEST-LeaderFailoverAfterPartitionTest.test-seed#[3E8984F5327246DA]) [n:127.0.0.1:40833_    ] o.a.s.m.r.SolrJmxReporter JMX monitoring for 'solr.node' (registry 'solr.node') enabled at server: com.sun.jmx.mbeanserver.JmxMBeanServer@7e91d102
   [junit4]   2> 742355 INFO  (TEST-LeaderFailoverAfterPartitionTest.test-seed#[3E8984F5327246DA]) [n:127.0.0.1:40833_    ] o.a.s.m.r.SolrJmxReporter JMX monitoring for 'solr.jvm' (registry 'solr.jvm') enabled at server: com.sun.jmx.mbeanserver.JmxMBeanServer@7e91d102
   [junit4]   2> 742355 INFO  (TEST-LeaderFailoverAfterPartitionTest.test-seed#[3E8984F5327246DA]) [n:127.0.0.1:40833_    ] o.a.s.m.r.SolrJmxReporter JMX monitoring for 'solr.jetty' (registry 'solr.jetty') enabled at server: com.sun.jmx.mbeanserver.JmxMBeanServer@7e91d102
   [junit4]   2> 742356 INFO  (TEST-LeaderFailoverAfterPartitionTest.test-seed#[3E8984F5327246DA]) [n:127.0.0.1:40833_    ] o.a.s.c.CorePropertiesLocator Found 0 core definitions underneath /home/jenkins/workspace/Lucene-Solr-7.0-Linux/solr/build/solr-core/test/J2/temp/solr.cloud.LeaderFailoverAfterPartitionTest_3E8984F5327246DA-001/shard-3-001/cores
   [junit4]   2> 742381 INFO  (qtp1648904132-7143) [n:127.0.0.1:34241_    ] o.a.s.h.a.CollectionsHandler Invoked Collection Action :addreplica with params node=127.0.0.1:40833_&action=ADDREPLICA&collection=collection1&shard=shard2&type=TLOG&wt=javabin&version=2 and sendToOCPQueue=true
   [junit4]   2> 742382 INFO  (OverseerThreadFactory-3171-thread-5-processing-n:127.0.0.1:43353_) [n:127.0.0.1:43353_    ] o.a.s.c.AddReplicaCmd Node Identified 127.0.0.1:40833_ for creating new replica
   [junit4]   2> 742383 INFO  (SocketProxy-Acceptor-40833) [    ] o.a.s.c.SocketProxy accepted Socket[addr=/127.0.0.1,port=58950,localport=40833], receiveBufferSize:531000
   [junit4]   2> 742385 INFO  (SocketProxy-Acceptor-40833) [    ] o.a.s.c.SocketProxy proxy connection Socket[addr=/127.0.0.1,port=33025,localport=45980], receiveBufferSize=530904
   [junit4]   2> 742385 INFO  (qtp1130657152-7176) [n:127.0.0.1:40833_    ] o.a.s.h.a.CoreAdminOperation core create command qt=/admin/cores&collection.configName=conf1&name=collection1_shard2_replica_t1&action=CREATE&collection=collection1&shard=shard2&wt=javabin&version=2&replicaType=TLOG
   [junit4]   2> 742386 INFO  (qtp1130657152-7176) [n:127.0.0.1:40833_    ] o.a.s.c.TransientSolrCoreCacheDefault Allocating transient cache for 4 transient cores
   [junit4]   2> 743398 INFO  (qtp1130657152-7176) [n:127.0.0.1:40833_ c:collection1 s:shard2  x:collection1_shard2_replica_t1] o.a.s.c.SolrConfig Using Lucene MatchVersion: 7.0.0
   [junit4]   2> 743408 INFO  (qtp1130657152-7176) [n:127.0.0.1:40833_ c:collection1 s:shard2  x:collection1_shard2_replica_t1] o.a.s.s.IndexSchema [collection1_shard2_replica_t1] Schema name=test
   [junit4]   2> 743487 INFO  (qtp1130657152-7176) [n:127.0.0.1:40833_ c:collection1 s:shard2  x:collection1_shard2_replica_t1] o.a.s.s.IndexSchema Loaded schema test/1.0 with uniqueid field id
   [junit4]   2> 743493 INFO  (qtp1130657152-7176) [n:127.0.0.1:40833_ c:collection1 s:shard2  x:collection1_shard2_replica_t1] o.a.s.c.CoreContainer Creating SolrCore 'collection1_shard2_replica_t1' using configuration from collection collection1, trusted=true
   [junit4]   2> 743493 INFO  (qtp1130657152-7176) [n:127.0.0.1:40833_ c:collection1 s:shard2  x:collection1_shard2_replica_t1] o.a.s.m.r.SolrJmxReporter JMX monitoring for 'solr.core.collection1.shard2.replica_t1' (registry 'solr.core.collection1.shard2.replica_t1') enabled at server: com.sun.jmx.mbeanserver.JmxMBeanServer@7e91d102
   [junit4]   2> 743494 INFO  (qtp1130657152-7176) [n:127.0.0.1:40833_ c:collection1 s:shard2  x:collection1_shard2_replica_t1] o.a.s.c.SolrCore solr.RecoveryStrategy.Builder
   [junit4]   2> 743494 INFO  (qtp1130657152-7176) [n:127.0.0.1:40833_ c:collection1 s:shard2  x:collection1_shard2_replica_t1] o.a.s.c.SolrCore [[collection1_shard2_replica_t1] ] Opening new SolrCore at [/home/jenkins/workspace/Lucene-Solr-7.0-Linux/solr/build/solr-core/test/J2/temp/solr.cloud.LeaderFailoverAfterPartitionTest_3E8984F5327246DA-001/shard-3-001/cores/collection1_shard2_replica_t1], dataDir=[/home/jenkins/workspace/Lucene-Solr-7.0-Linux/solr/build/solr-core/test/J2/temp/solr.cloud.LeaderFailoverAfterPartitionTest_3E8984F5327246DA-001/shard-3-001/cores/collection1_shard2_replica_t1/data/]
   [junit4]   2> 743495 INFO  (qtp1130657152-7176) [n:127.0.0.1:40833_ c:collection1 s:shard2  x:collection1_shard2_replica_t1] o.a.s.u.RandomMergePolicy RandomMergePolicy wrapping class org.apache.lucene.index.TieredMergePolicy: [TieredMergePolicy: maxMergeAtOnce=34, maxMergeAtOnceExplicit=42, maxMergedSegmentMB=38.7080078125, floorSegmentMB=1.7412109375, forceMergeDeletesPctAllowed=18.225739266777197, segmentsPerTier=32.0, maxCFSSegmentSizeMB=8.796093022207999E12, noCFSRatio=0.8995008669461599
   [junit4]   2> 743496 WARN  (qtp1130657152-7176) [n:127.0.0.1:40833_ c:collection1 s:shard2  x:collection1_shard2_replica_t1] o.a.s.c.RequestHandlers INVALID paramSet a in requestHandler {type = requestHandler,name = /dump,class = DumpRequestHandler,attributes = {initParams=a, name=/dump, class=DumpRequestHandler},args = {defaults={a=A,b=B}}}
   [junit4]   2> 743517 INFO  (qtp1130657152-7176) [n:127.0.0.1:40833_ c:collection1 s:shard2  x:collection1_shard2_replica_t1] o.a.s.u.UpdateHandler Using UpdateLog implementation: org.apache.solr.update.UpdateLog
   [junit4]   2> 743517 INFO  (qtp1130657152-7176) [n:127.0.0.1:40833_ c:collection1 s:shard2  x:collection1_shard2_replica_t1] o.a.s.u.UpdateLog Initializing UpdateLog: dataDir= defaultSyncLevel=FLUSH numRecordsToKeep=100 maxNumLogsToKeep=10 numVersionBuckets=65536
   [junit4]   2> 743517 INFO  (qtp1130657152-7176) [n:127.0.0.1:40833_ c:collection1 s:shard2  x:collection1_shard2_replica_t1] o.a.s.u.CommitTracker Hard AutoCommit: disabled
   [junit4]   2> 743517 INFO  (qtp1130657152-7176) [n:127.0.0.1:40833_ c:collection1 s:shard2  x:collection1_shard2_replica_t1] o.a.s.u.CommitTracker Soft AutoCommit: disabled
   [junit4]   2> 743518 INFO  (qtp1130657152-7176) [n:127.0.0.1:40833_ c:collection1 s:shard2  x:collection1_shard2_replica_t1] o.a.s.u.RandomMergePolicy RandomMergePolicy wrapping class org.apache.lucene.index.LogDocMergePolicy: [LogDocMergePolicy: minMergeSize=1000, mergeFactor=18, maxMergeSize=9223372036854775807, maxMergeSizeForForcedMerge=9223372036854775807, calibrateSizeByDeletes=false, maxMergeDocs=2147483647, maxCFSSegmentSizeMB=8.796093022207999E12, noCFSRatio=1.0]
   [junit4]   2> 743518 INFO  (qtp1130657152-7176) [n:127.0.0.1:40833_ c:collection1 s:shard2  x:collection1_shard2_replica_t1] o.a.s.s.SolrIndexSearcher Opening [Searcher@73c3de54[collection1_shard2_replica_t1] main]
   [junit4]   2> 743519 INFO  (qtp1130657152-7176) [n:127.0.0.1:40833_ c:collection1 s:shard2  x:collection1_shard2_replica_t1] o.a.s.r.ManagedResourceStorage Configured ZooKeeperStorageIO with znodeBase: /configs/conf1
   [junit4]   2> 743519 INFO  (qtp1130657152-7176) [n:127.0.0.1:40833_ c:collection1 s:shard2  x:collection1_shard2_replica_t1] o.a.s.r.ManagedResourceStorage Loaded null at path _rest_managed.json using ZooKeeperStorageIO:path=/configs/conf1
   [junit4]   2> 743519 INFO  (qtp1130657152-7176) [n:127.0.0.1:40833_ c:collection1 s:shard2  x:collection1_shard2_replica_t1] o.a.s.h.ReplicationHandler Commits will be reserved for  10000
   [junit4]   2> 743519 INFO  (qtp1130657152-7176) [n:127.0.0.1:40833_ c:collection1 s:shard2  x:collection1_shard2_replica_t1] o.a.s.u.UpdateLog Could not find max version in index or recent updates, using new clock 1574734400696877056
   [junit4]   2> 743520 INFO  (searcherExecutor-3207-thread-1-processing-n:127.0.0.1:40833_ x:collection1_shard2_replica_t1 s:shard2 c:collection1) [n:127.0.0.1:40833_ c:collection1 s:shard2  x:collection1_shard2_replica_t1] o.a.s.c.SolrCore [collection1_shard2_replica_t1] Registered new searcher Searcher@73c3de54[collection1_shard2_replica_t1] main{ExitableDirectoryReader(UninvertingDirectoryReader())}
   [junit4]   2> 743521 INFO  (qtp1130657152-7176) [n:127.0.0.1:40833_ c:collection1 s:shard2  x:collection1_shard2_replica_t1] o.a.s.c.ZkController Core needs to recover:collection1_shard2_replica_t1
   [junit4]   2> 743521 INFO  (updateExecutor-1311-thread-1-processing-n:127.0.0.1:40833_ x:collection1_shard2_replica_t1 s:shard2 c:collection1) [n:127.0.0.1:40833_ c:collection1 s:shard2 r:core_node3 x:collection1_shard2_replica_t1] o.a.s.u.DefaultSolrCoreState Running recovery
   [junit4]   2> 743521 INFO  (recoveryExecutor-1312-thread-1-processing-n:127.0.0.1:40833_ x:collection1_shard2_replica_t1 s:shard2 c:collection1 r:core_node3) [n:127.0.0.1:40833_ c:collection1 s:shard2 r:core_node3 x:collection1_shard2_replica_t1] o.a.s.c.RecoveryStrategy Starting recovery process. recoveringAfterStartup=true
   [junit4]   2> 743521 INFO  (recoveryExecutor-1312-thread-1-processing-n:127.0.0.1:40833_ x:collection1_shard2_replica_t1 s:shard2 c:collection1 r:core_node3) [n:127.0.0.1:40833_ c:collection1 s:shard2 r:core_node3 x:collection1_shard2_replica_t1] o.a.s.c.RecoveryStrategy ###### startupVersions=[[]]
   [junit4]   2> 743521 INFO  (recoveryExecutor-1312-thread-1-processing-n:127.0.0.1:40833_ x:collection1_shard2_replica_t1 s:shard2 c:collection1 r:core_node3) [n:127.0.0.1:40833_ c:collection1 s:shard2 r:core_node3 x:collection1_shard2_replica_t1] o.a.s.c.ZkController collection1_shard2_replica_t1 stopping background replication from leader
   [junit4]   2> 743521 INFO  (recoveryExecutor-1312-thread-1-processing-n:127.0.0.1:40833_ x:collection1_shard2_replica_t1 s:shard2 c:collection1 r:core_node3) [n:127.0.0.1:40833_ c:collection1 s:shard2 r:core_node3 x:collection1_shard2_replica_t1] o.a.s.c.RecoveryStrategy Begin buffering updates. core=[collection1_shard2_replica_t1]
   [junit4]   2> 743521 INFO  (recoveryExecutor-1312-thread-1-processing-n:127.0.0.1:40833_ x:collection1_shard2_replica_t1 s:shard2 c:collection1 r:core_node3) [n:127.0.0.1:40833_ c:collection1 s:shard2 r:core_node3 x:collection1_shard2_replica_t1] o.a.s.u.UpdateLog Starting to buffer updates. FSUpdateLog{state=ACTIVE, tlog=null}
   [junit4]   2> 743521 INFO  (recoveryExecutor-1312-thread-1-processing-n:127.0.0.1:40833_ x:collection1_shard2_replica_t1 s:shard2 c:collection1 r:core_node3) [n:127.0.0.1:40833_ c:collection1 s:shard2 r:core_node3 x:collection1_shard2_replica_t1] o.a.s.c.RecoveryStrategy Publishing state of core [collection1_shard2_replica_t1] as recovering, leader is [http://127.0.0.1:37319/collection1_shard2_replica_t0/] and I am [http://127.0.0.1:40833/collection1_shard2_replica_t1/]
   [junit4]   2> 743522 INFO  (qtp1130657152-7176) [n:127.0.0.1:40833_ c:collection1 s:shard2  x:collection1_shard2_replica_t1] o.a.s.s.HttpSolrCall [admin] webapp=null path=/admin/cores params={qt=/admin/cores&collection.configName=conf1&name=collection1_shard2_replica_t1&action=CREATE&collection=collection1&shard=shard2&wt=javabin&version=2&replicaType=TLOG} status=0 QTime=1136
   [junit4]   2> 743523 INFO  (qtp1648904132-7143) [n:127.0.0.1:34241_    ] o.a.s.s.HttpSolrCall [admin] webapp=null path=/admin/collections params={node=127.0.0.1:40833_&action=ADDREPLICA&collection=collection1&shard=shard2&type=TLOG&wt=javabin&version=2} status=0 QTime=1141
   [junit4]   2> 743523 INFO  (recoveryExecutor-1312-thread-1-processing-n:127.0.0.1:40833_ x:collection1_shard2_replica_t1 s:shard2 c:collection1 r:core_node3) [n:127.0.0.1:40833_ c:collection1 s:shard2 r:core_node3 x:collection1_shard2_replica_t1] o.a.s.c.RecoveryStrategy Sending prep recovery command to [http://127.0.0.1:37319]; [WaitForState: action=PREPRECOVERY&core=collection1_shard2_replica_t0&nodeName=127.0.0.1:40833_&coreNodeName=core_node3&state=recovering&checkLive=true&onlyIfLeader=true&onlyIfLeaderActive=true]
   [junit4]   2> 743523 INFO  (SocketProxy-Acceptor-37319) [    ] o.a.s.c.SocketProxy accepted Socket[addr=/127.0.0.1,port=37142,localport=37319], receiveBufferSize:531000
   [junit4]   2> 743524 INFO  (SocketProxy-Acceptor-37319) [    ] o.a.s.c.SocketProxy proxy connection Socket[addr=/127.0.0.1,port=39107,localport=44586], receiveBufferSize=530904
   [junit4]   2> 743524 INFO  (qtp121424150-7104) [n:127.0.0.1:37319_    ] o.a.s.h.a.PrepRecoveryOp Going to wait for coreNodeName: core_node3, state: recovering, checkLive: true, onlyIfLeader: true, onlyIfLeaderActive: true, maxTime: 183 s
   [junit4]   2> 743524 INFO  (qtp121424150-7104) [n:127.0.0.1:37319_    ] o.a.s.h.a.PrepRecoveryOp In WaitForState(recovering): collection=collection1, shard=shard2, thisCore=collection1_shard2_replica_t0, leaderDoesNotNeedRecovery=false, isLeader? true, live=true, checkLive=true, currentState=down, localState=active, nodeName=127.0.0.1:40833_, coreNodeName=core_node3, onlyIfActiveCheckResult=false, nodeProps: core_node3:{"core":"collection1_shard2_replica_t1","base_url":"http://127.0.0.1:40833","node_name":"127.0.0.1:40833_","state":"down","type":"TLOG"}
   [junit4]   2> 743524 INFO  (TEST-LeaderFailoverAfterPartitionTest.test-seed#[3E8984F5327246DA])

[...truncated too long message...]

27.0.0.1:37237_solr) [n:127.0.0.1:37237_solr    ] o.a.s.c.OverseerElectionContext I am going to be the leader 127.0.0.1:37237_solr
   [junit4]   2> 2277010 INFO  (jetty-closer-2591-thread-2) [    ] o.a.s.c.TransientSolrCoreCacheDefault Allocating transient cache for 2147483647 transient cores
   [junit4]   2> 2277013 ERROR (Thread[Thread-3933,5,TGRP-TestSolrCloudWithDelegationTokens]) [n:127.0.0.1:33469_solr    ] o.a.h.s.t.d.AbstractDelegationTokenSecretManager ExpiredTokenRemover received java.lang.InterruptedException: sleep interrupted
   [junit4]   2> 2277013 INFO  (zkCallback-2601-thread-2-processing-n:127.0.0.1:37237_solr) [n:127.0.0.1:37237_solr    ] o.a.s.c.c.ZkStateReader Updated live nodes from ZooKeeper... (2) -> (1)
   [junit4]   2> 2277013 WARN  (zkCallback-2601-thread-1-processing-n:127.0.0.1:37237_solr) [n:127.0.0.1:37237_solr    ] o.a.s.c.c.ZkStateReader ZooKeeper watch triggered, but Solr cannot talk to ZK: [KeeperErrorCode = Session expired for /live_nodes]
   [junit4]   2> 2277013 ERROR (Thread[Thread-3932,5,TGRP-TestSolrCloudWithDelegationTokens]) [n:127.0.0.1:37237_solr    ] o.a.h.s.t.d.AbstractDelegationTokenSecretManager ExpiredTokenRemover received java.lang.InterruptedException: sleep interrupted
   [junit4]   2> 2277017 INFO  (jetty-closer-2591-thread-2) [    ] o.e.j.s.h.ContextHandler Stopped o.e.j.s.ServletContextHandler@20ca529b{/solr,null,UNAVAILABLE}
   [junit4]   2> 2277021 INFO  (jetty-closer-2591-thread-1) [    ] o.e.j.s.h.ContextHandler Stopped o.e.j.s.ServletContextHandler@63eb6302{/solr,null,UNAVAILABLE}
   [junit4]   2> 2277022 ERROR (SUITE-TestSolrCloudWithDelegationTokens-seed#[3E8984F5327246DA]-worker) [    ] o.a.z.s.ZooKeeperServer ZKShutdownHandler is not registered, so ZooKeeper server won't take any action on ERROR or SHUTDOWN server state changes
   [junit4]   2> 2277022 INFO  (SUITE-TestSolrCloudWithDelegationTokens-seed#[3E8984F5327246DA]-worker) [    ] o.a.s.c.ZkTestServer connecting to 127.0.0.1:39701 39701
   [junit4]   2> 2277169 INFO  (Thread-3915) [    ] o.a.s.c.ZkTestServer connecting to 127.0.0.1:39701 39701
   [junit4]   2> 2277170 WARN  (Thread-3915) [    ] o.a.s.c.ZkTestServer Watch limit violations: 
   [junit4]   2> Maximum concurrent create/delete watches above limit:
   [junit4]   2> 
   [junit4]   2> 	6	/solr/aliases.json
   [junit4]   2> 	2	/solr/security.json
   [junit4]   2> 
   [junit4]   2> Maximum concurrent data watches above limit:
   [junit4]   2> 
   [junit4]   2> 	6	/solr/clusterprops.json
   [junit4]   2> 	6	/solr/clusterstate.json
   [junit4]   2> 	4	/solr/security/zkdtsm/ZKDTSMRoot/ZKDTSMKeyIdRoot
   [junit4]   2> 	2	/solr/security/zkdtsm/ZKDTSMRoot/ZKDTSMTokensRoot/DT_7
   [junit4]   2> 	2	/solr/security/zkdtsm/ZKDTSMRoot/ZKDTSMTokensRoot/DT_6
   [junit4]   2> 	2	/solr/security/zkdtsm/ZKDTSMRoot/ZKDTSMTokensRoot/DT_8
   [junit4]   2> 	2	/solr/security/zkdtsm/ZKDTSMRoot/ZKDTSMMasterKeyRoot/DK_1
   [junit4]   2> 	2	/solr/security/zkdtsm/ZKDTSMRoot/ZKDTSMTokensRoot/DT_1
   [junit4]   2> 	2	/solr/security/zkdtsm/ZKDTSMRoot/ZKDTSMTokensRoot/DT_3
   [junit4]   2> 	2	/solr/security/zkdtsm/ZKDTSMRoot/ZKDTSMMasterKeyRoot/DK_2
   [junit4]   2> 	2	/solr/security/zkdtsm/ZKDTSMRoot/ZKDTSMTokensRoot/DT_2
   [junit4]   2> 	2	/solr/security/zkdtsm/ZKDTSMRoot/ZKDTSMTokensRoot/DT_5
   [junit4]   2> 	2	/solr/security/zkdtsm/ZKDTSMRoot/ZKDTSMMasterKeyRoot/DK_4
   [junit4]   2> 	2	/solr/security/zkdtsm/ZKDTSMRoot/ZKDTSMTokensRoot/DT_4
   [junit4]   2> 	2	/solr/security/zkdtsm/ZKDTSMRoot/ZKDTSMSeqNumRoot
   [junit4]   2> 
   [junit4]   2> Maximum concurrent children watches above limit:
   [junit4]   2> 
   [junit4]   2> 	6	/solr/live_nodes
   [junit4]   2> 	6	/solr/collections
   [junit4]   2> 	2	/solr/security/zkdtsm/ZKDTSMRoot/ZKDTSMMasterKeyRoot
   [junit4]   2> 	2	/solr/security/zkdtsm/ZKDTSMRoot/ZKDTSMTokensRoot
   [junit4]   2> 
   [junit4]   2> NOTE: leaving temporary files on disk at: /home/jenkins/workspace/Lucene-Solr-7.0-Linux/solr/build/solr-core/test/J2/temp/solr.cloud.TestSolrCloudWithDelegationTokens_3E8984F5327246DA-001
   [junit4]   2> Aug 03, 2017 6:34:46 PM com.carrotsearch.randomizedtesting.ThreadLeakControl checkThreadLeaks
   [junit4]   2> WARNING: Will linger awaiting termination of 1 leaked thread(s).
   [junit4]   2> NOTE: test params are: codec=DummyCompressingStoredFields(storedFieldsFormat=CompressingStoredFieldsFormat(compressionMode=DUMMY, chunkSize=16594, maxDocsPerChunk=2, blockSize=9), termVectorsFormat=CompressingTermVectorsFormat(compressionMode=DUMMY, chunkSize=16594, blockSize=9)), sim=RandomSimilarity(queryNorm=true): {}, locale=hi, timezone=Europe/Gibraltar
   [junit4]   2> NOTE: Linux 4.10.0-27-generic amd64/Oracle Corporation 1.8.0_141 (64-bit)/cpus=8,threads=1,free=161516712,total=527433728
   [junit4]   2> NOTE: All tests run in this JVM: [TestPivotHelperCode, OverseerTest, BasicDistributedZk2Test, DateMathParserTest, TestManagedStopFilterFactory, TimeZoneUtilsTest, TestDFRSimilarityFactory, TestPullReplicaErrorHandling, TestSchemaNameResource, TestDynamicFieldCollectionResource, TestHdfsBackupRestoreCore, TestManagedResource, TestFieldCacheVsDocValues, TestDistribDocBasedVersion, BaseCdcrDistributedZkTest, TestImplicitCoreProperties, TestCloudPseudoReturnFields, TestBulkSchemaAPI, DistributedFacetPivotSmallTest, CircularListTest, TestJmxIntegration, TestMaxTokenLenTokenizer, EnumFieldTest, XsltUpdateRequestHandlerTest, TestRuleBasedAuthorizationPlugin, TestNRTOpen, FastVectorHighlighterTest, HdfsRestartWhileUpdatingTest, PolyFieldTest, TestXmlQParserPlugin, UninvertDocValuesMergePolicyTest, URLClassifyProcessorTest, TestJavabinTupleStreamParser, BlockDirectoryTest, BadIndexSchemaTest, TestSimpleTextCodec, DirectUpdateHandlerTest, DirectUpdateHandlerOptimizeTest, TolerantUpdateProcessorTest, QueryResultKeyTest, TestClassicSimilarityFactory, TestStressReorder, TestRandomCollapseQParserPlugin, CdcrReplicationHandlerTest, TestFieldResource, SignatureUpdateProcessorFactoryTest, TestConfigSetImmutable, V2ApiIntegrationTest, TestTrie, PathHierarchyTokenizerFactoryTest, ChaosMonkeyNothingIsSafeWithPullReplicasTest, TestSolrConfigHandlerCloud, TestPolicyCloud, DeleteReplicaTest, TestSimpleQParserPlugin, SolrGangliaReporterTest, SearchHandlerTest, CollectionsAPISolrJTest, CachingDirectoryFactoryTest, TestLegacyField, SolrInfoBeanTest, OverseerRolesTest, TestFreeTextSuggestions, TestRebalanceLeaders, MinimalSchemaTest, MetricsHandlerTest, TestRecovery, TestLFUCache, CopyFieldTest, PeerSyncReplicationTest, TestCollectionAPI, TestTolerantSearch, NotRequiredUniqueKeyTest, MultiTermTest, UnloadDistributedZkTest, SolrCoreCheckLockOnStartupTest, LeaderFailoverAfterPartitionTest, ClusterStateTest, DistributedFacetPivotLargeTest, TermVectorComponentDistributedTest, TestCollapseQParserPlugin, TestMinMaxOnMultiValuedField, TestCloudManagedSchema, TestSolrCoreProperties, TestZkChroot, TestGraphTermsQParserPlugin, TestRequestStatusCollectionAPI, TestMultiWordSynonyms, VersionInfoTest, TestCollectionAPIs, RecoveryZkTest, TestSort, SpatialHeatmapFacetsTest, TestHdfsCloudBackupRestore, ZkStateWriterTest, DistribCursorPagingTest, TestDistribIDF, TestDistributedStatsComponentCardinality, BitVectorTest, SuggesterTest, JvmMetricsTest, ReplaceNodeTest, PingRequestHandlerTest, DistributedQueryComponentOptimizationTest, SegmentsInfoRequestHandlerTest, SolrSlf4jReporterTest, TestPayloadCheckQParserPlugin, SpellPossibilityIteratorTest, TestInPlaceUpdatesDistrib, ShowFileRequestHandlerTest, TestReload, PrimitiveFieldTypeTest, DirectoryFactoryTest, OverriddenZkACLAndCredentialsProvidersTest, CurrencyFieldTypeTest, TestExportWriter, DocumentBuilderTest, TestNumericTerms32, CleanupOldIndexTest, CollectionsAPIAsyncDistributedZkTest, DeleteLastCustomShardedReplicaTest, DeleteNodeTest, DeleteStatusTest, DistribJoinFromCollectionTest, DistributedQueueTest, ForceLeaderTest, LeaderInitiatedRecoveryOnCommitTest, MultiThreadedOCPTest, SSLMigrationTest, SaslZkACLProviderTest, ShardSplitTest, TestRandomRequestDistribution, TestSSLRandomization, TestSizeLimitedDistributedMap, TestSolrCloudWithDelegationTokens]
   [junit4] Completed [533/727 (2!)] on J2 in 1.13s, 8 tests, 1 failure, 1 skipped <<< FAILURES!

[...truncated 3287 lines...]
   [junit4] Suite: org.apache.solr.analytics.facet.FieldFacetExtrasCloudTest
   [junit4]   2> Creating dataDir: /home/jenkins/workspace/Lucene-Solr-7.0-Linux/solr/build/contrib/solr-analytics/test/J1/temp/solr.analytics.facet.FieldFacetExtrasCloudTest_D6A92C496610243E-001/init-core-data-001
   [junit4]   2> NOTE: test params are: codec=Lucene70, sim=RandomSimilarity(queryNorm=true): {}, locale=de-AT, timezone=America/Nome
   [junit4]   2> NOTE: Linux 4.10.0-27-generic amd64/Oracle Corporation 1.8.0_141 (64-bit)/cpus=8,threads=1,free=358329720,total=475004928
   [junit4]   2> NOTE: All tests run in this JVM: [AbstractAnalyticsFacetTest, ExpressionTest, FieldFacetExtrasCloudTest]
   [junit4]   2> NOTE: reproduce with: ant test  -Dtestcase=FieldFacetExtrasCloudTest -Dtests.seed=D6A92C496610243E -Dtests.multiplier=3 -Dtests.slow=true -Dtests.locale=de-AT -Dtests.timezone=America/Nome -Dtests.asserts=true -Dtests.file.encoding=US-ASCII
   [junit4] ERROR   0.00s J1 | FieldFacetExtrasCloudTest (suite) <<<
   [junit4]    > Throwable #1: java.lang.AssertionError: Could not find collection:collection1
   [junit4]    > 	at __randomizedtesting.SeedInfo.seed([D6A92C496610243E]:0)
   [junit4]    > 	at org.apache.solr.cloud.AbstractDistribZkTestBase.waitForRecoveriesToFinish(AbstractDistribZkTestBase.java:155)
   [junit4]    > 	at org.apache.solr.analytics.facet.AbstractAnalyticsFacetCloudTest.setupCluster(AbstractAnalyticsFacetCloudTest.java:59)
   [junit4]    > 	at org.apache.solr.analytics.facet.FieldFacetExtrasCloudTest.beforeClass(FieldFacetExtrasCloudTest.java:47)
   [junit4]    > 	at java.lang.Thread.run(Thread.java:748)
   [junit4] Completed [17/17 (1!)] on J1 in 155.29s, 0 tests, 1 failure <<< FAILURES!

[...truncated 40694 lines...]

Mime
View raw message