lucene-dev mailing list archives

Site index · List index
Message view « Date » · « Thread »
Top « Date » · « Thread »
From Policeman Jenkins Server <jenk...@thetaphi.de>
Subject [JENKINS] Lucene-Solr-7.x-Solaris (64bit/jdk1.8.0) - Build # 105 - Still Unstable!
Date Fri, 11 Aug 2017 08:15:12 GMT
Build: https://jenkins.thetaphi.de/job/Lucene-Solr-7.x-Solaris/105/
Java: 64bit/jdk1.8.0 -XX:+UseCompressedOops -XX:+UseConcMarkSweepGC

3 tests failed.
FAILED:  org.apache.solr.cloud.TestCloudSearcherWarming.testRepFactor1LeaderStartup

Error Message:
 null Live Nodes: [127.0.0.1:56327_solr] Last available state: DocCollection(testRepFactor1LeaderStartup//collections/testRepFactor1LeaderStartup/state.json/4)={   "pullReplicas":"0",   "replicationFactor":"1",   "shards":{"shard1":{       "range":"80000000-7fffffff",       "state":"active",       "replicas":{"core_node2":{           "core":"testRepFactor1LeaderStartup_shard1_replica_n1",           "base_url":"http://127.0.0.1:56327/solr",           "node_name":"127.0.0.1:56327_solr",           "state":"active",           "type":"NRT",           "leader":"true"}}}},   "router":{"name":"compositeId"},   "maxShardsPerNode":"1",   "autoAddReplicas":"false",   "nrtReplicas":"1",   "tlogReplicas":"0"}

Stack Trace:
java.lang.AssertionError: 
null
Live Nodes: [127.0.0.1:56327_solr]
Last available state: DocCollection(testRepFactor1LeaderStartup//collections/testRepFactor1LeaderStartup/state.json/4)={
  "pullReplicas":"0",
  "replicationFactor":"1",
  "shards":{"shard1":{
      "range":"80000000-7fffffff",
      "state":"active",
      "replicas":{"core_node2":{
          "core":"testRepFactor1LeaderStartup_shard1_replica_n1",
          "base_url":"http://127.0.0.1:56327/solr",
          "node_name":"127.0.0.1:56327_solr",
          "state":"active",
          "type":"NRT",
          "leader":"true"}}}},
  "router":{"name":"compositeId"},
  "maxShardsPerNode":"1",
  "autoAddReplicas":"false",
  "nrtReplicas":"1",
  "tlogReplicas":"0"}
	at __randomizedtesting.SeedInfo.seed([ABADFD3F221670C6:7C85B0E733F63928]:0)
	at org.junit.Assert.fail(Assert.java:93)
	at org.apache.solr.cloud.SolrCloudTestCase.waitForState(SolrCloudTestCase.java:269)
	at org.apache.solr.cloud.TestCloudSearcherWarming.testRepFactor1LeaderStartup(TestCloudSearcherWarming.java:126)
	at sun.reflect.NativeMethodAccessorImpl.invoke0(Native Method)
	at sun.reflect.NativeMethodAccessorImpl.invoke(NativeMethodAccessorImpl.java:62)
	at sun.reflect.DelegatingMethodAccessorImpl.invoke(DelegatingMethodAccessorImpl.java:43)
	at java.lang.reflect.Method.invoke(Method.java:498)
	at com.carrotsearch.randomizedtesting.RandomizedRunner.invoke(RandomizedRunner.java:1713)
	at com.carrotsearch.randomizedtesting.RandomizedRunner$8.evaluate(RandomizedRunner.java:907)
	at com.carrotsearch.randomizedtesting.RandomizedRunner$9.evaluate(RandomizedRunner.java:943)
	at com.carrotsearch.randomizedtesting.RandomizedRunner$10.evaluate(RandomizedRunner.java:957)
	at com.carrotsearch.randomizedtesting.rules.SystemPropertiesRestoreRule$1.evaluate(SystemPropertiesRestoreRule.java:57)
	at org.apache.lucene.util.TestRuleSetupTeardownChained$1.evaluate(TestRuleSetupTeardownChained.java:49)
	at org.apache.lucene.util.AbstractBeforeAfterRule$1.evaluate(AbstractBeforeAfterRule.java:45)
	at org.apache.lucene.util.TestRuleThreadAndTestName$1.evaluate(TestRuleThreadAndTestName.java:48)
	at org.apache.lucene.util.TestRuleIgnoreAfterMaxFailures$1.evaluate(TestRuleIgnoreAfterMaxFailures.java:64)
	at org.apache.lucene.util.TestRuleMarkFailure$1.evaluate(TestRuleMarkFailure.java:47)
	at com.carrotsearch.randomizedtesting.rules.StatementAdapter.evaluate(StatementAdapter.java:36)
	at com.carrotsearch.randomizedtesting.ThreadLeakControl$StatementRunner.run(ThreadLeakControl.java:368)
	at com.carrotsearch.randomizedtesting.ThreadLeakControl.forkTimeoutingTask(ThreadLeakControl.java:817)
	at com.carrotsearch.randomizedtesting.ThreadLeakControl$3.evaluate(ThreadLeakControl.java:468)
	at com.carrotsearch.randomizedtesting.RandomizedRunner.runSingleTest(RandomizedRunner.java:916)
	at com.carrotsearch.randomizedtesting.RandomizedRunner$5.evaluate(RandomizedRunner.java:802)
	at com.carrotsearch.randomizedtesting.RandomizedRunner$6.evaluate(RandomizedRunner.java:852)
	at com.carrotsearch.randomizedtesting.RandomizedRunner$7.evaluate(RandomizedRunner.java:863)
	at com.carrotsearch.randomizedtesting.rules.StatementAdapter.evaluate(StatementAdapter.java:36)
	at com.carrotsearch.randomizedtesting.rules.SystemPropertiesRestoreRule$1.evaluate(SystemPropertiesRestoreRule.java:57)
	at org.apache.lucene.util.AbstractBeforeAfterRule$1.evaluate(AbstractBeforeAfterRule.java:45)
	at com.carrotsearch.randomizedtesting.rules.StatementAdapter.evaluate(StatementAdapter.java:36)
	at org.apache.lucene.util.TestRuleStoreClassName$1.evaluate(TestRuleStoreClassName.java:41)
	at com.carrotsearch.randomizedtesting.rules.NoShadowingOrOverridesOnMethodsRule$1.evaluate(NoShadowingOrOverridesOnMethodsRule.java:40)
	at com.carrotsearch.randomizedtesting.rules.NoShadowingOrOverridesOnMethodsRule$1.evaluate(NoShadowingOrOverridesOnMethodsRule.java:40)
	at com.carrotsearch.randomizedtesting.rules.StatementAdapter.evaluate(StatementAdapter.java:36)
	at com.carrotsearch.randomizedtesting.rules.StatementAdapter.evaluate(StatementAdapter.java:36)
	at com.carrotsearch.randomizedtesting.rules.StatementAdapter.evaluate(StatementAdapter.java:36)
	at org.apache.lucene.util.TestRuleAssertionsRequired$1.evaluate(TestRuleAssertionsRequired.java:53)
	at org.apache.lucene.util.TestRuleMarkFailure$1.evaluate(TestRuleMarkFailure.java:47)
	at org.apache.lucene.util.TestRuleIgnoreAfterMaxFailures$1.evaluate(TestRuleIgnoreAfterMaxFailures.java:64)
	at org.apache.lucene.util.TestRuleIgnoreTestSuites$1.evaluate(TestRuleIgnoreTestSuites.java:54)
	at com.carrotsearch.randomizedtesting.rules.StatementAdapter.evaluate(StatementAdapter.java:36)
	at com.carrotsearch.randomizedtesting.ThreadLeakControl$StatementRunner.run(ThreadLeakControl.java:368)
	at java.lang.Thread.run(Thread.java:748)


FAILED:  org.apache.solr.cloud.TestCloudSearcherWarming.testPeersyncFailureReplicationSuccess

Error Message:
0

Stack Trace:
java.lang.ArrayIndexOutOfBoundsException: 0
	at __randomizedtesting.SeedInfo.seed([ABADFD3F221670C6:7FFC9E70F3A847A5]:0)
	at java.util.concurrent.CopyOnWriteArrayList.get(CopyOnWriteArrayList.java:387)
	at java.util.concurrent.CopyOnWriteArrayList.get(CopyOnWriteArrayList.java:396)
	at org.apache.solr.cloud.MiniSolrCloudCluster.getJettySolrRunner(MiniSolrCloudCluster.java:367)
	at org.apache.solr.cloud.TestCloudSearcherWarming.testPeersyncFailureReplicationSuccess(TestCloudSearcherWarming.java:141)
	at sun.reflect.NativeMethodAccessorImpl.invoke0(Native Method)
	at sun.reflect.NativeMethodAccessorImpl.invoke(NativeMethodAccessorImpl.java:62)
	at sun.reflect.DelegatingMethodAccessorImpl.invoke(DelegatingMethodAccessorImpl.java:43)
	at java.lang.reflect.Method.invoke(Method.java:498)
	at com.carrotsearch.randomizedtesting.RandomizedRunner.invoke(RandomizedRunner.java:1713)
	at com.carrotsearch.randomizedtesting.RandomizedRunner$8.evaluate(RandomizedRunner.java:907)
	at com.carrotsearch.randomizedtesting.RandomizedRunner$9.evaluate(RandomizedRunner.java:943)
	at com.carrotsearch.randomizedtesting.RandomizedRunner$10.evaluate(RandomizedRunner.java:957)
	at com.carrotsearch.randomizedtesting.rules.SystemPropertiesRestoreRule$1.evaluate(SystemPropertiesRestoreRule.java:57)
	at org.apache.lucene.util.TestRuleSetupTeardownChained$1.evaluate(TestRuleSetupTeardownChained.java:49)
	at org.apache.lucene.util.AbstractBeforeAfterRule$1.evaluate(AbstractBeforeAfterRule.java:45)
	at org.apache.lucene.util.TestRuleThreadAndTestName$1.evaluate(TestRuleThreadAndTestName.java:48)
	at org.apache.lucene.util.TestRuleIgnoreAfterMaxFailures$1.evaluate(TestRuleIgnoreAfterMaxFailures.java:64)
	at org.apache.lucene.util.TestRuleMarkFailure$1.evaluate(TestRuleMarkFailure.java:47)
	at com.carrotsearch.randomizedtesting.rules.StatementAdapter.evaluate(StatementAdapter.java:36)
	at com.carrotsearch.randomizedtesting.ThreadLeakControl$StatementRunner.run(ThreadLeakControl.java:368)
	at com.carrotsearch.randomizedtesting.ThreadLeakControl.forkTimeoutingTask(ThreadLeakControl.java:817)
	at com.carrotsearch.randomizedtesting.ThreadLeakControl$3.evaluate(ThreadLeakControl.java:468)
	at com.carrotsearch.randomizedtesting.RandomizedRunner.runSingleTest(RandomizedRunner.java:916)
	at com.carrotsearch.randomizedtesting.RandomizedRunner$5.evaluate(RandomizedRunner.java:802)
	at com.carrotsearch.randomizedtesting.RandomizedRunner$6.evaluate(RandomizedRunner.java:852)
	at com.carrotsearch.randomizedtesting.RandomizedRunner$7.evaluate(RandomizedRunner.java:863)
	at com.carrotsearch.randomizedtesting.rules.StatementAdapter.evaluate(StatementAdapter.java:36)
	at com.carrotsearch.randomizedtesting.rules.SystemPropertiesRestoreRule$1.evaluate(SystemPropertiesRestoreRule.java:57)
	at org.apache.lucene.util.AbstractBeforeAfterRule$1.evaluate(AbstractBeforeAfterRule.java:45)
	at com.carrotsearch.randomizedtesting.rules.StatementAdapter.evaluate(StatementAdapter.java:36)
	at org.apache.lucene.util.TestRuleStoreClassName$1.evaluate(TestRuleStoreClassName.java:41)
	at com.carrotsearch.randomizedtesting.rules.NoShadowingOrOverridesOnMethodsRule$1.evaluate(NoShadowingOrOverridesOnMethodsRule.java:40)
	at com.carrotsearch.randomizedtesting.rules.NoShadowingOrOverridesOnMethodsRule$1.evaluate(NoShadowingOrOverridesOnMethodsRule.java:40)
	at com.carrotsearch.randomizedtesting.rules.StatementAdapter.evaluate(StatementAdapter.java:36)
	at com.carrotsearch.randomizedtesting.rules.StatementAdapter.evaluate(StatementAdapter.java:36)
	at com.carrotsearch.randomizedtesting.rules.StatementAdapter.evaluate(StatementAdapter.java:36)
	at org.apache.lucene.util.TestRuleAssertionsRequired$1.evaluate(TestRuleAssertionsRequired.java:53)
	at org.apache.lucene.util.TestRuleMarkFailure$1.evaluate(TestRuleMarkFailure.java:47)
	at org.apache.lucene.util.TestRuleIgnoreAfterMaxFailures$1.evaluate(TestRuleIgnoreAfterMaxFailures.java:64)
	at org.apache.lucene.util.TestRuleIgnoreTestSuites$1.evaluate(TestRuleIgnoreTestSuites.java:54)
	at com.carrotsearch.randomizedtesting.rules.StatementAdapter.evaluate(StatementAdapter.java:36)
	at com.carrotsearch.randomizedtesting.ThreadLeakControl$StatementRunner.run(ThreadLeakControl.java:368)
	at java.lang.Thread.run(Thread.java:748)


FAILED:  org.apache.solr.cloud.ForceLeaderTest.testReplicasInLIRNoLeader

Error Message:
Doc with id=1 not found in http://127.0.0.1:41946/eqch/gp/forceleader_test_collection due to: Path not found: /id; rsp={doc=null}

Stack Trace:
java.lang.AssertionError: Doc with id=1 not found in http://127.0.0.1:41946/eqch/gp/forceleader_test_collection due to: Path not found: /id; rsp={doc=null}
	at __randomizedtesting.SeedInfo.seed([ABADFD3F221670C6:4D3AC9FF1B9489A7]:0)
	at org.junit.Assert.fail(Assert.java:93)
	at org.junit.Assert.assertTrue(Assert.java:43)
	at org.apache.solr.cloud.HttpPartitionTest.assertDocExists(HttpPartitionTest.java:603)
	at org.apache.solr.cloud.HttpPartitionTest.assertDocsExistInAllReplicas(HttpPartitionTest.java:556)
	at org.apache.solr.cloud.ForceLeaderTest.testReplicasInLIRNoLeader(ForceLeaderTest.java:142)
	at sun.reflect.NativeMethodAccessorImpl.invoke0(Native Method)
	at sun.reflect.NativeMethodAccessorImpl.invoke(NativeMethodAccessorImpl.java:62)
	at sun.reflect.DelegatingMethodAccessorImpl.invoke(DelegatingMethodAccessorImpl.java:43)
	at java.lang.reflect.Method.invoke(Method.java:498)
	at com.carrotsearch.randomizedtesting.RandomizedRunner.invoke(RandomizedRunner.java:1713)
	at com.carrotsearch.randomizedtesting.RandomizedRunner$8.evaluate(RandomizedRunner.java:907)
	at com.carrotsearch.randomizedtesting.RandomizedRunner$9.evaluate(RandomizedRunner.java:943)
	at com.carrotsearch.randomizedtesting.RandomizedRunner$10.evaluate(RandomizedRunner.java:957)
	at org.apache.solr.BaseDistributedSearchTestCase$ShardsRepeatRule$ShardsFixedStatement.callStatement(BaseDistributedSearchTestCase.java:993)
	at org.apache.solr.BaseDistributedSearchTestCase$ShardsRepeatRule$ShardsStatement.evaluate(BaseDistributedSearchTestCase.java:968)
	at com.carrotsearch.randomizedtesting.rules.SystemPropertiesRestoreRule$1.evaluate(SystemPropertiesRestoreRule.java:57)
	at org.apache.lucene.util.TestRuleSetupTeardownChained$1.evaluate(TestRuleSetupTeardownChained.java:49)
	at org.apache.lucene.util.AbstractBeforeAfterRule$1.evaluate(AbstractBeforeAfterRule.java:45)
	at org.apache.lucene.util.TestRuleThreadAndTestName$1.evaluate(TestRuleThreadAndTestName.java:48)
	at org.apache.lucene.util.TestRuleIgnoreAfterMaxFailures$1.evaluate(TestRuleIgnoreAfterMaxFailures.java:64)
	at org.apache.lucene.util.TestRuleMarkFailure$1.evaluate(TestRuleMarkFailure.java:47)
	at com.carrotsearch.randomizedtesting.rules.StatementAdapter.evaluate(StatementAdapter.java:36)
	at com.carrotsearch.randomizedtesting.ThreadLeakControl$StatementRunner.run(ThreadLeakControl.java:368)
	at com.carrotsearch.randomizedtesting.ThreadLeakControl.forkTimeoutingTask(ThreadLeakControl.java:817)
	at com.carrotsearch.randomizedtesting.ThreadLeakControl$3.evaluate(ThreadLeakControl.java:468)
	at com.carrotsearch.randomizedtesting.RandomizedRunner.runSingleTest(RandomizedRunner.java:916)
	at com.carrotsearch.randomizedtesting.RandomizedRunner$5.evaluate(RandomizedRunner.java:802)
	at com.carrotsearch.randomizedtesting.RandomizedRunner$6.evaluate(RandomizedRunner.java:852)
	at com.carrotsearch.randomizedtesting.RandomizedRunner$7.evaluate(RandomizedRunner.java:863)
	at com.carrotsearch.randomizedtesting.rules.StatementAdapter.evaluate(StatementAdapter.java:36)
	at com.carrotsearch.randomizedtesting.rules.SystemPropertiesRestoreRule$1.evaluate(SystemPropertiesRestoreRule.java:57)
	at org.apache.lucene.util.AbstractBeforeAfterRule$1.evaluate(AbstractBeforeAfterRule.java:45)
	at com.carrotsearch.randomizedtesting.rules.StatementAdapter.evaluate(StatementAdapter.java:36)
	at org.apache.lucene.util.TestRuleStoreClassName$1.evaluate(TestRuleStoreClassName.java:41)
	at com.carrotsearch.randomizedtesting.rules.NoShadowingOrOverridesOnMethodsRule$1.evaluate(NoShadowingOrOverridesOnMethodsRule.java:40)
	at com.carrotsearch.randomizedtesting.rules.NoShadowingOrOverridesOnMethodsRule$1.evaluate(NoShadowingOrOverridesOnMethodsRule.java:40)
	at com.carrotsearch.randomizedtesting.rules.StatementAdapter.evaluate(StatementAdapter.java:36)
	at com.carrotsearch.randomizedtesting.rules.StatementAdapter.evaluate(StatementAdapter.java:36)
	at com.carrotsearch.randomizedtesting.rules.StatementAdapter.evaluate(StatementAdapter.java:36)
	at org.apache.lucene.util.TestRuleAssertionsRequired$1.evaluate(TestRuleAssertionsRequired.java:53)
	at org.apache.lucene.util.TestRuleMarkFailure$1.evaluate(TestRuleMarkFailure.java:47)
	at org.apache.lucene.util.TestRuleIgnoreAfterMaxFailures$1.evaluate(TestRuleIgnoreAfterMaxFailures.java:64)
	at org.apache.lucene.util.TestRuleIgnoreTestSuites$1.evaluate(TestRuleIgnoreTestSuites.java:54)
	at com.carrotsearch.randomizedtesting.rules.StatementAdapter.evaluate(StatementAdapter.java:36)
	at com.carrotsearch.randomizedtesting.ThreadLeakControl$StatementRunner.run(ThreadLeakControl.java:368)
	at java.lang.Thread.run(Thread.java:748)




Build Log:
[...truncated 10892 lines...]
   [junit4] Suite: org.apache.solr.cloud.TestCloudSearcherWarming
   [junit4]   2> 244269 INFO  (SUITE-TestCloudSearcherWarming-seed#[ABADFD3F221670C6]-worker) [    ] o.a.s.SolrTestCaseJ4 SecureRandom sanity checks: test.solr.allowed.securerandom=null & java.security.egd=file:/dev/./urandom
   [junit4]   2> Creating dataDir: /export/home/jenkins/workspace/Lucene-Solr-7.x-Solaris/solr/build/solr-core/test/J1/temp/solr.cloud.TestCloudSearcherWarming_ABADFD3F221670C6-001/init-core-data-001
   [junit4]   2> 244271 WARN  (SUITE-TestCloudSearcherWarming-seed#[ABADFD3F221670C6]-worker) [    ] o.a.s.SolrTestCaseJ4 startTrackingSearchers: numOpens=1 numCloses=1
   [junit4]   2> 244271 INFO  (SUITE-TestCloudSearcherWarming-seed#[ABADFD3F221670C6]-worker) [    ] o.a.s.SolrTestCaseJ4 Using PointFields (NUMERIC_POINTS_SYSPROP=true) w/NUMERIC_DOCVALUES_SYSPROP=true
   [junit4]   2> 244273 INFO  (SUITE-TestCloudSearcherWarming-seed#[ABADFD3F221670C6]-worker) [    ] o.a.s.SolrTestCaseJ4 Randomized ssl (false) and clientAuth (false) via: @org.apache.solr.util.RandomizeSSL(reason=, value=NaN, ssl=NaN, clientAuth=NaN)
   [junit4]   2> 244273 INFO  (SUITE-TestCloudSearcherWarming-seed#[ABADFD3F221670C6]-worker) [    ] o.a.s.c.MiniSolrCloudCluster Starting cluster of 1 servers in /export/home/jenkins/workspace/Lucene-Solr-7.x-Solaris/solr/build/solr-core/test/J1/temp/solr.cloud.TestCloudSearcherWarming_ABADFD3F221670C6-001/tempDir-001
   [junit4]   2> 244274 INFO  (SUITE-TestCloudSearcherWarming-seed#[ABADFD3F221670C6]-worker) [    ] o.a.s.c.ZkTestServer STARTING ZK TEST SERVER
   [junit4]   2> 244274 INFO  (Thread-439) [    ] o.a.s.c.ZkTestServer client port:0.0.0.0/0.0.0.0:0
   [junit4]   2> 244274 INFO  (Thread-439) [    ] o.a.s.c.ZkTestServer Starting server
   [junit4]   2> 244277 ERROR (Thread-439) [    ] o.a.z.s.ZooKeeperServer ZKShutdownHandler is not registered, so ZooKeeper server won't take any action on ERROR or SHUTDOWN server state changes
   [junit4]   2> 244374 INFO  (SUITE-TestCloudSearcherWarming-seed#[ABADFD3F221670C6]-worker) [    ] o.a.s.c.ZkTestServer start zk server on port:51125
   [junit4]   2> 244384 WARN  (NIOServerCxn.Factory:0.0.0.0/0.0.0.0:0) [    ] o.a.z.s.NIOServerCnxn caught end of stream exception
   [junit4]   2> EndOfStreamException: Unable to read additional data from client sessionid 0x15dd0139c880000, likely client has closed socket
   [junit4]   2> 	at org.apache.zookeeper.server.NIOServerCnxn.doIO(NIOServerCnxn.java:239)
   [junit4]   2> 	at org.apache.zookeeper.server.NIOServerCnxnFactory.run(NIOServerCnxnFactory.java:203)
   [junit4]   2> 	at java.lang.Thread.run(Thread.java:748)
   [junit4]   2> 244386 INFO  (jetty-launcher-289-thread-1) [    ] o.e.j.s.Server jetty-9.3.14.v20161028
   [junit4]   2> 244401 INFO  (jetty-launcher-289-thread-1) [    ] o.e.j.s.h.ContextHandler Started o.e.j.s.ServletContextHandler@4c4c4fe4{/solr,null,AVAILABLE}
   [junit4]   2> 244403 INFO  (jetty-launcher-289-thread-1) [    ] o.e.j.s.AbstractConnector Started ServerConnector@5000d7a3{HTTP/1.1,[http/1.1]}{127.0.0.1:56327}
   [junit4]   2> 244403 INFO  (jetty-launcher-289-thread-1) [    ] o.e.j.s.Server Started @246322ms
   [junit4]   2> 244403 INFO  (jetty-launcher-289-thread-1) [    ] o.a.s.c.s.e.JettySolrRunner Jetty properties: {hostContext=/solr, hostPort=56327}
   [junit4]   2> 244403 ERROR (jetty-launcher-289-thread-1) [    ] o.a.s.s.StartupLoggingUtils Missing Java Option solr.log.dir. Logging may be missing or incomplete.
   [junit4]   2> 244403 INFO  (jetty-launcher-289-thread-1) [    ] o.a.s.s.SolrDispatchFilter  ___      _       Welcome to Apache Solr? version 7.1.0
   [junit4]   2> 244403 INFO  (jetty-launcher-289-thread-1) [    ] o.a.s.s.SolrDispatchFilter / __| ___| |_ _   Starting in cloud mode on port null
   [junit4]   2> 244403 INFO  (jetty-launcher-289-thread-1) [    ] o.a.s.s.SolrDispatchFilter \__ \/ _ \ | '_|  Install dir: null, Default config dir: null
   [junit4]   2> 244403 INFO  (jetty-launcher-289-thread-1) [    ] o.a.s.s.SolrDispatchFilter |___/\___/_|_|    Start time: 2017-08-11T06:55:32.615Z
   [junit4]   2> 244447 INFO  (jetty-launcher-289-thread-1) [    ] o.a.s.s.SolrDispatchFilter solr.xml found in ZooKeeper. Loading...
   [junit4]   2> 244458 INFO  (jetty-launcher-289-thread-1) [    ] o.a.s.c.ZkContainer Zookeeper client=127.0.0.1:51125/solr
   [junit4]   2> 244582 INFO  (jetty-launcher-289-thread-1) [n:127.0.0.1:56327_solr    ] o.a.s.c.Overseer Overseer (id=null) closing
   [junit4]   2> 244583 INFO  (jetty-launcher-289-thread-1) [n:127.0.0.1:56327_solr    ] o.a.s.c.OverseerElectionContext I am going to be the leader 127.0.0.1:56327_solr
   [junit4]   2> 244584 INFO  (jetty-launcher-289-thread-1) [n:127.0.0.1:56327_solr    ] o.a.s.c.Overseer Overseer (id=98463549521133571-127.0.0.1:56327_solr-n_0000000000) starting
   [junit4]   2> 244593 INFO  (jetty-launcher-289-thread-1) [n:127.0.0.1:56327_solr    ] o.a.s.c.ZkController Register node as live in ZooKeeper:/live_nodes/127.0.0.1:56327_solr
   [junit4]   2> 244596 INFO  (zkCallback-296-thread-1-processing-n:127.0.0.1:56327_solr) [n:127.0.0.1:56327_solr    ] o.a.s.c.c.ZkStateReader Updated live nodes from ZooKeeper... (0) -> (1)
   [junit4]   2> 244661 INFO  (jetty-launcher-289-thread-1) [n:127.0.0.1:56327_solr    ] o.a.s.m.r.SolrJmxReporter JMX monitoring for 'solr_56327.solr.node' (registry 'solr.node') enabled at server: com.sun.jmx.mbeanserver.JmxMBeanServer@3e1ec772
   [junit4]   2> 244663 INFO  (jetty-launcher-289-thread-1) [n:127.0.0.1:56327_solr    ] o.a.s.m.r.SolrJmxReporter JMX monitoring for 'solr_56327.solr.jvm' (registry 'solr.jvm') enabled at server: com.sun.jmx.mbeanserver.JmxMBeanServer@3e1ec772
   [junit4]   2> 244663 INFO  (jetty-launcher-289-thread-1) [n:127.0.0.1:56327_solr    ] o.a.s.m.r.SolrJmxReporter JMX monitoring for 'solr_56327.solr.jetty' (registry 'solr.jetty') enabled at server: com.sun.jmx.mbeanserver.JmxMBeanServer@3e1ec772
   [junit4]   2> 244664 INFO  (jetty-launcher-289-thread-1) [n:127.0.0.1:56327_solr    ] o.a.s.c.CorePropertiesLocator Found 0 core definitions underneath /export/home/jenkins/workspace/Lucene-Solr-7.x-Solaris/solr/build/solr-core/test/J1/temp/solr.cloud.TestCloudSearcherWarming_ABADFD3F221670C6-001/tempDir-001/node1/.
   [junit4]   2> 244682 INFO  (SUITE-TestCloudSearcherWarming-seed#[ABADFD3F221670C6]-worker) [    ] o.a.s.c.c.ZkStateReader Updated live nodes from ZooKeeper... (0) -> (1)
   [junit4]   2> 244684 INFO  (SUITE-TestCloudSearcherWarming-seed#[ABADFD3F221670C6]-worker) [    ] o.a.s.c.s.i.ZkClientClusterStateProvider Cluster at 127.0.0.1:51125/solr ready
   [junit4]   2> 244699 INFO  (TEST-TestCloudSearcherWarming.testRepFactor1LeaderStartup-seed#[ABADFD3F221670C6]) [    ] o.a.s.SolrTestCaseJ4 ###Starting testRepFactor1LeaderStartup
   [junit4]   2> 244702 INFO  (qtp183313701-1617) [n:127.0.0.1:56327_solr    ] o.a.s.h.a.CollectionsHandler Invoked Collection Action :delete with params name=testRepFactor1LeaderStartup&action=DELETE&wt=javabin&version=2 and sendToOCPQueue=true
   [junit4]   2> 244705 INFO  (OverseerThreadFactory-779-thread-1-processing-n:127.0.0.1:56327_solr) [n:127.0.0.1:56327_solr    ] o.a.s.c.OverseerCollectionMessageHandler Executing Collection Cmd : action=UNLOAD&deleteInstanceDir=true&deleteDataDir=true
   [junit4]   2> 244706 ERROR (OverseerThreadFactory-779-thread-1-processing-n:127.0.0.1:56327_solr) [n:127.0.0.1:56327_solr    ] o.a.s.c.OverseerCollectionMessageHandler Collection: testRepFactor1LeaderStartup operation: delete failed:org.apache.solr.common.SolrException: Could not find collection : testRepFactor1LeaderStartup
   [junit4]   2> 	at org.apache.solr.common.cloud.ClusterState.getCollection(ClusterState.java:109)
   [junit4]   2> 	at org.apache.solr.cloud.OverseerCollectionMessageHandler.collectionCmd(OverseerCollectionMessageHandler.java:795)
   [junit4]   2> 	at org.apache.solr.cloud.DeleteCollectionCmd.call(DeleteCollectionCmd.java:88)
   [junit4]   2> 	at org.apache.solr.cloud.OverseerCollectionMessageHandler.processMessage(OverseerCollectionMessageHandler.java:227)
   [junit4]   2> 	at org.apache.solr.cloud.OverseerTaskProcessor$Runner.run(OverseerTaskProcessor.java:464)
   [junit4]   2> 	at org.apache.solr.common.util.ExecutorUtil$MDCAwareThreadPoolExecutor.lambda$execute$0(ExecutorUtil.java:188)
   [junit4]   2> 	at java.util.concurrent.ThreadPoolExecutor.runWorker(ThreadPoolExecutor.java:1149)
   [junit4]   2> 	at java.util.concurrent.ThreadPoolExecutor$Worker.run(ThreadPoolExecutor.java:624)
   [junit4]   2> 	at java.lang.Thread.run(Thread.java:748)
   [junit4]   2> 
   [junit4]   2> 244716 INFO  (qtp183313701-1617) [n:127.0.0.1:56327_solr    ] o.a.s.s.HttpSolrCall [admin] webapp=null path=/admin/collections params={name=testRepFactor1LeaderStartup&action=DELETE&wt=javabin&version=2} status=400 QTime=14
   [junit4]   2> 244717 INFO  (qtp183313701-1618) [n:127.0.0.1:56327_solr    ] o.a.s.h.a.CollectionsHandler Invoked Collection Action :delete with params name=testPeersyncFailureReplicationSuccess&action=DELETE&wt=javabin&version=2 and sendToOCPQueue=true
   [junit4]   2> 244720 INFO  (OverseerCollectionConfigSetProcessor-98463549521133571-127.0.0.1:56327_solr-n_0000000000) [n:127.0.0.1:56327_solr    ] o.a.s.c.OverseerTaskQueue Response ZK path: /overseer/collection-queue-work/qnr-0000000000 doesn't exist.  Requestor may have disconnected from ZooKeeper
   [junit4]   2> 244721 INFO  (OverseerThreadFactory-779-thread-2-processing-n:127.0.0.1:56327_solr) [n:127.0.0.1:56327_solr    ] o.a.s.c.OverseerCollectionMessageHandler Executing Collection Cmd : action=UNLOAD&deleteInstanceDir=true&deleteDataDir=true
   [junit4]   2> 244722 ERROR (OverseerThreadFactory-779-thread-2-processing-n:127.0.0.1:56327_solr) [n:127.0.0.1:56327_solr    ] o.a.s.c.OverseerCollectionMessageHandler Collection: testPeersyncFailureReplicationSuccess operation: delete failed:org.apache.solr.common.SolrException: Could not find collection : testPeersyncFailureReplicationSuccess
   [junit4]   2> 	at org.apache.solr.common.cloud.ClusterState.getCollection(ClusterState.java:109)
   [junit4]   2> 	at org.apache.solr.cloud.OverseerCollectionMessageHandler.collectionCmd(OverseerCollectionMessageHandler.java:795)
   [junit4]   2> 	at org.apache.solr.cloud.DeleteCollectionCmd.call(DeleteCollectionCmd.java:88)
   [junit4]   2> 	at org.apache.solr.cloud.OverseerCollectionMessageHandler.processMessage(OverseerCollectionMessageHandler.java:227)
   [junit4]   2> 	at org.apache.solr.cloud.OverseerTaskProcessor$Runner.run(OverseerTaskProcessor.java:464)
   [junit4]   2> 	at org.apache.solr.common.util.ExecutorUtil$MDCAwareThreadPoolExecutor.lambda$execute$0(ExecutorUtil.java:188)
   [junit4]   2> 	at java.util.concurrent.ThreadPoolExecutor.runWorker(ThreadPoolExecutor.java:1149)
   [junit4]   2> 	at java.util.concurrent.ThreadPoolExecutor$Worker.run(ThreadPoolExecutor.java:624)
   [junit4]   2> 	at java.lang.Thread.run(Thread.java:748)
   [junit4]   2> 
   [junit4]   2> 244725 INFO  (qtp183313701-1618) [n:127.0.0.1:56327_solr    ] o.a.s.s.HttpSolrCall [admin] webapp=null path=/admin/collections params={name=testPeersyncFailureReplicationSuccess&action=DELETE&wt=javabin&version=2} status=400 QTime=7
   [junit4]   2> 244725 INFO  (qtp183313701-1619) [n:127.0.0.1:56327_solr    ] o.a.s.h.a.CollectionsHandler Invoked Collection Action :create with params pullReplicas=0&replicationFactor=1&name=testRepFactor1LeaderStartup&nrtReplicas=1&action=CREATE&numShards=1&tlogReplicas=0&createNodeSet=127.0.0.1:56327_solr&wt=javabin&version=2 and sendToOCPQueue=true
   [junit4]   2> 244732 INFO  (OverseerThreadFactory-779-thread-3-processing-n:127.0.0.1:56327_solr) [n:127.0.0.1:56327_solr    ] o.a.s.c.CreateCollectionCmd Create collection testRepFactor1LeaderStartup
   [junit4]   2> 244732 INFO  (OverseerCollectionConfigSetProcessor-98463549521133571-127.0.0.1:56327_solr-n_0000000000) [n:127.0.0.1:56327_solr    ] o.a.s.c.OverseerTaskQueue Response ZK path: /overseer/collection-queue-work/qnr-0000000002 doesn't exist.  Requestor may have disconnected from ZooKeeper
   [junit4]   2> 244732 INFO  (OverseerThreadFactory-779-thread-3-processing-n:127.0.0.1:56327_solr) [n:127.0.0.1:56327_solr    ] o.a.s.c.CreateCollectionCmd Only _default config set found, using it.
   [junit4]   2> 244733 INFO  (OverseerThreadFactory-779-thread-3-processing-n:127.0.0.1:56327_solr) [n:127.0.0.1:56327_solr    ] o.a.s.c.c.ZkConfigManager Copying zk node /configs/_default/protwords.txt to /configs/testRepFactor1LeaderStartup/protwords.txt
   [junit4]   2> 244734 INFO  (OverseerThreadFactory-779-thread-3-processing-n:127.0.0.1:56327_solr) [n:127.0.0.1:56327_solr    ] o.a.s.c.c.ZkConfigManager Copying zk node /configs/_default/managed-schema to /configs/testRepFactor1LeaderStartup/managed-schema
   [junit4]   2> 244736 INFO  (OverseerThreadFactory-779-thread-3-processing-n:127.0.0.1:56327_solr) [n:127.0.0.1:56327_solr    ] o.a.s.c.c.ZkConfigManager Copying zk node /configs/_default/solrconfig.xml to /configs/testRepFactor1LeaderStartup/solrconfig.xml
   [junit4]   2> 244739 INFO  (OverseerThreadFactory-779-thread-3-processing-n:127.0.0.1:56327_solr) [n:127.0.0.1:56327_solr    ] o.a.s.c.c.ZkConfigManager Copying zk node /configs/_default/synonyms.txt to /configs/testRepFactor1LeaderStartup/synonyms.txt
   [junit4]   2> 244742 INFO  (OverseerThreadFactory-779-thread-3-processing-n:127.0.0.1:56327_solr) [n:127.0.0.1:56327_solr    ] o.a.s.c.c.ZkConfigManager Copying zk node /configs/_default/stopwords.txt to /configs/testRepFactor1LeaderStartup/stopwords.txt
   [junit4]   2> 244745 INFO  (OverseerThreadFactory-779-thread-3-processing-n:127.0.0.1:56327_solr) [n:127.0.0.1:56327_solr    ] o.a.s.c.c.ZkConfigManager Copying zk node /configs/_default/lang/contractions_it.txt to /configs/testRepFactor1LeaderStartup/lang/contractions_it.txt
   [junit4]   2> 244748 INFO  (OverseerThreadFactory-779-thread-3-processing-n:127.0.0.1:56327_solr) [n:127.0.0.1:56327_solr    ] o.a.s.c.c.ZkConfigManager Copying zk node /configs/_default/lang/stopwords_no.txt to /configs/testRepFactor1LeaderStartup/lang/stopwords_no.txt
   [junit4]   2> 244751 INFO  (OverseerThreadFactory-779-thread-3-processing-n:127.0.0.1:56327_solr) [n:127.0.0.1:56327_solr    ] o.a.s.c.c.ZkConfigManager Copying zk node /configs/_default/lang/stopwords_hy.txt to /configs/testRepFactor1LeaderStartup/lang/stopwords_hy.txt
   [junit4]   2> 244754 INFO  (OverseerThreadFactory-779-thread-3-processing-n:127.0.0.1:56327_solr) [n:127.0.0.1:56327_solr    ] o.a.s.c.c.ZkConfigManager Copying zk node /configs/_default/lang/contractions_ca.txt to /configs/testRepFactor1LeaderStartup/lang/contractions_ca.txt
   [junit4]   2> 244756 INFO  (OverseerThreadFactory-779-thread-3-processing-n:127.0.0.1:56327_solr) [n:127.0.0.1:56327_solr    ] o.a.s.c.c.ZkConfigManager Copying zk node /configs/_default/lang/stemdict_nl.txt to /configs/testRepFactor1LeaderStartup/lang/stemdict_nl.txt
   [junit4]   2> 244759 INFO  (OverseerThreadFactory-779-thread-3-processing-n:127.0.0.1:56327_solr) [n:127.0.0.1:56327_solr    ] o.a.s.c.c.ZkConfigManager Copying zk node /configs/_default/lang/stopwords_id.txt to /configs/testRepFactor1LeaderStartup/lang/stopwords_id.txt
   [junit4]   2> 244762 INFO  (OverseerThreadFactory-779-thread-3-processing-n:127.0.0.1:56327_solr) [n:127.0.0.1:56327_solr    ] o.a.s.c.c.ZkConfigManager Copying zk node /configs/_default/lang/stopwords_ga.txt to /configs/testRepFactor1LeaderStartup/lang/stopwords_ga.txt
   [junit4]   2> 244765 INFO  (OverseerThreadFactory-779-thread-3-processing-n:127.0.0.1:56327_solr) [n:127.0.0.1:56327_solr    ] o.a.s.c.c.ZkConfigManager Copying zk node /configs/_default/lang/stopwords_da.txt to /configs/testRepFactor1LeaderStartup/lang/stopwords_da.txt
   [junit4]   2> 244768 INFO  (OverseerThreadFactory-779-thread-3-processing-n:127.0.0.1:56327_solr) [n:127.0.0.1:56327_solr    ] o.a.s.c.c.ZkConfigManager Copying zk node /configs/_default/lang/stopwords_hi.txt to /configs/testRepFactor1LeaderStartup/lang/stopwords_hi.txt
   [junit4]   2> 244771 INFO  (OverseerThreadFactory-779-thread-3-processing-n:127.0.0.1:56327_solr) [n:127.0.0.1:56327_solr    ] o.a.s.c.c.ZkConfigManager Copying zk node /configs/_default/lang/stopwords_ja.txt to /configs/testRepFactor1LeaderStartup/lang/stopwords_ja.txt
   [junit4]   2> 244774 INFO  (OverseerThreadFactory-779-thread-3-processing-n:127.0.0.1:56327_solr) [n:127.0.0.1:56327_solr    ] o.a.s.c.c.ZkConfigManager Copying zk node /configs/_default/lang/stopwords_pt.txt to /configs/testRepFactor1LeaderStartup/lang/stopwords_pt.txt
   [junit4]   2> 244777 INFO  (OverseerThreadFactory-779-thread-3-processing-n:127.0.0.1:56327_solr) [n:127.0.0.1:56327_solr    ] o.a.s.c.c.ZkConfigManager Copying zk node /configs/_default/lang/stopwords_hu.txt to /configs/testRepFactor1LeaderStartup/lang/stopwords_hu.txt
   [junit4]   2> 244780 INFO  (OverseerThreadFactory-779-thread-3-processing-n:127.0.0.1:56327_solr) [n:127.0.0.1:56327_solr    ] o.a.s.c.c.ZkConfigManager Copying zk node /configs/_default/lang/stopwords_el.txt to /configs/testRepFactor1LeaderStartup/lang/stopwords_el.txt
   [junit4]   2> 244782 INFO  (OverseerThreadFactory-779-thread-3-processing-n:127.0.0.1:56327_solr) [n:127.0.0.1:56327_solr    ] o.a.s.c.c.ZkConfigManager Copying zk node /configs/_default/lang/stopwords_ru.txt to /configs/testRepFactor1LeaderStartup/lang/stopwords_ru.txt
   [junit4]   2> 244785 INFO  (OverseerThreadFactory-779-thread-3-processing-n:127.0.0.1:56327_solr) [n:127.0.0.1:56327_solr    ] o.a.s.c.c.ZkConfigManager Copying zk node /configs/_default/lang/stopwords_tr.txt to /configs/testRepFactor1LeaderStartup/lang/stopwords_tr.txt
   [junit4]   2> 244787 INFO  (OverseerThreadFactory-779-thread-3-processing-n:127.0.0.1:56327_solr) [n:127.0.0.1:56327_solr    ] o.a.s.c.c.ZkConfigManager Copying zk node /configs/_default/lang/stopwords_ar.txt to /configs/testRepFactor1LeaderStartup/lang/stopwords_ar.txt
   [junit4]   2> 244790 INFO  (OverseerThreadFactory-779-thread-3-processing-n:127.0.0.1:56327_solr) [n:127.0.0.1:56327_solr    ] o.a.s.c.c.ZkConfigManager Copying zk node /configs/_default/lang/userdict_ja.txt to /configs/testRepFactor1LeaderStartup/lang/userdict_ja.txt
   [junit4]   2> 244792 INFO  (OverseerThreadFactory-779-thread-3-processing-n:127.0.0.1:56327_solr) [n:127.0.0.1:56327_solr    ] o.a.s.c.c.ZkConfigManager Copying zk node /configs/_default/lang/stopwords_eu.txt to /configs/testRepFactor1LeaderStartup/lang/stopwords_eu.txt
   [junit4]   2> 244796 INFO  (OverseerThreadFactory-779-thread-3-processing-n:127.0.0.1:56327_solr) [n:127.0.0.1:56327_solr    ] o.a.s.c.c.ZkConfigManager Copying zk node /configs/_default/lang/stopwords_it.txt to /configs/testRepFactor1LeaderStartup/lang/stopwords_it.txt
   [junit4]   2> 244799 INFO  (OverseerThreadFactory-779-thread-3-processing-n:127.0.0.1:56327_solr) [n:127.0.0.1:56327_solr    ] o.a.s.c.c.ZkConfigManager Copying zk node /configs/_default/lang/stopwords_cz.txt to /configs/testRepFactor1LeaderStartup/lang/stopwords_cz.txt
   [junit4]   2> 244801 INFO  (OverseerThreadFactory-779-thread-3-processing-n:127.0.0.1:56327_solr) [n:127.0.0.1:56327_solr    ] o.a.s.c.c.ZkConfigManager Copying zk node /configs/_default/lang/stoptags_ja.txt to /configs/testRepFactor1LeaderStartup/lang/stoptags_ja.txt
   [junit4]   2> 244805 INFO  (OverseerThreadFactory-779-thread-3-processing-n:127.0.0.1:56327_solr) [n:127.0.0.1:56327_solr    ] o.a.s.c.c.ZkConfigManager Copying zk node /configs/_default/lang/contractions_fr.txt to /configs/testRepFactor1LeaderStartup/lang/contractions_fr.txt
   [junit4]   2> 244807 INFO  (OverseerThreadFactory-779-thread-3-processing-n:127.0.0.1:56327_solr) [n:127.0.0.1:56327_solr    ] o.a.s.c.c.ZkConfigManager Copying zk node /configs/_default/lang/stopwords_de.txt to /configs/testRepFactor1LeaderStartup/lang/stopwords_de.txt
   [junit4]   2> 244810 INFO  (OverseerThreadFactory-779-thread-3-processing-n:127.0.0.1:56327_solr) [n:127.0.0.1:56327_solr    ] o.a.s.c.c.ZkConfigManager Copying zk node /configs/_default/lang/stopwords_fa.txt to /configs/testRepFactor1LeaderStartup/lang/stopwords_fa.txt
   [junit4]   2> 244812 INFO  (OverseerThreadFactory-779-thread-3-processing-n:127.0.0.1:56327_solr) [n:127.0.0.1:56327_solr    ] o.a.s.c.c.ZkConfigManager Copying zk node /configs/_default/lang/contractions_ga.txt to /configs/testRepFactor1LeaderStartup/lang/contractions_ga.txt
   [junit4]   2> 244815 INFO  (OverseerThreadFactory-779-thread-3-processing-n:127.0.0.1:56327_solr) [n:127.0.0.1:56327_solr    ] o.a.s.c.c.ZkConfigManager Copying zk node /configs/_default/lang/stopwords_ca.txt to /configs/testRepFactor1LeaderStartup/lang/stopwords_ca.txt
   [junit4]   2> 244817 INFO  (OverseerThreadFactory-779-thread-3-processing-n:127.0.0.1:56327_solr) [n:127.0.0.1:56327_solr    ] o.a.s.c.c.ZkConfigManager Copying zk node /configs/_default/lang/stopwords_nl.txt to /configs/testRepFactor1LeaderStartup/lang/stopwords_nl.txt
   [junit4]   2> 244820 INFO  (OverseerThreadFactory-779-thread-3-processing-n:127.0.0.1:56327_solr) [n:127.0.0.1:56327_solr    ] o.a.s.c.c.ZkConfigManager Copying zk node /configs/_default/lang/stopwords_bg.txt to /configs/testRepFactor1LeaderStartup/lang/stopwords_bg.txt
   [junit4]   2> 244823 INFO  (OverseerThreadFactory-779-thread-3-processing-n:127.0.0.1:56327_solr) [n:127.0.0.1:56327_solr    ] o.a.s.c.c.ZkConfigManager Copying zk node /configs/_default/lang/stopwords_lv.txt to /configs/testRepFactor1LeaderStartup/lang/stopwords_lv.txt
   [junit4]   2> 244825 INFO  (OverseerThreadFactory-779-thread-3-processing-n:127.0.0.1:56327_solr) [n:127.0.0.1:56327_solr    ] o.a.s.c.c.ZkConfigManager Copying zk node /configs/_default/lang/stopwords_en.txt to /configs/testRepFactor1LeaderStartup/lang/stopwords_en.txt
   [junit4]   2> 244828 INFO  (OverseerThreadFactory-779-thread-3-processing-n:127.0.0.1:56327_solr) [n:127.0.0.1:56327_solr    ] o.a.s.c.c.ZkConfigManager Copying zk node /configs/_default/lang/stopwords_es.txt to /configs/testRepFactor1LeaderStartup/lang/stopwords_es.txt
   [junit4]   2> 244831 INFO  (OverseerThreadFactory-779-thread-3-processing-n:127.0.0.1:56327_solr) [n:127.0.0.1:56327_solr    ] o.a.s.c.c.ZkConfigManager Copying zk node /configs/_default/lang/stopwords_ro.txt to /configs/testRepFactor1LeaderStartup/lang/stopwords_ro.txt
   [junit4]   2> 244834 INFO  (OverseerThreadFactory-779-thread-3-processing-n:127.0.0.1:56327_solr) [n:127.0.0.1:56327_solr    ] o.a.s.c.c.ZkConfigManager Copying zk node /configs/_default/lang/stopwords_th.txt to /configs/testRepFactor1LeaderStartup/lang/stopwords_th.txt
   [junit4]   2> 244836 INFO  (OverseerThreadFactory-779-thread-3-processing-n:127.0.0.1:56327_solr) [n:127.0.0.1:56327_solr    ] o.a.s.c.c.ZkConfigManager Copying zk node /configs/_default/lang/stopwords_fr.txt to /configs/testRepFactor1LeaderStartup/lang/stopwords_fr.txt
   [junit4]   2> 244839 INFO  (OverseerThreadFactory-779-thread-3-processing-n:127.0.0.1:56327_solr) [n:127.0.0.1:56327_solr    ] o.a.s.c.c.ZkConfigManager Copying zk node /configs/_default/lang/stopwords_sv.txt to /configs/testRepFactor1LeaderStartup/lang/stopwords_sv.txt
   [junit4]   2> 244841 INFO  (OverseerThreadFactory-779-thread-3-processing-n:127.0.0.1:56327_solr) [n:127.0.0.1:56327_solr    ] o.a.s.c.c.ZkConfigManager Copying zk node /configs/_default/lang/stopwords_fi.txt to /configs/testRepFactor1LeaderStartup/lang/stopwords_fi.txt
   [junit4]   2> 244844 INFO  (OverseerThreadFactory-779-thread-3-processing-n:127.0.0.1:56327_solr) [n:127.0.0.1:56327_solr    ] o.a.s.c.c.ZkConfigManager Copying zk node /configs/_default/lang/hyphenations_ga.txt to /configs/testRepFactor1LeaderStartup/lang/hyphenations_ga.txt
   [junit4]   2> 244846 INFO  (OverseerThreadFactory-779-thread-3-processing-n:127.0.0.1:56327_solr) [n:127.0.0.1:56327_solr    ] o.a.s.c.c.ZkConfigManager Copying zk node /configs/_default/lang/stopwords_gl.txt to /configs/testRepFactor1LeaderStartup/lang/stopwords_gl.txt
   [junit4]   2> 244849 INFO  (OverseerThreadFactory-779-thread-3-processing-n:127.0.0.1:56327_solr) [n:127.0.0.1:56327_solr    ] o.a.s.c.c.ZkConfigManager Copying zk node /configs/_default/params.json to /configs/testRepFactor1LeaderStartup/params.json
   [junit4]   2> 244961 INFO  (OverseerStateUpdate-98463549521133571-127.0.0.1:56327_solr-n_0000000000) [n:127.0.0.1:56327_solr    ] o.a.s.c.o.SliceMutator createReplica() {
   [junit4]   2>   "operation":"ADDREPLICA",
   [junit4]   2>   "collection":"testRepFactor1LeaderStartup",
   [junit4]   2>   "shard":"shard1",
   [junit4]   2>   "core":"testRepFactor1LeaderStartup_shard1_replica_n1",
   [junit4]   2>   "state":"down",
   [junit4]   2>   "base_url":"http://127.0.0.1:56327/solr",
   [junit4]   2>   "type":"NRT"} 
   [junit4]   2> 245164 INFO  (qtp183313701-1620) [n:127.0.0.1:56327_solr    ] o.a.s.h.a.CoreAdminOperation core create command qt=/admin/cores&coreNodeName=core_node2&collection.configName=testRepFactor1LeaderStartup&newCollection=true&name=testRepFactor1LeaderStartup_shard1_replica_n1&action=CREATE&numShards=1&collection=testRepFactor1LeaderStartup&shard=shard1&wt=javabin&version=2&replicaType=NRT
   [junit4]   2> 245164 INFO  (qtp183313701-1620) [n:127.0.0.1:56327_solr    ] o.a.s.c.TransientSolrCoreCacheDefault Allocating transient cache for 2147483647 transient cores
   [junit4]   2> 245271 INFO  (zkCallback-296-thread-2-processing-n:127.0.0.1:56327_solr) [n:127.0.0.1:56327_solr    ] o.a.s.c.c.ZkStateReader A cluster state change: [WatchedEvent state:SyncConnected type:NodeDataChanged path:/collections/testRepFactor1LeaderStartup/state.json] for collection [testRepFactor1LeaderStartup] has occurred - updating... (live nodes size: [1])
   [junit4]   2> 245271 INFO  (zkCallback-296-thread-1-processing-n:127.0.0.1:56327_solr) [n:127.0.0.1:56327_solr    ] o.a.s.c.c.ZkStateReader A cluster state change: [WatchedEvent state:SyncConnected type:NodeDataChanged path:/collections/testRepFactor1LeaderStartup/state.json] for collection [testRepFactor1LeaderStartup] has occurred - updating... (live nodes size: [1])
   [junit4]   2> 246184 INFO  (qtp183313701-1620) [n:127.0.0.1:56327_solr c:testRepFactor1LeaderStartup s:shard1 r:core_node2 x:testRepFactor1LeaderStartup_shard1_replica_n1] o.a.s.c.RequestParams conf resource params.json loaded . version : 0 
   [junit4]   2> 246184 INFO  (qtp183313701-1620) [n:127.0.0.1:56327_solr c:testRepFactor1LeaderStartup s:shard1 r:core_node2 x:testRepFactor1LeaderStartup_shard1_replica_n1] o.a.s.c.RequestParams request params refreshed to version 0
   [junit4]   2> 246185 WARN  (qtp183313701-1620) [n:127.0.0.1:56327_solr c:testRepFactor1LeaderStartup s:shard1 r:core_node2 x:testRepFactor1LeaderStartup_shard1_replica_n1] o.a.s.c.SolrConfig Couldn't add files from /export/home/jenkins/workspace/Lucene-Solr-7.x-Solaris/solr/build/solr-core/test/J1/temp/solr.cloud.TestCloudSearcherWarming_ABADFD3F221670C6-001/tempDir-001/node1/testRepFactor1LeaderStartup_shard1_replica_n1/../../../../contrib/extraction/lib filtered by .*\.jar to classpath: /export/home/jenkins/workspace/Lucene-Solr-7.x-Solaris/solr/build/solr-core/test/J1/temp/solr.cloud.TestCloudSearcherWarming_ABADFD3F221670C6-001/tempDir-001/node1/testRepFactor1LeaderStartup_shard1_replica_n1/../../../../contrib/extraction/lib
   [junit4]   2> 246185 WARN  (qtp183313701-1620) [n:127.0.0.1:56327_solr c:testRepFactor1LeaderStartup s:shard1 r:core_node2 x:testRepFactor1LeaderStartup_shard1_replica_n1] o.a.s.c.SolrConfig Couldn't add files from /export/home/jenkins/workspace/Lucene-Solr-7.x-Solaris/solr/build/solr-core/test/J1/temp/solr.cloud.TestCloudSearcherWarming_ABADFD3F221670C6-001/tempDir-001/node1/testRepFactor1LeaderStartup_shard1_replica_n1/../../../../dist filtered by solr-cell-\d.*\.jar to classpath: /export/home/jenkins/workspace/Lucene-Solr-7.x-Solaris/solr/build/solr-core/test/J1/temp/solr.cloud.TestCloudSearcherWarming_ABADFD3F221670C6-001/tempDir-001/node1/testRepFactor1LeaderStartup_shard1_replica_n1/../../../../dist
   [junit4]   2> 246185 WARN  (qtp183313701-1620) [n:127.0.0.1:56327_solr c:testRepFactor1LeaderStartup s:shard1 r:core_node2 x:testRepFactor1LeaderStartup_shard1_replica_n1] o.a.s.c.SolrConfig Couldn't add files from /export/home/jenkins/workspace/Lucene-Solr-7.x-Solaris/solr/build/solr-core/test/J1/temp/solr.cloud.TestCloudSearcherWarming_ABADFD3F221670C6-001/tempDir-001/node1/testRepFactor1LeaderStartup_shard1_replica_n1/../../../../contrib/clustering/lib filtered by .*\.jar to classpath: /export/home/jenkins/workspace/Lucene-Solr-7.x-Solaris/solr/build/solr-core/test/J1/temp/solr.cloud.TestCloudSearcherWarming_ABADFD3F221670C6-001/tempDir-001/node1/testRepFactor1LeaderStartup_shard1_replica_n1/../../../../contrib/clustering/lib
   [junit4]   2> 246190 WARN  (qtp183313701-1620) [n:127.0.0.1:56327_solr c:testRepFactor1LeaderStartup s:shard1 r:core_node2 x:testRepFactor1LeaderStartup_shard1_replica_n1] o.a.s.c.SolrConfig Couldn't add files from /export/home/jenkins/workspace/Lucene-Solr-7.x-Solaris/solr/build/solr-core/test/J1/temp/solr.cloud.TestCloudSearcherWarming_ABADFD3F221670C6-001/tempDir-001/node1/testRepFactor1LeaderStartup_shard1_replica_n1/../../../../dist filtered by solr-clustering-\d.*\.jar to classpath: /export/home/jenkins/workspace/Lucene-Solr-7.x-Solaris/solr/build/solr-core/test/J1/temp/solr.cloud.TestCloudSearcherWarming_ABADFD3F221670C6-001/tempDir-001/node1/testRepFactor1LeaderStartup_shard1_replica_n1/../../../../dist
   [junit4]   2> 246190 WARN  (qtp183313701-1620) [n:127.0.0.1:56327_solr c:testRepFactor1LeaderStartup s:shard1 r:core_node2 x:testRepFactor1LeaderStartup_shard1_replica_n1] o.a.s.c.SolrConfig Couldn't add files from /export/home/jenkins/workspace/Lucene-Solr-7.x-Solaris/solr/build/solr-core/test/J1/temp/solr.cloud.TestCloudSearcherWarming_ABADFD3F221670C6-001/tempDir-001/node1/testRepFactor1LeaderStartup_shard1_replica_n1/../../../../contrib/langid/lib filtered by .*\.jar to classpath: /export/home/jenkins/workspace/Lucene-Solr-7.x-Solaris/solr/build/solr-core/test/J1/temp/solr.cloud.TestCloudSearcherWarming_ABADFD3F221670C6-001/tempDir-001/node1/testRepFactor1LeaderStartup_shard1_replica_n1/../../../../contrib/langid/lib
   [junit4]   2> 246191 WARN  (qtp183313701-1620) [n:127.0.0.1:56327_solr c:testRepFactor1LeaderStartup s:shard1 r:core_node2 x:testRepFactor1LeaderStartup_shard1_replica_n1] o.a.s.c.SolrConfig Couldn't add files from /export/home/jenkins/workspace/Lucene-Solr-7.x-Solaris/solr/build/solr-core/test/J1/temp/solr.cloud.TestCloudSearcherWarming_ABADFD3F221670C6-001/tempDir-001/node1/testRepFactor1LeaderStartup_shard1_replica_n1/../../../../dist filtered by solr-langid-\d.*\.jar to classpath: /export/home/jenkins/workspace/Lucene-Solr-7.x-Solaris/solr/build/solr-core/test/J1/temp/solr.cloud.TestCloudSearcherWarming_ABADFD3F221670C6-001/tempDir-001/node1/testRepFactor1LeaderStartup_shard1_replica_n1/../../../../dist
   [junit4]   2> 246191 WARN  (qtp183313701-1620) [n:127.0.0.1:56327_solr c:testRepFactor1LeaderStartup s:shard1 r:core_node2 x:testRepFactor1LeaderStartup_shard1_replica_n1] o.a.s.c.SolrConfig Couldn't add files from /export/home/jenkins/workspace/Lucene-Solr-7.x-Solaris/solr/build/solr-core/test/J1/temp/solr.cloud.TestCloudSearcherWarming_ABADFD3F221670C6-001/tempDir-001/node1/testRepFactor1LeaderStartup_shard1_replica_n1/../../../../contrib/velocity/lib filtered by .*\.jar to classpath: /export/home/jenkins/workspace/Lucene-Solr-7.x-Solaris/solr/build/solr-core/test/J1/temp/solr.cloud.TestCloudSearcherWarming_ABADFD3F221670C6-001/tempDir-001/node1/testRepFactor1LeaderStartup_shard1_replica_n1/../../../../contrib/velocity/lib
   [junit4]   2> 246191 WARN  (qtp183313701-1620) [n:127.0.0.1:56327_solr c:testRepFactor1LeaderStartup s:shard1 r:core_node2 x:testRepFactor1LeaderStartup_shard1_replica_n1] o.a.s.c.SolrConfig Couldn't add files from /export/home/jenkins/workspace/Lucene-Solr-7.x-Solaris/solr/build/solr-core/test/J1/temp/solr.cloud.TestCloudSearcherWarming_ABADFD3F221670C6-001/tempDir-001/node1/testRepFactor1LeaderStartup_shard1_replica_n1/../../../../dist filtered by solr-velocity-\d.*\.jar to classpath: /export/home/jenkins/workspace/Lucene-Solr-7.x-Solaris/solr/build/solr-core/test/J1/temp/solr.cloud.TestCloudSearcherWarming_ABADFD3F221670C6-001/tempDir-001/node1/testRepFactor1LeaderStartup_shard1_replica_n1/../../../../dist
   [junit4]   2> 246198 INFO  (qtp183313701-1620) [n:127.0.0.1:56327_solr c:testRepFactor1LeaderStartup s:shard1 r:core_node2 x:testRepFactor1LeaderStartup_shard1_replica_n1] o.a.s.c.SolrConfig Using Lucene MatchVersion: 7.1.0
   [junit4]   2> 246227 INFO  (qtp183313701-1620) [n:127.0.0.1:56327_solr c:testRepFactor1LeaderStartup s:shard1 r:core_node2 x:testRepFactor1LeaderStartup_shard1_replica_n1] o.a.s.s.IndexSchema [testRepFactor1LeaderStartup_shard1_replica_n1] Schema name=default-config
   [junit4]   2> 246379 INFO  (qtp183313701-1620) [n:127.0.0.1:56327_solr c:testRepFactor1LeaderStartup s:shard1 r:core_node2 x:testRepFactor1LeaderStartup_shard1_replica_n1] o.a.s.s.IndexSchema Loaded schema default-config/1.6 with uniqueid field id
   [junit4]   2> 246470 INFO  (qtp183313701-1620) [n:127.0.0.1:56327_solr c:testRepFactor1LeaderStartup s:shard1 r:core_node2 x:testRepFactor1LeaderStartup_shard1_replica_n1] o.a.s.c.CoreContainer Creating SolrCore 'testRepFactor1LeaderStartup_shard1_replica_n1' using configuration from collection testRepFactor1LeaderStartup, trusted=true
   [junit4]   2> 246471 INFO  (qtp183313701-1620) [n:127.0.0.1:56327_solr c:testRepFactor1LeaderStartup s:shard1 r:core_node2 x:testRepFactor1LeaderStartup_shard1_replica_n1] o.a.s.m.r.SolrJmxReporter JMX monitoring for 'solr_56327.solr.core.testRepFactor1LeaderStartup.shard1.replica_n1' (registry 'solr.core.testRepFactor1LeaderStartup.shard1.replica_n1') enabled at server: com.sun.jmx.mbeanserver.JmxMBeanServer@3e1ec772
   [junit4]   2> 246472 INFO  (qtp183313701-1620) [n:127.0.0.1:56327_solr c:testRepFactor1LeaderStartup s:shard1 r:core_node2 x:testRepFactor1LeaderStartup_shard1_replica_n1] o.a.s.c.SolrCore solr.RecoveryStrategy.Builder
   [junit4]   2> 246472 INFO  (qtp183313701-1620) [n:127.0.0.1:56327_solr c:testRepFactor1LeaderStartup s:shard1 r:core_node2 x:testRepFactor1LeaderStartup_shard1_replica_n1] o.a.s.c.SolrCore [[testRepFactor1LeaderStartup_shard1_replica_n1] ] Opening new SolrCore at [/export/home/jenkins/workspace/Lucene-Solr-7.x-Solaris/solr/build/solr-core/test/J1/temp/solr.cloud.TestCloudSearcherWarming_ABADFD3F221670C6-001/tempDir-001/node1/testRepFactor1LeaderStartup_shard1_replica_n1], dataDir=[/export/home/jenkins/workspace/Lucene-Solr-7.x-Solaris/solr/build/solr-core/test/J1/temp/solr.cloud.TestCloudSearcherWarming_ABADFD3F221670C6-001/tempDir-001/node1/./testRepFactor1LeaderStartup_shard1_replica_n1/data/]
   [junit4]   2> 246476 INFO  (qtp183313701-1620) [n:127.0.0.1:56327_solr c:testRepFactor1LeaderStartup s:shard1 r:core_node2 x:testRepFactor1LeaderStartup_shard1_replica_n1] o.a.s.r.XSLTResponseWriter xsltCacheLifetimeSeconds=5
   [junit4]   2> 246522 INFO  (qtp183313701-1620) [n:127.0.0.1:56327_solr c:testRepFactor1LeaderStartup s:shard1 r:core_node2 x:testRepFactor1LeaderStartup_shard1_replica_n1] o.a.s.u.UpdateHandler Using UpdateLog implementation: org.apache.solr.update.UpdateLog
   [junit4]   2> 246522 INFO  (qtp183313701-1620) [n:127.0.0.1:56327_solr c:testRepFactor1LeaderStartup s:shard1 r:core_node2 x:testRepFactor1LeaderStartup_shard1_replica_n1] o.a.s.u.UpdateLog Initializing UpdateLog: dataDir= defaultSyncLevel=FLUSH numRecordsToKeep=100 maxNumLogsToKeep=10 numVersionBuckets=65536
   [junit4]   2> 246523 INFO  (qtp183313701-1620) [n:127.0.0.1:56327_solr c:testRepFactor1LeaderStartup s:shard1 r:core_node2 x:testRepFactor1LeaderStartup_shard1_replica_n1] o.a.s.u.CommitTracker Hard AutoCommit: if uncommited for 15000ms; 
   [junit4]   2> 246523 INFO  (qtp183313701-1620) [n:127.0.0.1:56327_solr c:testRepFactor1LeaderStartup s:shard1 r:core_node2 x:testRepFactor1LeaderStartup_shard1_replica_n1] o.a.s.u.CommitTracker Soft AutoCommit: disabled
   [junit4]   2> 246525 INFO  (qtp183313701-1620) [n:127.0.0.1:56327_solr c:testRepFactor1LeaderStartup s:shard1 r:core_node2 x:testRepFactor1LeaderStartup_shard1_replica_n1] o.a.s.s.SolrIndexSearcher Opening [Searcher@11fc2bda[testRepFactor1LeaderStartup_shard1_replica_n1] main]
   [junit4]   2> 246526 INFO  (qtp183313701-1620) [n:127.0.0.1:56327_solr c:testRepFactor1LeaderStartup s:shard1 r:core_node2 x:testRepFactor1LeaderStartup_shard1_replica_n1] o.a.s.r.ManagedResourceStorage Configured ZooKeeperStorageIO with znodeBase: /configs/testRepFactor1LeaderStartup
   [junit4]   2> 246527 INFO  (qtp183313701-1620) [n:127.0.0.1:56327_solr c:testRepFactor1LeaderStartup s:shard1 r:core_node2 x:testRepFactor1LeaderStartup_shard1_replica_n1] o.a.s.r.ManagedResourceStorage Loaded null at path _rest_managed.json using ZooKeeperStorageIO:path=/configs/testRepFactor1LeaderStartup
   [junit4]   2> 246527 INFO  (qtp183313701-1620) [n:127.0.0.1:56327_solr c:testRepFactor1LeaderStartup s:shard1 r:core_node2 x:testRepFactor1LeaderStartup_shard1_replica_n1] o.a.s.s.ZkIndexSchemaReader Creating ZooKeeper watch for the managed schema at /configs/testRepFactor1LeaderStartup/managed-schema
   [junit4]   2> 246528 INFO  (qtp183313701-1620) [n:127.0.0.1:56327_solr c:testRepFactor1LeaderStartup s:shard1 r:core_node2 x:testRepFactor1LeaderStartup_shard1_replica_n1] o.a.s.s.ZkIndexSchemaReader Current schema version 0 is already the latest
   [junit4]   2> 246528 INFO  (qtp183313701-1620) [n:127.0.0.1:56327_solr c:testRepFactor1LeaderStartup s:shard1 r:core_node2 x:testRepFactor1LeaderStartup_shard1_replica_n1] o.a.s.h.c.SpellCheckComponent Initializing spell checkers
   [junit4]   2> 246528 INFO  (qtp183313701-1620) [n:127.0.0.1:56327_solr c:testRepFactor1LeaderStartup s:shard1 r:core_node2 x:testRepFactor1LeaderStartup_shard1_replica_n1] o.a.s.s.DirectSolrSpellChecker init: {name=default,field=_text_,classname=solr.DirectSolrSpellChecker,distanceMeasure=internal,accuracy=0.5,maxEdits=2,minPrefix=1,maxInspections=5,minQueryLength=4,maxQueryFrequency=0.01}
   [junit4]   2> 246530 INFO  (qtp183313701-1620) [n:127.0.0.1:56327_solr c:testRepFactor1LeaderStartup s:shard1 r:core_node2 x:testRepFactor1LeaderStartup_shard1_replica_n1] o.a.s.h.ReplicationHandler Commits will be reserved for  10000
   [junit4]   2> 246530 INFO  (qtp183313701-1620) [n:127.0.0.1:56327_solr c:testRepFactor1LeaderStartup s:shard1 r:core_node2 x:testRepFactor1LeaderStartup_shard1_replica_n1] o.a.s.u.UpdateLog Could not find max version in index or recent updates, using new clock 1575416794701627392
   [junit4]   2> 246531 INFO  (searcherExecutor-782-thread-1-processing-n:127.0.0.1:56327_solr x:testRepFactor1LeaderStartup_shard1_replica_n1 s:shard1 c:testRepFactor1LeaderStartup r:core_node2) [n:127.0.0.1:56327_solr c:testRepFactor1LeaderStartup s:shard1 r:core_node2 x:testRepFactor1LeaderStartup_shard1_replica_n1] o.a.s.c.QuerySenderListener QuerySenderListener sending requests to Searcher@11fc2bda[testRepFactor1LeaderStartup_shard1_replica_n1] main{ExitableDirectoryReader(UninvertingDirectoryReader())}
   [junit4]   2> 246531 INFO  (searcherExecutor-782-thread-1-processing-n:127.0.0.1:56327_solr x:testRepFactor1LeaderStartup_shard1_replica_n1 s:shard1 c:testRepFactor1LeaderStartup r:core_node2) [n:127.0.0.1:56327_solr c:testRepFactor1LeaderStartup s:shard1 r:core_node2 x:testRepFactor1LeaderStartup_shard1_replica_n1] o.a.s.c.QuerySenderListener QuerySenderListener done.
   [junit4]   2> 246531 INFO  (searcherExecutor-782-thread-1-processing-n:127.0.0.1:56327_solr x:testRepFactor1LeaderStartup_shard1_replica_n1 s:shard1 c:testRepFactor1LeaderStartup r:core_node2) [n:127.0.0.1:56327_solr c:testRepFactor1LeaderStartup s:shard1 r:core_node2 x:testRepFactor1LeaderStartup_shard1_replica_n1] o.a.s.h.c.SpellCheckComponent Loading spell index for spellchecker: default
   [junit4]   2> 246533 INFO  (searcherExecutor-782-thread-1-processing-n:127.0.0.1:56327_solr x:testRepFactor1LeaderStartup_shard1_replica_n1 s:shard1 c:testRepFactor1LeaderStartup r:core_node2) [n:127.0.0.1:56327_solr c:testRepFactor1LeaderStartup s:shard1 r:core_node2 x:testRepFactor1LeaderStartup_shard1_replica_n1] o.a.s.c.SolrCore [testRepFactor1LeaderStartup_shard1_replica_n1] Registered new searcher Searcher@11fc2bda[testRepFactor1LeaderStartup_shard1_replica_n1] main{ExitableDirectoryReader(UninvertingDirectoryReader())}
   [junit4]   2> 246542 INFO  (qtp183313701-1620) [n:127.0.0.1:56327_solr c:testRepFactor1LeaderStartup s:shard1 r:core_node2 x:testRepFactor1LeaderStartup_shard1_replica_n1] o.a.s.c.ShardLeaderElectionContext Enough replicas found to continue.
   [junit4]   2> 246542 INFO  (qtp183313701-1620) [n:127.0.0.1:56327_solr c:testRepFactor1LeaderStartup s:shard1 r:core_node2 x:testRepFactor1LeaderStartup_shard1_replica_n1] o.a.s.c.ShardLeaderElectionContext I may be the new leader - try and sync
   [junit4]   2> 246542 INFO  (qtp183313701-1620) [n:127.0.0.1:56327_solr c:testRepFactor1LeaderStartup s:shard1 r:core_node2 x:testRepFactor1LeaderStartup_shard1_replica_n1] o.a.s.c.SyncStrategy Sync replicas to http://127.0.0.1:56327/solr/testRepFactor1LeaderStartup_shard1_replica_n1/
   [junit4]   2> 246542 INFO  (qtp183313701-1620) [n:127.0.0.1:56327_solr c:testRepFactor1LeaderStartup s:shard1 r:core_node2 x:testRepFactor1LeaderStartup_shard1_replica_n1] o.a.s.c.SyncStrategy Sync Success - now sync replicas to me
   [junit4]   2> 246542 INFO  (qtp183313701-1620) [n:127.0.0.1:56327_solr c:testRepFactor1LeaderStartup s:shard1 r:core_node2 x:testRepFactor1LeaderStartup_shard1_replica_n1] o.a.s.c.SyncStrategy http://127.0.0.1:56327/solr/testRepFactor1LeaderStartup_shard1_replica_n1/ has no replicas
   [junit4]   2> 246542 INFO  (qtp183313701-1620) [n:127.0.0.1:56327_solr c:testRepFactor1LeaderStartup s:shard1 r:core_node2 x:testRepFactor1LeaderStartup_shard1_replica_n1] o.a.s.c.ShardLeaderElectionContext Found all replicas participating in election, clear LIR
   [junit4]   2> 246548 INFO  (qtp183313701-1620) [n:127.0.0.1:56327_solr c:testRepFactor1LeaderStartup s:shard1 r:core_node2 x:testRepFactor1LeaderStartup_shard1_replica_n1] o.a.s.c.ShardLeaderElectionContext I am the new leader: http://127.0.0.1:56327/solr/testRepFactor1LeaderStartup_shard1_replica_n1/ shard1
   [junit4]   2> 246652 INFO  (zkCallback-296-thread-1-processing-n:127.0.0.1:56327_solr) [n:127.0.0.1:56327_solr    ] o.a.s.c.c.ZkStateReader A cluster state change: [WatchedEvent state:SyncConnected type:NodeDataChanged path:/collections/testRepFactor1LeaderStartup/state.json] for collection [testRepFactor1LeaderStartup] has occurred - updating... (live nodes size: [1])
   [junit4]   2> 246653 INFO  (zkCallback-296-thread-2-processing-n:127.0.0.1:56327_solr) [n:127.0.0.1:56327_solr    ] o.a.s.c.c.ZkStateReader A cluster state change: [WatchedEvent state:SyncConnected type:NodeDataChanged path:/collections/testRepFactor1LeaderStartup/state.json] for collection [testRepFactor1LeaderStartup] has occurred - updating... (live nodes size: [1])
   [junit4]   2> 246700 INFO  (qtp183313701-1620) [n:127.0.0.1:56327_solr c:testRepFactor1LeaderStartup s:shard1 r:core_node2 x:testRepFactor1LeaderStartup_shard1_replica_n1] o.a.s.c.ZkController I am the leader, no recovery necessary
   [junit4]   2> 246702 INFO  (qtp183313701-1620) [n:127.0.0.1:56327_solr c:testRepFactor1LeaderStartup s:shard1 r:core_node2 x:testRepFactor1LeaderStartup_shard1_replica_n1] o.a.s.s.HttpSolrCall [admin] webapp=null path=/admin/cores params={qt=/admin/cores&coreNodeName=core_node2&collection.configName=testRepFactor1LeaderStartup&newCollection=true&name=testRepFactor1LeaderStartup_shard1_replica_n1&action=CREATE&numShards=1&collection=testRepFactor1LeaderStartup&shard=shard1&wt=javabin&version=2&replicaType=NRT} status=0 QTime=1539
   [junit4]   2> 246707 INFO  (qtp183313701-1619) [n:127.0.0.1:56327_solr    ] o.a.s.h.a.CollectionsHandler Wait for new collection to be active for at most 30 seconds. Check all shard replicas
   [junit4]   2> 246733 INFO  (OverseerCollectionConfigSetProcessor-98463549521133571-127.0.0.1:56327_solr-n_0000000000) [n:127.0.0.1:56327_solr    ] o.a.s.c.OverseerTaskQueue Response ZK path: /overseer/collection-queue-work/qnr-0000000004 doesn't exist.  Requestor may have disconnected from ZooKeeper
   [junit4]   2> 246806 INFO  (zkCallback-296-thread-1-processing-n:127.0.0.1:56327_solr) [n:127.0.0.1:56327_solr    ] o.a.s.c.c.ZkStateReader A cluster state change: [WatchedEvent state:SyncConnected type:NodeDataChanged path:/collections/testRepFactor1LeaderStartup/state.json] for collection [testRepFactor1LeaderStartup] has occurred - updating... (live nodes size: [1])
   [junit4]   2> 246806 INFO  (zkCallback-296-thread-2-processing-n:127.0.0.1:56327_solr) [n:127.0.0.1:56327_solr    ] o.a.s.c.c.ZkStateReader A cluster state change: [WatchedEvent state:SyncConnected type:NodeDataChanged path:/collections/testRepFactor1LeaderStartup/state.json] for collection [testRepFactor1LeaderStartup] has occurred - updating... (live nodes size: [1])
   [junit4]   2> 247708 INFO  (qtp183313701-1619) [n:127.0.0.1:56327_solr    ] o.a.s.s.HttpSolrCall [admin] webapp=null path=/admin/collections params={pullReplicas=0&replicationFactor=1&name=testRepFactor1LeaderStartup&nrtReplicas=1&action=CREATE&numShards=1&tlogReplicas=0&createNodeSet=127.0.0.1:56327_solr&wt=javabin&version=2} status=0 QTime=2984
   [junit4]   2> java.lang.RuntimeException
   [junit4]   2> 	at org.apache.solr.cloud.TestCloudSearcherWarming$SleepingSolrEventListener.init(TestCloudSearcherWarming.java:306)
   [junit4]   2> 	at org.apache.solr.core.SolrCore.createInitInstance(SolrCore.java:826)
   [junit4]   2> 	at org.apache.solr.handler.SolrConfigHandler$Command.verifyClass(SolrConfigHandler.java:562)
   [junit4]   2> 	at org.apache.solr.handler.SolrConfigHandler$Command.updateNamedPlugin(SolrConfigHandler.java:533)
   [junit4]   2> 	at org.apache.solr.handler.SolrConfigHandler$Command.handleCommands(SolrConfigHandler.java:482)
   [junit4]   2> 	at org.apache.solr.handler.SolrConfigHandler$Command.handlePOST(SolrConfigHandler.java:346)
   [junit4]   2> 	at org.apache.solr.handler.SolrConfigHandler$Command.access$100(SolrConfigHandler.java:159)
   [junit4]   2> 	at org.apache.solr.handler.SolrConfigHandler.handleRequestBody(SolrConfigHandler.java:137)
   [junit4]   2> 	at org.apache.solr.handler.RequestHandlerBase.handleRequest(RequestHandlerBase.java:177)
   [junit4]   2> 	at org.apache.solr.core.SolrCore.execute(SolrCore.java:2482)
   [junit4]   2> 	at org.apache.solr.servlet.HttpSolrCall.execute(HttpSolrCall.java:720)
   [junit4]   2> 	at org.apache.solr.servlet.HttpSolrCall.call(HttpSolrCall.java:526)
   [junit4]   2> 	at org.apache.solr.servlet.SolrDispatchFilter.doFilter(SolrDispatchFilter.java:378)
   [junit4]   2> 	at org.apache.solr.servlet.SolrDispatchFilter.doFilter(SolrDispatchFilter.java:322)
   [junit4]   2> 	at org.eclipse.jetty.servlet.ServletHandler$CachedChain.doFilter(ServletHandler.java:1699)
   [junit4]   2> 	at org.apache.solr.client.solrj.embedded.JettySolrRunner$DebugFilter.doFilter(JettySolrRunner.java:139)
   [junit4]   2> 	at org.eclipse.jetty.servlet.ServletHandler$CachedChain.doFilter(ServletHandler.java:1699)
   [junit4]   2> 	at org.eclipse.jetty.servlet.ServletHandler.doHandle(ServletHandler.java:582)
   [junit4]   2> 	at org.eclipse.jetty.server.session.SessionHandler.doHandle(SessionHandler.java:224)
   [junit4]   2> 	at org.eclipse.jetty.server.handler.ContextHandler.doHandle(ContextHandler.java:1180)
   [junit4]   2> 	at org.eclipse.jetty.servlet.ServletHandler.doScope(ServletHandler.java:512)
   [junit4]   2> 	at org.eclipse.jetty.server.session.SessionHandler.doScope(SessionHandler.java:185)
   [junit4]   2> 	at org.eclipse.jetty.server.handler.ContextHandler.doScope(ContextHandler.java:1112)
   [junit4]   2> 	at org.eclipse.jetty.server.handler.ScopedHandler.handle(ScopedHandler.java:141)
   [junit4]   2> 	at org.eclipse.jetty.server.handler.gzip.GzipHandler.handle(GzipHandler.java:395)
   [junit4]   2> 	at org.eclipse.jetty.server.handler.HandlerWrapper.handle(HandlerWrapper.java:134)
   [junit4]   2> 	at org.eclipse.jetty.server.Server.handle(Server.java:534)
   [junit4]   2> 	at org.eclipse.jetty.server.HttpChannel.handle(HttpChannel.java:320)
   [junit4]   2> 	at org.eclipse.jetty.server.HttpConnection.onFillable(HttpConnection.java:251)
   [junit4]   2> 	at org.eclipse.jetty.io.AbstractConnection$ReadCallback.succeeded(AbstractConnection.java:273)
   [junit4]   2> 	at org.eclipse.jetty.io.FillInterest.fillable(FillInterest.java:95)
   [junit4]   2> 	at org.eclipse.jetty.io.SelectChannelEndPoint$2.run(SelectChannelEndPoint.java:93)
   [junit4]   2> 	at org.eclipse.jetty.util.thread.strategy.ExecuteProduceConsume.executeProduceConsume(ExecuteProduceConsume.java:303)
   [junit4]   2> 	at org.eclipse.jetty.util.thread.strategy.ExecuteProduceConsume.produceConsume(ExecuteProduceConsume.java:148)
   [junit4]   2> 	at org.eclipse.jetty.util.thread.strategy.ExecuteProduceConsume.run(ExecuteProduceConsume.java:136)
   [junit4]   2> 	at org.eclipse.jetty.util.thread.QueuedThreadPool.runJob(QueuedThreadPool.java:671)
   [junit4]   2> 	at org.eclipse.jetty.util.thread.QueuedThreadPool$2.run(QueuedThreadPool.java:589)
   [junit4]   2> 	at java.lang.Thread.run(Thread.java:748)
   [junit4]   1> {event=newSearcher}
   [junit4]   2> java.lang.RuntimeException
   [junit4]   2> 	at org.apache.solr.cloud.TestCloudSearcherWarming$SleepingSolrEventListener.init(TestCloudSearcherWarming.java:306)
   [junit4]   2> 	at org.apache.solr.core.SolrCore.createInitInstance(SolrCore.java:826)
   [junit4]   2> 	at org.apache.solr.handler.SolrConfigHandler$Command.verifyClass(SolrConfigHandler.java:562)
   [junit4]   2> 	at org.apache.solr.handler.SolrConfigHandler$Command.updateNamedPlugin(SolrConfigHandler.java:533)
   [junit4]   2> 	at org.apache.solr.handler.SolrConfigHandler$Command.handleCommands(SolrConfigHandler.java:482)
   [junit4]   2> 	at org.apache.solr.handler.SolrConfigHandler$Command.handlePOST(SolrConfigHandler.java:346)
   [junit4]   2> 	at org.apache.solr.handler.SolrConfigHandler$Command.access$100(SolrConfigHandler.java:159)
   [junit4]   2> 	at org.apache.solr.handler.SolrConfigHandler.handleRequestBody(SolrConfigHandler.java:137)
   [junit4]   2> 	at org.apache.solr.handler.RequestHandlerBase.handleRequest(RequestHandlerBase.java:177)
   [junit4]   2> 	at org.apache.solr.core.SolrCore.execute(SolrCore.java:2482)
   [junit4]   2> 	at org.apache.solr.servlet.HttpSolrCall.execute(HttpSolrCall.java:720)
   [junit4]   2> 	at org.apache.solr.servlet.HttpSolrCall.call(HttpSolrCall.java:526)
   [junit4]   2> 	at org.apache.solr.servlet.SolrDispatchFilter.doFilter(SolrDispatchFilter.java:378)
   [junit4]   2> 	at org.apache.solr.servlet.SolrDispatchFilter.doFilter(SolrDispatchFilter.java:322)
   [junit4]   2> 	at org.eclipse.jetty.servlet.ServletHandler$CachedChain.doFilter(ServletHandler.java:1699)
   [junit4]   2> 	at org.apache.solr.client.solrj.embedded.JettySolrRunner$DebugFilter.doFilter(JettySolrRunner.java:139)
   [junit4]   2> 	at org.eclipse.jetty.servlet.ServletHandler$CachedChain.doFilter(ServletHandler.java:1699)
   [junit4]   2> 	at org.eclipse.jetty.servlet.ServletHandler.doHandle(ServletHandler.java:582)
   [junit4]   2> 	at org.eclipse.jetty.server.session.SessionHandler.doHandle(SessionHandler.java:224)
   [junit4]   2> 	at org.eclipse.jetty.server.handler.ContextHandler.doHandle(ContextHandler.java:1180)
   [junit4]   2> 	at org.eclipse.jetty.servlet.ServletHandler.doScope(ServletHandler.java:512)
   [junit4]   2> 	at org.eclipse.jetty.server.session.SessionHandler.doScope(SessionHandler.java:185)
   [junit4]   2> 	at org.eclipse.jetty.server.handler.ContextHandler.doScope(ContextHandler.java:1112)
   [junit4]   2> 	at org.eclipse.jetty.server.handler.ScopedHandler.handle(ScopedHandler.java:141)
   [junit4]   2> 	at org.eclipse.jetty.server.handler.gzip.GzipHandler.handle(GzipHandler.java:395)
   [junit4]   2> 	at org.eclipse.jetty.server.handler.HandlerWrapper.handle(HandlerWrapper.java:134)
   [junit4]   2> 	at org.eclipse.jetty.server.Server.handle(Server.java:534)
   [junit4]   2> 	at org.eclipse.jetty.server.HttpChannel.handle(HttpChannel.java:320)
   [junit4]   2> 	at org.eclipse.jetty.server.HttpConnection.onFillable(HttpConnection.java:251)
   [junit4]   2> 	at org.eclipse.jetty.io.AbstractConnection$ReadCallback.succeeded(AbstractConnection.java:273)
   [junit4]   2> 	at org.eclipse.jetty.io.FillInterest.fillable(FillInterest.java:95)
   [junit4]   2> 	at org.eclipse.jetty.io.SelectChannelEndPoint$2.run(SelectChannelEndPoint.java:93)
   [junit4]   2> 	at org.eclipse.jetty.util.thread.strategy.ExecuteProduceConsume.executeProduceConsume(ExecuteProduceConsume.java:303)
   [junit4]   2> 	at org.eclipse.jetty.util.thread.strategy.ExecuteProduceConsume.produceConsume(ExecuteProduceConsume.java:148)
   [junit4]   2> 	at org.eclipse.jetty.util.thread.strategy.ExecuteProduceConsume.run(ExecuteProduceConsume.java:136)
   [junit4]   2> 	at org.eclipse.jetty.util.thread.QueuedThreadPool.runJob(QueuedThreadPool.java:671)
   [junit4]   2> 	at org.eclipse.jetty.util.thread.QueuedThreadPool$2.run(QueuedThreadPool.java:589)
   [junit4]   2> 	at java.lang.Thread.run(Thread.java:748)
   [junit4]   1> {event=firstSearcher}
   [junit4]   2> 247754 INFO  (qtp183313701-1613) [n:127.0.0.1:56327_solr c:testRepFactor1LeaderStartup s:shard1 r:core_node2 x:testRepFactor1LeaderStartup_shard1_replica_n1] o.a.s.h.SolrConfigHandler Executed config commands successfully and persisted to ZK [{"add-listener":{
   [junit4]   2>     "name":"newSearcherListener",
   [junit4]   2>     "event":"newSearcher",
   [junit4]   2>     "class":"org.apache.solr.cloud.TestCloudSearcherWarming$SleepingSolrEventListener"}}, {"add-listener":{
   [junit4]   2>     "name":"firstSearcherListener",
   [junit4]   2>     "event":"firstSearcher",
   [junit4]   2>     "class":"org.apache.solr.cloud.TestCloudSearcherWarming$SleepingSolrEventListener"}}]
   [junit4]   2> 247763 INFO  (qtp183313701-1613) [n:127.0.0.1:56327_solr c:testRepFactor1LeaderStartup s:shard1 r:core_node2 x:testRepFactor1LeaderStartup_shard1_replica_n1] o.a.s.h.SolrConfigHandler Waiting up to 30 secs for 1 replicas to set the property overlay to be of version 0 for collection testRepFactor1LeaderStartup
   [junit4]   2> 247764 INFO  (Thread-449) [n:127.0.0.1:56327_solr    ] o.a.s.c.SolrCore config update listener called for core testRepFactor1LeaderStartup_shard1_replica_n1
   [junit4]   2> 247766 INFO  (solrHandlerExecutor-787-thread-1-processing-n:127.0.0.1:56327_solr x:testRepFactor1LeaderStartup_shard1_replica_n1 s:shard1 c:testRepFactor1LeaderStartup r:core_node2) [n:127.0.0.1:56327_solr c:testRepFactor1LeaderStartup s:shard1 r:core_node2 x:testRepFactor1LeaderStartup_shard1_replica_n1] o.a.s.h.SolrConfigHandler Time elapsed : 0 secs, maxWait 30
   [junit4]   2> 247768 INFO  (Thread-449) [n:127.0.0.1:56327_solr    ] o.a.s.c.SolrCore core reload testRepFactor1LeaderStartup_shard1_replica_n1
   [junit4]   2> 247780 INFO  (Thread-449) [n:127.0.0.1:56327_solr    ] o.a.s.c.RequestParams conf resource params.json loaded . version : 0 
   [junit4]   2> 247780 INFO  (Thread-449) [n:127.0.0.1:56327_solr    ] o.a.s.c.RequestParams request params refreshed to version 0
   [junit4]   2> 247781 WARN  (Thread-449) [n:127.0.0.1:56327_solr    ] o.a.s.c.SolrConfig Couldn't add files from /export/home/jenkins/workspace/Lucene-Solr-7.x-Solaris/solr/build/solr-core/test/J1/temp/solr.cloud.TestCloudSearcherWarming_ABADFD3F221670C6-001/tempDir-001/node1/testRepFactor1LeaderStartup_shard1_replica_n1/../../../../contrib/extraction/lib filtered by .*\.jar to classpath: /export/home/jenkins/workspace/Lucene-Solr-7.x-Solaris/solr/build/solr-core/test/J1/temp/solr.cloud.TestCloudSearcherWarming_ABADFD3F221670C6-001/tempDir-001/node1/testRepFactor1LeaderStartup_shard1_replica_n1/../../../../contrib/extraction/lib
   [junit4]   2> 247781 WARN  (Thread-449) [n:127.0.0.1:56327_solr    ] o.a.s.c.SolrConfig Couldn't add files from /export/home/jenkins/workspace/Lucene-Solr-7.x-Solaris/solr/build/solr-core/test/J1/temp/solr.cloud.TestCloudSearcherWarming_ABADFD3F221670C6-001/tempDir-001/node1/testRepFactor1LeaderStartup_shard1_replica_n1/../../../../dist filtered by solr-cell-\d.*\.jar to classpath: /export/home/jenkins/workspace/Lucene-Solr-7.x-Solaris/solr/build/solr-core/test/J1/temp/solr.cloud.TestCloudSearcherWarming_ABADFD3F221670C6-001/tempDir-001/node1/testRepFactor1LeaderStartup_shard1_replica_n1/../../../../dist
   [junit4]   2> 247781 WARN  (Thread-449) [n:127.0.0.1:56327_solr    ] o.a.s.c.SolrConfig Couldn't add files from /export/home/jenkins/workspace/Lucene-Solr-7.x-Solaris/solr/build/solr-core/test/J1/temp/solr.cloud.TestCloudSearcherWarming_ABADFD3F221670C6-001/tempDir-001/node1/testRepFactor1LeaderStartup_shard1_replica_n1/../../../../contrib/clustering/lib filtered by .*\.jar to classpath: /export/home/jenkins/workspace/Lucene-Solr-7.x-Solaris/solr/build/solr-core/test/J1/temp/solr.cloud.TestCloudSearcherWarming_ABADFD3F221670C6-001/tempDir-001/node1/testRepFactor1LeaderStartup_shard1_replica_n1/../../../../contrib/clustering/lib
   [junit4]   2> 247781 WARN  (Thread-449) [n:127.0.0.1:56327_solr    ] o.a.s.c.SolrConfig Couldn't add files from /export/home/jenkins/workspace/Lucene-Solr-7.x-Solaris/solr/build/solr-core/test/J1/temp/solr.cloud.TestCloudSearcherWarming_ABADFD3F221670C6-001/tempDir-001/node1/testRepFactor1LeaderStartup_shard1_replica_n1/../../../../dist filtered by solr-clustering-\d.*\.jar to classpath: /export/home/jenkins/workspace/Lucene-Solr-7.x-Solaris/solr/build/solr-core/test/J1/temp/solr.cloud.TestCloudSearcherWarming_ABADFD3F221670C6-001/tempDir-001/node1/testRepFactor1LeaderStartup_shard1_replica_n1/../../../../dist
   [junit4]   2> 247782 WARN  (Thread-449) [n:127.0.0.1:56327_solr    ] o.a.s.c.SolrConfig Couldn't add files from /export/home/jenkins/workspace/Lucene-Solr-7.x-Solaris/solr/build/solr-core/test/J1/temp/solr.cloud.TestCloudSearcherWarming_ABADFD3F221670C6-001/tempDir-001/node1/testRepFactor1LeaderStartup_shard1_replica_n1/../../../../contrib/langid/lib filtered by .*\.jar to classpath: /export/home/jenkins/workspace/Lucene-Solr-7.x-Solaris/solr/build/solr-core/test/J1/temp/solr.cloud.TestCloudSearcherWarming_ABADFD3F221670C6-001/tempDir-001/node1/testRepFactor1LeaderStartup_shard1_replica_n1/../../../../contrib/langid/lib
   [junit4]   2> 247782 WARN  (Thread-449) [n:127.0.0.1:56327_solr    ] o.a.s.c.SolrConfig Couldn't add files from /export/home/jenkins/workspace/Lucene-Solr-7.x-Solaris/solr/build/solr-core/test/J1/temp/solr.cloud.TestCloudSearcherWarming_ABADFD3F221670C6-001/tempDir-001/node1/testRepFactor1LeaderStartup_shard1_replica_n1/../../../../dist filtered by solr-langid-\d.*\.jar to classpath: /export/home/jenkins/workspace/Lucene-Solr-7.x-Solaris/solr/build/solr-core/test/J1/temp/solr.cloud.TestCloudSearcherWarming_ABADFD3F221670C6-001/tempDir-001/node1/testRepFactor1LeaderStartup_shard1_replica_n1/../../../../dist
   [junit4]   2> 247782 WARN  (Thread-449) [n:127.0.0.1:56327_solr    ] o.a.s.c.SolrConfig Couldn't add files from /export/home/jenkins/workspace/Lucene-Solr-7.x-Solaris/solr/build/solr-core/test/J1/temp/solr.cloud.TestCloudSearcherWarming_ABADFD3F221670C6-001/tempDir-001/node1/testRepFactor1LeaderStartup_shard1_replica_n1/../../../../contrib/velocity/lib filtered by .*\.jar to classpath: /export/home/jenkins/workspace/Lucene-Solr-7.x-Solaris/solr/build/solr-core/test/J1/temp/solr.cloud.TestCloudSearcherWarming_ABADFD3F221670C6-001/tempDir-001/node1/testRepFactor1LeaderStartup_shard1_replica_n1/../../../../contrib/velocity/lib
   [junit4]   2> 247782 WARN  (Thread-449) [n:127.0.0.1:56327_solr    ] o.a.s.c.SolrConfig Couldn't add files from /export/home/jenkins/workspace/Lucene-Solr-7.x-Solaris/solr/build/solr-core/test/J1/temp/solr.cloud.TestCloudSearcherWarming_ABADFD3F221670C6-001/tempDir-001/node1/testRepFactor1LeaderStartup_shard1_replica_n1/../../../../dist filtered by solr-velocity-\d.*\.jar to classpath: /export/home/jenkins/workspace/Lucene-Solr-7.x-Solaris/solr/build/solr-core/test/J1/temp/solr.cloud.TestCloudSearcherWarming_ABADFD3F221670C6-001/tempDir-001/node1/testRepFactor1LeaderStartup_shard1_replica_n1/../../../../dist
   [junit4]   2> 247812 INFO  (Thread-449) [n:127.0.0.1:56327_solr    ] o.a.s.c.SolrConfig Using Lucene MatchVersion: 7.1.0
   [junit4]   2> 247831 INFO  (Thread-449) [n:127.0.0.1:56327_solr    ] o.a.s.s.IndexSchema [testRepFactor1LeaderStartup_shard1_replica_n1] Schema name=default-config
   [junit4]   2> 247871 INFO  (qtp183313701-1617) [n:127.0.0.1:56327_solr c:testRepFactor1LeaderStartup s:shard1 r:core_node2 x:testRepFactor1LeaderStartup_shard1_replica_n1] o.a.s.h.SolrConfigHandler expecting overlay version 0 but my version is -1
   [junit4]   2> 247872 INFO  (qtp183313701-1617) [n:127.0.0.1:56327_solr c:testRepFactor1LeaderStartup s:shard1 r:core_node2 x:testRepFactor1LeaderStartup_shard1_replica_n1] o.a.s.c.S.Request [testRepFactor1LeaderStartup_shard1_replica_n1]  webapp=/solr path=/config/znodeVersion params={overlay=0&wt=javabin&version=2} status=0 QTime=3
   [junit4]   2> 247872 INFO  (SolrConfigHandler-refreshconf) [n:127.0.0.1:56327_solr c:testRepFactor1LeaderStartup s:shard1 r:core_node2 x:testRepFactor1LeaderStartup_shard1_replica_n1] o.a.s.h.SolrConfigHandler Another reload is in progress . Not doing anything
   [junit4]   2> 247873 INFO  (solrHandlerExecutor-787-thread-1-processing-n:127.0.0.1:56327_solr x:testRepFactor1LeaderStartup_shard1_replica_n1 s:shard1 c:testRepFactor1LeaderStartup r:core_node2) [n:127.0.0.1:56327_solr c:testRepFactor1LeaderStartup s:shard1 r:core_node2 x:testRepFactor1LeaderStartup_shard1_replica_n1] o.a.s.h.SolrConfigHandler Could not get expectedVersion 0 from http://127.0.0.1:56327/solr/testRepFactor1LeaderStartup_shard1_replica_n1/ for prop overlay   after 1 attempts
   [junit4]   2> 247873 INFO  (solrHandlerExecutor-787-thread-1-processing-n:127.0.0.1:56327_solr x:testRepFactor1LeaderStartup_shard1_replica_n1 s:shard1 c:testRepFactor1LeaderStartup r:core_node2) [n:127.0.0.1:56327_solr c:testRepFactor1LeaderStartup s:shard1 r:core_node2 x:testRepFactor1LeaderStartup_shard1_replica_n1] o.a.s.h.SolrConfigHandler Time elapsed : 0 secs, maxWait 30
   [junit4]   2> 248004 INFO  (qtp183313701-1618) [n:127.0.0.1:56327_solr c:testRepFactor1LeaderStartup s:shard1 r:core_node2 x:testRepFactor1LeaderStartup_shard1_replica_n1] o.a.s.h.SolrConfigHandler expecting overlay version 0 but my version is -1
   [junit4]   2> 248005 INFO  (qtp183313701-1618) [n:127.0.0.1:56327_solr c:testRepFactor1LeaderStartup s:shard1 r:core_node2 x:testRepFactor1LeaderStartup_shard1_replica_n1] o.a.s.c.S.Request [testRepFactor1LeaderStartup_shard1_replica_n1]  webapp=/solr path=/config/znodeVersion params={overlay=0&wt=javabin&version=2} status=0 QTime=0
   [junit4]   2> 248005 INFO  (SolrConfigHandler-refreshconf) [n:127.0.0.1:56327_solr c:testRepFactor1LeaderStartup s:shard1 r:core_node2 x:testRepFactor1LeaderStartup_shard1_replica_n1] o.a.s.h.SolrConfigHandler Another reload is in progress . Not doing anything
   [junit4]   2> 248005 INFO  (solrHandlerExecutor-787-thread-1-processing-n:127.0.0.1:56327_solr x:testRepFactor1LeaderStartup_shard1_replica_n1 s:shard1 c:testRepFactor1LeaderStartup r:core_node2) [n:127.0.0.1:56327_solr c:testRepFactor1LeaderStartup s:shard1 r:core_node2 x:testRepFactor1LeaderStartup_shard1_replica_n1] o.a.s.h.SolrConfigHandler Could not get expectedVersion 0 from http://127.0.0.1:56327/solr/testRepFactor1LeaderStartup_shard1_replica_n1/ for prop overlay   after 2 attempts
   [junit4]   2> 248005 INFO  (solrHandlerExecutor-787-thread-1-processing-n:127.0.0.1:56327_solr x:testRepFactor1LeaderStartup_shard1_replica_n1 s:shard1 c:testRepFactor1LeaderStartup r:core_node2) [n:127.0.0.1:56327_solr c:testRepFactor1LeaderStartup s:shard1 r:core_node2 x:testRepFactor1LeaderStartup_shard1_replica_n1] o.a.s.h.SolrConfigHandler Time elapsed : 0 secs, maxWait 30
   [junit4]   2> 248106 INFO  (qtp183313701-1614) [n:127.0.0.1:56327_solr c:testRepFactor1LeaderStartup s:shard1 r:core_node2 x:testRepFactor1LeaderStartup_shard1_replica_n1] o.a.s.h.SolrConfigHandler expecting overlay version 0 but my version is -1
   [junit4]   2> 248106 INFO  (qtp183313701-1614) [n:127.0.0.1:56327_solr c:testRepFactor1LeaderStartup s:shard1 r:core_node2 x:testRepFactor1LeaderStartup_shard1_replica_n1] o.a.s.c.S.Request [testRepFactor1LeaderStartup_shard1_replica_n1]  webapp=/solr path=/config/znodeVersion params={overlay=0&wt=javabin&version=2} status=0 QTime=0
   [junit4]   2> 248106 INFO  (SolrConfigHandler-refreshconf) [n:127.0.0.1:56327_solr c:testRepFactor1LeaderStartup s:shard1 r:core_node2 x:testRepFactor1LeaderStartup_shard1_replica_n1] o.a.s.h.SolrConfigHandler Another reload is in progress . Not doing anything
   [junit4]   2> 248107 INFO  (solrHandlerExecutor-787-thread-1-processing-n:127.0.0.1:56327_solr x:testRepFactor1LeaderStartup_shard1_replica_n1 s:shard1 c:testRepFactor1LeaderStartup r:core_node2) [n:127.0.0.1:56327_solr c:testRepFactor1LeaderStartup s:shard1 r:core_node2 x:testRepFactor1LeaderStartup_shard1_replica_n1] o.a.s.h.SolrConfigHandler Could not get expectedVersion 0 from http://127.0.0.1:56327/solr/testRepFactor1LeaderStartup_shard1_replica_n1/ for prop overlay   after 3 attempts
   [junit4]   2> 248107 INFO  (solrHandlerExecutor-787-thread-1-processing-n:127.0.0.1:56327_solr x:testRepFactor1LeaderStartup_shard1_replica_n1 s:shard1 c:testRepFactor1LeaderStartup r:core_node2) [n:127.0.0.1:56327_solr c:testRepFactor1LeaderStartup s:shard1 r:core_node2 x:testRepFactor1LeaderStartup_shard1_replica_n1] o.a.s.h.SolrConfigHandler Time elapsed : 0 secs, maxWait 30
   [junit4]   2> 248110 INFO  (Thread-449) [n:127.0.0.1:56327_solr    ] o.a.s.s.IndexSchema Loaded schema default-config/1.6 with uniqueid field id
   [junit4]   2> 248210 INFO  (qtp183313701-1620) [n:127.0.0.1:56327_solr c:testRepFactor1LeaderStartup s:shard1 r:core_node2 x:testRepFactor1LeaderStartup_shard1_replica_n1] o.a.s.h.SolrConfigHandler expecting overlay version 0 but my version is -1
   [junit4]   2> 248210 INFO  (qtp183313701-1620) [n:127.0.0.1:56327_solr c:testRepFactor1LeaderStartup s:shard1 r:core_node2 x:testRepFactor1LeaderStartup_shard1_replica_n1] o.a.s.c.S.Request [testRepFactor1LeaderStartup_shard1_replica_n1]  webapp=/solr path=/config/znodeVersion params={overlay=0&wt=javabin&version=2} status=0 QTime=0
   [junit4]   2> 248210 INFO  (SolrConfigHandler-refreshconf) [n:127.0.0.1:56327_solr c:testRepFactor1LeaderStartup s:shard1 r:core_node2 x:testRepFactor1LeaderStartup_shard1_replica_n1] o.a.s.h.SolrConfigHandler Another reload is in progress . Not doing anything
   [junit4]   2> 248210 INFO  (solrHandlerExecutor-787-thread-1-processing-n:127.0.0.1:56327_solr x:testRepFactor1LeaderStartup_shard1_replica_n1 s:shard1 c:testRepFactor1LeaderStartup r:core_node2) [n:127.0.0.1:56327_solr c:testRepFactor1LeaderStartup s:shard1 r:core_node2 x:testRepFactor1LeaderStartup_shard1_replica_n1] o.a.s.h.SolrConfigHandler Could not get expectedVersion 0 from http://127.0.0.1:56327/solr/testRepFactor1LeaderStartup_shard1_replica_n1/ for prop overlay   after 4 attempts
   [junit4]   2> 248210 INFO  (solrHandlerExecutor-787-thread-1-processing-n:127.0.0.1:56327_solr x:testRepFactor1LeaderStartup_shard1_replica_n1 s:shard1 c:testRepFactor1LeaderStartup r:core_node2) [n:127.0.0.1:56327_solr c:testRepFactor1LeaderStartup s:shard1 r:core_node2 x:testRepFactor1LeaderStartup_shard1_replica_n1] o.a.s.h.SolrConfigHandler Time elapsed : 0 secs, maxWait 30
   [junit4]   2> 248255 INFO  (Thread-449) [n:127.0.0.1:56327_solr    ] o.a.s.c.CoreContainer Reloading SolrCore 'testRepFactor1LeaderStartup_shard1_replica_n1' using configuration from collection testRepFactor1LeaderStartup
   [junit4]   2> 248268 INFO  (Thread-449) [n:127.0.0.1:56327_solr c:testRepFactor1LeaderStartup s:shard1 r:core_node2 x:testRepFactor1LeaderStartup_shard1_replica_n1] o.a.s.m.r.SolrJmxReporter JMX monitoring for 'solr_56327.solr.core.testRepFactor1LeaderStartup.shard1.replica_n1' (registry 'solr.core.testRepFactor1LeaderStartup.shard1.replica_n1') enabled at server: com.sun.jmx.mbeanserver.JmxMBeanServer@3e1ec772
   [junit4]   2> 248268 INFO  (Thread-449) [n:127.0.0.1:56327_solr c:testRepFactor1LeaderStartup s:shard1 r:core_node2 x:testRepFactor1LeaderStartup_shard1_replica_n1] o.a.s.c.SolrCore [[testRepFactor1LeaderStartup_shard1_replica_n1] ] Opening new SolrCore at [/export/home/jenkins/workspace/Lucene-Solr-7.x-Solaris/solr/build/solr-core/test/J1/temp/solr.cloud.TestCloudSearcherWarming_ABADFD3F221670C6-001/tempDir-001/node1/testRepFactor1LeaderStartup_shard1_replica_n1], dataDir=[/export/home/jenkins/workspace/Lucene-Solr-7.x-Solaris/solr/build/solr-core/test/J1/temp/solr.cloud.TestCloudSearcherWarming_ABADFD3F221670C6-001/tempDir-001/node1/./testRepFactor1LeaderStartup_shard1_replica_n1/data/]
   [junit4]   2> java.lang.RuntimeException
   [junit4]   2> 	at org.apache.solr.cloud.TestCloudSearcherWarming$SleepingSolrEventListener.init(TestCloudSearcherWarming.java:306)
   [junit4]   2> 	at org.apache.solr.core.SolrCore.createInitInstance(SolrCore.java:826)
   [junit4]   2> 	at org.apache.solr.core.SolrCore.initListeners(SolrCore.java:573)
   [junit4]   2> 	at org.apache.solr.core.SolrCore.<init>(SolrCore.java:926)
   [junit4]   2> 	at org.apache.solr.core.SolrCore.reload(SolrCore.java:636)
   [junit4]   2> 	at org.apache.solr.core.CoreContainer.reload(CoreContainer.java:1231)
   [junit4]   2> 	at org.apache.solr.core.SolrCore.lambda$getConfListener$20(SolrCore.java:2948)
   [junit4]   2> 	at org.apache.solr.cloud.ZkController.lambda$fireEventListeners$4(ZkController.java:2434)
   [junit4]   2> 	at java.lang.Thread.run(Thread.java:748)
   [junit4]   1> {event=newSearcher}
   [junit4]   2> java.lang.RuntimeException
   [junit4]   2> 	at org.apache.solr.cloud.TestCloudSearcherWarming$SleepingSolrEventListener.init(TestCloudSearcherWarming.java:306)
   [junit4]   2> 	at org.apache.solr.core.SolrCore.createInitInstance(SolrCore.java:826)
   [junit4]   2> 	at org.apache.solr.core.SolrCore.initListeners(SolrCore.java:569)
   [junit4]   2> 	at org.apache.solr.core.SolrCore.<init>(SolrCore.java:926)
   [junit4]   2> 	at org.apache.solr.core.SolrCore.reload(SolrCore.java:636)
   [junit4]   2> 	at org.apache.solr.core.CoreContainer.reload(CoreContainer.java:1231)
   [junit4]   2> 	at org.apache.solr.core.SolrCore.lambda$getConfListener$20(SolrCore.java:2948)
   [junit4]   2> 	at org.apache.solr.cloud.ZkController.lambda$fireEventListeners$4(ZkController.java:2434)
   [junit4]   2> 	at java.lang.Thread.run(Thread.java:748)
   [junit4]   1> {event=firstSearcher}
   [junit4]   2> 248274 INFO  (Thread-449) [n:127.0.0.1:56327_solr c:testRepFactor1LeaderStartup s:shard1 r:core_node2 x:testRepFactor1LeaderStartup_shard1_replica_n1] o.a.s.r.XSLTResponseWriter xsltCacheLifetimeSeconds=5
   [junit4]   2> 248331 INFO  (qtp183313701-1620) [n:127.0.0.1:56327_solr c:testRepFactor1LeaderStartup s:shard1 r:core_node2 x:testRepFactor1LeaderStartup_shard1_replica_n1] o.a.s.h.SolrConfigHandler expecting overlay version 0 but my version is -1
   [junit4]   2> 248332 INFO  (qtp183313701-1620) [n:127.0.0.1:56327_solr c:testRepFactor1LeaderStartup s:shard1 r:core_node2 x:testRepFactor1LeaderStartup_shard1_replica_n1] o.a.s.c.S.Request [testRepFactor1LeaderStartup_shard1_replica_n1]  webapp=/solr path=/config/znodeVersion params={overlay=0&wt=javabin&version=2} status=0 QTime=16
   [junit4]   2> 248332 INFO  (SolrConfigHandler-refreshconf) [n:127.0.0.1:56327_solr c:testRepFactor1LeaderStartup s:shard1 r:core_node2 x:testRepFactor1LeaderStartup_shard1_replica_n1] o.a.s.h.SolrConfigHandler Another reload is in progress . Not doing anything
   [junit4]   2> 248332 INFO  (solrHandlerExecutor-787-thread-1-processing-n:127.0.0.1:56327_solr x:testRepFactor1LeaderStartup_shard1_replica_n1 s:shard1 c:testRepFactor1LeaderStartup r:core_node2) [n:127.0.0.1:56327_solr c:testRepFactor1LeaderStartup s:shard1 r:core_node2 x:testRepFactor1LeaderStartup_shard1_replica_n1] o.a.s.h.SolrConfigHandler Could not get expectedVersion 0 from http://127.0.0.1:56327/solr/testRepFactor1LeaderStartup_shard1_replica_n1/ for prop overlay   after 5 attempts
   [junit4]   2> 248332 INFO  (solrHandlerExecutor-787-thread-1-processing-n:127.0.0.1:56327_solr x:testRepFactor1LeaderStartup_shard1_replica_n1 s:shard1 c:testRepFactor1LeaderStartup r:core_node2) [n:127.0.0.1:56327_solr c:testRepFactor1LeaderStartup s:shard1 r:core_node2 x:testRepFactor1LeaderStartup_shard1_replica_n1] o.a.s.h.SolrConfigHandler Time elapsed : 0 secs, maxWait 30
   [junit4]   2> 248340 INFO  (Thread-449) [n:127.0.0.1:56327_solr c:testRepFactor1LeaderStartup s:shard1 r:core_node2 x:testRepFactor1LeaderStartup_shard1_replica_n1] o.a.s.u.CommitTracker Hard AutoCommit: if uncommited for 15000ms; 
   [junit4]   2> 248341 INFO  (Thread-449) [n:127.0.0.1:56327_solr c:testRepFactor1LeaderStartup s:shard1 r:core_node2 x:testRepFactor1LeaderStartup_shard1_replica_n1] o.a.s.u.CommitTracker Soft AutoCommit: disabled
   [junit4]   2> 248365 INFO  (Thread-449) [n:127.0.0.1:56327_solr c:testRepFactor1LeaderStartup s:shard1 r:core_node2 x:testRepFactor1LeaderStartup_shard1_replica_n1] o.a.s.s.SolrIndexSearcher Opening [Searcher@4647bd52[testRepFactor1LeaderStartup_shard1_replica_n1] main]
   [junit4]   2> 248366 INFO  (Thread-449) [n:127.0.0.1:56327_solr c:testRepFactor1LeaderStartup s:shard1 r:core_node2 x:testRepFactor1LeaderStartup_shard1_replica_n1] o.a.s.r.ManagedResourceStorage Configured ZooKeeperStorageIO with znodeBase: /configs/testRepFactor1LeaderStartup
   [junit4]   2> 248371 INFO  (Thread-449) [n:127.0.0.1:56327_solr c:testRepFactor1LeaderStartup s:shard1 r:core_node2 x:testRepFactor1LeaderStartup_shard1_replica_n1] o.a.s.r.ManagedResourceStorage Loaded null at path _rest_managed.json using ZooKeeperStorageIO:path=/configs/testRepFactor1LeaderStartup
   [junit4]   2> 248371 INFO  (Thread-449) [n:127.0.0.1:56327_solr c:testRepFactor1LeaderStartup s:shard1 r:core_node2 x:testRepFactor1LeaderStartup_shard1_replica_n1] o.a.s.s.ZkIndexSchemaReader Creating ZooKeeper watch for the managed schema at /configs/testRepFactor1LeaderStartup/managed-schema
   [junit4]   2> 248373 INFO  (Thread-449) [n:127.0.0.1:56327_solr c:testRepFactor1LeaderStartup s:shard1 r:core_node2 x:testRepFactor1LeaderStartup_shard1_replica_n1] o.a.s.s.ZkIndexSchemaReader 

[...truncated too long message...]

5_eqch%2Fgp) [n:127.0.0.1:63865_eqch%2Fgp c:collection1 s:shard2 r:core_node46 x:collection1_shard2_replica_t45] o.a.s.c.SolrCore [collection1_shard2_replica_t45]  CLOSING SolrCore org.apache.solr.core.SolrCore@71475874
   [junit4]   2> 2086729 INFO  (zkCallback-2924-thread-3-processing-n:127.0.0.1:63865_eqch%2Fgp) [n:127.0.0.1:63865_eqch%2Fgp c:collection1 s:shard2 r:core_node46 x:collection1_shard2_replica_t45] o.a.s.m.SolrMetricManager Closing metric reporters for registry=solr.core.collection1.shard2.replica_t45, tag=1900501108
   [junit4]   2> 2086732 INFO  (zkCallback-2924-thread-3-processing-n:127.0.0.1:63865_eqch%2Fgp) [n:127.0.0.1:63865_eqch%2Fgp c:collection1 s:shard2 r:core_node46 x:collection1_shard2_replica_t45] o.a.s.m.SolrMetricManager Closing metric reporters for registry=solr.collection.collection1.shard2.leader, tag=1900501108
   [junit4]   2> 2086733 INFO  (TEST-ForceLeaderTest.testReplicasInLIRNoLeader-seed#[ABADFD3F221670C6]) [    ] o.e.j.s.AbstractConnector Stopped ServerConnector@471defdb{HTTP/1.1,[http/1.1]}{127.0.0.1:0}
   [junit4]   2> 2086733 INFO  (TEST-ForceLeaderTest.testReplicasInLIRNoLeader-seed#[ABADFD3F221670C6]) [    ] o.e.j.s.h.ContextHandler Stopped o.e.j.s.ServletContextHandler@2e8a8baa{/eqch/gp,null,UNAVAILABLE}
   [junit4]   2> 2086735 ERROR (TEST-ForceLeaderTest.testReplicasInLIRNoLeader-seed#[ABADFD3F221670C6]) [    ] o.a.z.s.ZooKeeperServer ZKShutdownHandler is not registered, so ZooKeeper server won't take any action on ERROR or SHUTDOWN server state changes
   [junit4]   2> 2086739 INFO  (TEST-ForceLeaderTest.testReplicasInLIRNoLeader-seed#[ABADFD3F221670C6]) [    ] o.a.s.c.ZkTestServer connecting to 127.0.0.1:49183 49183
   [junit4]   2> 2094481 INFO  (Thread-7751) [    ] o.a.s.c.ZkTestServer connecting to 127.0.0.1:49183 49183
   [junit4]   2> 2094481 WARN  (Thread-7751) [    ] o.a.s.c.ZkTestServer Watch limit violations: 
   [junit4]   2> Maximum concurrent create/delete watches above limit:
   [junit4]   2> 
   [junit4]   2> 	6	/solr/aliases.json
   [junit4]   2> 	4	/solr/security.json
   [junit4]   2> 	4	/solr/configs/conf1
   [junit4]   2> 	3	/solr/collections/forceleader_test_collection/state.json
   [junit4]   2> 	3	/solr/collections/collection1/state.json
   [junit4]   2> 
   [junit4]   2> Maximum concurrent data watches above limit:
   [junit4]   2> 
   [junit4]   2> 	6	/solr/clusterstate.json
   [junit4]   2> 	6	/solr/clusterprops.json
   [junit4]   2> 	2	/solr/overseer_elect/election/98463667994820617-127.0.0.1:43951_eqch%2Fgp-n_0000000001
   [junit4]   2> 
   [junit4]   2> Maximum concurrent children watches above limit:
   [junit4]   2> 
   [junit4]   2> 	6	/solr/live_nodes
   [junit4]   2> 	6	/solr/collections
   [junit4]   2> 	2	/solr/overseer/queue
   [junit4]   2> 	2	/solr/overseer/collection-queue-work
   [junit4]   2> 
   [junit4]   2> 2094485 WARN  (TEST-ForceLeaderTest.testReplicasInLIRNoLeader-seed#[ABADFD3F221670C6]) [    ] o.a.s.c.SocketProxy Closing 2 connections to: http://127.0.0.1:63865/eqch/gp, target: http://127.0.0.1:57619/eqch/gp
   [junit4]   2> 2094485 WARN  (TEST-ForceLeaderTest.testReplicasInLIRNoLeader-seed#[ABADFD3F221670C6]) [    ] o.a.s.c.SocketProxy Closing 4 connections to: http://127.0.0.1:43951/eqch/gp, target: http://127.0.0.1:53321/eqch/gp
   [junit4]   2> 2094486 WARN  (TEST-ForceLeaderTest.testReplicasInLIRNoLeader-seed#[ABADFD3F221670C6]) [    ] o.a.s.c.SocketProxy Closing 11 connections to: http://127.0.0.1:41946/eqch/gp, target: http://127.0.0.1:45830/eqch/gp
   [junit4]   2> 2094486 WARN  (TEST-ForceLeaderTest.testReplicasInLIRNoLeader-seed#[ABADFD3F221670C6]) [    ] o.a.s.c.SocketProxy Closing 0 connections to: http://127.0.0.1:33750/eqch/gp, target: http://127.0.0.1:37729/eqch/gp
   [junit4]   2> NOTE: reproduce with: ant test  -Dtestcase=ForceLeaderTest -Dtests.method=testReplicasInLIRNoLeader -Dtests.seed=ABADFD3F221670C6 -Dtests.slow=true -Dtests.locale=fr-LU -Dtests.timezone=America/Yellowknife -Dtests.asserts=true -Dtests.file.encoding=ISO-8859-1
   [junit4] FAILURE 42.5s J1 | ForceLeaderTest.testReplicasInLIRNoLeader <<<
   [junit4]    > Throwable #1: java.lang.AssertionError: Doc with id=1 not found in http://127.0.0.1:41946/eqch/gp/forceleader_test_collection due to: Path not found: /id; rsp={doc=null}
   [junit4]    > 	at __randomizedtesting.SeedInfo.seed([ABADFD3F221670C6:4D3AC9FF1B9489A7]:0)
   [junit4]    > 	at org.apache.solr.cloud.HttpPartitionTest.assertDocExists(HttpPartitionTest.java:603)
   [junit4]    > 	at org.apache.solr.cloud.HttpPartitionTest.assertDocsExistInAllReplicas(HttpPartitionTest.java:556)
   [junit4]    > 	at org.apache.solr.cloud.ForceLeaderTest.testReplicasInLIRNoLeader(ForceLeaderTest.java:142)
   [junit4]    > 	at org.apache.solr.BaseDistributedSearchTestCase$ShardsRepeatRule$ShardsFixedStatement.callStatement(BaseDistributedSearchTestCase.java:993)
   [junit4]    > 	at org.apache.solr.BaseDistributedSearchTestCase$ShardsRepeatRule$ShardsStatement.evaluate(BaseDistributedSearchTestCase.java:968)
   [junit4]    > 	at java.lang.Thread.run(Thread.java:748)
   [junit4]   2> NOTE: leaving temporary files on disk at: /export/home/jenkins/workspace/Lucene-Solr-7.x-Solaris/solr/build/solr-core/test/J1/temp/solr.cloud.ForceLeaderTest_ABADFD3F221670C6-001
   [junit4]   2> NOTE: test params are: codec=Asserting(Lucene70): {multiDefault=PostingsFormat(name=LuceneFixedGap), a_t=PostingsFormat(name=MockRandom), id=Lucene50(blocksize=128), text=FST50}, docValues:{range_facet_l_dv=DocValuesFormat(name=Lucene70), _version_=DocValuesFormat(name=Direct), range_facet_i_dv=DocValuesFormat(name=Direct), intDvoDefault=DocValuesFormat(name=Lucene70), timestamp=DocValuesFormat(name=Direct)}, maxPointsInLeafNode=497, maxMBSortInHeap=7.751888332061293, sim=RandomSimilarity(queryNorm=false): {}, locale=fr-LU, timezone=America/Yellowknife
   [junit4]   2> NOTE: SunOS 5.11 amd64/Oracle Corporation 1.8.0_141 (64-bit)/cpus=3,threads=1,free=154654160,total=518979584
   [junit4]   2> NOTE: All tests run in this JVM: [TestUseDocValuesAsStored2, TestSha256AuthenticationProvider, SpellCheckCollatorWithCollapseTest, TestElisionMultitermQuery, TestQueryUtils, UpdateRequestProcessorFactoryTest, ChaosMonkeySafeLeaderTest, TestJettySolrRunner, TestFieldCollectionResource, TestPayloadCheckQParserPlugin, SharedFSAutoReplicaFailoverUtilsTest, TestConfig, SmileWriterTest, TestSolrIndexConfig, TestTrieFacet, TestSolrQueryResponse, DocumentBuilderTest, TestClusterStateMutator, TestPrepRecovery, TestSimpleTrackingShardHandler, ChaosMonkeySafeLeaderWithPullReplicasTest, TestExactStatsCache, LeaderElectionIntegrationTest, LoggingHandlerTest, TestCloudSearcherWarming, TestCharFilters, TermVectorComponentTest, MoveReplicaHDFSUlogDirTest, TestCloudJSONFacetJoinDomain, StatsComponentTest, TestSolrConfigHandlerCloud, DeleteNodeTest, TestSchemalessBufferedUpdates, LeaderFailureAfterFreshStartTest, RequestLoggingTest, QueryEqualityTest, TestNumericRangeQuery64, CollectionReloadTest, TestHalfAndHalfDocValues, TestValueSourceCache, TestCloudDeleteByQuery, TestSmileRequest, TestManagedResourceStorage, SpellPossibilityIteratorTest, BadIndexSchemaTest, GraphQueryTest, TestDistribIDF, DistributedFacetExistsSmallTest, CachingDirectoryFactoryTest, DistributedVersionInfoTest, SpellCheckComponentTest, SolrShardReporterTest, TestFreeTextSuggestions, InfixSuggestersTest, TestFilteredDocIdSet, AddBlockUpdateTest, LukeRequestHandlerTest, TestHdfsCloudBackupRestore, CdcrReplicationHandlerTest, ShardSplitTest, HdfsTlogReplayBufferedWhileIndexingTest, TestFastOutputStream, DOMUtilTest, TestBadConfig, ConvertedLegacyTest, ExplicitHLLTest, TestScoreJoinQPScore, TestManagedSynonymGraphFilterFactory, WrapperMergePolicyFactoryTest, CdcrUpdateLogTest, TestCustomSort, TestPostingsSolrHighlighter, TestTrie, ActionThrottleTest, TestCoreDiscovery, CdcrVersionReplicationTest, ZkNodePropsTest, UUIDUpdateProcessorFallbackTest, SolrCmdDistributorTest, TestFiltering, DistributedQueryComponentCustomSortTest, TestConfigOverlay, BasicFunctionalityTest, BJQParserTest, SynonymTokenizerTest, ClassificationUpdateProcessorTest, HdfsNNFailoverTest, TestCSVLoader, JsonLoaderTest, MissingSegmentRecoveryTest, BooleanFieldTest, SolrRequestParserTest, ResponseHeaderTest, HLLSerializationTest, TestConfigsApi, TestCloudSchemaless, TestRangeQuery, DocValuesMultiTest, DistributedQueryElevationComponentTest, SolrCoreCheckLockOnStartupTest, BasicZkTest, CloudMLTQParserTest, DistributedSuggestComponentTest, EchoParamsTest, TestNRTOpen, TestHashQParserPlugin, TestLeaderElectionZkExpiry, IndexSchemaRuntimeFieldTest, TestDynamicFieldCollectionResource, TestManagedStopFilterFactory, TestSchemaSimilarityResource, InfoHandlerTest, CurrencyFieldTypeTest, LeaderInitiatedRecoveryOnShardRestartTest, TestDeleteCollectionOnDownNodes, CopyFieldTest, MetricsConfigTest, TestRTGBase, TestApiFramework, TestSizeLimitedDistributedMap, TestSubQueryTransformerDistrib, SuggestComponentContextFilterQueryTest, TestRTimerTree, MBeansHandlerTest, FileUtilsTest, CollectionsAPISolrJTest, TestRecovery, SolrMetricsIntegrationTest, CleanupOldIndexTest, TestSolrQueryParser, V2StandaloneTest, TestXmlQParserPlugin, TestCrossCoreJoin, TestCustomDocTransformer, DistributedMLTComponentTest, DeleteInactiveReplicaTest, TestMergePolicyConfig, SchemaVersionSpecificBehaviorTest, ZkSolrClientTest, TestMultiValuedNumericRangeQuery, ExitableDirectoryReaderTest, TestRecoveryHdfs, TestBM25SimilarityFactory, PluginInfoTest, FullSolrCloudDistribCmdsTest, CollectionsAPIDistributedZkTest, TestSchemaNameResource, TestConfigSetsAPI, TestRealTimeGet, TestMacros, TestLegacyNumericUtils, TestDocumentBuilder, TestHdfsUpdateLog, TestSystemIdResolver, TestComponentsName, TestLRUCache, SearchHandlerTest, TestCollectionAPI, SolrXmlInZkTest, SuggesterTSTTest, TermsComponentTest, TestManagedSchemaAPI, ForceLeaderTest]
   [junit4] Completed [350/728 (2!)] on J1 in 118.14s, 3 tests, 1 failure, 1 skipped <<< FAILURES!

[...truncated 44557 lines...]

Mime
View raw message