lucene-dev mailing list archives

Site index · List index
Message view « Date » · « Thread »
Top « Date » · « Thread »
From Policeman Jenkins Server <jenk...@thetaphi.de>
Subject [JENKINS-EA] Lucene-Solr-7.x-Linux (64bit/jdk-9-ea+181) - Build # 324 - Unstable!
Date Sun, 27 Aug 2017 14:12:53 GMT
Build: https://jenkins.thetaphi.de/job/Lucene-Solr-7.x-Linux/324/
Java: 64bit/jdk-9-ea+181 -XX:+UseCompressedOops -XX:+UseG1GC --illegal-access=deny

1 tests failed.
FAILED:  org.apache.solr.update.processor.UpdateRequestProcessorFactoryTest.testUpdateDistribChainSkipping

Error Message:
Tests must be run with INFO level logging otherwise LogUpdateProcessor isn't used and can't
be tested.

Stack Trace:
java.lang.AssertionError: Tests must be run with INFO level logging otherwise LogUpdateProcessor
isn't used and can't be tested.
	at __randomizedtesting.SeedInfo.seed([D0B2C9C65A8D105C:A15637102C663790]:0)
	at org.junit.Assert.fail(Assert.java:93)
	at org.junit.Assert.assertTrue(Assert.java:43)
	at org.apache.solr.update.processor.UpdateRequestProcessorFactoryTest.testUpdateDistribChainSkipping(UpdateRequestProcessorFactoryTest.java:101)
	at java.base/jdk.internal.reflect.NativeMethodAccessorImpl.invoke0(Native Method)
	at java.base/jdk.internal.reflect.NativeMethodAccessorImpl.invoke(NativeMethodAccessorImpl.java:62)
	at java.base/jdk.internal.reflect.DelegatingMethodAccessorImpl.invoke(DelegatingMethodAccessorImpl.java:43)
	at java.base/java.lang.reflect.Method.invoke(Method.java:564)
	at com.carrotsearch.randomizedtesting.RandomizedRunner.invoke(RandomizedRunner.java:1713)
	at com.carrotsearch.randomizedtesting.RandomizedRunner$8.evaluate(RandomizedRunner.java:907)
	at com.carrotsearch.randomizedtesting.RandomizedRunner$9.evaluate(RandomizedRunner.java:943)
	at com.carrotsearch.randomizedtesting.RandomizedRunner$10.evaluate(RandomizedRunner.java:957)
	at com.carrotsearch.randomizedtesting.rules.SystemPropertiesRestoreRule$1.evaluate(SystemPropertiesRestoreRule.java:57)
	at org.apache.lucene.util.TestRuleSetupTeardownChained$1.evaluate(TestRuleSetupTeardownChained.java:49)
	at org.apache.lucene.util.AbstractBeforeAfterRule$1.evaluate(AbstractBeforeAfterRule.java:45)
	at org.apache.lucene.util.TestRuleThreadAndTestName$1.evaluate(TestRuleThreadAndTestName.java:48)
	at org.apache.lucene.util.TestRuleIgnoreAfterMaxFailures$1.evaluate(TestRuleIgnoreAfterMaxFailures.java:64)
	at org.apache.lucene.util.TestRuleMarkFailure$1.evaluate(TestRuleMarkFailure.java:47)
	at com.carrotsearch.randomizedtesting.rules.StatementAdapter.evaluate(StatementAdapter.java:36)
	at com.carrotsearch.randomizedtesting.ThreadLeakControl$StatementRunner.run(ThreadLeakControl.java:368)
	at com.carrotsearch.randomizedtesting.ThreadLeakControl.forkTimeoutingTask(ThreadLeakControl.java:817)
	at com.carrotsearch.randomizedtesting.ThreadLeakControl$3.evaluate(ThreadLeakControl.java:468)
	at com.carrotsearch.randomizedtesting.RandomizedRunner.runSingleTest(RandomizedRunner.java:916)
	at com.carrotsearch.randomizedtesting.RandomizedRunner$5.evaluate(RandomizedRunner.java:802)
	at com.carrotsearch.randomizedtesting.RandomizedRunner$6.evaluate(RandomizedRunner.java:852)
	at com.carrotsearch.randomizedtesting.RandomizedRunner$7.evaluate(RandomizedRunner.java:863)
	at com.carrotsearch.randomizedtesting.rules.StatementAdapter.evaluate(StatementAdapter.java:36)
	at com.carrotsearch.randomizedtesting.rules.SystemPropertiesRestoreRule$1.evaluate(SystemPropertiesRestoreRule.java:57)
	at org.apache.lucene.util.AbstractBeforeAfterRule$1.evaluate(AbstractBeforeAfterRule.java:45)
	at com.carrotsearch.randomizedtesting.rules.StatementAdapter.evaluate(StatementAdapter.java:36)
	at org.apache.lucene.util.TestRuleStoreClassName$1.evaluate(TestRuleStoreClassName.java:41)
	at com.carrotsearch.randomizedtesting.rules.NoShadowingOrOverridesOnMethodsRule$1.evaluate(NoShadowingOrOverridesOnMethodsRule.java:40)
	at com.carrotsearch.randomizedtesting.rules.NoShadowingOrOverridesOnMethodsRule$1.evaluate(NoShadowingOrOverridesOnMethodsRule.java:40)
	at com.carrotsearch.randomizedtesting.rules.StatementAdapter.evaluate(StatementAdapter.java:36)
	at com.carrotsearch.randomizedtesting.rules.StatementAdapter.evaluate(StatementAdapter.java:36)
	at org.apache.lucene.util.TestRuleAssertionsRequired$1.evaluate(TestRuleAssertionsRequired.java:53)
	at org.apache.lucene.util.TestRuleMarkFailure$1.evaluate(TestRuleMarkFailure.java:47)
	at org.apache.lucene.util.TestRuleIgnoreAfterMaxFailures$1.evaluate(TestRuleIgnoreAfterMaxFailures.java:64)
	at org.apache.lucene.util.TestRuleIgnoreTestSuites$1.evaluate(TestRuleIgnoreTestSuites.java:54)
	at com.carrotsearch.randomizedtesting.rules.StatementAdapter.evaluate(StatementAdapter.java:36)
	at com.carrotsearch.randomizedtesting.ThreadLeakControl$StatementRunner.run(ThreadLeakControl.java:368)
	at java.base/java.lang.Thread.run(Thread.java:844)




Build Log:
[...truncated 12167 lines...]
   [junit4] Suite: org.apache.solr.update.processor.UpdateRequestProcessorFactoryTest
   [junit4]   2> Creating dataDir: /home/jenkins/workspace/Lucene-Solr-7.x-Linux/solr/build/solr-core/test/J2/temp/solr.update.processor.UpdateRequestProcessorFactoryTest_D0B2C9C65A8D105C-001/init-core-data-001
   [junit4]   2> 1682731 WARN  (SUITE-UpdateRequestProcessorFactoryTest-seed#[D0B2C9C65A8D105C]-worker)
[    ] o.a.s.SolrTestCaseJ4 startTrackingSearchers: numOpens=2 numCloses=2
   [junit4]   2> 1682932 WARN  (coreLoadExecutor-7324-thread-1) [    ] o.a.s.c.RequestHandlers
no default request handler is registered (either '/select' or 'standard')
   [junit4]   2> 1682932 WARN  (coreLoadExecutor-7324-thread-1) [    ] o.a.s.r.ManagedResourceStorage
Cannot write to config directory /home/jenkins/workspace/Lucene-Solr-7.x-Linux/solr/core/src/test-files/solr/collection1/conf;
switching to use InMemory storage instead.
   [junit4]   2> NOTE: reproduce with: ant test  -Dtestcase=UpdateRequestProcessorFactoryTest
-Dtests.method=testUpdateDistribChainSkipping -Dtests.seed=D0B2C9C65A8D105C -Dtests.multiplier=3
-Dtests.slow=true -Dtests.locale=ru-RU -Dtests.timezone=America/Puerto_Rico -Dtests.asserts=true
-Dtests.file.encoding=US-ASCII
   [junit4] FAILURE 0.00s J2 | UpdateRequestProcessorFactoryTest.testUpdateDistribChainSkipping
<<<
   [junit4]    > Throwable #1: java.lang.AssertionError: Tests must be run with INFO level
logging otherwise LogUpdateProcessor isn't used and can't be tested.
   [junit4]    > 	at __randomizedtesting.SeedInfo.seed([D0B2C9C65A8D105C:A15637102C663790]:0)
   [junit4]    > 	at org.apache.solr.update.processor.UpdateRequestProcessorFactoryTest.testUpdateDistribChainSkipping(UpdateRequestProcessorFactoryTest.java:101)
   [junit4]    > 	at java.base/jdk.internal.reflect.NativeMethodAccessorImpl.invoke0(Native
Method)
   [junit4]    > 	at java.base/jdk.internal.reflect.NativeMethodAccessorImpl.invoke(NativeMethodAccessorImpl.java:62)
   [junit4]    > 	at java.base/jdk.internal.reflect.DelegatingMethodAccessorImpl.invoke(DelegatingMethodAccessorImpl.java:43)
   [junit4]    > 	at java.base/java.lang.reflect.Method.invoke(Method.java:564)
   [junit4]    > 	at java.base/java.lang.Thread.run(Thread.java:844)
   [junit4]   2> NOTE: leaving temporary files on disk at: /home/jenkins/workspace/Lucene-Solr-7.x-Linux/solr/build/solr-core/test/J2/temp/solr.update.processor.UpdateRequestProcessorFactoryTest_D0B2C9C65A8D105C-001
   [junit4]   2> NOTE: test params are: codec=Asserting(Lucene70), sim=RandomSimilarity(queryNorm=true):
{}, locale=ru-RU, timezone=America/Puerto_Rico
   [junit4]   2> NOTE: Linux 4.10.0-27-generic amd64/Oracle Corporation 9 (64-bit)/cpus=8,threads=1,free=397144216,total=536870912
   [junit4]   2> NOTE: All tests run in this JVM: [CdcrRequestHandlerTest, HardAutoCommitTest,
TestEmbeddedSolrServerSchemaAPI, UtilsToolTest, ShowFileRequestHandlerTest, TestFoldingMultitermQuery,
ChaosMonkeySafeLeaderWithPullReplicasTest, TestCollationFieldDocValues, SolrTestCaseJ4Test,
TestGeoJSONResponseWriter, ConcurrentDeleteAndCreateCollectionTest, TestUtils, DirectUpdateHandlerOptimizeTest,
UniqFieldsUpdateProcessorFactoryTest, SimpleFacetsTest, TestSimpleQParserPlugin, DocumentBuilderTest,
OverseerTest, ClassificationUpdateProcessorIntegrationTest, TestManagedSchemaAPI, FullHLLTest,
SpatialHeatmapFacetsTest, DistributedDebugComponentTest, TestMacros, TestXmlQParserPlugin,
FastVectorHighlighterTest, TestSolrCoreProperties, TermVectorComponentDistributedTest, AtomicUpdateProcessorFactoryTest,
DistanceUnitsTest, TestCustomSort, LeaderElectionTest, SearchHandlerTest, SolrInfoBeanTest,
TestCodecSupport, CursorMarkTest, TestUseDocValuesAsStored2, CdcrBootstrapTest, PingRequestHandlerTest,
AutoCommitTest, TestPivotHelperCode, TestSolrCloudSnapshots, TestCorePropertiesReload, SolrCoreCheckLockOnStartupTest,
TestSolrCloudWithSecureImpersonation, ClusterStateTest, RequiredFieldsTest, TestSubQueryTransformerCrossCore,
NotRequiredUniqueKeyTest, SignatureUpdateProcessorFactoryTest, HdfsDirectoryTest, CopyFieldTest,
TestJmxIntegration, TestDistribIDF, CdcrUpdateLogTest, TestBinaryResponseWriter, PKIAuthenticationIntegrationTest,
HttpPartitionTest, BadIndexSchemaTest, TestReload, MoveReplicaHDFSUlogDirTest, TestPayloadCheckQParserPlugin,
TestLegacyNumericRangeQueryBuilder, TestRTimerTree, TestSSLRandomization, PathHierarchyTokenizerFactoryTest,
HdfsNNFailoverTest, TestReversedWildcardFilterFactory, TestStressReorder, BlockCacheTest,
TestRecoveryHdfs, DistributedFacetPivotLargeTest, InfixSuggestersTest, TestSolrCoreParser,
TestPerFieldSimilarityWithDefaultOverride, RecoveryAfterSoftCommitTest, TestCollapseQParserPlugin,
RegexBoostProcessorTest, DirectUpdateHandlerTest, CoreAdminRequestStatusTest, VMParamsZkACLAndCredentialsProvidersTest,
HdfsRestartWhileUpdatingTest, PreAnalyzedUpdateProcessorTest, DistribDocExpirationUpdateProcessorTest,
TestSolrConfigHandlerCloud, PrimitiveFieldTypeTest, SolrMetricManagerTest, SolrShardReporterTest,
StressHdfsTest, TestImplicitCoreProperties, TestSimpleTextCodec, TestCollectionAPIs, TestReplicaProperties,
HighlighterMaxOffsetTest, TestSchemaManager, SolrIndexMetricsTest, TestNestedDocsSort, RankQueryTest,
MetricsHandlerTest, SpellCheckCollatorWithCollapseTest, TestPrepRecovery, V2ApiIntegrationTest,
SearchHandlerTest, TestSurroundQueryParser, TestClassicSimilarityFactory, BasicDistributedZk2Test,
HdfsTlogReplayBufferedWhileIndexingTest, TestNumericRangeQuery64, SegmentsInfoRequestHandlerTest,
TestSizeLimitedDistributedMap, TestPushWriter, TestCollectionAPI, TestLockTree, TestFileDictionaryLookup,
TestBulkSchemaConcurrent, TestRuleBasedAuthorizationPlugin, SolrCLIZkUtilsTest, TestRestoreCore,
CachingDirectoryFactoryTest, UnloadDistributedZkTest, SyncSliceTest, LeaderElectionIntegrationTest,
BasicZkTest, RecoveryZkTest, FullSolrCloudDistribCmdsTest, TestReplicationHandler, ClusterStateUpdateTest,
TestRandomFaceting, TestZkChroot, ZkCLITest, TestDistributedGrouping, TestFaceting, TestRecovery,
ZkControllerTest, TestRealTimeGet, TestJoin, TestSolr4Spatial, StatsComponentTest, TestGroupingSearch,
TestSort, TestFunctionQuery, BasicFunctionalityTest, TestLazyCores, DistributedQueryElevationComponentTest,
SolrIndexSplitterTest, SimplePostToolTest, TestExtendedDismaxParser, SpellCheckCollatorTest,
SuggesterFSTTest, SolrRequestParserTest, SuggesterTest, TestStressLucene, TestTrie, TestCSVLoader,
PolyFieldTest, WordBreakSolrSpellCheckerTest, SchemaVersionSpecificBehaviorTest, TestPseudoReturnFields,
TestUpdate, QueryEqualityTest, SortByFunctionTest, TestRemoteStreaming, DocValuesMultiTest,
XsltUpdateRequestHandlerTest, DebugComponentTest, CacheHeaderTest, LukeRequestHandlerTest,
TestQueryUtils, DocumentAnalysisRequestHandlerTest, TestQueryTypes, FileBasedSpellCheckerTest,
TermsComponentTest, TestValueSourceCache, MoreLikeThisHandlerTest, FieldAnalysisRequestHandlerTest,
IndexSchemaTest, ReturnFieldsTest, UpdateRequestProcessorFactoryTest]
   [junit4] Completed [427/731 (1!)] on J2 in 0.23s, 3 tests, 1 failure <<< FAILURES!

[...truncated 37667 lines...]

Mime
View raw message