lucene-dev mailing list archives

Site index · List index
Message view « Date » · « Thread »
Top « Date » · « Thread »
From Apache Jenkins Server <jenk...@builds.apache.org>
Subject [JENKINS] Lucene-Solr-Tests-7.x - Build # 115 - Still Unstable
Date Wed, 02 Aug 2017 23:16:27 GMT
Build: https://builds.apache.org/job/Lucene-Solr-Tests-7.x/115/

1 tests failed.
FAILED:  org.apache.solr.cloud.FullSolrCloudDistribCmdsTest.test

Error Message:
KeeperErrorCode = Session expired for /clusterstate.json

Stack Trace:
org.apache.zookeeper.KeeperException$SessionExpiredException: KeeperErrorCode = Session expired for /clusterstate.json
	at __randomizedtesting.SeedInfo.seed([BD674BF60FFB7CCA:3533742CA1071132]:0)
	at org.apache.zookeeper.KeeperException.create(KeeperException.java:127)
	at org.apache.zookeeper.KeeperException.create(KeeperException.java:51)
	at org.apache.zookeeper.ZooKeeper.getData(ZooKeeper.java:1212)
	at org.apache.solr.common.cloud.SolrZkClient$7.execute(SolrZkClient.java:357)
	at org.apache.solr.common.cloud.SolrZkClient$7.execute(SolrZkClient.java:354)
	at org.apache.solr.common.cloud.ZkCmdExecutor.retryOperation(ZkCmdExecutor.java:60)
	at org.apache.solr.common.cloud.SolrZkClient.getData(SolrZkClient.java:354)
	at org.apache.solr.common.cloud.ZkStateReader.refreshLegacyClusterState(ZkStateReader.java:541)
	at org.apache.solr.common.cloud.ZkStateReader.forceUpdateCollection(ZkStateReader.java:309)
	at org.apache.solr.cloud.AbstractFullDistribZkTestBase.updateMappingsFromZk(AbstractFullDistribZkTestBase.java:674)
	at org.apache.solr.cloud.AbstractFullDistribZkTestBase.checkShardConsistency(AbstractFullDistribZkTestBase.java:1311)
	at org.apache.solr.cloud.AbstractFullDistribZkTestBase.checkShardConsistency(AbstractFullDistribZkTestBase.java:1302)
	at org.apache.solr.cloud.AbstractFullDistribZkTestBase.checkShardConsistency(AbstractFullDistribZkTestBase.java:1294)
	at org.apache.solr.cloud.FullSolrCloudDistribCmdsTest.testIndexingDocPerRequestWithHttpSolrClient(FullSolrCloudDistribCmdsTest.java:588)
	at org.apache.solr.cloud.FullSolrCloudDistribCmdsTest.test(FullSolrCloudDistribCmdsTest.java:136)
	at sun.reflect.NativeMethodAccessorImpl.invoke0(Native Method)
	at sun.reflect.NativeMethodAccessorImpl.invoke(NativeMethodAccessorImpl.java:62)
	at sun.reflect.DelegatingMethodAccessorImpl.invoke(DelegatingMethodAccessorImpl.java:43)
	at java.lang.reflect.Method.invoke(Method.java:498)
	at com.carrotsearch.randomizedtesting.RandomizedRunner.invoke(RandomizedRunner.java:1713)
	at com.carrotsearch.randomizedtesting.RandomizedRunner$8.evaluate(RandomizedRunner.java:907)
	at com.carrotsearch.randomizedtesting.RandomizedRunner$9.evaluate(RandomizedRunner.java:943)
	at com.carrotsearch.randomizedtesting.RandomizedRunner$10.evaluate(RandomizedRunner.java:957)
	at org.apache.solr.BaseDistributedSearchTestCase$ShardsRepeatRule$ShardsFixedStatement.callStatement(BaseDistributedSearchTestCase.java:993)
	at org.apache.solr.BaseDistributedSearchTestCase$ShardsRepeatRule$ShardsStatement.evaluate(BaseDistributedSearchTestCase.java:968)
	at com.carrotsearch.randomizedtesting.rules.SystemPropertiesRestoreRule$1.evaluate(SystemPropertiesRestoreRule.java:57)
	at org.apache.lucene.util.TestRuleSetupTeardownChained$1.evaluate(TestRuleSetupTeardownChained.java:49)
	at org.apache.lucene.util.AbstractBeforeAfterRule$1.evaluate(AbstractBeforeAfterRule.java:45)
	at org.apache.lucene.util.TestRuleThreadAndTestName$1.evaluate(TestRuleThreadAndTestName.java:48)
	at org.apache.lucene.util.TestRuleIgnoreAfterMaxFailures$1.evaluate(TestRuleIgnoreAfterMaxFailures.java:64)
	at org.apache.lucene.util.TestRuleMarkFailure$1.evaluate(TestRuleMarkFailure.java:47)
	at com.carrotsearch.randomizedtesting.rules.StatementAdapter.evaluate(StatementAdapter.java:36)
	at com.carrotsearch.randomizedtesting.ThreadLeakControl$StatementRunner.run(ThreadLeakControl.java:368)
	at com.carrotsearch.randomizedtesting.ThreadLeakControl.forkTimeoutingTask(ThreadLeakControl.java:817)
	at com.carrotsearch.randomizedtesting.ThreadLeakControl$3.evaluate(ThreadLeakControl.java:468)
	at com.carrotsearch.randomizedtesting.RandomizedRunner.runSingleTest(RandomizedRunner.java:916)
	at com.carrotsearch.randomizedtesting.RandomizedRunner$5.evaluate(RandomizedRunner.java:802)
	at com.carrotsearch.randomizedtesting.RandomizedRunner$6.evaluate(RandomizedRunner.java:852)
	at com.carrotsearch.randomizedtesting.RandomizedRunner$7.evaluate(RandomizedRunner.java:863)
	at com.carrotsearch.randomizedtesting.rules.StatementAdapter.evaluate(StatementAdapter.java:36)
	at com.carrotsearch.randomizedtesting.rules.SystemPropertiesRestoreRule$1.evaluate(SystemPropertiesRestoreRule.java:57)
	at org.apache.lucene.util.AbstractBeforeAfterRule$1.evaluate(AbstractBeforeAfterRule.java:45)
	at com.carrotsearch.randomizedtesting.rules.StatementAdapter.evaluate(StatementAdapter.java:36)
	at org.apache.lucene.util.TestRuleStoreClassName$1.evaluate(TestRuleStoreClassName.java:41)
	at com.carrotsearch.randomizedtesting.rules.NoShadowingOrOverridesOnMethodsRule$1.evaluate(NoShadowingOrOverridesOnMethodsRule.java:40)
	at com.carrotsearch.randomizedtesting.rules.NoShadowingOrOverridesOnMethodsRule$1.evaluate(NoShadowingOrOverridesOnMethodsRule.java:40)
	at com.carrotsearch.randomizedtesting.rules.StatementAdapter.evaluate(StatementAdapter.java:36)
	at com.carrotsearch.randomizedtesting.rules.StatementAdapter.evaluate(StatementAdapter.java:36)
	at com.carrotsearch.randomizedtesting.rules.StatementAdapter.evaluate(StatementAdapter.java:36)
	at org.apache.lucene.util.TestRuleAssertionsRequired$1.evaluate(TestRuleAssertionsRequired.java:53)
	at org.apache.lucene.util.TestRuleMarkFailure$1.evaluate(TestRuleMarkFailure.java:47)
	at org.apache.lucene.util.TestRuleIgnoreAfterMaxFailures$1.evaluate(TestRuleIgnoreAfterMaxFailures.java:64)
	at org.apache.lucene.util.TestRuleIgnoreTestSuites$1.evaluate(TestRuleIgnoreTestSuites.java:54)
	at com.carrotsearch.randomizedtesting.rules.StatementAdapter.evaluate(StatementAdapter.java:36)
	at com.carrotsearch.randomizedtesting.ThreadLeakControl$StatementRunner.run(ThreadLeakControl.java:368)
	at java.lang.Thread.run(Thread.java:748)




Build Log:
[...truncated 11239 lines...]
   [junit4] Suite: org.apache.solr.cloud.FullSolrCloudDistribCmdsTest
   [junit4]   2> 790492 INFO  (SUITE-FullSolrCloudDistribCmdsTest-seed#[BD674BF60FFB7CCA]-worker) [    ] o.a.s.SolrTestCaseJ4 SecureRandom sanity checks: test.solr.allowed.securerandom=null & java.security.egd=file:/dev/./urandom
   [junit4]   2> Creating dataDir: /home/jenkins/jenkins-slave/workspace/Lucene-Solr-Tests-7.x/solr/build/solr-core/test/J2/temp/solr.cloud.FullSolrCloudDistribCmdsTest_BD674BF60FFB7CCA-001/init-core-data-001
   [junit4]   2> 790492 WARN  (SUITE-FullSolrCloudDistribCmdsTest-seed#[BD674BF60FFB7CCA]-worker) [    ] o.a.s.SolrTestCaseJ4 startTrackingSearchers: numOpens=27 numCloses=27
   [junit4]   2> 790493 INFO  (SUITE-FullSolrCloudDistribCmdsTest-seed#[BD674BF60FFB7CCA]-worker) [    ] o.a.s.SolrTestCaseJ4 Using PointFields (NUMERIC_POINTS_SYSPROP=true) w/NUMERIC_DOCVALUES_SYSPROP=true
   [junit4]   2> 790507 INFO  (SUITE-FullSolrCloudDistribCmdsTest-seed#[BD674BF60FFB7CCA]-worker) [    ] o.a.s.SolrTestCaseJ4 Randomized ssl (false) and clientAuth (false) via: @org.apache.solr.SolrTestCaseJ4$SuppressSSL(bugUrl=https://issues.apache.org/jira/browse/SOLR-5776)
   [junit4]   2> 790507 INFO  (SUITE-FullSolrCloudDistribCmdsTest-seed#[BD674BF60FFB7CCA]-worker) [    ] o.a.s.BaseDistributedSearchTestCase Setting hostContext system property: /
   [junit4]   2> 790579 INFO  (TEST-FullSolrCloudDistribCmdsTest.test-seed#[BD674BF60FFB7CCA]) [    ] o.a.s.c.ZkTestServer STARTING ZK TEST SERVER
   [junit4]   2> 790607 INFO  (Thread-2248) [    ] o.a.s.c.ZkTestServer client port:0.0.0.0/0.0.0.0:0
   [junit4]   2> 790607 INFO  (Thread-2248) [    ] o.a.s.c.ZkTestServer Starting server
   [junit4]   2> 790660 ERROR (Thread-2248) [    ] o.a.z.s.ZooKeeperServer ZKShutdownHandler is not registered, so ZooKeeper server won't take any action on ERROR or SHUTDOWN server state changes
   [junit4]   2> 790745 INFO  (TEST-FullSolrCloudDistribCmdsTest.test-seed#[BD674BF60FFB7CCA]) [    ] o.a.s.c.ZkTestServer start zk server on port:42775
   [junit4]   2> 790930 INFO  (TEST-FullSolrCloudDistribCmdsTest.test-seed#[BD674BF60FFB7CCA]) [    ] o.a.s.c.AbstractZkTestCase put /home/jenkins/jenkins-slave/workspace/Lucene-Solr-Tests-7.x/solr/core/src/test-files/solr/collection1/conf/solrconfig-tlog.xml to /configs/conf1/solrconfig.xml
   [junit4]   2> 790931 INFO  (TEST-FullSolrCloudDistribCmdsTest.test-seed#[BD674BF60FFB7CCA]) [    ] o.a.s.c.AbstractZkTestCase put /home/jenkins/jenkins-slave/workspace/Lucene-Solr-Tests-7.x/solr/core/src/test-files/solr/collection1/conf/schema15.xml to /configs/conf1/schema.xml
   [junit4]   2> 790965 INFO  (TEST-FullSolrCloudDistribCmdsTest.test-seed#[BD674BF60FFB7CCA]) [    ] o.a.s.c.AbstractZkTestCase put /home/jenkins/jenkins-slave/workspace/Lucene-Solr-Tests-7.x/solr/core/src/test-files/solr/collection1/conf/solrconfig.snippet.randomindexconfig.xml to /configs/conf1/solrconfig.snippet.randomindexconfig.xml
   [junit4]   2> 790965 INFO  (TEST-FullSolrCloudDistribCmdsTest.test-seed#[BD674BF60FFB7CCA]) [    ] o.a.s.c.AbstractZkTestCase put /home/jenkins/jenkins-slave/workspace/Lucene-Solr-Tests-7.x/solr/core/src/test-files/solr/collection1/conf/stopwords.txt to /configs/conf1/stopwords.txt
   [junit4]   2> 790966 INFO  (TEST-FullSolrCloudDistribCmdsTest.test-seed#[BD674BF60FFB7CCA]) [    ] o.a.s.c.AbstractZkTestCase put /home/jenkins/jenkins-slave/workspace/Lucene-Solr-Tests-7.x/solr/core/src/test-files/solr/collection1/conf/protwords.txt to /configs/conf1/protwords.txt
   [junit4]   2> 790967 INFO  (TEST-FullSolrCloudDistribCmdsTest.test-seed#[BD674BF60FFB7CCA]) [    ] o.a.s.c.AbstractZkTestCase put /home/jenkins/jenkins-slave/workspace/Lucene-Solr-Tests-7.x/solr/core/src/test-files/solr/collection1/conf/currency.xml to /configs/conf1/currency.xml
   [junit4]   2> 790967 INFO  (TEST-FullSolrCloudDistribCmdsTest.test-seed#[BD674BF60FFB7CCA]) [    ] o.a.s.c.AbstractZkTestCase put /home/jenkins/jenkins-slave/workspace/Lucene-Solr-Tests-7.x/solr/core/src/test-files/solr/collection1/conf/enumsConfig.xml to /configs/conf1/enumsConfig.xml
   [junit4]   2> 790968 INFO  (TEST-FullSolrCloudDistribCmdsTest.test-seed#[BD674BF60FFB7CCA]) [    ] o.a.s.c.AbstractZkTestCase put /home/jenkins/jenkins-slave/workspace/Lucene-Solr-Tests-7.x/solr/core/src/test-files/solr/collection1/conf/open-exchange-rates.json to /configs/conf1/open-exchange-rates.json
   [junit4]   2> 790997 INFO  (TEST-FullSolrCloudDistribCmdsTest.test-seed#[BD674BF60FFB7CCA]) [    ] o.a.s.c.AbstractZkTestCase put /home/jenkins/jenkins-slave/workspace/Lucene-Solr-Tests-7.x/solr/core/src/test-files/solr/collection1/conf/mapping-ISOLatin1Accent.txt to /configs/conf1/mapping-ISOLatin1Accent.txt
   [junit4]   2> 790999 INFO  (TEST-FullSolrCloudDistribCmdsTest.test-seed#[BD674BF60FFB7CCA]) [    ] o.a.s.c.AbstractZkTestCase put /home/jenkins/jenkins-slave/workspace/Lucene-Solr-Tests-7.x/solr/core/src/test-files/solr/collection1/conf/old_synonyms.txt to /configs/conf1/old_synonyms.txt
   [junit4]   2> 790999 INFO  (TEST-FullSolrCloudDistribCmdsTest.test-seed#[BD674BF60FFB7CCA]) [    ] o.a.s.c.AbstractZkTestCase put /home/jenkins/jenkins-slave/workspace/Lucene-Solr-Tests-7.x/solr/core/src/test-files/solr/collection1/conf/synonyms.txt to /configs/conf1/synonyms.txt
   [junit4]   2> 791033 INFO  (TEST-FullSolrCloudDistribCmdsTest.test-seed#[BD674BF60FFB7CCA]) [    ] o.a.s.c.AbstractFullDistribZkTestBase Will use NRT replicas unless explicitly asked otherwise
   [junit4]   2> 792250 INFO  (TEST-FullSolrCloudDistribCmdsTest.test-seed#[BD674BF60FFB7CCA]) [    ] o.e.j.s.Server jetty-9.3.14.v20161028
   [junit4]   2> 792274 INFO  (TEST-FullSolrCloudDistribCmdsTest.test-seed#[BD674BF60FFB7CCA]) [    ] o.e.j.s.h.ContextHandler Started o.e.j.s.ServletContextHandler@376f1e17{/,null,AVAILABLE}
   [junit4]   2> 792275 INFO  (TEST-FullSolrCloudDistribCmdsTest.test-seed#[BD674BF60FFB7CCA]) [    ] o.e.j.s.AbstractConnector Started ServerConnector@5d1aae44{HTTP/1.1,[http/1.1]}{127.0.0.1:42785}
   [junit4]   2> 792275 INFO  (TEST-FullSolrCloudDistribCmdsTest.test-seed#[BD674BF60FFB7CCA]) [    ] o.e.j.s.Server Started @803214ms
   [junit4]   2> 792275 INFO  (TEST-FullSolrCloudDistribCmdsTest.test-seed#[BD674BF60FFB7CCA]) [    ] o.a.s.c.s.e.JettySolrRunner Jetty properties: {solr.data.dir=/home/jenkins/jenkins-slave/workspace/Lucene-Solr-Tests-7.x/solr/build/solr-core/test/J2/temp/solr.cloud.FullSolrCloudDistribCmdsTest_BD674BF60FFB7CCA-001/tempDir-001/control/data, hostContext=/, hostPort=42785, coreRootDirectory=/home/jenkins/jenkins-slave/workspace/Lucene-Solr-Tests-7.x/solr/build/solr-core/test/J2/../../../../../../../../../../home/jenkins/jenkins-slave/workspace/Lucene-Solr-Tests-7.x/solr/build/solr-core/test/J2/temp/solr.cloud.FullSolrCloudDistribCmdsTest_BD674BF60FFB7CCA-001/control-001/cores}
   [junit4]   2> 792275 ERROR (TEST-FullSolrCloudDistribCmdsTest.test-seed#[BD674BF60FFB7CCA]) [    ] o.a.s.s.StartupLoggingUtils Missing Java Option solr.log.dir. Logging may be missing or incomplete.
   [junit4]   2> 792275 INFO  (TEST-FullSolrCloudDistribCmdsTest.test-seed#[BD674BF60FFB7CCA]) [    ] o.a.s.s.SolrDispatchFilter  ___      _       Welcome to Apache Solr? version 7.1.0
   [junit4]   2> 792275 INFO  (TEST-FullSolrCloudDistribCmdsTest.test-seed#[BD674BF60FFB7CCA]) [    ] o.a.s.s.SolrDispatchFilter / __| ___| |_ _   Starting in cloud mode on port null
   [junit4]   2> 792275 INFO  (TEST-FullSolrCloudDistribCmdsTest.test-seed#[BD674BF60FFB7CCA]) [    ] o.a.s.s.SolrDispatchFilter \__ \/ _ \ | '_|  Install dir: null, Default config dir: null
   [junit4]   2> 792276 INFO  (TEST-FullSolrCloudDistribCmdsTest.test-seed#[BD674BF60FFB7CCA]) [    ] o.a.s.s.SolrDispatchFilter |___/\___/_|_|    Start time: 2017-08-02T21:44:09.616Z
   [junit4]   2> 792305 INFO  (TEST-FullSolrCloudDistribCmdsTest.test-seed#[BD674BF60FFB7CCA]) [    ] o.a.s.s.SolrDispatchFilter Loading solr.xml from SolrHome (not found in ZooKeeper)
   [junit4]   2> 792305 INFO  (TEST-FullSolrCloudDistribCmdsTest.test-seed#[BD674BF60FFB7CCA]) [    ] o.a.s.c.SolrXmlConfig Loading container configuration from /home/jenkins/jenkins-slave/workspace/Lucene-Solr-Tests-7.x/solr/build/solr-core/test/J2/temp/solr.cloud.FullSolrCloudDistribCmdsTest_BD674BF60FFB7CCA-001/control-001/solr.xml
   [junit4]   2> 792335 INFO  (TEST-FullSolrCloudDistribCmdsTest.test-seed#[BD674BF60FFB7CCA]) [    ] o.a.s.c.SolrXmlConfig MBean server found: com.sun.jmx.mbeanserver.JmxMBeanServer@14df4b07, but no JMX reporters were configured - adding default JMX reporter.
   [junit4]   2> 792354 INFO  (TEST-FullSolrCloudDistribCmdsTest.test-seed#[BD674BF60FFB7CCA]) [    ] o.a.s.c.ZkContainer Zookeeper client=127.0.0.1:42775/solr
   [junit4]   2> 792940 INFO  (TEST-FullSolrCloudDistribCmdsTest.test-seed#[BD674BF60FFB7CCA]) [n:127.0.0.1:42785_    ] o.a.s.c.Overseer Overseer (id=null) closing
   [junit4]   2> 792940 INFO  (TEST-FullSolrCloudDistribCmdsTest.test-seed#[BD674BF60FFB7CCA]) [n:127.0.0.1:42785_    ] o.a.s.c.OverseerElectionContext I am going to be the leader 127.0.0.1:42785_
   [junit4]   2> 792941 INFO  (TEST-FullSolrCloudDistribCmdsTest.test-seed#[BD674BF60FFB7CCA]) [n:127.0.0.1:42785_    ] o.a.s.c.Overseer Overseer (id=98416082810503172-127.0.0.1:42785_-n_0000000000) starting
   [junit4]   2> 792997 INFO  (TEST-FullSolrCloudDistribCmdsTest.test-seed#[BD674BF60FFB7CCA]) [n:127.0.0.1:42785_    ] o.a.s.c.ZkController Register node as live in ZooKeeper:/live_nodes/127.0.0.1:42785_
   [junit4]   2> 792998 INFO  (zkCallback-750-thread-1-processing-n:127.0.0.1:42785_) [n:127.0.0.1:42785_    ] o.a.s.c.c.ZkStateReader Updated live nodes from ZooKeeper... (0) -> (1)
   [junit4]   2> 793215 INFO  (TEST-FullSolrCloudDistribCmdsTest.test-seed#[BD674BF60FFB7CCA]) [n:127.0.0.1:42785_    ] o.a.s.m.r.SolrJmxReporter JMX monitoring for 'solr.node' (registry 'solr.node') enabled at server: com.sun.jmx.mbeanserver.JmxMBeanServer@14df4b07
   [junit4]   2> 793235 INFO  (TEST-FullSolrCloudDistribCmdsTest.test-seed#[BD674BF60FFB7CCA]) [n:127.0.0.1:42785_    ] o.a.s.m.r.SolrJmxReporter JMX monitoring for 'solr.jvm' (registry 'solr.jvm') enabled at server: com.sun.jmx.mbeanserver.JmxMBeanServer@14df4b07
   [junit4]   2> 793235 INFO  (TEST-FullSolrCloudDistribCmdsTest.test-seed#[BD674BF60FFB7CCA]) [n:127.0.0.1:42785_    ] o.a.s.m.r.SolrJmxReporter JMX monitoring for 'solr.jetty' (registry 'solr.jetty') enabled at server: com.sun.jmx.mbeanserver.JmxMBeanServer@14df4b07
   [junit4]   2> 793248 INFO  (TEST-FullSolrCloudDistribCmdsTest.test-seed#[BD674BF60FFB7CCA]) [n:127.0.0.1:42785_    ] o.a.s.c.CorePropertiesLocator Found 0 core definitions underneath /home/jenkins/jenkins-slave/workspace/Lucene-Solr-Tests-7.x/solr/build/solr-core/test/J2/../../../../../../../../../../home/jenkins/jenkins-slave/workspace/Lucene-Solr-Tests-7.x/solr/build/solr-core/test/J2/temp/solr.cloud.FullSolrCloudDistribCmdsTest_BD674BF60FFB7CCA-001/control-001/cores
   [junit4]   2> 793379 INFO  (TEST-FullSolrCloudDistribCmdsTest.test-seed#[BD674BF60FFB7CCA]) [    ] o.a.s.c.c.ZkStateReader Updated live nodes from ZooKeeper... (0) -> (1)
   [junit4]   2> 793380 INFO  (TEST-FullSolrCloudDistribCmdsTest.test-seed#[BD674BF60FFB7CCA]) [    ] o.a.s.c.s.i.ZkClientClusterStateProvider Cluster at 127.0.0.1:42775/solr ready
   [junit4]   2> 793397 INFO  (qtp495437613-5414) [n:127.0.0.1:42785_    ] o.a.s.h.a.CollectionsHandler Invoked Collection Action :create with params replicationFactor=1&collection.configName=conf1&name=control_collection&nrtReplicas=1&action=CREATE&numShards=1&createNodeSet=127.0.0.1:42785_&wt=javabin&version=2 and sendToOCPQueue=true
   [junit4]   2> 793415 INFO  (OverseerThreadFactory-2135-thread-1-processing-n:127.0.0.1:42785_) [n:127.0.0.1:42785_    ] o.a.s.c.CreateCollectionCmd Create collection control_collection
   [junit4]   2> 793571 INFO  (qtp495437613-5412) [n:127.0.0.1:42785_    ] o.a.s.h.a.CoreAdminOperation core create command qt=/admin/cores&collection.configName=conf1&newCollection=true&name=control_collection_shard1_replica_n1&action=CREATE&numShards=1&collection=control_collection&shard=shard1&wt=javabin&version=2&replicaType=NRT
   [junit4]   2> 793571 INFO  (qtp495437613-5412) [n:127.0.0.1:42785_    ] o.a.s.c.TransientSolrCoreCacheDefault Allocating transient cache for 4 transient cores
   [junit4]   2> 793800 INFO  (zkCallback-750-thread-2-processing-n:127.0.0.1:42785_) [n:127.0.0.1:42785_    ] o.a.s.c.c.ZkStateReader A cluster state change: [WatchedEvent state:SyncConnected type:NodeDataChanged path:/collections/control_collection/state.json] for collection [control_collection] has occurred - updating... (live nodes size: [1])
   [junit4]   2> 794720 INFO  (qtp495437613-5412) [n:127.0.0.1:42785_ c:control_collection s:shard1  x:control_collection_shard1_replica_n1] o.a.s.c.SolrConfig Using Lucene MatchVersion: 7.1.0
   [junit4]   2> 794775 INFO  (qtp495437613-5412) [n:127.0.0.1:42785_ c:control_collection s:shard1  x:control_collection_shard1_replica_n1] o.a.s.s.IndexSchema [control_collection_shard1_replica_n1] Schema name=test
   [junit4]   2> 795085 INFO  (qtp495437613-5412) [n:127.0.0.1:42785_ c:control_collection s:shard1  x:control_collection_shard1_replica_n1] o.a.s.s.IndexSchema Loaded schema test/1.6 with uniqueid field id
   [junit4]   2> 795138 INFO  (qtp495437613-5412) [n:127.0.0.1:42785_ c:control_collection s:shard1  x:control_collection_shard1_replica_n1] o.a.s.c.CoreContainer Creating SolrCore 'control_collection_shard1_replica_n1' using configuration from collection control_collection, trusted=true
   [junit4]   2> 795139 INFO  (qtp495437613-5412) [n:127.0.0.1:42785_ c:control_collection s:shard1  x:control_collection_shard1_replica_n1] o.a.s.m.r.SolrJmxReporter JMX monitoring for 'solr.core.control_collection.shard1.replica_n1' (registry 'solr.core.control_collection.shard1.replica_n1') enabled at server: com.sun.jmx.mbeanserver.JmxMBeanServer@14df4b07
   [junit4]   2> 795139 INFO  (qtp495437613-5412) [n:127.0.0.1:42785_ c:control_collection s:shard1  x:control_collection_shard1_replica_n1] o.a.s.c.SolrCore solr.RecoveryStrategy.Builder
   [junit4]   2> 795139 INFO  (qtp495437613-5412) [n:127.0.0.1:42785_ c:control_collection s:shard1  x:control_collection_shard1_replica_n1] o.a.s.c.SolrCore [[control_collection_shard1_replica_n1] ] Opening new SolrCore at [/home/jenkins/jenkins-slave/workspace/Lucene-Solr-Tests-7.x/solr/build/solr-core/test/J2/temp/solr.cloud.FullSolrCloudDistribCmdsTest_BD674BF60FFB7CCA-001/control-001/cores/control_collection_shard1_replica_n1], dataDir=[/home/jenkins/jenkins-slave/workspace/Lucene-Solr-Tests-7.x/solr/build/solr-core/test/J2/../../../../../../../../../../home/jenkins/jenkins-slave/workspace/Lucene-Solr-Tests-7.x/solr/build/solr-core/test/J2/temp/solr.cloud.FullSolrCloudDistribCmdsTest_BD674BF60FFB7CCA-001/control-001/cores/control_collection_shard1_replica_n1/data/]
   [junit4]   2> 795149 INFO  (qtp495437613-5412) [n:127.0.0.1:42785_ c:control_collection s:shard1  x:control_collection_shard1_replica_n1] o.a.s.u.RandomMergePolicy RandomMergePolicy wrapping class org.apache.lucene.index.TieredMergePolicy: [TieredMergePolicy: maxMergeAtOnce=47, maxMergeAtOnceExplicit=34, maxMergedSegmentMB=23.9375, floorSegmentMB=1.3779296875, forceMergeDeletesPctAllowed=19.841286615352494, segmentsPerTier=19.0, maxCFSSegmentSizeMB=8.796093022207999E12, noCFSRatio=0.0
   [junit4]   2> 795191 WARN  (qtp495437613-5412) [n:127.0.0.1:42785_ c:control_collection s:shard1  x:control_collection_shard1_replica_n1] o.a.s.c.RequestHandlers INVALID paramSet a in requestHandler {type = requestHandler,name = /dump,class = DumpRequestHandler,attributes = {initParams=a, name=/dump, class=DumpRequestHandler},args = {defaults={a=A,b=B}}}
   [junit4]   2> 795322 INFO  (qtp495437613-5412) [n:127.0.0.1:42785_ c:control_collection s:shard1  x:control_collection_shard1_replica_n1] o.a.s.u.UpdateHandler Using UpdateLog implementation: org.apache.solr.update.UpdateLog
   [junit4]   2> 795322 INFO  (qtp495437613-5412) [n:127.0.0.1:42785_ c:control_collection s:shard1  x:control_collection_shard1_replica_n1] o.a.s.u.UpdateLog Initializing UpdateLog: dataDir= defaultSyncLevel=FLUSH numRecordsToKeep=100 maxNumLogsToKeep=10 numVersionBuckets=65536
   [junit4]   2> 795336 INFO  (qtp495437613-5412) [n:127.0.0.1:42785_ c:control_collection s:shard1  x:control_collection_shard1_replica_n1] o.a.s.u.CommitTracker Hard AutoCommit: disabled
   [junit4]   2> 795336 INFO  (qtp495437613-5412) [n:127.0.0.1:42785_ c:control_collection s:shard1  x:control_collection_shard1_replica_n1] o.a.s.u.CommitTracker Soft AutoCommit: disabled
   [junit4]   2> 795337 INFO  (qtp495437613-5412) [n:127.0.0.1:42785_ c:control_collection s:shard1  x:control_collection_shard1_replica_n1] o.a.s.u.RandomMergePolicy RandomMergePolicy wrapping class org.apache.lucene.index.TieredMergePolicy: [TieredMergePolicy: maxMergeAtOnce=21, maxMergeAtOnceExplicit=15, maxMergedSegmentMB=98.69921875, floorSegmentMB=0.6572265625, forceMergeDeletesPctAllowed=25.320352790408105, segmentsPerTier=28.0, maxCFSSegmentSizeMB=8.796093022207999E12, noCFSRatio=0.46112342894838354
   [junit4]   2> 795337 INFO  (qtp495437613-5412) [n:127.0.0.1:42785_ c:control_collection s:shard1  x:control_collection_shard1_replica_n1] o.a.s.s.SolrIndexSearcher Opening [Searcher@17b611aa[control_collection_shard1_replica_n1] main]
   [junit4]   2> 795351 INFO  (qtp495437613-5412) [n:127.0.0.1:42785_ c:control_collection s:shard1  x:control_collection_shard1_replica_n1] o.a.s.r.ManagedResourceStorage Configured ZooKeeperStorageIO with znodeBase: /configs/conf1
   [junit4]   2> 795351 INFO  (qtp495437613-5412) [n:127.0.0.1:42785_ c:control_collection s:shard1  x:control_collection_shard1_replica_n1] o.a.s.r.ManagedResourceStorage Loaded null at path _rest_managed.json using ZooKeeperStorageIO:path=/configs/conf1
   [junit4]   2> 795352 INFO  (qtp495437613-5412) [n:127.0.0.1:42785_ c:control_collection s:shard1  x:control_collection_shard1_replica_n1] o.a.s.h.ReplicationHandler Commits will be reserved for  10000
   [junit4]   2> 795353 INFO  (searcherExecutor-2138-thread-1-processing-n:127.0.0.1:42785_ x:control_collection_shard1_replica_n1 s:shard1 c:control_collection) [n:127.0.0.1:42785_ c:control_collection s:shard1  x:control_collection_shard1_replica_n1] o.a.s.c.SolrCore [control_collection_shard1_replica_n1] Registered new searcher Searcher@17b611aa[control_collection_shard1_replica_n1] main{ExitableDirectoryReader(UninvertingDirectoryReader())}
   [junit4]   2> 795353 INFO  (qtp495437613-5412) [n:127.0.0.1:42785_ c:control_collection s:shard1  x:control_collection_shard1_replica_n1] o.a.s.u.UpdateLog Could not find max version in index or recent updates, using new clock 1574657329927815168
   [junit4]   2> 795390 INFO  (qtp495437613-5412) [n:127.0.0.1:42785_ c:control_collection s:shard1  x:control_collection_shard1_replica_n1] o.a.s.c.ShardLeaderElectionContext Enough replicas found to continue.
   [junit4]   2> 795391 INFO  (qtp495437613-5412) [n:127.0.0.1:42785_ c:control_collection s:shard1  x:control_collection_shard1_replica_n1] o.a.s.c.ShardLeaderElectionContext I may be the new leader - try and sync
   [junit4]   2> 795391 INFO  (qtp495437613-5412) [n:127.0.0.1:42785_ c:control_collection s:shard1  x:control_collection_shard1_replica_n1] o.a.s.c.SyncStrategy Sync replicas to http://127.0.0.1:42785/control_collection_shard1_replica_n1/
   [junit4]   2> 795391 INFO  (qtp495437613-5412) [n:127.0.0.1:42785_ c:control_collection s:shard1  x:control_collection_shard1_replica_n1] o.a.s.c.SyncStrategy Sync Success - now sync replicas to me
   [junit4]   2> 795391 INFO  (qtp495437613-5412) [n:127.0.0.1:42785_ c:control_collection s:shard1  x:control_collection_shard1_replica_n1] o.a.s.c.SyncStrategy http://127.0.0.1:42785/control_collection_shard1_replica_n1/ has no replicas
   [junit4]   2> 795391 INFO  (qtp495437613-5412) [n:127.0.0.1:42785_ c:control_collection s:shard1  x:control_collection_shard1_replica_n1] o.a.s.c.ShardLeaderElectionContext Found all replicas participating in election, clear LIR
   [junit4]   2> 795419 INFO  (qtp495437613-5412) [n:127.0.0.1:42785_ c:control_collection s:shard1  x:control_collection_shard1_replica_n1] o.a.s.c.ShardLeaderElectionContext I am the new leader: http://127.0.0.1:42785/control_collection_shard1_replica_n1/ shard1
   [junit4]   2> 795526 INFO  (zkCallback-750-thread-2-processing-n:127.0.0.1:42785_) [n:127.0.0.1:42785_    ] o.a.s.c.c.ZkStateReader A cluster state change: [WatchedEvent state:SyncConnected type:NodeDataChanged path:/collections/control_collection/state.json] for collection [control_collection] has occurred - updating... (live nodes size: [1])
   [junit4]   2> 795570 INFO  (qtp495437613-5412) [n:127.0.0.1:42785_ c:control_collection s:shard1  x:control_collection_shard1_replica_n1] o.a.s.c.ZkController I am the leader, no recovery necessary
   [junit4]   2> 795571 INFO  (qtp495437613-5412) [n:127.0.0.1:42785_ c:control_collection s:shard1  x:control_collection_shard1_replica_n1] o.a.s.s.HttpSolrCall [admin] webapp=null path=/admin/cores params={qt=/admin/cores&collection.configName=conf1&newCollection=true&name=control_collection_shard1_replica_n1&action=CREATE&numShards=1&collection=control_collection&shard=shard1&wt=javabin&version=2&replicaType=NRT} status=0 QTime=1999
   [junit4]   2> 795626 INFO  (qtp495437613-5414) [n:127.0.0.1:42785_    ] o.a.s.h.a.CollectionsHandler Wait for new collection to be active for at most 30 seconds. Check all shard replicas
   [junit4]   2> 795729 INFO  (zkCallback-750-thread-1-processing-n:127.0.0.1:42785_) [n:127.0.0.1:42785_    ] o.a.s.c.c.ZkStateReader A cluster state change: [WatchedEvent state:SyncConnected type:NodeDataChanged path:/collections/control_collection/state.json] for collection [control_collection] has occurred - updating... (live nodes size: [1])
   [junit4]   2> 796634 INFO  (qtp495437613-5414) [n:127.0.0.1:42785_    ] o.a.s.s.HttpSolrCall [admin] webapp=null path=/admin/collections params={replicationFactor=1&collection.configName=conf1&name=control_collection&nrtReplicas=1&action=CREATE&numShards=1&createNodeSet=127.0.0.1:42785_&wt=javabin&version=2} status=0 QTime=3237
   [junit4]   2> 796638 INFO  (TEST-FullSolrCloudDistribCmdsTest.test-seed#[BD674BF60FFB7CCA]) [    ] o.a.s.c.c.ZkStateReader Updated live nodes from ZooKeeper... (0) -> (1)
   [junit4]   2> 796639 INFO  (TEST-FullSolrCloudDistribCmdsTest.test-seed#[BD674BF60FFB7CCA]) [    ] o.a.s.c.s.i.ZkClientClusterStateProvider Cluster at 127.0.0.1:42775/solr ready
   [junit4]   2> 796639 INFO  (TEST-FullSolrCloudDistribCmdsTest.test-seed#[BD674BF60FFB7CCA]) [    ] o.a.s.c.ChaosMonkey monkey: init - expire sessions:false cause connection loss:false
   [junit4]   2> 796640 INFO  (qtp495437613-5411) [n:127.0.0.1:42785_    ] o.a.s.h.a.CollectionsHandler Invoked Collection Action :create with params replicationFactor=1&collection.configName=conf1&name=collection1&nrtReplicas=1&action=CREATE&numShards=3&createNodeSet=&stateFormat=1&wt=javabin&version=2 and sendToOCPQueue=true
   [junit4]   2> 796641 INFO  (OverseerThreadFactory-2135-thread-2-processing-n:127.0.0.1:42785_) [n:127.0.0.1:42785_    ] o.a.s.c.CreateCollectionCmd Create collection collection1
   [junit4]   2> 796641 INFO  (OverseerCollectionConfigSetProcessor-98416082810503172-127.0.0.1:42785_-n_0000000000) [n:127.0.0.1:42785_    ] o.a.s.c.OverseerTaskQueue Response ZK path: /overseer/collection-queue-work/qnr-0000000000 doesn't exist.  Requestor may have disconnected from ZooKeeper
   [junit4]   2> 796642 WARN  (OverseerThreadFactory-2135-thread-2-processing-n:127.0.0.1:42785_) [n:127.0.0.1:42785_    ] o.a.s.c.CreateCollectionCmd It is unusual to create a collection (collection1) without cores.
   [junit4]   2> 796879 INFO  (qtp495437613-5411) [n:127.0.0.1:42785_    ] o.a.s.h.a.CollectionsHandler Wait for new collection to be active for at most 30 seconds. Check all shard replicas
   [junit4]   2> 796879 INFO  (qtp495437613-5411) [n:127.0.0.1:42785_    ] o.a.s.s.HttpSolrCall [admin] webapp=null path=/admin/collections params={replicationFactor=1&collection.configName=conf1&name=collection1&nrtReplicas=1&action=CREATE&numShards=3&createNodeSet=&stateFormat=1&wt=javabin&version=2} status=0 QTime=239
   [junit4]   2> 797207 INFO  (TEST-FullSolrCloudDistribCmdsTest.test-seed#[BD674BF60FFB7CCA]) [    ] o.a.s.c.AbstractFullDistribZkTestBase create jetty 1 in directory /home/jenkins/jenkins-slave/workspace/Lucene-Solr-Tests-7.x/solr/build/solr-core/test/J2/temp/solr.cloud.FullSolrCloudDistribCmdsTest_BD674BF60FFB7CCA-001/shard-1-001 of type NRT
   [junit4]   2> 797208 INFO  (TEST-FullSolrCloudDistribCmdsTest.test-seed#[BD674BF60FFB7CCA]) [    ] o.e.j.s.Server jetty-9.3.14.v20161028
   [junit4]   2> 797209 INFO  (TEST-FullSolrCloudDistribCmdsTest.test-seed#[BD674BF60FFB7CCA]) [    ] o.e.j.s.h.ContextHandler Started o.e.j.s.ServletContextHandler@265f716e{/,null,AVAILABLE}
   [junit4]   2> 797209 INFO  (TEST-FullSolrCloudDistribCmdsTest.test-seed#[BD674BF60FFB7CCA]) [    ] o.e.j.s.AbstractConnector Started ServerConnector@2c05aa3b{HTTP/1.1,[http/1.1]}{127.0.0.1:34455}
   [junit4]   2> 797209 INFO  (TEST-FullSolrCloudDistribCmdsTest.test-seed#[BD674BF60FFB7CCA]) [    ] o.e.j.s.Server Started @808148ms
   [junit4]   2> 797209 INFO  (TEST-FullSolrCloudDistribCmdsTest.test-seed#[BD674BF60FFB7CCA]) [    ] o.a.s.c.s.e.JettySolrRunner Jetty properties: {solr.data.dir=/home/jenkins/jenkins-slave/workspace/Lucene-Solr-Tests-7.x/solr/build/solr-core/test/J2/temp/solr.cloud.FullSolrCloudDistribCmdsTest_BD674BF60FFB7CCA-001/tempDir-001/jetty1, solrconfig=solrconfig.xml, hostContext=/, hostPort=34455, coreRootDirectory=/home/jenkins/jenkins-slave/workspace/Lucene-Solr-Tests-7.x/solr/build/solr-core/test/J2/../../../../../../../../../../home/jenkins/jenkins-slave/workspace/Lucene-Solr-Tests-7.x/solr/build/solr-core/test/J2/temp/solr.cloud.FullSolrCloudDistribCmdsTest_BD674BF60FFB7CCA-001/shard-1-001/cores}
   [junit4]   2> 797209 ERROR (TEST-FullSolrCloudDistribCmdsTest.test-seed#[BD674BF60FFB7CCA]) [    ] o.a.s.s.StartupLoggingUtils Missing Java Option solr.log.dir. Logging may be missing or incomplete.
   [junit4]   2> 797209 INFO  (TEST-FullSolrCloudDistribCmdsTest.test-seed#[BD674BF60FFB7CCA]) [    ] o.a.s.s.SolrDispatchFilter  ___      _       Welcome to Apache Solr? version 7.1.0
   [junit4]   2> 797209 INFO  (TEST-FullSolrCloudDistribCmdsTest.test-seed#[BD674BF60FFB7CCA]) [    ] o.a.s.s.SolrDispatchFilter / __| ___| |_ _   Starting in cloud mode on port null
   [junit4]   2> 797209 INFO  (TEST-FullSolrCloudDistribCmdsTest.test-seed#[BD674BF60FFB7CCA]) [    ] o.a.s.s.SolrDispatchFilter \__ \/ _ \ | '_|  Install dir: null, Default config dir: null
   [junit4]   2> 797209 INFO  (TEST-FullSolrCloudDistribCmdsTest.test-seed#[BD674BF60FFB7CCA]) [    ] o.a.s.s.SolrDispatchFilter |___/\___/_|_|    Start time: 2017-08-02T21:44:14.549Z
   [junit4]   2> 797246 INFO  (TEST-FullSolrCloudDistribCmdsTest.test-seed#[BD674BF60FFB7CCA]) [    ] o.a.s.s.SolrDispatchFilter Loading solr.xml from SolrHome (not found in ZooKeeper)
   [junit4]   2> 797246 INFO  (TEST-FullSolrCloudDistribCmdsTest.test-seed#[BD674BF60FFB7CCA]) [    ] o.a.s.c.SolrXmlConfig Loading container configuration from /home/jenkins/jenkins-slave/workspace/Lucene-Solr-Tests-7.x/solr/build/solr-core/test/J2/temp/solr.cloud.FullSolrCloudDistribCmdsTest_BD674BF60FFB7CCA-001/shard-1-001/solr.xml
   [junit4]   2> 797271 INFO  (TEST-FullSolrCloudDistribCmdsTest.test-seed#[BD674BF60FFB7CCA]) [    ] o.a.s.c.SolrXmlConfig MBean server found: com.sun.jmx.mbeanserver.JmxMBeanServer@14df4b07, but no JMX reporters were configured - adding default JMX reporter.
   [junit4]   2> 797286 INFO  (TEST-FullSolrCloudDistribCmdsTest.test-seed#[BD674BF60FFB7CCA]) [    ] o.a.s.c.ZkContainer Zookeeper client=127.0.0.1:42775/solr
   [junit4]   2> 797326 INFO  (TEST-FullSolrCloudDistribCmdsTest.test-seed#[BD674BF60FFB7CCA]) [n:127.0.0.1:34455_    ] o.a.s.c.c.ZkStateReader Updated live nodes from ZooKeeper... (0) -> (1)
   [junit4]   2> 797328 INFO  (TEST-FullSolrCloudDistribCmdsTest.test-seed#[BD674BF60FFB7CCA]) [n:127.0.0.1:34455_    ] o.a.s.c.Overseer Overseer (id=null) closing
   [junit4]   2> 797337 INFO  (TEST-FullSolrCloudDistribCmdsTest.test-seed#[BD674BF60FFB7CCA]) [n:127.0.0.1:34455_    ] o.a.s.c.ZkController Register node as live in ZooKeeper:/live_nodes/127.0.0.1:34455_
   [junit4]   2> 797338 INFO  (zkCallback-757-thread-1) [    ] o.a.s.c.c.ZkStateReader Updated live nodes from ZooKeeper... (1) -> (2)
   [junit4]   2> 797340 INFO  (zkCallback-750-thread-1-processing-n:127.0.0.1:42785_) [n:127.0.0.1:42785_    ] o.a.s.c.c.ZkStateReader Updated live nodes from ZooKeeper... (1) -> (2)
   [junit4]   2> 797340 INFO  (zkCallback-762-thread-1-processing-n:127.0.0.1:34455_) [n:127.0.0.1:34455_    ] o.a.s.c.c.ZkStateReader Updated live nodes from ZooKeeper... (1) -> (2)
   [junit4]   2> 797452 INFO  (TEST-FullSolrCloudDistribCmdsTest.test-seed#[BD674BF60FFB7CCA]) [n:127.0.0.1:34455_    ] o.a.s.m.r.SolrJmxReporter JMX monitoring for 'solr.node' (registry 'solr.node') enabled at server: com.sun.jmx.mbeanserver.JmxMBeanServer@14df4b07
   [junit4]   2> 797456 INFO  (TEST-FullSolrCloudDistribCmdsTest.test-seed#[BD674BF60FFB7CCA]) [n:127.0.0.1:34455_    ] o.a.s.m.r.SolrJmxReporter JMX monitoring for 'solr.jvm' (registry 'solr.jvm') enabled at server: com.sun.jmx.mbeanserver.JmxMBeanServer@14df4b07
   [junit4]   2> 797456 INFO  (TEST-FullSolrCloudDistribCmdsTest.test-seed#[BD674BF60FFB7CCA]) [n:127.0.0.1:34455_    ] o.a.s.m.r.SolrJmxReporter JMX monitoring for 'solr.jetty' (registry 'solr.jetty') enabled at server: com.sun.jmx.mbeanserver.JmxMBeanServer@14df4b07
   [junit4]   2> 797457 INFO  (TEST-FullSolrCloudDistribCmdsTest.test-seed#[BD674BF60FFB7CCA]) [n:127.0.0.1:34455_    ] o.a.s.c.CorePropertiesLocator Found 0 core definitions underneath /home/jenkins/jenkins-slave/workspace/Lucene-Solr-Tests-7.x/solr/build/solr-core/test/J2/../../../../../../../../../../home/jenkins/jenkins-slave/workspace/Lucene-Solr-Tests-7.x/solr/build/solr-core/test/J2/temp/solr.cloud.FullSolrCloudDistribCmdsTest_BD674BF60FFB7CCA-001/shard-1-001/cores
   [junit4]   2> 797473 INFO  (qtp1091633706-5456) [n:127.0.0.1:34455_    ] o.a.s.h.a.CollectionsHandler Invoked Collection Action :addreplica with params node=127.0.0.1:34455_&action=ADDREPLICA&collection=collection1&shard=shard2&type=NRT&wt=javabin&version=2 and sendToOCPQueue=true
   [junit4]   2> 797475 INFO  (OverseerThreadFactory-2135-thread-3-processing-n:127.0.0.1:42785_) [n:127.0.0.1:42785_    ] o.a.s.c.AddReplicaCmd Node Identified 127.0.0.1:34455_ for creating new replica
   [junit4]   2> 797475 INFO  (OverseerCollectionConfigSetProcessor-98416082810503172-127.0.0.1:42785_-n_0000000000) [n:127.0.0.1:42785_    ] o.a.s.c.OverseerTaskQueue Response ZK path: /overseer/collection-queue-work/qnr-0000000002 doesn't exist.  Requestor may have disconnected from ZooKeeper
   [junit4]   2> 797476 INFO  (qtp1091633706-5458) [n:127.0.0.1:34455_    ] o.a.s.h.a.CoreAdminOperation core create command qt=/admin/cores&collection.configName=conf1&name=collection1_shard2_replica_n1&action=CREATE&collection=collection1&shard=shard2&wt=javabin&version=2&replicaType=NRT
   [junit4]   2> 797477 INFO  (qtp1091633706-5458) [n:127.0.0.1:34455_    ] o.a.s.c.TransientSolrCoreCacheDefault Allocating transient cache for 4 transient cores
   [junit4]   2> 798545 INFO  (qtp1091633706-5458) [n:127.0.0.1:34455_ c:collection1 s:shard2  x:collection1_shard2_replica_n1] o.a.s.c.SolrConfig Using Lucene MatchVersion: 7.1.0
   [junit4]   2> 798579 INFO  (qtp1091633706-5458) [n:127.0.0.1:34455_ c:collection1 s:shard2  x:collection1_shard2_replica_n1] o.a.s.s.IndexSchema [collection1_shard2_replica_n1] Schema name=test
   [junit4]   2> 798738 INFO  (qtp1091633706-5458) [n:127.0.0.1:34455_ c:collection1 s:shard2  x:collection1_shard2_replica_n1] o.a.s.s.IndexSchema Loaded schema test/1.6 with uniqueid field id
   [junit4]   2> 798783 INFO  (qtp1091633706-5458) [n:127.0.0.1:34455_ c:collection1 s:shard2  x:collection1_shard2_replica_n1] o.a.s.c.CoreContainer Creating SolrCore 'collection1_shard2_replica_n1' using configuration from collection collection1, trusted=true
   [junit4]   2> 798791 INFO  (qtp1091633706-5458) [n:127.0.0.1:34455_ c:collection1 s:shard2  x:collection1_shard2_replica_n1] o.a.s.m.r.SolrJmxReporter JMX monitoring for 'solr.core.collection1.shard2.replica_n1' (registry 'solr.core.collection1.shard2.replica_n1') enabled at server: com.sun.jmx.mbeanserver.JmxMBeanServer@14df4b07
   [junit4]   2> 798791 INFO  (qtp1091633706-5458) [n:127.0.0.1:34455_ c:collection1 s:shard2  x:collection1_shard2_replica_n1] o.a.s.c.SolrCore solr.RecoveryStrategy.Builder
   [junit4]   2> 798792 INFO  (qtp1091633706-5458) [n:127.0.0.1:34455_ c:collection1 s:shard2  x:collection1_shard2_replica_n1] o.a.s.c.SolrCore [[collection1_shard2_replica_n1] ] Opening new SolrCore at [/home/jenkins/jenkins-slave/workspace/Lucene-Solr-Tests-7.x/solr/build/solr-core/test/J2/temp/solr.cloud.FullSolrCloudDistribCmdsTest_BD674BF60FFB7CCA-001/shard-1-001/cores/collection1_shard2_replica_n1], dataDir=[/home/jenkins/jenkins-slave/workspace/Lucene-Solr-Tests-7.x/solr/build/solr-core/test/J2/../../../../../../../../../../home/jenkins/jenkins-slave/workspace/Lucene-Solr-Tests-7.x/solr/build/solr-core/test/J2/temp/solr.cloud.FullSolrCloudDistribCmdsTest_BD674BF60FFB7CCA-001/shard-1-001/cores/collection1_shard2_replica_n1/data/]
   [junit4]   2> 798794 INFO  (qtp1091633706-5458) [n:127.0.0.1:34455_ c:collection1 s:shard2  x:collection1_shard2_replica_n1] o.a.s.u.RandomMergePolicy RandomMergePolicy wrapping class org.apache.lucene.index.TieredMergePolicy: [TieredMergePolicy: maxMergeAtOnce=47, maxMergeAtOnceExplicit=34, maxMergedSegmentMB=23.9375, floorSegmentMB=1.3779296875, forceMergeDeletesPctAllowed=19.841286615352494, segmentsPerTier=19.0, maxCFSSegmentSizeMB=8.796093022207999E12, noCFSRatio=0.0
   [junit4]   2> 798813 WARN  (qtp1091633706-5458) [n:127.0.0.1:34455_ c:collection1 s:shard2  x:collection1_shard2_replica_n1] o.a.s.c.RequestHandlers INVALID paramSet a in requestHandler {type = requestHandler,name = /dump,class = DumpRequestHandler,attributes = {initParams=a, name=/dump, class=DumpRequestHandler},args = {defaults={a=A,b=B}}}
   [junit4]   2> 799043 INFO  (qtp1091633706-5458) [n:127.0.0.1:34455_ c:collection1 s:shard2  x:collection1_shard2_replica_n1] o.a.s.u.UpdateHandler Using UpdateLog implementation: org.apache.solr.update.UpdateLog
   [junit4]   2> 799043 INFO  (qtp1091633706-5458) [n:127.0.0.1:34455_ c:collection1 s:shard2  x:collection1_shard2_replica_n1] o.a.s.u.UpdateLog Initializing UpdateLog: dataDir= defaultSyncLevel=FLUSH numRecordsToKeep=100 maxNumLogsToKeep=10 numVersionBuckets=65536
   [junit4]   2> 799044 INFO  (qtp1091633706-5458) [n:127.0.0.1:34455_ c:collection1 s:shard2  x:collection1_shard2_replica_n1] o.a.s.u.CommitTracker Hard AutoCommit: disabled
   [junit4]   2> 799044 INFO  (qtp1091633706-5458) [n:127.0.0.1:34455_ c:collection1 s:shard2  x:collection1_shard2_replica_n1] o.a.s.u.CommitTracker Soft AutoCommit: disabled
   [junit4]   2> 799045 INFO  (qtp1091633706-5458) [n:127.0.0.1:34455_ c:collection1 s:shard2  x:collection1_shard2_replica_n1] o.a.s.u.RandomMergePolicy RandomMergePolicy wrapping class org.apache.lucene.index.TieredMergePolicy: [TieredMergePolicy: maxMergeAtOnce=21, maxMergeAtOnceExplicit=15, maxMergedSegmentMB=98.69921875, floorSegmentMB=0.6572265625, forceMergeDeletesPctAllowed=25.320352790408105, segmentsPerTier=28.0, maxCFSSegmentSizeMB=8.796093022207999E12, noCFSRatio=0.46112342894838354
   [junit4]   2> 799045 INFO  (qtp1091633706-5458) [n:127.0.0.1:34455_ c:collection1 s:shard2  x:collection1_shard2_replica_n1] o.a.s.s.SolrIndexSearcher Opening [Searcher@fa22c1f[collection1_shard2_replica_n1] main]
   [junit4]   2> 799047 INFO  (qtp1091633706-5458) [n:127.0.0.1:34455_ c:collection1 s:shard2  x:collection1_shard2_replica_n1] o.a.s.r.ManagedResourceStorage Configured ZooKeeperStorageIO with znodeBase: /configs/conf1
   [junit4]   2> 799061 INFO  (qtp1091633706-5458) [n:127.0.0.1:34455_ c:collection1 s:shard2  x:collection1_shard2_replica_n1] o.a.s.r.ManagedResourceStorage Loaded null at path _rest_managed.json using ZooKeeperStorageIO:path=/configs/conf1
   [junit4]   2> 799062 INFO  (qtp1091633706-5458) [n:127.0.0.1:34455_ c:collection1 s:shard2  x:collection1_shard2_replica_n1] o.a.s.h.ReplicationHandler Commits will be reserved for  10000
   [junit4]   2> 799062 INFO  (qtp1091633706-5458) [n:127.0.0.1:34455_ c:collection1 s:shard2  x:collection1_shard2_replica_n1] o.a.s.u.UpdateLog Could not find max version in index or recent updates, using new clock 1574657333816983552
   [junit4]   2> 799119 INFO  (searcherExecutor-2149-thread-1-processing-n:127.0.0.1:34455_ x:collection1_shard2_replica_n1 s:shard2 c:collection1) [n:127.0.0.1:34455_ c:collection1 s:shard2  x:collection1_shard2_replica_n1] o.a.s.c.SolrCore [collection1_shard2_replica_n1] Registered new searcher Searcher@fa22c1f[collection1_shard2_replica_n1] main{ExitableDirectoryReader(UninvertingDirectoryReader())}
   [junit4]   2> 799199 INFO  (qtp1091633706-5458) [n:127.0.0.1:34455_ c:collection1 s:shard2  x:collection1_shard2_replica_n1] o.a.s.c.ShardLeaderElectionContext Enough replicas found to continue.
   [junit4]   2> 799199 INFO  (qtp1091633706-5458) [n:127.0.0.1:34455_ c:collection1 s:shard2  x:collection1_shard2_replica_n1] o.a.s.c.ShardLeaderElectionContext I may be the new leader - try and sync
   [junit4]   2> 799199 INFO  (qtp1091633706-5458) [n:127.0.0.1:34455_ c:collection1 s:shard2  x:collection1_shard2_replica_n1] o.a.s.c.SyncStrategy Sync replicas to http://127.0.0.1:34455/collection1_shard2_replica_n1/
   [junit4]   2> 799199 INFO  (qtp1091633706-5458) [n:127.0.0.1:34455_ c:collection1 s:shard2  x:collection1_shard2_replica_n1] o.a.s.c.SyncStrategy Sync Success - now sync replicas to me
   [junit4]   2> 799199 INFO  (qtp1091633706-5458) [n:127.0.0.1:34455_ c:collection1 s:shard2  x:collection1_shard2_replica_n1] o.a.s.c.SyncStrategy http://127.0.0.1:34455/collection1_shard2_replica_n1/ has no replicas
   [junit4]   2> 799199 INFO  (qtp1091633706-5458) [n:127.0.0.1:34455_ c:collection1 s:shard2  x:collection1_shard2_replica_n1] o.a.s.c.ShardLeaderElectionContext Found all replicas participating in election, clear LIR
   [junit4]   2> 799201 INFO  (qtp1091633706-5458) [n:127.0.0.1:34455_ c:collection1 s:shard2  x:collection1_shard2_replica_n1] o.a.s.c.ShardLeaderElectionContext I am the new leader: http://127.0.0.1:34455/collection1_shard2_replica_n1/ shard2
   [junit4]   2> 799357 INFO  (qtp1091633706-5458) [n:127.0.0.1:34455_ c:collection1 s:shard2  x:collection1_shard2_replica_n1] o.a.s.c.ZkController I am the leader, no recovery necessary
   [junit4]   2> 799365 INFO  (qtp1091633706-5458) [n:127.0.0.1:34455_ c:collection1 s:shard2  x:collection1_shard2_replica_n1] o.a.s.s.HttpSolrCall [admin] webapp=null path=/admin/cores params={qt=/admin/cores&collection.configName=conf1&name=collection1_shard2_replica_n1&action=CREATE&collection=collection1&shard=shard2&wt=javabin&version=2&replicaType=NRT} status=0 QTime=1888
   [junit4]   2> 799395 INFO  (qtp1091633706-5456) [n:127.0.0.1:34455_    ] o.a.s.s.HttpSolrCall [admin] webapp=null path=/admin/collections params={node=127.0.0.1:34455_&action=ADDREPLICA&collection=collection1&shard=shard2&type=NRT&wt=javabin&version=2} status=0 QTime=1921
   [junit4]   2> 799510 INFO  (OverseerCollectionConfigSetProcessor-98416082810503172-127.0.0.1:42785_-n_0000000000) [n:127.0.0.1:42785_    ] o.a.s.c.OverseerTaskQueue Response ZK path: /overseer/collection-queue-work/qnr-0000000004 doesn't exist.  Requestor may have disconnected from ZooKeeper
   [junit4]   2> 799791 INFO  (TEST-FullSolrCloudDistribCmdsTest.test-seed#[BD674BF60FFB7CCA]) [    ] o.a.s.c.AbstractFullDistribZkTestBase create jetty 2 in directory /home/jenkins/jenkins-slave/workspace/Lucene-Solr-Tests-7.x/solr/build/solr-core/test/J2/temp/solr.cloud.FullSolrCloudDistribCmdsTest_BD674BF60FFB7CCA-001/shard-2-001 of type NRT
   [junit4]   2> 799792 INFO  (TEST-FullSolrCloudDistribCmdsTest.test-seed#[BD674BF60FFB7CCA]) [    ] o.e.j.s.Server jetty-9.3.14.v20161028
   [junit4]   2> 799811 INFO  (TEST-FullSolrCloudDistribCmdsTest.test-seed#[BD674BF60FFB7CCA]) [    ] o.e.j.s.h.ContextHandler Started o.e.j.s.ServletContextHandler@54ba78f6{/,null,AVAILABLE}
   [junit4]   2> 799811 INFO  (TEST-FullSolrCloudDistribCmdsTest.test-seed#[BD674BF60FFB7CCA]) [    ] o.e.j.s.AbstractConnector Started ServerConnector@e14bb5f{HTTP/1.1,[http/1.1]}{127.0.0.1:45645}
   [junit4]   2> 799811 INFO  (TEST-FullSolrCloudDistribCmdsTest.test-seed#[BD674BF60FFB7CCA]) [    ] o.e.j.s.Server Started @810750ms
   [junit4]   2> 799811 INFO  (TEST-FullSolrCloudDistribCmdsTest.test-seed#[BD674BF60FFB7CCA]) [    ] o.a.s.c.s.e.JettySolrRunner Jetty properties: {solr.data.dir=/home/jenkins/jenkins-slave/workspace/Lucene-Solr-Tests-7.x/solr/build/solr-core/test/J2/temp/solr.cloud.FullSolrCloudDistribCmdsTest_BD674BF60FFB7CCA-001/tempDir-001/jetty2, solrconfig=solrconfig.xml, hostContext=/, hostPort=45645, coreRootDirectory=/home/jenkins/jenkins-slave/workspace/Lucene-Solr-Tests-7.x/solr/build/solr-core/test/J2/../../../../../../../../../../home/jenkins/jenkins-slave/workspace/Lucene-Solr-Tests-7.x/solr/build/solr-core/test/J2/temp/solr.cloud.FullSolrCloudDistribCmdsTest_BD674BF60FFB7CCA-001/shard-2-001/cores}
   [junit4]   2> 799811 ERROR (TEST-FullSolrCloudDistribCmdsTest.test-seed#[BD674BF60FFB7CCA]) [    ] o.a.s.s.StartupLoggingUtils Missing Java Option solr.log.dir. Logging may be missing or incomplete.
   [junit4]   2> 799831 INFO  (TEST-FullSolrCloudDistribCmdsTest.test-seed#[BD674BF60FFB7CCA]) [    ] o.a.s.s.SolrDispatchFilter  ___      _       Welcome to Apache Solr? version 7.1.0
   [junit4]   2> 799831 INFO  (TEST-FullSolrCloudDistribCmdsTest.test-seed#[BD674BF60FFB7CCA]) [    ] o.a.s.s.SolrDispatchFilter / __| ___| |_ _   Starting in cloud mode on port null
   [junit4]   2> 799831 INFO  (TEST-FullSolrCloudDistribCmdsTest.test-seed#[BD674BF60FFB7CCA]) [    ] o.a.s.s.SolrDispatchFilter \__ \/ _ \ | '_|  Install dir: null, Default config dir: null
   [junit4]   2> 799831 INFO  (TEST-FullSolrCloudDistribCmdsTest.test-seed#[BD674BF60FFB7CCA]) [    ] o.a.s.s.SolrDispatchFilter |___/\___/_|_|    Start time: 2017-08-02T21:44:17.171Z
   [junit4]   2> 799904 INFO  (TEST-FullSolrCloudDistribCmdsTest.test-seed#[BD674BF60FFB7CCA]) [    ] o.a.s.s.SolrDispatchFilter Loading solr.xml from SolrHome (not found in ZooKeeper)
   [junit4]   2> 799904 INFO  (TEST-FullSolrCloudDistribCmdsTest.test-seed#[BD674BF60FFB7CCA]) [    ] o.a.s.c.SolrXmlConfig Loading container configuration from /home/jenkins/jenkins-slave/workspace/Lucene-Solr-Tests-7.x/solr/build/solr-core/test/J2/temp/solr.cloud.FullSolrCloudDistribCmdsTest_BD674BF60FFB7CCA-001/shard-2-001/solr.xml
   [junit4]   2> 799925 INFO  (TEST-FullSolrCloudDistribCmdsTest.test-seed#[BD674BF60FFB7CCA]) [    ] o.a.s.c.SolrXmlConfig MBean server found: com.sun.jmx.mbeanserver.JmxMBeanServer@14df4b07, but no JMX reporters were configured - adding default JMX reporter.
   [junit4]   2> 799927 INFO  (TEST-FullSolrCloudDistribCmdsTest.test-seed#[BD674BF60FFB7CCA]) [    ] o.a.s.c.ZkContainer Zookeeper client=127.0.0.1:42775/solr
   [junit4]   2> 799982 INFO  (TEST-FullSolrCloudDistribCmdsTest.test-seed#[BD674BF60FFB7CCA]) [n:127.0.0.1:45645_    ] o.a.s.c.c.ZkStateReader Updated live nodes from ZooKeeper... (0) -> (2)
   [junit4]   2> 799983 INFO  (TEST-FullSolrCloudDistribCmdsTest.test-seed#[BD674BF60FFB7CCA]) [n:127.0.0.1:45645_    ] o.a.s.c.Overseer Overseer (id=null) closing
   [junit4]   2> 799985 INFO  (TEST-FullSolrCloudDistribCmdsTest.test-seed#[BD674BF60FFB7CCA]) [n:127.0.0.1:45645_    ] o.a.s.c.ZkController Register node as live in ZooKeeper:/live_nodes/127.0.0.1:45645_
   [junit4]   2> 799993 INFO  (zkCallback-757-thread-1) [    ] o.a.s.c.c.ZkStateReader Updated live nodes from ZooKeeper... (2) -> (3)
   [junit4]   2> 799997 INFO  (zkCallback-768-thread-1-processing-n:127.0.0.1:45645_) [n:127.0.0.1:45645_    ] o.a.s.c.c.ZkStateReader Updated live nodes from ZooKeeper... (2) -> (3)
   [junit4]   2> 800009 INFO  (zkCallback-750-thread-2-processing-n:127.0.0.1:42785_) [n:127.0.0.1:42785_    ] o.a.s.c.c.ZkStateReader Updated live nodes from ZooKeeper... (2) -> (3)
   [junit4]   2> 800017 INFO  (zkCallback-762-thread-1-processing-n:127.0.0.1:34455_) [n:127.0.0.1:34455_    ] o.a.s.c.c.ZkStateReader Updated live nodes from ZooKeeper... (2) -> (3)
   [junit4]   2> 800438 INFO  (TEST-FullSolrCloudDistribCmdsTest.test-seed#[BD674BF60FFB7CCA]) [n:127.0.0.1:45645_    ] o.a.s.m.r.SolrJmxReporter JMX monitoring for 'solr.node' (registry 'solr.node') enabled at server: com.sun.jmx.mbeanserver.JmxMBeanServer@14df4b07
   [junit4]   2> 800454 INFO  (TEST-FullSolrCloudDistribCmdsTest.test-seed#[BD674BF60FFB7CCA]) [n:127.0.0.1:45645_    ] o.a.s.m.r.SolrJmxReporter JMX monitoring for 'solr.jvm' (registry 'solr.jvm') enabled at server: com.sun.jmx.mbeanserver.JmxMBeanServer@14df4b07
   [junit4]   2> 800454 INFO  (TEST-FullSolrCloudDistribCmdsTest.test-seed#[BD674BF60FFB7CCA]) [n:127.0.0.1:45645_    ] o.a.s.m.r.SolrJmxReporter JMX monitoring for 'solr.jetty' (registry 'solr.jetty') enabled at server: com.sun.jmx.mbeanserver.JmxMBeanServer@14df4b07
   [junit4]   2> 800472 INFO  (TEST-FullSolrCloudDistribCmdsTest.test-seed#[BD674BF60FFB7CCA]) [n:127.0.0.1:45645_    ] o.a.s.c.CorePropertiesLocator Found 0 core definitions underneath /home/jenkins/jenkins-slave/workspace/Lucene-Solr-Tests-7.x/solr/build/solr-core/test/J2/../../../../../../../../../../home/jenkins/jenkins-slave/workspace/Lucene-Solr-Tests-7.x/solr/build/solr-core/test/J2/temp/solr.cloud.FullSolrCloudDistribCmdsTest_BD674BF60FFB7CCA-001/shard-2-001/cores
   [junit4]   2> 800622 INFO  (qtp316943632-5486) [n:127.0.0.1:45645_    ] o.a.s.h.a.CollectionsHandler Invoked Collection Action :addreplica with params node=127.0.0.1:45645_&action=ADDREPLICA&collection=collection1&shard=shard3&type=NRT&wt=javabin&version=2 and sendToOCPQueue=true
   [junit4]   2> 800707 INFO  (OverseerThreadFactory-2135-thread-4-processing-n:127.0.0.1:42785_) [n:127.0.0.1:42785_    ] o.a.s.c.AddReplicaCmd Node Identified 127.0.0.1:45645_ for creating new replica
   [junit4]   2> 800825 INFO  (qtp316943632-5482) [n:127.0.0.1:45645_    ] o.a.s.h.a.CoreAdminOperation core create command qt=/admin/cores&collection.configName=conf1&name=collection1_shard3_replica_n3&action=CREATE&collection=collection1&shard=shard3&wt=javabin&version=2&replicaType=NRT
   [junit4]   2> 800825 INFO  (qtp316943632-5482) [n:127.0.0.1:45645_    ] o.a.s.c.TransientSolrCoreCacheDefault Allocating transient cache for 4 transient cores
   [junit4]   2> 801851 INFO  (qtp316943632-5482) [n:127.0.0.1:45645_ c:collection1 s:shard3  x:collection1_shard3_replica_n3] o.a.s.c.SolrConfig Using Lucene MatchVersion: 7.1.0
   [junit4]   2> 801893 INFO  (qtp316943632-5482) [n:127.0.0.1:45645_ c:collection1 s:shard3  x:collection1_shard3_replica_n3] o.a.s.s.IndexSchema [collection1_shard3_replica_n3] Schema name=test
   [junit4]   2> 802270 INFO  (qtp316943632-5482) [n:127.0.0.1:45645_ c:collection1 s:shard3  x:collection1_shard3_replica_n3] o.a.s.s.IndexSchema Loaded schema test/1.6 with uniqueid field id
   [junit4]   2> 802313 INFO  (qtp316943632-5482) [n:127.0.0.1:45645_ c:collection1 s:shard3  x:collection1_shard3_replica_n3] o.a.s.c.CoreContainer Creating SolrCore 'collection1_shard3_replica_n3' using configuration from collection collection1, trusted=true
   [junit4]   2> 802313 INFO  (qtp316943632-5482) [n:127.0.0.1:45645_ c:collection1 s:shard3  x:collection1_shard3_replica_n3] o.a.s.m.r.SolrJmxReporter JMX monitoring for 'solr.core.collection1.shard3.replica_n3' (registry 'solr.core.collection1.shard3.replica_n3') enabled at server: com.sun.jmx.mbeanserver.JmxMBeanServer@14df4b07
   [junit4]   2> 802313 INFO  (qtp316943632-5482) [n:127.0.0.1:45645_ c:collection1 s:shard3  x:collection1_shard3_replica_n3] o.a.s.c.SolrCore solr.RecoveryStrategy.Builder
   [junit4]   2> 802313 INFO  (qtp316943632-5482) [n:127.0.0.1:45645_ c:collection1 s:shard3  x:collection1_shard3_replica_n3] o.a.s.c.SolrCore [[collection1_shard3_replica_n3] ] Opening new SolrCore at [/home/jenkins/jenkins-slave/workspace/Lucene-Solr-Tests-7.x/solr/build/solr-core/test/J2/temp/solr.cloud.FullSolrCloudDistribCmdsTest_BD674BF60FFB7CCA-001/shard-2-001/cores/collection1_shard3_replica_n3], dataDir=[/home/jenkins/jenkins-slave/workspace/Lucene-Solr-Tests-7.x/solr/build/solr-core/test/J2/../../../../../../../../../../home/jenkins/jenkins-slave/workspace/Lucene-Solr-Tests-7.x/solr/build/solr-core/test/J2/temp/solr.cloud.FullSolrCloudDistribCmdsTest_BD674BF60FFB7CCA-001/shard-2-001/cores/collection1_shard3_replica_n3/data/]
   [junit4]   2> 802348 INFO  (qtp316943632-5482) [n:127.0.0.1:45645_ c:collection1 s:shard3  x:collection1_shard3_replica_n3] o.a.s.u.RandomMergePolicy RandomMergePolicy wrapping class org.apache.lucene.index.TieredMergePolicy: [TieredMergePolicy: maxMergeAtOnce=47, maxMergeAtOnceExplicit=34, maxMergedSegmentMB=23.9375, floorSegmentMB=1.3779296875, forceMergeDeletesPctAllowed=19.841286615352494, segmentsPerTier=19.0, maxCFSSegmentSizeMB=8.796093022207999E12, noCFSRatio=0.0
   [junit4]   2> 802368 WARN  (qtp316943632-5482) [n:127.0.0.1:45645_ c:collection1 s:shard3  x:collection1_shard3_replica_n3] o.a.s.c.RequestHandlers INVALID paramSet a in requestHandler {type = requestHandler,name = /dump,class = DumpRequestHandler,attributes = {initParams=a, name=/dump, class=DumpRequestHandler},args = {defaults={a=A,b=B}}}
   [junit4]   2> 802643 INFO  (qtp316943632-5482) [n:127.0.0.1:45645_ c:collection1 s:shard3  x:collection1_shard3_replica_n3] o.a.s.u.UpdateHandler Using UpdateLog implementation: org.apache.solr.update.UpdateLog
   [junit4]   2> 802643 INFO  (qtp316943632-5482) [n:127.0.0.1:45645_ c:collection1 s:shard3  x:collection1_shard3_replica_n3] o.a.s.u.UpdateLog Initializing UpdateLog: dataDir= defaultSyncLevel=FLUSH numRecordsToKeep=100 maxNumLogsToKeep=10 numVersionBuckets=65536
   [junit4]   2> 802644 INFO  (qtp316943632-5482) [n:127.0.0.1:45645_ c:collection1 s:shard3  x:collection1_shard3_replica_n3] o.a.s.u.CommitTracker Hard AutoCommit: disabled
   [junit4]   2> 802644 INFO  (qtp316943632-5482) [n:127.0.0.1:45645_ c:collection1 s:shard3  x:collection1_shard3_replica_n3] o.a.s.u.CommitTracker Soft AutoCommit: disabled
   [junit4]   2> 802645 INFO  (qtp316943632-5482) [n:127.0.0.1:45645_ c:collection1 s:shard3  x:collection1_shard3_replica_n3] o.a.s.u.RandomMergePolicy RandomMergePolicy wrapping class org.apache.lucene.index.TieredMergePolicy: [TieredMergePolicy: maxMergeAtOnce=21, maxMergeAtOnceExplicit=15, maxMergedSegmentMB=98.69921875, floorSegmentMB=0.6572265625, forceMergeDeletesPctAllowed=25.320352790408105, segmentsPerTier=28.0, maxCFSSegmentSizeMB=8.796093022207999E12, noCFSRatio=0.46112342894838354
   [junit4]   2> 802645 INFO  (qtp316943632-5482) [n:127.0.0.1:45645_ c:collection1 s:shard3  x:collection1_shard3_replica_n3] o.a.s.s.SolrIndexSearcher Opening [Searcher@581e1a24[collection1_shard3_replica_n3] main]
   [junit4]   2> 802646 INFO  (qtp316943632-5482) [n:127.0.0.1:45645_ c:collection1 s:shard3  x:collection1_shard3_replica_n3] o.a.s.r.ManagedResourceStorage Configured ZooKeeperStorageIO with znodeBase: /configs/conf1
   [junit4]   2> 802646 INFO  (qtp316943632-5482) [n:127.0.0.1:45645_ c:collection1 s:shard3  x:collection1_shard3_replica_n3] o.a.s.r.ManagedResourceStorage Loaded null at path _rest_managed.json using ZooKeeperStorageIO:path=/configs/conf1
   [junit4]   2> 802663 INFO  (qtp316943632-5482) [n:127.0.0.1:45645_ c:collection1 s:shard3  x:collection1_shard3_replica_n3] o.a.s.h.ReplicationHandler Commits will be reserved for  10000
   [junit4]   2> 802672 INFO  (searcherExecutor-2160-thread-1-processing-n:127.0.0.1:45645_ x:collection1_shard3_replica_n3 s:shard3 c:collection1) [n:127.0.0.1:45645_ c:collection1 s:shard3  x:collection1_shard3_replica_n3] o.a.s.c.SolrCore [collection1_shard3_replica_n3] Registered new searcher Searcher@581e1a24[collection1_shard3_replica_n3] main{ExitableDirectoryReader(UninvertingDirectoryReader())}
   [junit4]   2> 802672 INFO  (qtp316943632-5482) [n:127.0.0.1:45645_ c:collection1 s:shard3  x:collection1_shard3_replica_n3] o.a.s.u.UpdateLog Could not find max version in index or recent updates, using new clock 1574657337602342912
   [junit4]   2> 802685 INFO  (qtp316943632-5482) [n:127.0.0.1:45645_ c:collection1 s:shard3  x:collection1_shard3_replica_n3] o.a.s.c.ShardLeaderElectionContext Enough replicas found to continue.
   [junit4]   2> 802685 INFO  (qtp316943632-5482) [n:127.0.0.1:45645_ c:collection1 s:shard3  x:collection1_shard3_replica_n3] o.a.s.c.ShardLeaderElectionContext I may be the new leader - try and sync
   [junit4]   2> 802685 INFO  (qtp316943632-5482) [n:127.0.0.1:45645_ c:collection1 s:shard3  x:collection1_shard3_replica_n3] o.a.s.c.SyncStrategy Sync replicas to http://127.0.0.1:45645/collection1_shard3_replica_n3/
   [junit4]   2> 802685 INFO  (qtp316943632-5482) [n:127.0.0.1:45645_ c:collection1 s:shard3  x:collection1_shard3_replica_n3] o.a.s.c.SyncStrategy Sync Success - now sync replicas to me
   [junit4]   2> 802686 INFO  (qtp316943632-5482) [n:127.0.0.1:45645_ c:collection1 s:shard3  x:collection1_shard3_replica_n3] o.a.s.c.SyncStrategy http://127.0.0.1:45645/collection1_shard3_replica_n3/ has no replicas
   [junit4]   2> 802686 INFO  (qtp316943632-5482) [n:127.0.0.1:45645_ c:collection1 s:shard3  x:collection1_shard3_replica_n3] o.a.s.c.ShardLeaderElectionContext Found all replicas participating in election, clear LIR
   [junit4]   2> 802699 INFO  (qtp316943632-5482) [n:127.0.0.1:45645_ c:collection1 s:shard3  x:collection1_shard3_replica_n3] o.a.s.c.ShardLeaderElectionContext I am the new leader: http://127.0.0.1:45645/collection1_shard3_replica_n3/ shard3
   [junit4]   2> 802859 INFO  (qtp316943632-5482) [n:127.0.0.1:45645_ c:collection1 s:shard3  x:collection1_shard3_replica_n3] o.a.s.c.ZkController I am the leader, no recovery necessary
   [junit4]   2> 802860 INFO  (qtp316943632-5482) [n:127.0.0.1:45645_ c:collection1 s:shard3  x:collection1_shard3_replica_n3] o.a.s.s.HttpSolrCall [admin] webapp=null path=/admin/cores params={qt=/admin/cores&collection.configName=conf1&name=collection1_shard3_replica_n3&action=CREATE&collection=collection1&shard=shard3&wt=javabin&version=2&replicaType=NRT} status=0 QTime=2035
   [junit4]   2> 802943 INFO  (qtp316943632-5486) [n:127.0.0.1:45645_    ] o.a.s.s.HttpSolrCall [admin] webapp=null path=/admin/collections params={node=127.0.0.1:45645_&action=ADDREPLICA&collection=collection1&shard=shard3&type=NRT&wt=javabin&version=2} status=0 QTime=2321
   [junit4]   2> 803410 INFO  (TEST-FullSolrCloudDistribCmdsTest.test-seed#[BD674BF60FFB7CCA]) [    ] o.a.s.c.AbstractFullDistribZkTestBase create jetty 3 in directory /home/jenkins/jenkins-slave/workspace/Lucene-Solr-Tests-7.x/solr/build/solr-core/test/J2/temp/solr.cloud.FullSolrCloudDistribCmdsTest_BD674BF60FFB7CCA-001/shard-3-001 of type NRT
   [junit4]   2> 803414 INFO  (TEST-FullSolrCloudDistribCmdsTest.test-seed#[BD674BF60FFB7CCA]) [    ] o.e.j.s.Server jetty-9.3.14.v20161028
   [junit4]   2> 803431 INFO  (TEST-FullSolrCloudDistribCmdsTest.test-seed#[BD674BF60FFB7CCA]) [    ] o.e.j.s.h.ContextHandler Started o.e.j.s.ServletContextHandler@6934134e{/,null,AVAILABLE}
   [junit4]   2> 803432 INFO  (TEST-FullSolrCloudDistribCmdsTest.test-seed#[BD674BF60FFB7CCA]) [    ] o.e.j.s.AbstractConnector Started ServerConnector@6f4eeb7b{HTTP/1.1,[http/1.1]}{127.0.0.1:39586}
   [junit4]   2> 803432 INFO  (TEST-FullSolrCloudDistribCmdsTest.test-seed#[BD674BF60FFB7CCA]) [    ] o.e.j.s.Server Started @814371ms
   [junit4]   2> 803432 INFO  (TEST-FullSolrCloudDistribCmdsTest.test-seed#[BD674BF60FFB7CCA]) [    ] o.a.s.c.s.e.JettySolrRunner Jetty properties: {solr.data.dir=/home/jenkins/jenkins-slave/workspace/Lucene-Solr-Tests-7.x/solr/build/solr-core/test/J2/temp/solr.cloud.FullSolrCloudDistribCmdsTest_BD674BF60FFB7CCA-001/tempDir-001/jetty3, solrconfig=solrconfig.xml, hostContext=/, hostPort=39586, coreRootDirectory=/home/jenkins/jenkins-slave/workspace/Lucene-Solr-Tests-7.x/solr/build/solr-core/test/J2/../../../../../../../../../../home/jenkins/jenkins-slave/workspace/Lucene-Solr-Tests-7.x/solr/build/solr-core/test/J2/temp/solr.cloud.FullSolrCloudDistribCmdsTest_BD674BF60FFB7CCA-001/shard-3-001/cores}
   [junit4]   2> 803432 ERROR (TEST-FullSolrCloudDistribCmdsTest.test-seed#[BD674BF60FFB7CCA]) [    ] o.a.s.s.StartupLoggingUtils Missing Java Option solr.log.dir. Logging may be missing or incomplete.
   [junit4]   2> 803528 INFO  (TEST-FullSolrCloudDistribCmdsTest.test-seed#[BD674BF60FFB7CCA]) [    ] o.a.s.s.SolrDispatchFilter  ___      _       Welcome to Apache Solr? version 7.1.0
   [junit4]   2> 803528 INFO  (TEST-FullSolrCloudDistribCmdsTest.test-seed#[BD674BF60FFB7CCA]) [    ] o.a.s.s.SolrDispatchFilter / __| ___| |_ _   Starting in cloud mode on port null
   [junit4]   2> 803528 INFO  (TEST-FullSolrCloudDistribCmdsTest.test-seed#[BD674BF60FFB7CCA]) [    ] o.a.s.s.SolrDispatchFilter \__ \/ _ \ | '_|  Install dir: null, Default config dir: null
   [junit4]   2> 803528 INFO  (TEST-FullSolrCloudDistribCmdsTest.test-seed#[BD674BF60FFB7CCA]) [    ] o.a.s.s.SolrDispatchFilter |___/\___/_|_|    Start time: 2017-08-02T21:44:20.868Z
   [junit4]   2> 803544 INFO  (TEST-FullSolrCloudDistribCmdsTest.test-seed#[BD674BF60FFB7CCA]) [    ] o.a.s.s.SolrDispatchFilter Loading solr.xml from SolrHome (not found in ZooKeeper)
   [junit4]   2> 803544 INFO  (TEST-FullSolrCloudDistribCmdsTest.test-seed#[BD674BF60FFB7CCA]) [    ] o.a.s.c.SolrXmlConfig Loading container configuration from /home/jenkins/jenkins-slave/workspace/Lucene-Solr-Tests-7.x/solr/build/solr-core/test/J2/temp/solr.cloud.FullSolrCloudDistribCmdsTest_BD674BF60FFB7CCA-001/shard-3-001/solr.xml
   [junit4]   2> 803602 INFO  (TEST-FullSolrCloudDistribCmdsTest.test-seed#[BD674BF60FFB7CCA]) [    ] o.a.s.c.SolrXmlConfig MBean server found: com.sun.jmx.mbeanserver.JmxMBeanServer@14df4b07, but no JMX reporters were configured - adding default JMX reporter.
   [junit4]   2> 803630 INFO  (TEST-FullSolrCloudDistribCmdsTest.test-seed#[BD674BF60FFB7CCA]) [    ] o.a.s.c.ZkContainer Zookeeper client=127.0.0.1:42775/solr
   [junit4]   2> 803787 INFO  (TEST-FullSolrCloudDistribCmdsTest.test-seed#[BD674BF60FFB7CCA]) [n:127.0.0.1:39586_    ] o.a.s.c.c.ZkStateReader Updated live nodes from ZooKeeper... (0) -> (3)
   [junit4]   2> 803788 INFO  (TEST-FullSolrCloudDistribCmdsTest.test-seed#[BD674BF60FFB7CCA]) [n:127.0.0.1:39586_    ] o.a.s.c.Overseer Overseer (id=null) closing
   [junit4]   2> 803806 INFO  (TEST-FullSolrCloudDistribCmdsTest.test-seed#[BD674BF60FFB7CCA]) [n:127.0.0.1:39586_    ] o.a.s.c.ZkController Register node as live in ZooKeeper:/live_nodes/127.0.0.1:39586_
   [junit4]   2> 803807 INFO  (zkCallback-757-thread-1) [    ] o.a.s.c.c.ZkStateReader Updated live nodes from ZooKeeper... (3) -> (4)
   [junit4]   2> 803837 INFO  (zkCallback-768-thread-1-processing-n:127.0.0.1:45645_) [n:127.0.0.1:45645_    ] o.a.s.c.c.ZkStateReader Updated live nodes from ZooKeeper... (3) -> (4)
   [junit4]   2> 803837 INFO  (zkCallback-750-thread-1-processing-n:127.0.0.1:42785_) [n:127.0.0.1:42785_    ] o.a.s.c.c.ZkStateReader Updated live nodes from ZooKeeper... (3) -> (4)
   [junit4]   2> 803838 INFO  (zkCallback-762-thread-1-processing-n:127.0.0.1:34455_) [n:127.0.0.1:34455_    ] o.a.s.c.c.ZkStateReader Updated live nodes from ZooKeeper... (3) -> (4)
   [junit4]   2> 803841 INFO  (zkCallback-774-thread-1-processing-n:127.0.0.1:39586_) [n:127.0.0.1:39586_    ] o.a.s.c.c.ZkStateReader Updated live nodes from ZooKeeper... (3) -> (4)
   [junit4]   2> 804370 INFO  (TEST-FullSolrCloudDistribCmdsTest.test-seed#[BD674BF60FFB7CCA]) [n:127.0.0.1:39586_    ] o.a.s.m.r.SolrJmxReporter JMX monitoring for 'solr.node' (registry 'solr.node') enabled at server: com.sun.jmx.mbeanserver.JmxMBeanServer@14df4b07
   [junit4]   2> 804407 INFO  (TEST-FullSolrCloudDistribCmdsTest.test-seed#[BD674BF60FFB7CCA]) [n:127.0.0.1:39586_    ] o.a.s.m.r.SolrJmxReporter JMX monitoring for 'solr.jvm' (registry 'solr.jvm') enabled at server: com.sun.jmx.mbeanserver.JmxMBeanServer@14df4b07
   [junit4]   2> 804407 INFO  (TEST-FullSolrCloudDistribCmdsTest.test-seed#[BD674BF60FFB7CCA]) [n:127.0.0.1:39586_    ] o.a.s.m.r.SolrJmxReporter JMX monitoring for 'solr.jetty' (registry 'solr.jetty') enabled at server: com.sun.jmx.mbeanserver.JmxMBeanServer@14df4b07
   [junit4]   2> 804409 INFO  (TEST-FullSolrCloudDistribCmdsTest.test-seed#[BD674BF60FFB7CCA]) [n:127.0.0.1:39586_    ] o.a.s.c.CorePropertiesLocator Found 0 core definitions underneath /home/jenkins/jenkins-slave/workspace/Lucene-Solr-Tests-7.x/solr/build/solr-core/test/J2/../../../../../../../../../../home/jenkins/jenkins-slave/workspace/Lucene-Solr-Tests-7.x/solr/build/solr-core/test/J2/temp/solr.cloud.FullSolrCloudDistribCmdsTest_BD674BF60FFB7CCA-001/shard-3-001/cores
   [junit4]   2> 804605 INFO  (qtp316943632-5487) [n:127.0.0.1:45645_    ] o.a.s.h.a.CollectionsHandler Invoked Collection Action :addreplica with params node=127.0.0.1:39586_&action=ADDREPLICA&collection=collection1&shard=shard1&type=NRT&wt=javabin&version=2 and sendToOCPQueue=true
   [junit4]   2> 804606 INFO  (OverseerCollectionConfigSetProcessor-98416082810503172-127.0.0.1:42785_-n_0000000000) [n:127.0.0.1:42785_    ] o.a.s.c.OverseerTaskQueue Response ZK path: /overseer/collection-queue-work/qnr-0000000006 doesn't exist.  Requestor may have disconnected from ZooKeeper
   [junit4]   2> 804607 INFO  (OverseerThreadFactory-2135-thread-5-processing-n:127.0.0.1:42785_) [n:127.0.0.1:42785_    ] o.a.s.c.AddReplicaCmd Node Identified 127.0.0.1:39586_ for creating new replica
   [junit4]   2> 804677 INFO  (qtp1863173047-5514) [n:127.0.0.1:39586_    ] o.a.s.h.a.CoreAdminOperation core create command qt=/admin/cores&collection.configName=conf1&name=collection1_shard1_replica_n5&action=CREATE&collection=collection1&shard=shard1&wt=javabin&version=2&replicaType=NRT
   [junit4]   2> 804678 INFO  (qtp1863173047-5514) [n:127.0.0.1:39586_    ] o.a.s.c.TransientSolrCoreCacheDefault Allocating transient cache for 4 transient cores
   [junit4]   2> 805898 INFO  (qtp1863173047-5514) [n:127.0.0.1:39586_ c:collection1 s:shard1  x:collection1_shard1_replica_n5] o.a.s.c.SolrConfig Using Lucene MatchVersion: 7.1.0
   [junit4]   2> 806087 INFO  (qtp1863173047-5514) [n:127.0.0.1:39586_ c:collection1 s:shard1  x:collection1_shard1_replica_n5] o.a.s.s.IndexSchema [collection1_shard1_replica_n5] Schema name=test
   [junit4]   2> 806477 INFO  (qtp1863173047-5514) [n:127.0.0.1:39586_ c:collection1 s:shard1  x:collection1_shard1_replica_n5] o.a.s.s.IndexSchema Loaded schema test/1.6 with uniqueid field id
   [junit4]   2> 806562 INFO  (qtp1863173047-5514) [n:127.0.0.1:39586_ c:collection1 s:shard1  x:collection1_shard1_replica_n5] o.a.s.c.CoreContainer Creating SolrCore 'collection1_shard1_replica_n5' using configuration from collection collection1, trusted=true
   [junit4]   2> 806562 INFO  (qtp1863173047-5514) [n:127.0.0.1:39586_ c:collection1 s:shard1  x:collection1_shard1_replica_n5] o.a.s.m.r.SolrJmxReporter JMX monitoring for 'solr.core.collection1.shard1.replica_n5' (registry 'solr.core.collection1.shard1.replica_n5') enabled at server: com.sun.jmx.mbeanserver.JmxMBeanServer@14df4b07
   [junit4]   2> 806563 INFO  (qtp1863173047-5514) [n:127.0.0.1:39586_ c:collection1 s:shard1  x:collection1_shard1_replica_n5] o.a.s.c.SolrCore solr.RecoveryStrategy.Builder
   [junit4]   2> 806563 INFO  (qtp1863173047-5514) [n:127.0.0.1:39586_ c:collection1 s:shard1  x:collection1_shard1_replica_n5] o.a.s.c.SolrCore [[collection1_shard1_replica_n5] ] Opening new SolrCore at [/home/jenkins/jenkins-slave/workspace/Lucene-Solr-Tests-7.x/solr/build/solr-core/test/J2/temp/solr.cloud.FullSolrCloudDistribCmdsTest_BD674BF60FFB7CCA-001/shard-3-001/cores/collection1_shard1_replica_n5], dataDir=[/home/jenkins/jenkins-slave/workspace/Lucene-Solr-Tests-7.x/solr/build/solr-core/test/J2/../../../../../../../../../../home/jenkins/jenkins-slave/workspace/Lucene-Solr-Tests-7.x/solr/build/solr-core/test/J2/temp/solr.cloud.FullSolrCloudDistribCmdsTest_BD674BF60FFB7CCA-001/shard-3-001/cores/collection1_shard1_replica_n5/data/]
   [junit4]   2> 806565 INFO  (qtp1863173047-5514) [n:127.0.0.1:39586_ c:collection1 s:shard1  x:collection1_shard1_replica_n5] o.a.s.u.RandomMergePolicy RandomMergePolicy wrapping class org.apache.lucene.index.TieredMergePolicy: [TieredMergePolicy: maxMergeAtOnce=47, maxMergeAtOnceExplicit=34, maxMergedSegmentMB=23.9375, floorSegmentMB=1.3779296875, forceMergeDeletesPctAllowed=19.841286615352494, segmentsPerTier=19.0, maxCFSSegmentSizeMB=8.796093022207999E12, noCFSRatio=0.0
   [junit4]   2> 806584 WARN  (qtp1863173047-5514) [n:127.0.0.1:39586_ c:collection1 s:shard1  x:collection1_shard1_replica_n5] o.a.s.c.RequestHandlers INVALID paramSet a in requestHandler {type = requestHandler,name = /dump,class = DumpRequestHandler,attributes = {initParams=a, name=/dump, class=DumpRequestHandler},args = {defaults={a=A,b=B}}}
   [junit4]   2> 806784 INFO  (qtp1863173047-5514) [n:127.0.0.1:39586_ c:collection1 s:shard1  x:collection1_shard1_replica_n5] o.a.s.u.UpdateHandler Using UpdateLog implementation: org.apache.solr.update.UpdateLog
   [junit4]   2> 806784 INFO  (qtp1863173047-5514) [n:127.0.0.1:39586_ c:collection1 s:shard1  x:collection1_shard1_replica_n5] o.a.s.u.UpdateLog Initializing UpdateLog: dataDir= defaultSyncLevel=FLUSH numRecordsToKeep=100 maxNumLogsToKeep=10 numVersionBuckets=65536
   [junit4]   2> 806801 INFO  (qtp1863173047-5514) [n:127.0.0.1:39586_ c:collection1 s:shard1  x:collection1_shard1_replica_n5] o.a.s.u.CommitTracker Hard AutoCommit: disabled
   [junit4]   2> 806802 INFO  (qtp1863173047-5514) [n:127.0.0.1:39586_ c:collection1 s:shard1  x:collection1_shard1_replica_n5] o.a.s.u.CommitTracker Soft AutoCommit: disabled
   [junit4]   2> 806803 INFO  (qtp1863173047-5514) [n:127.0.0.1:39586_ c:collection1 s:shard1  x:collection1_shard1_replica_n5] o.a.s.u.RandomMergePolicy RandomMergePolicy wrapping class org.apache.lucene.index.TieredMergePolicy: [TieredMergePolicy: maxMergeAtOnce=21, maxMergeAtOnceExplicit=15, maxMergedSegmentMB=98.69921875, floorSegmentMB=0.6572265625, forceMergeDeletesPctAllowed=25.320352790408105, segmentsPerTier=28.0, maxCFSSegmentSizeMB=8.796093022207999E12, noCFSRatio=0.46112342894838354
   [junit4]   2> 806803 INFO  (qtp1863173047-5514) [n:127.0.0.1:39586_ c:collection1 s:shard1  x:collection1_shard1_replica_n5] o.a.s.s.SolrIndexSearcher Opening [Searcher@432fea3d[collection1_shard1_replica_n5] main]
   [junit4]   2> 806804 INFO  (qtp1863173047-5514) [n:127.0.0.1:39586_ c:collection1 s:shard1  x:collection1_shard1_replica_n5] o.a.s.r.ManagedResourceStorage Configured ZooKeeperStorageIO with znodeBase: /configs/conf1
   [junit4]   2> 806804 INFO  (qtp1863173047-5514) [n:127.0.0.1:39586_ c:collection1 s:shard1  x:collection1_shard1_replica_n5] o.a.s.r.ManagedResourceStorage Loaded null at path _rest_managed.json using ZooKeeperStorageIO:path=/configs/conf1
   [junit4]   2> 806804 INFO  (qtp1863173047-5514) [n:127.0.0.1:39586_ c:collection1 s:shard1  x:collection1_shard1_replica_n5] o.a.s.h.ReplicationHandler Commits will be reserved for  10000
   [junit4]   2> 806819 INFO  (searcherExecutor-2171-thread-1-processing-n:127.0.0.1:39586_ x:collection1_shard1_replica_n5 s:shard1 c:collection1) [n:127.0.0.1:39586_ c:collection1 s:shard1  x:collection1_shard1_replica_n5] o.a.s.c.SolrCore [collection1_shard1_replica_n5] Registered new searcher Searcher@432fea3d[collection1_shard1_replica_n5] main{ExitableDirectoryReader(UninvertingDirectoryReader())}
   [junit4]   2> 806819 INFO  (qtp1863173047-5514) [n:127.0.0.1:39586_ c:collection1 s:shard1  x:collection1_shard1_replica_n5] o.a.s.u.UpdateLog Could not find max version in index or recent updates, using new clock 1574657341950787584
   [junit4]   2> 806835 INFO  (qtp1863173047-5514) [n:127.0.0.1:39586_ c:collection1 s:shard1  x:collection1_shard1_replica_n5] o.a.s.c.ShardLeaderElectionContext Enough replicas found to continue.
   [junit4]   2> 806835 INFO  (qtp1863173047-5514) [n:127.0.0.1:39586_ c:collection1 s:shard1  x:collection1_shard1_replica_n5] o.a.s.c.ShardLeaderElectionContext I may be the new leader - try and sync
   [junit4]   2> 806835 INFO  (qtp1863173047-5514) [n:127.0.0.1:39586_ c:collection1 s:shard1  x:collection1_shard1_replica_n5] o.a.s.c.SyncStrategy Sync replicas to http://127.0.0.1:39586/collection1_shard1_replica_n5/
   [junit4]   2> 806835 INFO  (qtp1863173047-5514) [n:127.0.0.1:39586_ c:collection1 s:shard1  x:collection1_shard1_replica_n5] o.a.s.c.SyncStrategy Sync Success - now sync replicas to me
   [junit4]   2> 806835 INFO  (qtp1863173047-5514) [n:127.0.0.1:39586_ c:collection1 s:shard1  x:collection1_shard1_replica_n5] o.a.s.c.SyncStrategy http://127.0.0.1:39586/collection1_shard1_replica_n5/ has no replicas
   [junit4]   2> 806835 INFO  (qtp1863173047-5514) [n:127.0.0.1:39586_ c:collection1 s:shard1  x:collection1_shard1_replica_n5] o.a.s.c.ShardLeaderElectionContext Found all replicas participating in election, clear LIR
   [junit4]   2> 806836 INFO  (qtp1863173047-5514) [n:127.0.0.1:39586_ c:collection1 s:shard1  x:collection1_shard1_replica_n5] o.a.s.c.ShardLeaderElectionContext I am the new leader: http://127.0.0.1:39586/collection1_shard1_replica_n5/ shard1
   [junit4]   2> 807000 INFO  (qtp1863173047-5514) [n:127.0.0.1:39586_ c:collection1 s:shard1  x:collection1_shard1_replica_n5] o.a.s.c.ZkController I am the leader, no recovery necessary
   [junit4]   2> 807053 INFO  (qtp1863173047-5514) [n:127.0.0.1:39586_ c:collection1 s:shard1  x:collection1_shard1_replica_n5] o.a.s.s.HttpSolrCall [admin] webapp=null path=/admin/cores params={qt=/admin/cores&collection.configName=conf1&name=collection1_shard1_replica_n5&action=CREATE&collection=collection1&shard=shard1&wt=javabin&version=2&replicaType=NRT} status=0 QTime=2375
   [junit4]   2> 807082 INFO  (qtp316943632-5487) [n:127.0.0.1:45645_    ] o.a.s.s.HttpSolrCall [admin] webapp=null path=/admin/collections params={node=127.0.0.1:39586_&action=ADDREPLICA&collection=collection1&shard=shard1&type=NRT&wt=javabin&version=2} status=0 QTime=2477
   [junit4]   2> 808277 INFO  (TEST-FullSolrCloudDistribCmdsTest.test-seed#[BD674BF60FFB7CCA]) [    ] o.a.s.c.AbstractFullDistribZkTestBase create jetty 4 in directory /home/jenkins/jenkins-slave/workspace/Lucene-Solr-Tests-7.x/solr/build/solr-core/test/J2/temp/solr.cloud.FullSolrCloudDistribCmdsTest_BD674BF60FFB7CCA-001/shard-4-001 of type NRT
   [junit4]   2> 808278 INFO  (TEST-FullSolrCloudDistribCmdsTest.test-seed#[BD674BF60FFB7CCA]) [    ] o.e.j.s.Server jetty-9.3.14.v20161028
   [junit4]   2> 808279 INFO  (TEST-FullSolrCloudDistribCmdsTest.test-seed#[BD674BF60FFB7CCA]) [    ] o.e.j.s.h.ContextHandler Started o.e.j.s.ServletContextHandler@46206606{/,null,AVAILABLE}
   [junit4]   2> 808279 INFO  (TEST-FullSolrCloudDistribCmdsTest.test-seed#[BD674BF60FFB7CCA]) [    ] o.e.j.s.AbstractConnector Started ServerConnector@6a3195b7{HTTP/1.1,[http/1.1]}{127.0.0.1:39648}
   [junit4]   2> 808279 INFO  (TEST-FullSolrCloudDistribCmdsTest.test-seed#[BD674BF60FFB7CCA]) [    ] o.e.j.s.Server Started @819218ms
   [junit4]   2> 808279 INFO  (TEST-FullSolrCloudDistribCmdsTest.test-seed#[BD674BF60FFB7CCA]) [    ] o.a.s.c.s.e.JettySolrRunner Jetty properties: {solr.data.dir=/home/jenkins/jenkins-slave/workspace/Lucene-Solr-Tests-7.x/solr/build/solr-core/test/J2/temp/solr.cloud.FullSolrCloudDistribCmdsTest_BD674BF60FFB7CCA-001/tempDir-001/jetty4, replicaType=NRT, solrconfig=solrconfig.xml, hostContext=/, hostPort=39648, coreRootDirectory=/home/jenkins/jenkins-slave/workspace/Lucene-Solr-Tests-7.x/solr/build/solr-core/test/J2/../../../../../../../../../../home/jenkins/jenkins-slave/workspace/Lucene-Solr-Tests-7.x/solr/build/solr-core/test/J2/temp/solr.cloud.FullSolrCloudDistribCmdsTest_BD674BF60FFB7CCA-001/shard-4-001/cores}
   [junit4]   2> 808279 ERROR (TEST-FullSolrCloudDistribCmdsTest.test-seed#[BD674BF60FFB7CCA]) [    ] o.a.s.s.StartupLoggingUtils Missing Java Option solr.log.dir. Logging may be missing or incomplete.
   [junit4]   2> 808297 INFO  (TEST-FullSolrCloudDistribCmdsTest.test-seed#[BD674BF60FFB7CCA]) [    ] o.a.s.s.SolrDispatchFilter  ___      _       Welcome to Apache Solr? version 7.1.0
   [junit4]   2> 808297 INFO  (TEST-FullSolrCloudDistribCmdsTest.test-seed#[BD674BF60FFB7CCA]) [    ] o.a.s.s.SolrDispatchFilter / __| ___| |_ _   Starting in cloud mode on port null
   [junit4]   2> 808297 INFO  (TEST-FullSolrCloudDistribCmdsTest.test-seed#[BD674BF60FFB7CCA]) [    ] o.a.s.s.SolrDispatchFilter \__ \/ _ \ | '_|  Install dir: null, Default config dir: null
   [junit4]   2> 808297 INFO  (TEST-FullSolrCloudDistribCmdsTest.test-seed#[BD674BF60FFB7CCA]) [    ] o.a.s.s.SolrDispatchFilter |___/\___/_|_|    Start time: 2017-08-02T21:44:25.637Z
   [junit4]   2> 808331 INFO  (TEST-FullSolrCloudDistribCmdsTest.test-seed#[BD674BF60FFB7CCA]) [    ] o.a.s.s.SolrDispatchFilter Loading solr.xml from SolrHome (not found in ZooKeeper)
   [junit4]   2> 808331 INFO  (TEST-FullSolrCloudDistribCmdsTest.test-seed#[BD674BF60FFB7CCA]) [    ] o.a.s.c.SolrXmlConfig Loading container configuration from /home/jenkins/jenkins-slave/workspace/Lucene-Solr-Tests-7.x/solr/build/solr-core/test/J2/temp/solr.cloud.FullSolrCloudDistribCmdsTest_BD674BF60FFB7CCA-001/shard-4-001/solr.xml
   [junit4]   2> 808498 INFO  (TEST-FullSolrCloudDistribCmdsTest.test-seed#[BD674BF60FFB7CCA]) [    ] o.a.s.c.SolrXmlConfig MBean server found: com.sun.jmx.mbeanserver.JmxMBeanServer@14df4b07, but no JMX reporters were configured - adding default JMX reporter.
   [junit4]   2> 808540 INFO  (TEST-FullSolrCloudDistribCmdsTest.test-seed#[BD674BF60FFB7CCA]) [    ] o.a.s.c.ZkContainer Zookeeper client=127.0.0.1:42775/solr
   [junit4]   2> 808617 INFO  (TEST-FullSolrCloudDistribCmdsTest.test-seed#[BD674BF60FFB7CCA]) [n:127.0.0.1:39648_    ] o.a.s.c.c.ZkStateReader Updated live nodes from ZooKeeper... (0) -> (4)
   [junit4]   2> 808635 INFO  (TEST-FullSolrCloudDistribCmdsTest.test-seed#[BD674BF60FFB7CCA]) [n:127.0.0.1:39648_    ] o.a.s.c.Overseer Overseer (id=null) closing
   [junit4]   2> 808636 INFO  (TEST-FullSolrCloudDistribCmdsTest.test-seed#[BD674BF60FFB7CCA]) [n:127.0.0.1:39648_    ] o.a.s.c.ZkController Register node as live in ZooKeeper:/live_nodes/127.0.0.1:39648_
   [junit4]   2> 808637 INFO  (zkCallback-757-thread-1) [    ] o.a.s.c.c.ZkStateReader Updated live nodes from ZooKeeper... (4) -> (5)
   [junit4]   2> 808637 INFO  (zkCallback-762-thread-1-processing-n:127.0.0.1:34455_) [n:127.0.0.1:34455_    ] o.a.s.c.c.ZkStateReader Updated live nodes from ZooKeeper... (4) -> (5)
   [junit4]   2> 808686 INFO  (zkCallback-774-thread-1-processing-n:127.0.0.1:39586_) [n:127.0.0.1:39586_    ] o.a.s.c.c.ZkStateReader Updated live nodes from ZooKeeper... (4) -> (5)
   [junit4]   2> 808686 INFO  (zkCallback-768-thread-1-processing-n:127.0.0.1:45645_) [n:127.0.0.1:45645_    ] o.a.s.c.c.ZkStateReader Updated live nodes from ZooKeeper... (4) -> (5)
   [junit4]   2> 808687 INFO  (zkCallback-780-thread-1-processing-n:127.0.0.1:39648_) [n:127.0.0.1:39648_    ] o.a.s.c.c.ZkStateReader Updated live nodes from ZooKeeper... (4) -> (5)
   [junit4]   2> 808687 INFO  (OverseerCollectionConfigSetProcessor-98416082810503172-127.0.0.1:42785_-n_0000000000) [n:127.0.0.1:42785_    ] o.a.s.c.OverseerTaskQueue Response ZK path: /overseer/collection-queue-work/qnr-0000000008 doesn't exist.  Requestor may have disconnected from ZooKeeper
   [junit4]   2> 808688 INFO  (zkCallback-750-thread-2-processing-n:127.0.0.1:42785_) [n:127.0.0.1:42785_    ] o.a.s.c.c.ZkStateReader Updated live nodes from ZooKeeper... (4) -> (5)
   [junit4]   2> 809052 INFO  (TEST-FullSolrCloudDistribCmdsTest.test-seed#[BD674BF60FFB7CCA]) [n:127.0.0.1:39648_    ] o.a.s.m.r.SolrJmxReporter JMX monitoring for 'solr.node' (registry 'solr.node') enabled at server: com.sun.jmx.mbeanserver.JmxMBeanServer@14df4b07
   [junit4]   2> 809069 INFO  (TEST-FullSolrCloudDistribCmdsTest.test-seed#[BD674BF60FFB7CCA]) [n:127.0.0.1:39648_    ] o.a.s.m.r.SolrJmxReporter JMX monitoring for 'solr.jvm' (registry 'solr.jvm') enabled at server: com.sun.jmx.mbeanserver.JmxMBeanServer@14df4b07
   [junit4]   2> 809069 INFO  (TEST-FullSolrCloudDistribCmdsTest.test-seed#[BD674BF60FFB7CCA]) [n:127.0.0.1:39648_    ] o.a.s.m.r.SolrJmxReporter JMX monitoring for 'solr.jetty' (registry 'solr.jetty') enabled at server: com.sun.jmx.mbeanserver.JmxMBeanServer@14df4b07
   [junit4]   2> 809070 INFO  (TEST-FullSolrCloudDistribCmdsTest.test-seed#[BD674BF60FFB7CCA]) [n:127.0.0.1:39648_    ] o.a.s.c.CorePropertiesLocator Found 0 core definitions underneath /home/jenkins/jenkins-slave/workspace/Lucene-Solr-Tests-7.x/solr/build/solr-core/test/J2/../../../../../../../../../../home/jenkins/jenkins-slave/workspace/Lucene-Solr-Tests-7.x/solr/build/solr-core/test/J2/temp/solr.cloud.FullSolrCloudDistribCmdsTest_BD674BF60FFB7CCA-001/shard-4-001/cores
   [junit4]   2> 809212 INFO  (qtp316943632-5489) [n:127.0.0.1:45645_    ] o.a.s.h.a.CollectionsHandler Invoked Collection Action :addreplica with params node=127.0.0.1:39648_&action=ADDREPLICA&collection=collection1&shard=shard2&type=NRT&wt=javabin&version=2 and sendToOCPQueue=true
   [junit4]   2> 809271 INFO  (OverseerThreadFactory-2135-thread-5-processing-n:127.0.0.1:42785_) [n:127.0.0.1:42785_    ] o.a.s.c.AddReplicaCmd Node Identified 127.0.0.1:39648_ for creating new replica
   [junit4]   2> 809312 INFO  (qtp145015049-5543) [n:127.0.0.1:39648_    ] o.a.s.h.a.CoreAdminOperation core create command qt=/admin/cores&collection.configName=conf1&name=collection1_shard2_replica_n7&action=CREATE&collection=collection1&shard=shard2&wt=javabin&version=2&replicaType=NRT
   [junit4]   2> 809312 INFO  (qtp145015049-5543) [n:127.0.0.1:39648_    ] o.a.s.c.TransientSolrCoreCacheDefault Allocating transient cache for 4 transient cores
   [junit4]   2> 810377 INFO  (qtp145015049-5543) [n:127.0.0.1:39648_ c:collection1 s:shard2  x:collection1_shard2_replica_n7] o.a.s.c.SolrConfig Using Lucene MatchVersion: 7.1.0
   [junit4]   2> 810416 INFO  (qtp145015049-5543) [n:127.0.0.1:39648_ c:collection1 s:shard2  x:collection1_shard2_replica_n7] o.a.s.s.IndexSchema [collection1_shard2_replica_n7] Schema name=test
   [junit4]   2> 810824 INFO  (qtp145015049-5543) [n:127.0.0.1:39648_ c:collection1 s:shard2  x:collection1_shard2_replica_n7] o.a.s.s.IndexSchema Loaded schema test/1.6 with uniqueid field id
   [junit4]   2> 810880 INFO  (qtp145015049-5543) [n:127.0.0.1:39648_ c:collection1 s:shard2  x:collection1_shard2_replica_n7] o.a.s.c.CoreContainer Creating SolrCore 'collection1_shard2_replica_n7' using configuration from collection collection1, trusted=true
   [junit4]   2> 810881 INFO  (qtp145015049-5543) [n:127.0.0.1:39648_ c:collection1 s:shard2  x:collection1_shard2_replica_n7] o.a.s.m.r.SolrJmxReporter JMX monitoring for 'solr.core.collection1.shard2.replica_n7' (registry 'solr.core.collection1.shard2.replica_n7') enabled at server: com.sun.jmx.mbeanserver.JmxMBeanServer@14df4b07
   [junit4]   2> 810881 INFO  (qtp145015049-5543) [n:127.0.0.1:39648_ c:collection1 s:shard2  x:collection1_shard2_replica_n7] o.a.s.c.SolrCore solr.RecoveryStrategy.Builder
   [junit4]   2> 810881 INFO  (qtp145015049-5543) [n:127.0.0.1:39648_ c:collection1 s:shard2  x:collection1_shard2_replica_n7] o.a.s.c.SolrCore [[collection1_shard2_replica_n7] ] Opening new SolrCore at [/home/jenkins/jenkins-slave/workspace/Lucene-Solr-Tests-7.x/solr/build/solr-core/test/J2/temp/solr.cloud.FullSolrCloudDistribCmdsTest_BD674BF60FFB7CCA-001/shard-4-001/cores/collection1_shard2_replica_n7], dataDir=[/home/jenkins/jenkins-slave/workspace/Lucene-Solr-Tests-7.x/solr/build/solr-core/test/J2/../../../../../../../../../../home/jenkins/jenkins-slave/workspace/Lucene-Solr-Tests-7.x/solr/build/solr-core/test/J2/temp/solr.cloud.FullSolrCloudDistribCmdsTest_BD674BF60FFB7CCA-001/shard-4-001/cores/collection1_shard2_replica_n7/data/]
   [junit4]   2> 810883 INFO  (qtp145015049-5543) [n:127.0.0.1:39648_ c:collection1 s:shard2  x:collection1_shard2_replica_n7] o.a.s.u.RandomMergePolicy RandomMergePolicy wrapping class org.apache.lucene.index.TieredMergePolicy: [TieredMergePolicy: maxMergeAtOnce=47, maxMergeAtOnceExplicit=34, maxMergedSegmentMB=23.9375, floorSegmentMB=1.3779296875, forceMergeDeletesPctAllowed=19.841286615352494, segmentsPerTier=19.0, maxCFSSegmentSizeMB=8.796093022207999E12, noCFSRatio=0.0
   [junit4]   2> 810898 WARN  (qtp145015049-5543) [n:127.0.0.1:39648_ c:collection1 s:shard2  x:collection1_shard2_replica_n7] o.a.s.c.RequestHandlers INVALID paramSet a in requestHandler {type = requestHandler,name = /dump,class = DumpRequestHandler,attributes = {initParams=a, name=/dump, class=DumpRequestHandler},args = {defaults={a=A,b=B}}}
   [junit4]   2> 811086 INFO  (qtp145015049-5543) [n:127.0.0.1:39648_ c:collection1 s:shard2  x:collection1_shard2_replica_n7] o.a.s.u.UpdateHandler Using UpdateLog implementation: org.apache.solr.update.UpdateLog
   [junit4]   2> 811086 INFO  (qtp145015049-5543) [n:127.0.0.1:39648_ c:collection1 s:shard2  x:collection1_shard2_replica_n7] o.a.s.u.UpdateLog Initializing UpdateLog: dataDir= defaultSyncLevel=FLUSH numRecordsToKeep=100 maxNumLogsToKeep=10 numVersionBuckets=65536
   [junit4]   2> 811087 INFO  (qtp145015049-5543) [n:127.0.0.1:39648_ c:collection1 s:shard2  x:collection1_shard2_replica_n7] o.a.s.u.CommitTracker Hard AutoCommit: disabled
   [junit4]   2> 811087 INFO  (qtp145015049-5543) [n:127.0.0.1:39648_ c:collection1 s:shard2  x:collection1_shard2_replica_n7] o.a.s.u.CommitTracker Soft AutoCommit: disabled
   [junit4]   2> 811088 INFO  (qtp145015049-5543) [n:127.0.0.1:39648_ c:collection1 s:shard2  x:collection1_shard2_replica_n7] o.a.s.u.RandomMergePolicy RandomMergePolicy wrapping class org.apache.lucene.index.TieredMergePolicy: [TieredMergePolicy: maxMergeAtOnce=21, maxMergeAtOnceExplicit=15, maxMergedSegmentMB=98.69921875, floorSegmentMB=0.6572265625, forceMergeDeletesPctAllowed=25.320352790408105, segmentsPerTier=28.0, maxCFSSegmentSizeMB=8.796093022207999E12, noCFSRatio=0.46112342894838354
   [junit4]   2> 811088 INFO  (qtp145015049-5543) [n:127.0.0.1:39648_ c:collection1 s:shard2  x:collection1_shard2_replica_n7] o.a.s.s.SolrIndexSearcher Opening [Searcher@10cbcb27[collection1_shard2_replica_n7] main]
   [junit4]   2> 811089 INFO  (qtp145015049-5543) [n:127.0.0.1:39648_ c:collection1 s:shard2  x:collection1_shard2_replica_n7] o.a.s.r.ManagedResourceStorage Configured ZooKeeperStorageIO with znodeBase: /configs/conf1
   [junit4]   2> 811089 INFO  (qtp145015049-5543) [n:127.0.0.1:39648_ c:collection1 s:shard2  x:collection1_shard2_replica_n7] o.a.s.r.ManagedResourceStorage Loaded null at path _rest_managed.json using ZooKeeperStorageIO:path=/configs/conf1
   [junit4]   2> 811090 INFO  (qtp145015049-5543) [n:127.0.0.1:39648_ c:collection1 s:shard2  x:collection1_shard2_replica_n7] o.a.s.h.ReplicationHandler Commits will be reserved for  10000
   [junit4]   2> 811090 INFO  (qtp145015049-5543) [n:127.0.0.1:39648_ c:collection1 s:shard2  x:collection1_shard2_replica_n7] o.a.s.u.UpdateLog Could not find max version in index or recent updates, using new clock 1574657346429255680
   [junit4]   2> 811132 INFO  (qtp145015049-5543) [n:127.0.0.1:39648_ c:collection1 s:shard2  x:collection1_shard2_replica_n7] o.a.s.c.ZkController Core needs to recover:collection1_shard2_replica_n7
   [junit4]   2> 811132 INFO  (sea

[...truncated too long message...]

core_node12 x:collection1_shard1_replica_n11] o.a.s.c.SyncStrategy http://127.0.0.1:45947/collection1_shard1_replica_n11/ has no replicas
   [junit4]   2> 849021 INFO  (zkCallback-794-thread-2-processing-n:127.0.0.1:45947_) [n:127.0.0.1:45947_ c:collection1 s:shard1 r:core_node12 x:collection1_shard1_replica_n11] o.a.s.c.ShardLeaderElectionContext I am the new leader: http://127.0.0.1:45947/collection1_shard1_replica_n11/ shard1
   [junit4]   2> 849591 WARN  (zkCallback-787-thread-1-processing-n:127.0.0.1:40921_) [n:127.0.0.1:40921_    ] o.a.s.c.c.ZkStateReader ZooKeeper watch triggered, but Solr cannot talk to ZK: [KeeperErrorCode = Session expired for /live_nodes]
   [junit4]   2> 849594 INFO  (TEST-FullSolrCloudDistribCmdsTest.test-seed#[BD674BF60FFB7CCA]) [    ] o.e.j.s.AbstractConnector Stopped ServerConnector@6083cdcb{HTTP/1.1,[http/1.1]}{127.0.0.1:0}
   [junit4]   2> 849594 INFO  (TEST-FullSolrCloudDistribCmdsTest.test-seed#[BD674BF60FFB7CCA]) [    ] o.e.j.s.h.ContextHandler Stopped o.e.j.s.ServletContextHandler@732c5ecb{/,null,UNAVAILABLE}
   [junit4]   2> 849594 INFO  (TEST-FullSolrCloudDistribCmdsTest.test-seed#[BD674BF60FFB7CCA]) [    ] o.a.s.c.ChaosMonkey monkey: stop jetty! 45947
   [junit4]   2> 849594 INFO  (TEST-FullSolrCloudDistribCmdsTest.test-seed#[BD674BF60FFB7CCA]) [    ] o.a.s.c.CoreContainer Shutting down CoreContainer instance=902621269
   [junit4]   2> 849594 INFO  (TEST-FullSolrCloudDistribCmdsTest.test-seed#[BD674BF60FFB7CCA]) [    ] o.a.s.m.SolrMetricManager Closing metric reporters for registry=solr.node, tag=null
   [junit4]   2> 849595 INFO  (TEST-FullSolrCloudDistribCmdsTest.test-seed#[BD674BF60FFB7CCA]) [    ] o.a.s.m.SolrMetricManager Closing metric reporters for registry=solr.jvm, tag=null
   [junit4]   2> 849595 INFO  (TEST-FullSolrCloudDistribCmdsTest.test-seed#[BD674BF60FFB7CCA]) [    ] o.a.s.m.SolrMetricManager Closing metric reporters for registry=solr.jetty, tag=null
   [junit4]   2> 849595 INFO  (TEST-FullSolrCloudDistribCmdsTest.test-seed#[BD674BF60FFB7CCA]) [    ] o.a.s.m.SolrMetricManager Closing metric reporters for registry=solr.cluster, tag=null
   [junit4]   2> 849596 INFO  (coreCloseExecutor-2233-thread-1) [n:127.0.0.1:45947_ c:collection1 s:shard1 r:core_node12 x:collection1_shard1_replica_n11] o.a.s.c.SolrCore [collection1_shard1_replica_n11]  CLOSING SolrCore org.apache.solr.core.SolrCore@6eaa5cfa
   [junit4]   2> 849597 INFO  (coreCloseExecutor-2233-thread-1) [n:127.0.0.1:45947_ c:collection1 s:shard1 r:core_node12 x:collection1_shard1_replica_n11] o.a.s.m.SolrMetricManager Closing metric reporters for registry=solr.core.collection1.shard1.replica_n11, tag=1856658682
   [junit4]   2> 849599 INFO  (coreCloseExecutor-2233-thread-1) [n:127.0.0.1:45947_ c:collection1 s:shard1 r:core_node12 x:collection1_shard1_replica_n11] o.a.s.m.SolrMetricManager Closing metric reporters for registry=solr.collection.collection1.shard1.leader, tag=1856658682
   [junit4]   2> 849599 INFO  (TEST-FullSolrCloudDistribCmdsTest.test-seed#[BD674BF60FFB7CCA]) [    ] o.a.s.c.Overseer Overseer (id=98416082810503192-127.0.0.1:45947_-n_0000000006) closing
   [junit4]   2> 849600 INFO  (OverseerStateUpdate-98416082810503192-127.0.0.1:45947_-n_0000000006) [n:127.0.0.1:45947_    ] o.a.s.c.Overseer Overseer Loop exiting : 127.0.0.1:45947_
   [junit4]   2> 851122 WARN  (zkCallback-794-thread-2-processing-n:127.0.0.1:45947_) [n:127.0.0.1:45947_    ] o.a.s.c.c.ZkStateReader ZooKeeper watch triggered, but Solr cannot talk to ZK: [KeeperErrorCode = Session expired for /live_nodes]
   [junit4]   2> 851123 INFO  (TEST-FullSolrCloudDistribCmdsTest.test-seed#[BD674BF60FFB7CCA]) [    ] o.e.j.s.AbstractConnector Stopped ServerConnector@282e7248{HTTP/1.1,[http/1.1]}{127.0.0.1:0}
   [junit4]   2> 851123 INFO  (TEST-FullSolrCloudDistribCmdsTest.test-seed#[BD674BF60FFB7CCA]) [    ] o.e.j.s.h.ContextHandler Stopped o.e.j.s.ServletContextHandler@aa66a7b{/,null,UNAVAILABLE}
   [junit4]   2> 851124 ERROR (TEST-FullSolrCloudDistribCmdsTest.test-seed#[BD674BF60FFB7CCA]) [    ] o.a.z.s.ZooKeeperServer ZKShutdownHandler is not registered, so ZooKeeper server won't take any action on ERROR or SHUTDOWN server state changes
   [junit4]   2> 851147 INFO  (TEST-FullSolrCloudDistribCmdsTest.test-seed#[BD674BF60FFB7CCA]) [    ] o.a.s.c.ZkTestServer connecting to 127.0.0.1:42775 42775
   [junit4]   2> 851248 INFO  (Thread-2248) [    ] o.a.s.c.ZkTestServer connecting to 127.0.0.1:42775 42775
   [junit4]   2> 851249 WARN  (Thread-2248) [    ] o.a.s.c.ZkTestServer Watch limit violations: 
   [junit4]   2> Maximum concurrent create/delete watches above limit:
   [junit4]   2> 
   [junit4]   2> 	13	/solr/aliases.json
   [junit4]   2> 	7	/solr/security.json
   [junit4]   2> 	7	/solr/configs/conf1
   [junit4]   2> 	6	/solr/collections/collection1/state.json
   [junit4]   2> 
   [junit4]   2> Maximum concurrent data watches above limit:
   [junit4]   2> 
   [junit4]   2> 	13	/solr/clusterprops.json
   [junit4]   2> 	13	/solr/clusterstate.json
   [junit4]   2> 
   [junit4]   2> Maximum concurrent children watches above limit:
   [junit4]   2> 
   [junit4]   2> 	13	/solr/live_nodes
   [junit4]   2> 	13	/solr/collections
   [junit4]   2> 	6	/solr/overseer/collection-queue-work
   [junit4]   2> 	5	/solr/overseer/queue
   [junit4]   2> 	2	/solr/overseer/queue-work
   [junit4]   2> 
   [junit4]   2> NOTE: reproduce with: ant test  -Dtestcase=FullSolrCloudDistribCmdsTest -Dtests.method=test -Dtests.seed=BD674BF60FFB7CCA -Dtests.multiplier=2 -Dtests.slow=true -Dtests.locale=ar-JO -Dtests.timezone=Europe/Vilnius -Dtests.asserts=true -Dtests.file.encoding=US-ASCII
   [junit4] ERROR   60.7s J2 | FullSolrCloudDistribCmdsTest.test <<<
   [junit4]    > Throwable #1: org.apache.zookeeper.KeeperException$SessionExpiredException: KeeperErrorCode = Session expired for /clusterstate.json
   [junit4]    > 	at __randomizedtesting.SeedInfo.seed([BD674BF60FFB7CCA:3533742CA1071132]:0)
   [junit4]    > 	at org.apache.zookeeper.KeeperException.create(KeeperException.java:127)
   [junit4]    > 	at org.apache.zookeeper.KeeperException.create(KeeperException.java:51)
   [junit4]    > 	at org.apache.zookeeper.ZooKeeper.getData(ZooKeeper.java:1212)
   [junit4]    > 	at org.apache.solr.common.cloud.SolrZkClient$7.execute(SolrZkClient.java:357)
   [junit4]    > 	at org.apache.solr.common.cloud.SolrZkClient$7.execute(SolrZkClient.java:354)
   [junit4]    > 	at org.apache.solr.common.cloud.ZkCmdExecutor.retryOperation(ZkCmdExecutor.java:60)
   [junit4]    > 	at org.apache.solr.common.cloud.SolrZkClient.getData(SolrZkClient.java:354)
   [junit4]    > 	at org.apache.solr.common.cloud.ZkStateReader.refreshLegacyClusterState(ZkStateReader.java:541)
   [junit4]    > 	at org.apache.solr.common.cloud.ZkStateReader.forceUpdateCollection(ZkStateReader.java:309)
   [junit4]    > 	at org.apache.solr.cloud.AbstractFullDistribZkTestBase.updateMappingsFromZk(AbstractFullDistribZkTestBase.java:674)
   [junit4]    > 	at org.apache.solr.cloud.AbstractFullDistribZkTestBase.checkShardConsistency(AbstractFullDistribZkTestBase.java:1311)
   [junit4]    > 	at org.apache.solr.cloud.AbstractFullDistribZkTestBase.checkShardConsistency(AbstractFullDistribZkTestBase.java:1302)
   [junit4]    > 	at org.apache.solr.cloud.AbstractFullDistribZkTestBase.checkShardConsistency(AbstractFullDistribZkTestBase.java:1294)
   [junit4]    > 	at org.apache.solr.cloud.FullSolrCloudDistribCmdsTest.testIndexingDocPerRequestWithHttpSolrClient(FullSolrCloudDistribCmdsTest.java:588)
   [junit4]    > 	at org.apache.solr.cloud.FullSolrCloudDistribCmdsTest.test(FullSolrCloudDistribCmdsTest.java:136)
   [junit4]    > 	at org.apache.solr.BaseDistributedSearchTestCase$ShardsRepeatRule$ShardsFixedStatement.callStatement(BaseDistributedSearchTestCase.java:993)
   [junit4]    > 	at org.apache.solr.BaseDistributedSearchTestCase$ShardsRepeatRule$ShardsStatement.evaluate(BaseDistributedSearchTestCase.java:968)
   [junit4]    > 	at java.lang.Thread.run(Thread.java:748)
   [junit4]   2> NOTE: leaving temporary files on disk at: /home/jenkins/jenkins-slave/workspace/Lucene-Solr-Tests-7.x/solr/build/solr-core/test/J2/temp/solr.cloud.FullSolrCloudDistribCmdsTest_BD674BF60FFB7CCA-001
   [junit4]   2> Aug 02, 2017 9:45:08 PM com.carrotsearch.randomizedtesting.ThreadLeakControl checkThreadLeaks
   [junit4]   2> WARNING: Will linger awaiting termination of 1 leaked thread(s).
   [junit4]   2> NOTE: test params are: codec=CheapBastard, sim=RandomSimilarity(queryNorm=false): {}, locale=ar-JO, timezone=Europe/Vilnius
   [junit4]   2> NOTE: Linux 4.4.0-83-generic amd64/Oracle Corporation 1.8.0_144 (64-bit)/cpus=4,threads=1,free=141912512,total=500170752
   [junit4]   2> NOTE: All tests run in this JVM: [TlogReplayBufferedWhileIndexingTest, PolyFieldTest, TestGeoJSONResponseWriter, UnloadDistributedZkTest, DateMathParserTest, NumericFieldsTest, TestDistribDocBasedVersion, TestManagedSchemaAPI, SignatureUpdateProcessorFactoryTest, TestClassicSimilarityFactory, TestCustomSort, SharedFSAutoReplicaFailoverUtilsTest, TestApiFramework, DirectUpdateHandlerOptimizeTest, TestJmxIntegration, AutoCommitTest, TestSQLHandlerNonCloud, InfoHandlerTest, TestLMJelinekMercerSimilarityFactory, SolrCoreMetricManagerTest, DataDrivenBlockJoinTest, SolrJmxReporterTest, TestDFRSimilarityFactory, XsltUpdateRequestHandlerTest, TestCoreAdminApis, TestMaxTokenLenTokenizer, ClusterStateTest, DeleteStatusTest, TestTlogReplica, RankQueryTest, TestPerFieldSimilarityWithDefaultOverride, HLLSerializationTest, HdfsBasicDistributedZkTest, MoveReplicaTest, AliasIntegrationTest, SortByFunctionTest, OverseerTest, FacetPivotSmallTest, ShufflingReplicaListTransformerTest, OverseerModifyCollectionTest, TestRecovery, TermVectorComponentDistributedTest, TestSort, CheckHdfsIndexTest, TestUtils, VersionInfoTest, TestDistributedMissingSort, FullSolrCloudDistribCmdsTest]
   [junit4] Completed [132/727 (1!)] on J2 in 61.30s, 1 test, 1 error <<< FAILURES!

[...truncated 45353 lines...]

Mime
View raw message