lucene-dev mailing list archives

Site index · List index
Message view « Date » · « Thread »
Top « Date » · « Thread »
From Policeman Jenkins Server <jenk...@thetaphi.de>
Subject [JENKINS] Lucene-Solr-master-Windows (32bit/jdk1.8.0_141) - Build # 6808 - Still Unstable!
Date Mon, 07 Aug 2017 05:41:32 GMT
Build: https://jenkins.thetaphi.de/job/Lucene-Solr-master-Windows/6808/
Java: 32bit/jdk1.8.0_141 -server -XX:+UseConcMarkSweepGC

1 tests failed.
FAILED:  org.apache.lucene.replicator.http.HttpReplicatorTest.testBasic

Error Message:
Could not remove the following files (in the order of attempts):    C:\Users\jenkins\workspace\Lucene-Solr-master-Windows\lucene\build\replicator\test\J0\temp\lucene.replicator.http.HttpReplicatorTest_4F81EC48407D9E85-001\httpReplicatorTest-002\2:
java.nio.file.DirectoryNotEmptyException: C:\Users\jenkins\workspace\Lucene-Solr-master-Windows\lucene\build\replicator\test\J0\temp\lucene.replicator.http.HttpReplicatorTest_4F81EC48407D9E85-001\httpReplicatorTest-002\2


Stack Trace:
java.io.IOException: Could not remove the following files (in the order of attempts):
   C:\Users\jenkins\workspace\Lucene-Solr-master-Windows\lucene\build\replicator\test\J0\temp\lucene.replicator.http.HttpReplicatorTest_4F81EC48407D9E85-001\httpReplicatorTest-002\2:
java.nio.file.DirectoryNotEmptyException: C:\Users\jenkins\workspace\Lucene-Solr-master-Windows\lucene\build\replicator\test\J0\temp\lucene.replicator.http.HttpReplicatorTest_4F81EC48407D9E85-001\httpReplicatorTest-002\2

	at __randomizedtesting.SeedInfo.seed([4F81EC48407D9E85:E47BF15D9FA118AB]:0)
	at org.apache.lucene.util.IOUtils.rm(IOUtils.java:329)
	at org.apache.lucene.replicator.PerSessionDirectoryFactory.cleanupSession(PerSessionDirectoryFactory.java:58)
	at org.apache.lucene.replicator.ReplicationClient.doUpdate(ReplicationClient.java:259)
	at org.apache.lucene.replicator.ReplicationClient.updateNow(ReplicationClient.java:401)
	at org.apache.lucene.replicator.http.HttpReplicatorTest.testBasic(HttpReplicatorTest.java:121)
	at sun.reflect.NativeMethodAccessorImpl.invoke0(Native Method)
	at sun.reflect.NativeMethodAccessorImpl.invoke(NativeMethodAccessorImpl.java:62)
	at sun.reflect.DelegatingMethodAccessorImpl.invoke(DelegatingMethodAccessorImpl.java:43)
	at java.lang.reflect.Method.invoke(Method.java:498)
	at com.carrotsearch.randomizedtesting.RandomizedRunner.invoke(RandomizedRunner.java:1713)
	at com.carrotsearch.randomizedtesting.RandomizedRunner$8.evaluate(RandomizedRunner.java:907)
	at com.carrotsearch.randomizedtesting.RandomizedRunner$9.evaluate(RandomizedRunner.java:943)
	at com.carrotsearch.randomizedtesting.RandomizedRunner$10.evaluate(RandomizedRunner.java:957)
	at org.apache.lucene.util.TestRuleSetupTeardownChained$1.evaluate(TestRuleSetupTeardownChained.java:49)
	at org.apache.lucene.util.AbstractBeforeAfterRule$1.evaluate(AbstractBeforeAfterRule.java:45)
	at org.apache.lucene.util.TestRuleThreadAndTestName$1.evaluate(TestRuleThreadAndTestName.java:48)
	at org.apache.lucene.util.TestRuleIgnoreAfterMaxFailures$1.evaluate(TestRuleIgnoreAfterMaxFailures.java:64)
	at org.apache.lucene.util.TestRuleMarkFailure$1.evaluate(TestRuleMarkFailure.java:47)
	at com.carrotsearch.randomizedtesting.rules.StatementAdapter.evaluate(StatementAdapter.java:36)
	at com.carrotsearch.randomizedtesting.ThreadLeakControl$StatementRunner.run(ThreadLeakControl.java:368)
	at com.carrotsearch.randomizedtesting.ThreadLeakControl.forkTimeoutingTask(ThreadLeakControl.java:817)
	at com.carrotsearch.randomizedtesting.ThreadLeakControl$3.evaluate(ThreadLeakControl.java:468)
	at com.carrotsearch.randomizedtesting.RandomizedRunner.runSingleTest(RandomizedRunner.java:916)
	at com.carrotsearch.randomizedtesting.RandomizedRunner$5.evaluate(RandomizedRunner.java:802)
	at com.carrotsearch.randomizedtesting.RandomizedRunner$6.evaluate(RandomizedRunner.java:852)
	at com.carrotsearch.randomizedtesting.RandomizedRunner$7.evaluate(RandomizedRunner.java:863)
	at org.apache.lucene.util.AbstractBeforeAfterRule$1.evaluate(AbstractBeforeAfterRule.java:45)
	at com.carrotsearch.randomizedtesting.rules.StatementAdapter.evaluate(StatementAdapter.java:36)
	at org.apache.lucene.util.TestRuleStoreClassName$1.evaluate(TestRuleStoreClassName.java:41)
	at com.carrotsearch.randomizedtesting.rules.NoShadowingOrOverridesOnMethodsRule$1.evaluate(NoShadowingOrOverridesOnMethodsRule.java:40)
	at com.carrotsearch.randomizedtesting.rules.NoShadowingOrOverridesOnMethodsRule$1.evaluate(NoShadowingOrOverridesOnMethodsRule.java:40)
	at com.carrotsearch.randomizedtesting.rules.StatementAdapter.evaluate(StatementAdapter.java:36)
	at com.carrotsearch.randomizedtesting.rules.StatementAdapter.evaluate(StatementAdapter.java:36)
	at com.carrotsearch.randomizedtesting.rules.StatementAdapter.evaluate(StatementAdapter.java:36)
	at org.apache.lucene.util.TestRuleAssertionsRequired$1.evaluate(TestRuleAssertionsRequired.java:53)
	at org.apache.lucene.util.TestRuleMarkFailure$1.evaluate(TestRuleMarkFailure.java:47)
	at org.apache.lucene.util.TestRuleIgnoreAfterMaxFailures$1.evaluate(TestRuleIgnoreAfterMaxFailures.java:64)
	at org.apache.lucene.util.TestRuleIgnoreTestSuites$1.evaluate(TestRuleIgnoreTestSuites.java:54)
	at com.carrotsearch.randomizedtesting.rules.StatementAdapter.evaluate(StatementAdapter.java:36)
	at com.carrotsearch.randomizedtesting.ThreadLeakControl$StatementRunner.run(ThreadLeakControl.java:368)
	at java.lang.Thread.run(Thread.java:748)




Build Log:
[...truncated 8394 lines...]
   [junit4] Suite: org.apache.lucene.replicator.http.HttpReplicatorTest
   [junit4]   2> 2017-08-07 13:10:06.241:INFO::TEST-HttpReplicatorTest.testServerErrors-seed#[4F81EC48407D9E85]:
Logging initialized @6532ms
   [junit4]   2> 2017-08-07 13:10:06.408:INFO:oejs.Server:TEST-HttpReplicatorTest.testServerErrors-seed#[4F81EC48407D9E85]:
jetty-9.3.14.v20161028
   [junit4]   2> 2017-08-07 13:10:11.486:INFO:oejs.AbstractConnector:TEST-HttpReplicatorTest.testServerErrors-seed#[4F81EC48407D9E85]:
Started ServerConnector@887555{HTTP/1.1,[http/1.1]}{127.0.0.1:63913}
   [junit4]   2> 2017-08-07 13:10:11.487:INFO:oejs.Server:TEST-HttpReplicatorTest.testServerErrors-seed#[4F81EC48407D9E85]:
Started @11778ms
   [junit4]   2> 2017-08-07 13:10:12.105:INFO:oejs.AbstractConnector:TEST-HttpReplicatorTest.testServerErrors-seed#[4F81EC48407D9E85]:
Stopped ServerConnector@887555{HTTP/1.1,[http/1.1]}{127.0.0.1:0}
   [junit4]   2> 2017-08-07 13:10:12.115:INFO:oejs.Server:TEST-HttpReplicatorTest.testBasic-seed#[4F81EC48407D9E85]:
jetty-9.3.14.v20161028
   [junit4]   2> 2017-08-07 13:10:12.116:INFO:oejs.AbstractConnector:TEST-HttpReplicatorTest.testBasic-seed#[4F81EC48407D9E85]:
Started ServerConnector@67812c{HTTP/1.1,[http/1.1]}{127.0.0.1:63955}
   [junit4]   2> 2017-08-07 13:10:12.116:INFO:oejs.Server:TEST-HttpReplicatorTest.testBasic-seed#[4F81EC48407D9E85]:
Started @12407ms
   [junit4]   2> 2017-08-07 13:10:12.171:INFO:oejs.AbstractConnector:TEST-HttpReplicatorTest.testBasic-seed#[4F81EC48407D9E85]:
Stopped ServerConnector@67812c{HTTP/1.1,[http/1.1]}{127.0.0.1:0}
   [junit4]   2> NOTE: reproduce with: ant test  -Dtestcase=HttpReplicatorTest -Dtests.method=testBasic
-Dtests.seed=4F81EC48407D9E85 -Dtests.slow=true -Dtests.locale=ar-TN -Dtests.timezone=Australia/Eucla
-Dtests.asserts=true -Dtests.file.encoding=Cp1252
   [junit4] ERROR   0.07s J0 | HttpReplicatorTest.testBasic <<<
   [junit4]    > Throwable #1: java.io.IOException: Could not remove the following files
(in the order of attempts):
   [junit4]    >    C:\Users\jenkins\workspace\Lucene-Solr-master-Windows\lucene\build\replicator\test\J0\temp\lucene.replicator.http.HttpReplicatorTest_4F81EC48407D9E85-001\httpReplicatorTest-002\2:
java.nio.file.DirectoryNotEmptyException: C:\Users\jenkins\workspace\Lucene-Solr-master-Windows\lucene\build\replicator\test\J0\temp\lucene.replicator.http.HttpReplicatorTest_4F81EC48407D9E85-001\httpReplicatorTest-002\2
   [junit4]    > 	at __randomizedtesting.SeedInfo.seed([4F81EC48407D9E85:E47BF15D9FA118AB]:0)
   [junit4]    > 	at org.apache.lucene.util.IOUtils.rm(IOUtils.java:329)
   [junit4]    > 	at org.apache.lucene.replicator.PerSessionDirectoryFactory.cleanupSession(PerSessionDirectoryFactory.java:58)
   [junit4]    > 	at org.apache.lucene.replicator.ReplicationClient.doUpdate(ReplicationClient.java:259)
   [junit4]    > 	at org.apache.lucene.replicator.ReplicationClient.updateNow(ReplicationClient.java:401)
   [junit4]    > 	at org.apache.lucene.replicator.http.HttpReplicatorTest.testBasic(HttpReplicatorTest.java:121)
   [junit4]    > 	at java.lang.Thread.run(Thread.java:748)
   [junit4]   2> NOTE: leaving temporary files on disk at: C:\Users\jenkins\workspace\Lucene-Solr-master-Windows\lucene\build\replicator\test\J0\temp\lucene.replicator.http.HttpReplicatorTest_4F81EC48407D9E85-001
   [junit4]   2> NOTE: test params are: codec=Asserting(Lucene70): {}, docValues:{}, maxPointsInLeafNode=375,
maxMBSortInHeap=5.0778031428766095, sim=RandomSimilarity(queryNorm=false): {}, locale=ar-TN,
timezone=Australia/Eucla
   [junit4]   2> NOTE: Windows 10 10.0 x86/Oracle Corporation 1.8.0_141 (32-bit)/cpus=3,threads=1,free=38210472,total=64880640
   [junit4]   2> NOTE: All tests run in this JVM: [IndexAndTaxonomyReplicationClientTest,
HttpReplicatorTest]
   [junit4] Completed [8/9 (1!)] on J0 in 6.05s, 2 tests, 1 error <<< FAILURES!

[...truncated 44183 lines...]

Mime
View raw message