lucene-dev mailing list archives

Site index · List index
Message view « Date » · « Thread »
Top « Date » · « Thread »
From Policeman Jenkins Server <jenk...@thetaphi.de>
Subject [JENKINS] Lucene-Solr-master-Linux (32bit/jdk1.8.0_141) - Build # 20258 - Unstable!
Date Fri, 04 Aug 2017 15:48:15 GMT
Build: https://jenkins.thetaphi.de/job/Lucene-Solr-master-Linux/20258/
Java: 32bit/jdk1.8.0_141 -client -XX:+UseParallelGC

1 tests failed.
FAILED:  org.apache.solr.handler.TestSolrConfigHandlerConcurrent.test

Error Message:


Stack Trace:
java.lang.NullPointerException
	at __randomizedtesting.SeedInfo.seed([99B0A63C28CEF9AF:11E499E686329457]:0)
	at org.apache.solr.handler.TestSolrConfigHandlerConcurrent.test(TestSolrConfigHandlerConcurrent.java:109)
	at sun.reflect.NativeMethodAccessorImpl.invoke0(Native Method)
	at sun.reflect.NativeMethodAccessorImpl.invoke(NativeMethodAccessorImpl.java:62)
	at sun.reflect.DelegatingMethodAccessorImpl.invoke(DelegatingMethodAccessorImpl.java:43)
	at java.lang.reflect.Method.invoke(Method.java:498)
	at com.carrotsearch.randomizedtesting.RandomizedRunner.invoke(RandomizedRunner.java:1713)
	at com.carrotsearch.randomizedtesting.RandomizedRunner$8.evaluate(RandomizedRunner.java:907)
	at com.carrotsearch.randomizedtesting.RandomizedRunner$9.evaluate(RandomizedRunner.java:943)
	at com.carrotsearch.randomizedtesting.RandomizedRunner$10.evaluate(RandomizedRunner.java:957)
	at org.apache.solr.BaseDistributedSearchTestCase$ShardsRepeatRule$ShardsFixedStatement.callStatement(BaseDistributedSearchTestCase.java:993)
	at org.apache.solr.BaseDistributedSearchTestCase$ShardsRepeatRule$ShardsStatement.evaluate(BaseDistributedSearchTestCase.java:968)
	at com.carrotsearch.randomizedtesting.rules.SystemPropertiesRestoreRule$1.evaluate(SystemPropertiesRestoreRule.java:57)
	at org.apache.lucene.util.TestRuleSetupTeardownChained$1.evaluate(TestRuleSetupTeardownChained.java:49)
	at org.apache.lucene.util.AbstractBeforeAfterRule$1.evaluate(AbstractBeforeAfterRule.java:45)
	at org.apache.lucene.util.TestRuleThreadAndTestName$1.evaluate(TestRuleThreadAndTestName.java:48)
	at org.apache.lucene.util.TestRuleIgnoreAfterMaxFailures$1.evaluate(TestRuleIgnoreAfterMaxFailures.java:64)
	at org.apache.lucene.util.TestRuleMarkFailure$1.evaluate(TestRuleMarkFailure.java:47)
	at com.carrotsearch.randomizedtesting.rules.StatementAdapter.evaluate(StatementAdapter.java:36)
	at com.carrotsearch.randomizedtesting.ThreadLeakControl$StatementRunner.run(ThreadLeakControl.java:368)
	at com.carrotsearch.randomizedtesting.ThreadLeakControl.forkTimeoutingTask(ThreadLeakControl.java:817)
	at com.carrotsearch.randomizedtesting.ThreadLeakControl$3.evaluate(ThreadLeakControl.java:468)
	at com.carrotsearch.randomizedtesting.RandomizedRunner.runSingleTest(RandomizedRunner.java:916)
	at com.carrotsearch.randomizedtesting.RandomizedRunner$5.evaluate(RandomizedRunner.java:802)
	at com.carrotsearch.randomizedtesting.RandomizedRunner$6.evaluate(RandomizedRunner.java:852)
	at com.carrotsearch.randomizedtesting.RandomizedRunner$7.evaluate(RandomizedRunner.java:863)
	at com.carrotsearch.randomizedtesting.rules.StatementAdapter.evaluate(StatementAdapter.java:36)
	at com.carrotsearch.randomizedtesting.rules.SystemPropertiesRestoreRule$1.evaluate(SystemPropertiesRestoreRule.java:57)
	at org.apache.lucene.util.AbstractBeforeAfterRule$1.evaluate(AbstractBeforeAfterRule.java:45)
	at com.carrotsearch.randomizedtesting.rules.StatementAdapter.evaluate(StatementAdapter.java:36)
	at org.apache.lucene.util.TestRuleStoreClassName$1.evaluate(TestRuleStoreClassName.java:41)
	at com.carrotsearch.randomizedtesting.rules.NoShadowingOrOverridesOnMethodsRule$1.evaluate(NoShadowingOrOverridesOnMethodsRule.java:40)
	at com.carrotsearch.randomizedtesting.rules.NoShadowingOrOverridesOnMethodsRule$1.evaluate(NoShadowingOrOverridesOnMethodsRule.java:40)
	at com.carrotsearch.randomizedtesting.rules.StatementAdapter.evaluate(StatementAdapter.java:36)
	at com.carrotsearch.randomizedtesting.rules.StatementAdapter.evaluate(StatementAdapter.java:36)
	at com.carrotsearch.randomizedtesting.rules.StatementAdapter.evaluate(StatementAdapter.java:36)
	at org.apache.lucene.util.TestRuleAssertionsRequired$1.evaluate(TestRuleAssertionsRequired.java:53)
	at org.apache.lucene.util.TestRuleMarkFailure$1.evaluate(TestRuleMarkFailure.java:47)
	at org.apache.lucene.util.TestRuleIgnoreAfterMaxFailures$1.evaluate(TestRuleIgnoreAfterMaxFailures.java:64)
	at org.apache.lucene.util.TestRuleIgnoreTestSuites$1.evaluate(TestRuleIgnoreTestSuites.java:54)
	at com.carrotsearch.randomizedtesting.rules.StatementAdapter.evaluate(StatementAdapter.java:36)
	at com.carrotsearch.randomizedtesting.ThreadLeakControl$StatementRunner.run(ThreadLeakControl.java:368)
	at java.lang.Thread.run(Thread.java:748)




Build Log:
[...truncated 11069 lines...]
   [junit4] Suite: org.apache.solr.handler.TestSolrConfigHandlerConcurrent
   [junit4]   2> 204164 INFO  (SUITE-TestSolrConfigHandlerConcurrent-seed#[99B0A63C28CEF9AF]-worker) [    ] o.a.s.SolrTestCaseJ4 SecureRandom sanity checks: test.solr.allowed.securerandom=null & java.security.egd=file:/dev/./urandom
   [junit4]   2> Creating dataDir: /home/jenkins/workspace/Lucene-Solr-master-Linux/solr/build/solr-core/test/J2/temp/solr.handler.TestSolrConfigHandlerConcurrent_99B0A63C28CEF9AF-001/init-core-data-001
   [junit4]   2> 204164 WARN  (SUITE-TestSolrConfigHandlerConcurrent-seed#[99B0A63C28CEF9AF]-worker) [    ] o.a.s.SolrTestCaseJ4 startTrackingSearchers: numOpens=3 numCloses=3
   [junit4]   2> 204164 INFO  (SUITE-TestSolrConfigHandlerConcurrent-seed#[99B0A63C28CEF9AF]-worker) [    ] o.a.s.SolrTestCaseJ4 Using PointFields (NUMERIC_POINTS_SYSPROP=true) w/NUMERIC_DOCVALUES_SYSPROP=true
   [junit4]   2> 204165 INFO  (SUITE-TestSolrConfigHandlerConcurrent-seed#[99B0A63C28CEF9AF]-worker) [    ] o.a.s.SolrTestCaseJ4 Randomized ssl (false) and clientAuth (false) via: @org.apache.solr.util.RandomizeSSL(reason=, ssl=NaN, value=NaN, clientAuth=NaN)
   [junit4]   2> 204165 INFO  (SUITE-TestSolrConfigHandlerConcurrent-seed#[99B0A63C28CEF9AF]-worker) [    ] o.a.s.BaseDistributedSearchTestCase Setting hostContext system property: /t_k/d
   [junit4]   2> 204169 INFO  (TEST-TestSolrConfigHandlerConcurrent.test-seed#[99B0A63C28CEF9AF]) [    ] o.a.s.c.ZkTestServer STARTING ZK TEST SERVER
   [junit4]   2> 204169 INFO  (Thread-4408) [    ] o.a.s.c.ZkTestServer client port:0.0.0.0/0.0.0.0:0
   [junit4]   2> 204169 INFO  (Thread-4408) [    ] o.a.s.c.ZkTestServer Starting server
   [junit4]   2> 204171 ERROR (Thread-4408) [    ] o.a.z.s.ZooKeeperServer ZKShutdownHandler is not registered, so ZooKeeper server won't take any action on ERROR or SHUTDOWN server state changes
   [junit4]   2> 204269 INFO  (TEST-TestSolrConfigHandlerConcurrent.test-seed#[99B0A63C28CEF9AF]) [    ] o.a.s.c.ZkTestServer start zk server on port:44263
   [junit4]   2> 204298 INFO  (TEST-TestSolrConfigHandlerConcurrent.test-seed#[99B0A63C28CEF9AF]) [    ] o.a.s.c.AbstractZkTestCase put /home/jenkins/workspace/Lucene-Solr-master-Linux/solr/core/src/test-files/solr/collection1/conf/solrconfig-tlog.xml to /configs/conf1/solrconfig.xml
   [junit4]   2> 204303 INFO  (TEST-TestSolrConfigHandlerConcurrent.test-seed#[99B0A63C28CEF9AF]) [    ] o.a.s.c.AbstractZkTestCase put /home/jenkins/workspace/Lucene-Solr-master-Linux/solr/core/src/test-files/solr/collection1/conf/schema.xml to /configs/conf1/schema.xml
   [junit4]   2> 204307 INFO  (TEST-TestSolrConfigHandlerConcurrent.test-seed#[99B0A63C28CEF9AF]) [    ] o.a.s.c.AbstractZkTestCase put /home/jenkins/workspace/Lucene-Solr-master-Linux/solr/core/src/test-files/solr/collection1/conf/solrconfig.snippet.randomindexconfig.xml to /configs/conf1/solrconfig.snippet.randomindexconfig.xml
   [junit4]   2> 204311 INFO  (TEST-TestSolrConfigHandlerConcurrent.test-seed#[99B0A63C28CEF9AF]) [    ] o.a.s.c.AbstractZkTestCase put /home/jenkins/workspace/Lucene-Solr-master-Linux/solr/core/src/test-files/solr/collection1/conf/stopwords.txt to /configs/conf1/stopwords.txt
   [junit4]   2> 204313 INFO  (TEST-TestSolrConfigHandlerConcurrent.test-seed#[99B0A63C28CEF9AF]) [    ] o.a.s.c.AbstractZkTestCase put /home/jenkins/workspace/Lucene-Solr-master-Linux/solr/core/src/test-files/solr/collection1/conf/protwords.txt to /configs/conf1/protwords.txt
   [junit4]   2> 204316 INFO  (TEST-TestSolrConfigHandlerConcurrent.test-seed#[99B0A63C28CEF9AF]) [    ] o.a.s.c.AbstractZkTestCase put /home/jenkins/workspace/Lucene-Solr-master-Linux/solr/core/src/test-files/solr/collection1/conf/currency.xml to /configs/conf1/currency.xml
   [junit4]   2> 204320 INFO  (TEST-TestSolrConfigHandlerConcurrent.test-seed#[99B0A63C28CEF9AF]) [    ] o.a.s.c.AbstractZkTestCase put /home/jenkins/workspace/Lucene-Solr-master-Linux/solr/core/src/test-files/solr/collection1/conf/enumsConfig.xml to /configs/conf1/enumsConfig.xml
   [junit4]   2> 204323 INFO  (TEST-TestSolrConfigHandlerConcurrent.test-seed#[99B0A63C28CEF9AF]) [    ] o.a.s.c.AbstractZkTestCase put /home/jenkins/workspace/Lucene-Solr-master-Linux/solr/core/src/test-files/solr/collection1/conf/open-exchange-rates.json to /configs/conf1/open-exchange-rates.json
   [junit4]   2> 204325 INFO  (TEST-TestSolrConfigHandlerConcurrent.test-seed#[99B0A63C28CEF9AF]) [    ] o.a.s.c.AbstractZkTestCase put /home/jenkins/workspace/Lucene-Solr-master-Linux/solr/core/src/test-files/solr/collection1/conf/mapping-ISOLatin1Accent.txt to /configs/conf1/mapping-ISOLatin1Accent.txt
   [junit4]   2> 204328 INFO  (TEST-TestSolrConfigHandlerConcurrent.test-seed#[99B0A63C28CEF9AF]) [    ] o.a.s.c.AbstractZkTestCase put /home/jenkins/workspace/Lucene-Solr-master-Linux/solr/core/src/test-files/solr/collection1/conf/old_synonyms.txt to /configs/conf1/old_synonyms.txt
   [junit4]   2> 204331 INFO  (TEST-TestSolrConfigHandlerConcurrent.test-seed#[99B0A63C28CEF9AF]) [    ] o.a.s.c.AbstractZkTestCase put /home/jenkins/workspace/Lucene-Solr-master-Linux/solr/core/src/test-files/solr/collection1/conf/synonyms.txt to /configs/conf1/synonyms.txt
   [junit4]   2> 204333 INFO  (TEST-TestSolrConfigHandlerConcurrent.test-seed#[99B0A63C28CEF9AF]) [    ] o.a.s.c.AbstractFullDistribZkTestBase Will use NRT replicas unless explicitly asked otherwise
   [junit4]   2> 204416 INFO  (TEST-TestSolrConfigHandlerConcurrent.test-seed#[99B0A63C28CEF9AF]) [    ] o.e.j.s.Server jetty-9.3.14.v20161028
   [junit4]   2> 204417 INFO  (TEST-TestSolrConfigHandlerConcurrent.test-seed#[99B0A63C28CEF9AF]) [    ] o.e.j.s.h.ContextHandler Started o.e.j.s.ServletContextHandler@1ed39b{/t_k/d,null,AVAILABLE}
   [junit4]   2> 204418 INFO  (TEST-TestSolrConfigHandlerConcurrent.test-seed#[99B0A63C28CEF9AF]) [    ] o.e.j.s.AbstractConnector Started ServerConnector@1b50c2c{HTTP/1.1,[http/1.1]}{127.0.0.1:45111}
   [junit4]   2> 204419 INFO  (TEST-TestSolrConfigHandlerConcurrent.test-seed#[99B0A63C28CEF9AF]) [    ] o.e.j.s.Server Started @205434ms
   [junit4]   2> 204419 INFO  (TEST-TestSolrConfigHandlerConcurrent.test-seed#[99B0A63C28CEF9AF]) [    ] o.a.s.c.s.e.JettySolrRunner Jetty properties: {solr.data.dir=/home/jenkins/workspace/Lucene-Solr-master-Linux/solr/build/solr-core/test/J2/temp/solr.handler.TestSolrConfigHandlerConcurrent_99B0A63C28CEF9AF-001/tempDir-001/control/data, hostContext=/t_k/d, hostPort=45111, coreRootDirectory=/home/jenkins/workspace/Lucene-Solr-master-Linux/solr/build/solr-core/test/J2/../../../../../../../../../home/jenkins/workspace/Lucene-Solr-master-Linux/solr/build/solr-core/test/J2/temp/solr.handler.TestSolrConfigHandlerConcurrent_99B0A63C28CEF9AF-001/control-001/cores}
   [junit4]   2> 204419 ERROR (TEST-TestSolrConfigHandlerConcurrent.test-seed#[99B0A63C28CEF9AF]) [    ] o.a.s.s.StartupLoggingUtils Missing Java Option solr.log.dir. Logging may be missing or incomplete.
   [junit4]   2> 204419 INFO  (TEST-TestSolrConfigHandlerConcurrent.test-seed#[99B0A63C28CEF9AF]) [    ] o.a.s.s.SolrDispatchFilter  ___      _       Welcome to Apache Solr™ version 8.0.0
   [junit4]   2> 204419 INFO  (TEST-TestSolrConfigHandlerConcurrent.test-seed#[99B0A63C28CEF9AF]) [    ] o.a.s.s.SolrDispatchFilter / __| ___| |_ _   Starting in cloud mode on port null
   [junit4]   2> 204419 INFO  (TEST-TestSolrConfigHandlerConcurrent.test-seed#[99B0A63C28CEF9AF]) [    ] o.a.s.s.SolrDispatchFilter \__ \/ _ \ | '_|  Install dir: null, Default config dir: null
   [junit4]   2> 204419 INFO  (TEST-TestSolrConfigHandlerConcurrent.test-seed#[99B0A63C28CEF9AF]) [    ] o.a.s.s.SolrDispatchFilter |___/\___/_|_|    Start time: 2017-08-04T14:53:47.674Z
   [junit4]   2> 204421 INFO  (TEST-TestSolrConfigHandlerConcurrent.test-seed#[99B0A63C28CEF9AF]) [    ] o.a.s.s.SolrDispatchFilter Loading solr.xml from SolrHome (not found in ZooKeeper)
   [junit4]   2> 204421 INFO  (TEST-TestSolrConfigHandlerConcurrent.test-seed#[99B0A63C28CEF9AF]) [    ] o.a.s.c.SolrXmlConfig Loading container configuration from /home/jenkins/workspace/Lucene-Solr-master-Linux/solr/build/solr-core/test/J2/temp/solr.handler.TestSolrConfigHandlerConcurrent_99B0A63C28CEF9AF-001/control-001/solr.xml
   [junit4]   2> 204428 INFO  (TEST-TestSolrConfigHandlerConcurrent.test-seed#[99B0A63C28CEF9AF]) [    ] o.a.s.c.SolrXmlConfig MBean server found: com.sun.jmx.mbeanserver.JmxMBeanServer@1de406d, but no JMX reporters were configured - adding default JMX reporter.
   [junit4]   2> 204430 INFO  (TEST-TestSolrConfigHandlerConcurrent.test-seed#[99B0A63C28CEF9AF]) [    ] o.a.s.c.ZkContainer Zookeeper client=127.0.0.1:44263/solr
   [junit4]   2> 204486 INFO  (TEST-TestSolrConfigHandlerConcurrent.test-seed#[99B0A63C28CEF9AF]) [n:127.0.0.1:45111_t_k%2Fd    ] o.a.s.c.Overseer Overseer (id=null) closing
   [junit4]   2> 204487 INFO  (TEST-TestSolrConfigHandlerConcurrent.test-seed#[99B0A63C28CEF9AF]) [n:127.0.0.1:45111_t_k%2Fd    ] o.a.s.c.OverseerElectionContext I am going to be the leader 127.0.0.1:45111_t_k%2Fd
   [junit4]   2> 204487 INFO  (TEST-TestSolrConfigHandlerConcurrent.test-seed#[99B0A63C28CEF9AF]) [n:127.0.0.1:45111_t_k%2Fd    ] o.a.s.c.Overseer Overseer (id=98425793899724804-127.0.0.1:45111_t_k%2Fd-n_0000000000) starting
   [junit4]   2> 204490 INFO  (TEST-TestSolrConfigHandlerConcurrent.test-seed#[99B0A63C28CEF9AF]) [n:127.0.0.1:45111_t_k%2Fd    ] o.a.s.c.ZkController Register node as live in ZooKeeper:/live_nodes/127.0.0.1:45111_t_k%2Fd
   [junit4]   2> 204491 INFO  (zkCallback-228-thread-1-processing-n:127.0.0.1:45111_t_k%2Fd) [n:127.0.0.1:45111_t_k%2Fd    ] o.a.s.c.c.ZkStateReader Updated live nodes from ZooKeeper... (0) -> (1)
   [junit4]   2> 204824 INFO  (TEST-TestSolrConfigHandlerConcurrent.test-seed#[99B0A63C28CEF9AF]) [n:127.0.0.1:45111_t_k%2Fd    ] o.a.s.m.r.SolrJmxReporter JMX monitoring for 'solr.node' (registry 'solr.node') enabled at server: com.sun.jmx.mbeanserver.JmxMBeanServer@1de406d
   [junit4]   2> 204827 INFO  (TEST-TestSolrConfigHandlerConcurrent.test-seed#[99B0A63C28CEF9AF]) [n:127.0.0.1:45111_t_k%2Fd    ] o.a.s.m.r.SolrJmxReporter JMX monitoring for 'solr.jvm' (registry 'solr.jvm') enabled at server: com.sun.jmx.mbeanserver.JmxMBeanServer@1de406d
   [junit4]   2> 204827 INFO  (TEST-TestSolrConfigHandlerConcurrent.test-seed#[99B0A63C28CEF9AF]) [n:127.0.0.1:45111_t_k%2Fd    ] o.a.s.m.r.SolrJmxReporter JMX monitoring for 'solr.jetty' (registry 'solr.jetty') enabled at server: com.sun.jmx.mbeanserver.JmxMBeanServer@1de406d
   [junit4]   2> 204829 INFO  (TEST-TestSolrConfigHandlerConcurrent.test-seed#[99B0A63C28CEF9AF]) [n:127.0.0.1:45111_t_k%2Fd    ] o.a.s.c.CorePropertiesLocator Found 0 core definitions underneath /home/jenkins/workspace/Lucene-Solr-master-Linux/solr/build/solr-core/test/J2/../../../../../../../../../home/jenkins/workspace/Lucene-Solr-master-Linux/solr/build/solr-core/test/J2/temp/solr.handler.TestSolrConfigHandlerConcurrent_99B0A63C28CEF9AF-001/control-001/cores
   [junit4]   2> 204842 INFO  (TEST-TestSolrConfigHandlerConcurrent.test-seed#[99B0A63C28CEF9AF]) [    ] o.a.s.c.c.ZkStateReader Updated live nodes from ZooKeeper... (0) -> (1)
   [junit4]   2> 204843 INFO  (TEST-TestSolrConfigHandlerConcurrent.test-seed#[99B0A63C28CEF9AF]) [    ] o.a.s.c.s.i.ZkClientClusterStateProvider Cluster at 127.0.0.1:44263/solr ready
   [junit4]   2> 204845 INFO  (qtp13008956-5452) [n:127.0.0.1:45111_t_k%2Fd    ] o.a.s.h.a.CollectionsHandler Invoked Collection Action :create with params replicationFactor=1&collection.configName=conf1&name=control_collection&nrtReplicas=1&action=CREATE&numShards=1&createNodeSet=127.0.0.1:45111_t_k%252Fd&wt=javabin&version=2 and sendToOCPQueue=true
   [junit4]   2> 204847 INFO  (OverseerThreadFactory-589-thread-1-processing-n:127.0.0.1:45111_t_k%2Fd) [n:127.0.0.1:45111_t_k%2Fd    ] o.a.s.c.CreateCollectionCmd Create collection control_collection
   [junit4]   2> 204957 INFO  (qtp13008956-5454) [n:127.0.0.1:45111_t_k%2Fd    ] o.a.s.h.a.CoreAdminOperation core create command qt=/admin/cores&collection.configName=conf1&newCollection=true&name=control_collection_shard1_replica_n1&action=CREATE&numShards=1&collection=control_collection&shard=shard1&wt=javabin&version=2&replicaType=NRT
   [junit4]   2> 204958 INFO  (qtp13008956-5454) [n:127.0.0.1:45111_t_k%2Fd    ] o.a.s.c.TransientSolrCoreCacheDefault Allocating transient cache for 4 transient cores
   [junit4]   2> 205066 INFO  (zkCallback-228-thread-1-processing-n:127.0.0.1:45111_t_k%2Fd) [n:127.0.0.1:45111_t_k%2Fd    ] o.a.s.c.c.ZkStateReader A cluster state change: [WatchedEvent state:SyncConnected type:NodeDataChanged path:/collections/control_collection/state.json] for collection [control_collection] has occurred - updating... (live nodes size: [1])
   [junit4]   2> 205987 INFO  (qtp13008956-5454) [n:127.0.0.1:45111_t_k%2Fd c:control_collection s:shard1  x:control_collection_shard1_replica_n1] o.a.s.c.SolrConfig Using Lucene MatchVersion: 8.0.0
   [junit4]   2> 206006 INFO  (qtp13008956-5454) [n:127.0.0.1:45111_t_k%2Fd c:control_collection s:shard1  x:control_collection_shard1_replica_n1] o.a.s.s.IndexSchema [control_collection_shard1_replica_n1] Schema name=test
   [junit4]   2> 206075 INFO  (qtp13008956-5454) [n:127.0.0.1:45111_t_k%2Fd c:control_collection s:shard1  x:control_collection_shard1_replica_n1] o.a.s.s.IndexSchema Loaded schema test/1.0 with uniqueid field id
   [junit4]   2> 206084 INFO  (qtp13008956-5454) [n:127.0.0.1:45111_t_k%2Fd c:control_collection s:shard1  x:control_collection_shard1_replica_n1] o.a.s.c.CoreContainer Creating SolrCore 'control_collection_shard1_replica_n1' using configuration from collection control_collection, trusted=true
   [junit4]   2> 206085 INFO  (qtp13008956-5454) [n:127.0.0.1:45111_t_k%2Fd c:control_collection s:shard1  x:control_collection_shard1_replica_n1] o.a.s.m.r.SolrJmxReporter JMX monitoring for 'solr.core.control_collection.shard1.replica_n1' (registry 'solr.core.control_collection.shard1.replica_n1') enabled at server: com.sun.jmx.mbeanserver.JmxMBeanServer@1de406d
   [junit4]   2> 206085 INFO  (qtp13008956-5454) [n:127.0.0.1:45111_t_k%2Fd c:control_collection s:shard1  x:control_collection_shard1_replica_n1] o.a.s.c.SolrCore solr.RecoveryStrategy.Builder
   [junit4]   2> 206085 INFO  (qtp13008956-5454) [n:127.0.0.1:45111_t_k%2Fd c:control_collection s:shard1  x:control_collection_shard1_replica_n1] o.a.s.c.SolrCore [[control_collection_shard1_replica_n1] ] Opening new SolrCore at [/home/jenkins/workspace/Lucene-Solr-master-Linux/solr/build/solr-core/test/J2/temp/solr.handler.TestSolrConfigHandlerConcurrent_99B0A63C28CEF9AF-001/control-001/cores/control_collection_shard1_replica_n1], dataDir=[/home/jenkins/workspace/Lucene-Solr-master-Linux/solr/build/solr-core/test/J2/../../../../../../../../../home/jenkins/workspace/Lucene-Solr-master-Linux/solr/build/solr-core/test/J2/temp/solr.handler.TestSolrConfigHandlerConcurrent_99B0A63C28CEF9AF-001/control-001/cores/control_collection_shard1_replica_n1/data/]
   [junit4]   2> 206088 INFO  (qtp13008956-5454) [n:127.0.0.1:45111_t_k%2Fd c:control_collection s:shard1  x:control_collection_shard1_replica_n1] o.a.s.u.RandomMergePolicy RandomMergePolicy wrapping class org.apache.lucene.index.TieredMergePolicy: [TieredMergePolicy: maxMergeAtOnce=40, maxMergeAtOnceExplicit=16, maxMergedSegmentMB=20.74609375, floorSegmentMB=2.0947265625, forceMergeDeletesPctAllowed=11.733083997195656, segmentsPerTier=49.0, maxCFSSegmentSizeMB=8.796093022207999E12, noCFSRatio=0.0
   [junit4]   2> 206090 WARN  (qtp13008956-5454) [n:127.0.0.1:45111_t_k%2Fd c:control_collection s:shard1  x:control_collection_shard1_replica_n1] o.a.s.c.RequestHandlers INVALID paramSet a in requestHandler {type = requestHandler,name = /dump,class = DumpRequestHandler,attributes = {initParams=a, name=/dump, class=DumpRequestHandler},args = {defaults={a=A,b=B}}}
   [junit4]   2> 206121 INFO  (qtp13008956-5454) [n:127.0.0.1:45111_t_k%2Fd c:control_collection s:shard1  x:control_collection_shard1_replica_n1] o.a.s.u.UpdateHandler Using UpdateLog implementation: org.apache.solr.update.UpdateLog
   [junit4]   2> 206121 INFO  (qtp13008956-5454) [n:127.0.0.1:45111_t_k%2Fd c:control_collection s:shard1  x:control_collection_shard1_replica_n1] o.a.s.u.UpdateLog Initializing UpdateLog: dataDir= defaultSyncLevel=FLUSH numRecordsToKeep=100 maxNumLogsToKeep=10 numVersionBuckets=65536
   [junit4]   2> 206122 INFO  (qtp13008956-5454) [n:127.0.0.1:45111_t_k%2Fd c:control_collection s:shard1  x:control_collection_shard1_replica_n1] o.a.s.u.CommitTracker Hard AutoCommit: disabled
   [junit4]   2> 206122 INFO  (qtp13008956-5454) [n:127.0.0.1:45111_t_k%2Fd c:control_collection s:shard1  x:control_collection_shard1_replica_n1] o.a.s.u.CommitTracker Soft AutoCommit: disabled
   [junit4]   2> 206123 INFO  (qtp13008956-5454) [n:127.0.0.1:45111_t_k%2Fd c:control_collection s:shard1  x:control_collection_shard1_replica_n1] o.a.s.u.RandomMergePolicy RandomMergePolicy wrapping class org.apache.lucene.index.LogDocMergePolicy: [LogDocMergePolicy: minMergeSize=1000, mergeFactor=39, maxMergeSize=9223372036854775807, maxMergeSizeForForcedMerge=9223372036854775807, calibrateSizeByDeletes=true, maxMergeDocs=2147483647, maxCFSSegmentSizeMB=8.796093022207999E12, noCFSRatio=1.0]
   [junit4]   2> 206123 INFO  (qtp13008956-5454) [n:127.0.0.1:45111_t_k%2Fd c:control_collection s:shard1  x:control_collection_shard1_replica_n1] o.a.s.s.SolrIndexSearcher Opening [Searcher@1197568[control_collection_shard1_replica_n1] main]
   [junit4]   2> 206124 INFO  (qtp13008956-5454) [n:127.0.0.1:45111_t_k%2Fd c:control_collection s:shard1  x:control_collection_shard1_replica_n1] o.a.s.r.ManagedResourceStorage Configured ZooKeeperStorageIO with znodeBase: /configs/conf1
   [junit4]   2> 206125 INFO  (qtp13008956-5454) [n:127.0.0.1:45111_t_k%2Fd c:control_collection s:shard1  x:control_collection_shard1_replica_n1] o.a.s.r.ManagedResourceStorage Loaded null at path _rest_managed.json using ZooKeeperStorageIO:path=/configs/conf1
   [junit4]   2> 206125 INFO  (qtp13008956-5454) [n:127.0.0.1:45111_t_k%2Fd c:control_collection s:shard1  x:control_collection_shard1_replica_n1] o.a.s.h.ReplicationHandler Commits will be reserved for  10000
   [junit4]   2> 206125 INFO  (qtp13008956-5454) [n:127.0.0.1:45111_t_k%2Fd c:control_collection s:shard1  x:control_collection_shard1_replica_n1] o.a.s.u.UpdateLog Could not find max version in index or recent updates, using new clock 1574812704445562880
   [junit4]   2> 206127 INFO  (searcherExecutor-592-thread-1-processing-n:127.0.0.1:45111_t_k%2Fd x:control_collection_shard1_replica_n1 s:shard1 c:control_collection) [n:127.0.0.1:45111_t_k%2Fd c:control_collection s:shard1  x:control_collection_shard1_replica_n1] o.a.s.c.SolrCore [control_collection_shard1_replica_n1] Registered new searcher Searcher@1197568[control_collection_shard1_replica_n1] main{ExitableDirectoryReader(UninvertingDirectoryReader())}
   [junit4]   2> 206130 INFO  (qtp13008956-5454) [n:127.0.0.1:45111_t_k%2Fd c:control_collection s:shard1  x:control_collection_shard1_replica_n1] o.a.s.c.ShardLeaderElectionContext Enough replicas found to continue.
   [junit4]   2> 206130 INFO  (qtp13008956-5454) [n:127.0.0.1:45111_t_k%2Fd c:control_collection s:shard1  x:control_collection_shard1_replica_n1] o.a.s.c.ShardLeaderElectionContext I may be the new leader - try and sync
   [junit4]   2> 206130 INFO  (qtp13008956-5454) [n:127.0.0.1:45111_t_k%2Fd c:control_collection s:shard1  x:control_collection_shard1_replica_n1] o.a.s.c.SyncStrategy Sync replicas to http://127.0.0.1:45111/t_k/d/control_collection_shard1_replica_n1/
   [junit4]   2> 206130 INFO  (qtp13008956-5454) [n:127.0.0.1:45111_t_k%2Fd c:control_collection s:shard1  x:control_collection_shard1_replica_n1] o.a.s.c.SyncStrategy Sync Success - now sync replicas to me
   [junit4]   2> 206130 INFO  (qtp13008956-5454) [n:127.0.0.1:45111_t_k%2Fd c:control_collection s:shard1  x:control_collection_shard1_replica_n1] o.a.s.c.SyncStrategy http://127.0.0.1:45111/t_k/d/control_collection_shard1_replica_n1/ has no replicas
   [junit4]   2> 206130 INFO  (qtp13008956-5454) [n:127.0.0.1:45111_t_k%2Fd c:control_collection s:shard1  x:control_collection_shard1_replica_n1] o.a.s.c.ShardLeaderElectionContext Found all replicas participating in election, clear LIR
   [junit4]   2> 206133 INFO  (qtp13008956-5454) [n:127.0.0.1:45111_t_k%2Fd c:control_collection s:shard1  x:control_collection_shard1_replica_n1] o.a.s.c.ShardLeaderElectionContext I am the new leader: http://127.0.0.1:45111/t_k/d/control_collection_shard1_replica_n1/ shard1
   [junit4]   2> 206235 INFO  (zkCallback-228-thread-1-processing-n:127.0.0.1:45111_t_k%2Fd) [n:127.0.0.1:45111_t_k%2Fd    ] o.a.s.c.c.ZkStateReader A cluster state change: [WatchedEvent state:SyncConnected type:NodeDataChanged path:/collections/control_collection/state.json] for collection [control_collection] has occurred - updating... (live nodes size: [1])
   [junit4]   2> 206283 INFO  (qtp13008956-5454) [n:127.0.0.1:45111_t_k%2Fd c:control_collection s:shard1  x:control_collection_shard1_replica_n1] o.a.s.c.ZkController I am the leader, no recovery necessary
   [junit4]   2> 206286 INFO  (qtp13008956-5454) [n:127.0.0.1:45111_t_k%2Fd c:control_collection s:shard1  x:control_collection_shard1_replica_n1] o.a.s.s.HttpSolrCall [admin] webapp=null path=/admin/cores params={qt=/admin/cores&collection.configName=conf1&newCollection=true&name=control_collection_shard1_replica_n1&action=CREATE&numShards=1&collection=control_collection&shard=shard1&wt=javabin&version=2&replicaType=NRT} status=0 QTime=1329
   [junit4]   2> 206291 INFO  (qtp13008956-5452) [n:127.0.0.1:45111_t_k%2Fd    ] o.a.s.h.a.CollectionsHandler Wait for new collection to be active for at most 30 seconds. Check all shard replicas
   [junit4]   2> 206391 INFO  (zkCallback-228-thread-1-processing-n:127.0.0.1:45111_t_k%2Fd) [n:127.0.0.1:45111_t_k%2Fd    ] o.a.s.c.c.ZkStateReader A cluster state change: [WatchedEvent state:SyncConnected type:NodeDataChanged path:/collections/control_collection/state.json] for collection [control_collection] has occurred - updating... (live nodes size: [1])
   [junit4]   2> 206850 INFO  (OverseerCollectionConfigSetProcessor-98425793899724804-127.0.0.1:45111_t_k%2Fd-n_0000000000) [n:127.0.0.1:45111_t_k%2Fd    ] o.a.s.c.OverseerTaskQueue Response ZK path: /overseer/collection-queue-work/qnr-0000000000 doesn't exist.  Requestor may have disconnected from ZooKeeper
   [junit4]   2> 207291 INFO  (qtp13008956-5452) [n:127.0.0.1:45111_t_k%2Fd    ] o.a.s.s.HttpSolrCall [admin] webapp=null path=/admin/collections params={replicationFactor=1&collection.configName=conf1&name=control_collection&nrtReplicas=1&action=CREATE&numShards=1&createNodeSet=127.0.0.1:45111_t_k%252Fd&wt=javabin&version=2} status=0 QTime=2446
   [junit4]   2> 207301 INFO  (TEST-TestSolrConfigHandlerConcurrent.test-seed#[99B0A63C28CEF9AF]) [    ] o.a.s.c.c.ZkStateReader Updated live nodes from ZooKeeper... (0) -> (1)
   [junit4]   2> 207303 INFO  (TEST-TestSolrConfigHandlerConcurrent.test-seed#[99B0A63C28CEF9AF]) [    ] o.a.s.c.s.i.ZkClientClusterStateProvider Cluster at 127.0.0.1:44263/solr ready
   [junit4]   2> 207306 INFO  (TEST-TestSolrConfigHandlerConcurrent.test-seed#[99B0A63C28CEF9AF]) [    ] o.a.s.c.ChaosMonkey monkey: init - expire sessions:false cause connection loss:false
   [junit4]   2> 207309 INFO  (qtp13008956-5452) [n:127.0.0.1:45111_t_k%2Fd    ] o.a.s.h.a.CollectionsHandler Invoked Collection Action :create with params replicationFactor=1&collection.configName=conf1&name=collection1&nrtReplicas=1&action=CREATE&numShards=2&createNodeSet=&stateFormat=1&wt=javabin&version=2 and sendToOCPQueue=true
   [junit4]   2> 207313 INFO  (OverseerThreadFactory-589-thread-2-processing-n:127.0.0.1:45111_t_k%2Fd) [n:127.0.0.1:45111_t_k%2Fd    ] o.a.s.c.CreateCollectionCmd Create collection collection1
   [junit4]   2> 207314 WARN  (OverseerThreadFactory-589-thread-2-processing-n:127.0.0.1:45111_t_k%2Fd) [n:127.0.0.1:45111_t_k%2Fd    ] o.a.s.c.CreateCollectionCmd It is unusual to create a collection (collection1) without cores.
   [junit4]   2> 207521 INFO  (qtp13008956-5452) [n:127.0.0.1:45111_t_k%2Fd    ] o.a.s.h.a.CollectionsHandler Wait for new collection to be active for at most 30 seconds. Check all shard replicas
   [junit4]   2> 207522 INFO  (qtp13008956-5452) [n:127.0.0.1:45111_t_k%2Fd    ] o.a.s.s.HttpSolrCall [admin] webapp=null path=/admin/collections params={replicationFactor=1&collection.configName=conf1&name=collection1&nrtReplicas=1&action=CREATE&numShards=2&createNodeSet=&stateFormat=1&wt=javabin&version=2} status=0 QTime=212
   [junit4]   2> 207617 INFO  (TEST-TestSolrConfigHandlerConcurrent.test-seed#[99B0A63C28CEF9AF]) [    ] o.a.s.c.AbstractFullDistribZkTestBase create jetty 1 in directory /home/jenkins/workspace/Lucene-Solr-master-Linux/solr/build/solr-core/test/J2/temp/solr.handler.TestSolrConfigHandlerConcurrent_99B0A63C28CEF9AF-001/shard-1-001 of type NRT
   [junit4]   2> 207617 INFO  (TEST-TestSolrConfigHandlerConcurrent.test-seed#[99B0A63C28CEF9AF]) [    ] o.e.j.s.Server jetty-9.3.14.v20161028
   [junit4]   2> 207618 INFO  (TEST-TestSolrConfigHandlerConcurrent.test-seed#[99B0A63C28CEF9AF]) [    ] o.e.j.s.h.ContextHandler Started o.e.j.s.ServletContextHandler@174b23c{/t_k/d,null,AVAILABLE}
   [junit4]   2> 207619 INFO  (TEST-TestSolrConfigHandlerConcurrent.test-seed#[99B0A63C28CEF9AF]) [    ] o.e.j.s.AbstractConnector Started ServerConnector@1a5ea60{HTTP/1.1,[http/1.1]}{127.0.0.1:36225}
   [junit4]   2> 207619 INFO  (TEST-TestSolrConfigHandlerConcurrent.test-seed#[99B0A63C28CEF9AF]) [    ] o.e.j.s.Server Started @208634ms
   [junit4]   2> 207619 INFO  (TEST-TestSolrConfigHandlerConcurrent.test-seed#[99B0A63C28CEF9AF]) [    ] o.a.s.c.s.e.JettySolrRunner Jetty properties: {solr.data.dir=/home/jenkins/workspace/Lucene-Solr-master-Linux/solr/build/solr-core/test/J2/temp/solr.handler.TestSolrConfigHandlerConcurrent_99B0A63C28CEF9AF-001/tempDir-001/jetty1, solrconfig=solrconfig.xml, hostContext=/t_k/d, hostPort=36225, coreRootDirectory=/home/jenkins/workspace/Lucene-Solr-master-Linux/solr/build/solr-core/test/J2/../../../../../../../../../home/jenkins/workspace/Lucene-Solr-master-Linux/solr/build/solr-core/test/J2/temp/solr.handler.TestSolrConfigHandlerConcurrent_99B0A63C28CEF9AF-001/shard-1-001/cores}
   [junit4]   2> 207619 ERROR (TEST-TestSolrConfigHandlerConcurrent.test-seed#[99B0A63C28CEF9AF]) [    ] o.a.s.s.StartupLoggingUtils Missing Java Option solr.log.dir. Logging may be missing or incomplete.
   [junit4]   2> 207619 INFO  (TEST-TestSolrConfigHandlerConcurrent.test-seed#[99B0A63C28CEF9AF]) [    ] o.a.s.s.SolrDispatchFilter  ___      _       Welcome to Apache Solr™ version 8.0.0
   [junit4]   2> 207619 INFO  (TEST-TestSolrConfigHandlerConcurrent.test-seed#[99B0A63C28CEF9AF]) [    ] o.a.s.s.SolrDispatchFilter / __| ___| |_ _   Starting in cloud mode on port null
   [junit4]   2> 207619 INFO  (TEST-TestSolrConfigHandlerConcurrent.test-seed#[99B0A63C28CEF9AF]) [    ] o.a.s.s.SolrDispatchFilter \__ \/ _ \ | '_|  Install dir: null, Default config dir: null
   [junit4]   2> 207619 INFO  (TEST-TestSolrConfigHandlerConcurrent.test-seed#[99B0A63C28CEF9AF]) [    ] o.a.s.s.SolrDispatchFilter |___/\___/_|_|    Start time: 2017-08-04T14:53:50.874Z
   [junit4]   2> 207622 INFO  (TEST-TestSolrConfigHandlerConcurrent.test-seed#[99B0A63C28CEF9AF]) [    ] o.a.s.s.SolrDispatchFilter Loading solr.xml from SolrHome (not found in ZooKeeper)
   [junit4]   2> 207622 INFO  (TEST-TestSolrConfigHandlerConcurrent.test-seed#[99B0A63C28CEF9AF]) [    ] o.a.s.c.SolrXmlConfig Loading container configuration from /home/jenkins/workspace/Lucene-Solr-master-Linux/solr/build/solr-core/test/J2/temp/solr.handler.TestSolrConfigHandlerConcurrent_99B0A63C28CEF9AF-001/shard-1-001/solr.xml
   [junit4]   2> 207626 INFO  (TEST-TestSolrConfigHandlerConcurrent.test-seed#[99B0A63C28CEF9AF]) [    ] o.a.s.c.SolrXmlConfig MBean server found: com.sun.jmx.mbeanserver.JmxMBeanServer@1de406d, but no JMX reporters were configured - adding default JMX reporter.
   [junit4]   2> 207628 INFO  (TEST-TestSolrConfigHandlerConcurrent.test-seed#[99B0A63C28CEF9AF]) [    ] o.a.s.c.ZkContainer Zookeeper client=127.0.0.1:44263/solr
   [junit4]   2> 207630 WARN  (NIOServerCxn.Factory:0.0.0.0/0.0.0.0:0) [    ] o.a.z.s.NIOServerCnxn caught end of stream exception
   [junit4]   2> EndOfStreamException: Unable to read additional data from client sessionid 0x15dadbcf2210008, likely client has closed socket
   [junit4]   2> 	at org.apache.zookeeper.server.NIOServerCnxn.doIO(NIOServerCnxn.java:239)
   [junit4]   2> 	at org.apache.zookeeper.server.NIOServerCnxnFactory.run(NIOServerCnxnFactory.java:203)
   [junit4]   2> 	at java.lang.Thread.run(Thread.java:748)
   [junit4]   2> 207634 INFO  (TEST-TestSolrConfigHandlerConcurrent.test-seed#[99B0A63C28CEF9AF]) [n:127.0.0.1:36225_t_k%2Fd    ] o.a.s.c.c.ZkStateReader Updated live nodes from ZooKeeper... (0) -> (1)
   [junit4]   2> 207635 INFO  (TEST-TestSolrConfigHandlerConcurrent.test-seed#[99B0A63C28CEF9AF]) [n:127.0.0.1:36225_t_k%2Fd    ] o.a.s.c.Overseer Overseer (id=null) closing
   [junit4]   2> 207636 INFO  (TEST-TestSolrConfigHandlerConcurrent.test-seed#[99B0A63C28CEF9AF]) [n:127.0.0.1:36225_t_k%2Fd    ] o.a.s.c.ZkController Register node as live in ZooKeeper:/live_nodes/127.0.0.1:36225_t_k%2Fd
   [junit4]   2> 207637 INFO  (zkCallback-228-thread-1-processing-n:127.0.0.1:45111_t_k%2Fd) [n:127.0.0.1:45111_t_k%2Fd    ] o.a.s.c.c.ZkStateReader Updated live nodes from ZooKeeper... (1) -> (2)
   [junit4]   2> 207637 INFO  (zkCallback-235-thread-1) [    ] o.a.s.c.c.ZkStateReader Updated live nodes from ZooKeeper... (1) -> (2)
   [junit4]   2> 207637 INFO  (zkCallback-240-thread-1-processing-n:127.0.0.1:36225_t_k%2Fd) [n:127.0.0.1:36225_t_k%2Fd    ] o.a.s.c.c.ZkStateReader Updated live nodes from ZooKeeper... (1) -> (2)
   [junit4]   2> 207812 INFO  (TEST-TestSolrConfigHandlerConcurrent.test-seed#[99B0A63C28CEF9AF]) [n:127.0.0.1:36225_t_k%2Fd    ] o.a.s.m.r.SolrJmxReporter JMX monitoring for 'solr.node' (registry 'solr.node') enabled at server: com.sun.jmx.mbeanserver.JmxMBeanServer@1de406d
   [junit4]   2> 207818 INFO  (TEST-TestSolrConfigHandlerConcurrent.test-seed#[99B0A63C28CEF9AF]) [n:127.0.0.1:36225_t_k%2Fd    ] o.a.s.m.r.SolrJmxReporter JMX monitoring for 'solr.jvm' (registry 'solr.jvm') enabled at server: com.sun.jmx.mbeanserver.JmxMBeanServer@1de406d
   [junit4]   2> 207818 INFO  (TEST-TestSolrConfigHandlerConcurrent.test-seed#[99B0A63C28CEF9AF]) [n:127.0.0.1:36225_t_k%2Fd    ] o.a.s.m.r.SolrJmxReporter JMX monitoring for 'solr.jetty' (registry 'solr.jetty') enabled at server: com.sun.jmx.mbeanserver.JmxMBeanServer@1de406d
   [junit4]   2> 207819 INFO  (TEST-TestSolrConfigHandlerConcurrent.test-seed#[99B0A63C28CEF9AF]) [n:127.0.0.1:36225_t_k%2Fd    ] o.a.s.c.CorePropertiesLocator Found 0 core definitions underneath /home/jenkins/workspace/Lucene-Solr-master-Linux/solr/build/solr-core/test/J2/../../../../../../../../../home/jenkins/workspace/Lucene-Solr-master-Linux/solr/build/solr-core/test/J2/temp/solr.handler.TestSolrConfigHandlerConcurrent_99B0A63C28CEF9AF-001/shard-1-001/cores
   [junit4]   2> 207838 INFO  (qtp13008956-5447) [n:127.0.0.1:45111_t_k%2Fd    ] o.a.s.h.a.CollectionsHandler Invoked Collection Action :addreplica with params node=127.0.0.1:36225_t_k%252Fd&action=ADDREPLICA&collection=collection1&shard=shard2&type=NRT&wt=javabin&version=2 and sendToOCPQueue=true
   [junit4]   2> 207840 INFO  (OverseerThreadFactory-589-thread-3-processing-n:127.0.0.1:45111_t_k%2Fd) [n:127.0.0.1:45111_t_k%2Fd    ] o.a.s.c.AddReplicaCmd Node Identified 127.0.0.1:36225_t_k%2Fd for creating new replica
   [junit4]   2> 207840 INFO  (OverseerCollectionConfigSetProcessor-98425793899724804-127.0.0.1:45111_t_k%2Fd-n_0000000000) [n:127.0.0.1:45111_t_k%2Fd    ] o.a.s.c.OverseerTaskQueue Response ZK path: /overseer/collection-queue-work/qnr-0000000002 doesn't exist.  Requestor may have disconnected from ZooKeeper
   [junit4]   2> 207847 INFO  (qtp2282550-5493) [n:127.0.0.1:36225_t_k%2Fd    ] o.a.s.h.a.CoreAdminOperation core create command qt=/admin/cores&collection.configName=conf1&name=collection1_shard2_replica_n41&action=CREATE&collection=collection1&shard=shard2&wt=javabin&version=2&replicaType=NRT
   [junit4]   2> 207848 INFO  (qtp2282550-5493) [n:127.0.0.1:36225_t_k%2Fd    ] o.a.s.c.TransientSolrCoreCacheDefault Allocating transient cache for 4 transient cores
   [junit4]   2> 208871 INFO  (qtp2282550-5493) [n:127.0.0.1:36225_t_k%2Fd c:collection1 s:shard2  x:collection1_shard2_replica_n41] o.a.s.c.SolrConfig Using Lucene MatchVersion: 8.0.0
   [junit4]   2> 208892 INFO  (qtp2282550-5493) [n:127.0.0.1:36225_t_k%2Fd c:collection1 s:shard2  x:collection1_shard2_replica_n41] o.a.s.s.IndexSchema [collection1_shard2_replica_n41] Schema name=test
   [junit4]   2> 208960 INFO  (qtp2282550-5493) [n:127.0.0.1:36225_t_k%2Fd c:collection1 s:shard2  x:collection1_shard2_replica_n41] o.a.s.s.IndexSchema Loaded schema test/1.0 with uniqueid field id
   [junit4]   2> 208972 INFO  (qtp2282550-5493) [n:127.0.0.1:36225_t_k%2Fd c:collection1 s:shard2  x:collection1_shard2_replica_n41] o.a.s.c.CoreContainer Creating SolrCore 'collection1_shard2_replica_n41' using configuration from collection collection1, trusted=true
   [junit4]   2> 208972 INFO  (qtp2282550-5493) [n:127.0.0.1:36225_t_k%2Fd c:collection1 s:shard2  x:collection1_shard2_replica_n41] o.a.s.m.r.SolrJmxReporter JMX monitoring for 'solr.core.collection1.shard2.replica_n41' (registry 'solr.core.collection1.shard2.replica_n41') enabled at server: com.sun.jmx.mbeanserver.JmxMBeanServer@1de406d
   [junit4]   2> 208973 INFO  (qtp2282550-5493) [n:127.0.0.1:36225_t_k%2Fd c:collection1 s:shard2  x:collection1_shard2_replica_n41] o.a.s.c.SolrCore solr.RecoveryStrategy.Builder
   [junit4]   2> 208973 INFO  (qtp2282550-5493) [n:127.0.0.1:36225_t_k%2Fd c:collection1 s:shard2  x:collection1_shard2_replica_n41] o.a.s.c.SolrCore [[collection1_shard2_replica_n41] ] Opening new SolrCore at [/home/jenkins/workspace/Lucene-Solr-master-Linux/solr/build/solr-core/test/J2/temp/solr.handler.TestSolrConfigHandlerConcurrent_99B0A63C28CEF9AF-001/shard-1-001/cores/collection1_shard2_replica_n41], dataDir=[/home/jenkins/workspace/Lucene-Solr-master-Linux/solr/build/solr-core/test/J2/../../../../../../../../../home/jenkins/workspace/Lucene-Solr-master-Linux/solr/build/solr-core/test/J2/temp/solr.handler.TestSolrConfigHandlerConcurrent_99B0A63C28CEF9AF-001/shard-1-001/cores/collection1_shard2_replica_n41/data/]
   [junit4]   2> 208975 INFO  (qtp2282550-5493) [n:127.0.0.1:36225_t_k%2Fd c:collection1 s:shard2  x:collection1_shard2_replica_n41] o.a.s.u.RandomMergePolicy RandomMergePolicy wrapping class org.apache.lucene.index.TieredMergePolicy: [TieredMergePolicy: maxMergeAtOnce=40, maxMergeAtOnceExplicit=16, maxMergedSegmentMB=20.74609375, floorSegmentMB=2.0947265625, forceMergeDeletesPctAllowed=11.733083997195656, segmentsPerTier=49.0, maxCFSSegmentSizeMB=8.796093022207999E12, noCFSRatio=0.0
   [junit4]   2> 208977 WARN  (qtp2282550-5493) [n:127.0.0.1:36225_t_k%2Fd c:collection1 s:shard2  x:collection1_shard2_replica_n41] o.a.s.c.RequestHandlers INVALID paramSet a in requestHandler {type = requestHandler,name = /dump,class = DumpRequestHandler,attributes = {initParams=a, name=/dump, class=DumpRequestHandler},args = {defaults={a=A,b=B}}}
   [junit4]   2> 209013 INFO  (qtp2282550-5493) [n:127.0.0.1:36225_t_k%2Fd c:collection1 s:shard2  x:collection1_shard2_replica_n41] o.a.s.u.UpdateHandler Using UpdateLog implementation: org.apache.solr.update.UpdateLog
   [junit4]   2> 209014 INFO  (qtp2282550-5493) [n:127.0.0.1:36225_t_k%2Fd c:collection1 s:shard2  x:collection1_shard2_replica_n41] o.a.s.u.UpdateLog Initializing UpdateLog: dataDir= defaultSyncLevel=FLUSH numRecordsToKeep=100 maxNumLogsToKeep=10 numVersionBuckets=65536
   [junit4]   2> 209014 INFO  (qtp2282550-5493) [n:127.0.0.1:36225_t_k%2Fd c:collection1 s:shard2  x:collection1_shard2_replica_n41] o.a.s.u.CommitTracker Hard AutoCommit: disabled
   [junit4]   2> 209014 INFO  (qtp2282550-5493) [n:127.0.0.1:36225_t_k%2Fd c:collection1 s:shard2  x:collection1_shard2_replica_n41] o.a.s.u.CommitTracker Soft AutoCommit: disabled
   [junit4]   2> 209016 INFO  (qtp2282550-5493) [n:127.0.0.1:36225_t_k%2Fd c:collection1 s:shard2  x:collection1_shard2_replica_n41] o.a.s.u.RandomMergePolicy RandomMergePolicy wrapping class org.apache.lucene.index.LogDocMergePolicy: [LogDocMergePolicy: minMergeSize=1000, mergeFactor=39, maxMergeSize=9223372036854775807, maxMergeSizeForForcedMerge=9223372036854775807, calibrateSizeByDeletes=true, maxMergeDocs=2147483647, maxCFSSegmentSizeMB=8.796093022207999E12, noCFSRatio=1.0]
   [junit4]   2> 209016 INFO  (qtp2282550-5493) [n:127.0.0.1:36225_t_k%2Fd c:collection1 s:shard2  x:collection1_shard2_replica_n41] o.a.s.s.SolrIndexSearcher Opening [Searcher@e17f19[collection1_shard2_replica_n41] main]
   [junit4]   2> 209017 INFO  (qtp2282550-5493) [n:127.0.0.1:36225_t_k%2Fd c:collection1 s:shard2  x:collection1_shard2_replica_n41] o.a.s.r.ManagedResourceStorage Configured ZooKeeperStorageIO with znodeBase: /configs/conf1
   [junit4]   2> 209018 INFO  (qtp2282550-5493) [n:127.0.0.1:36225_t_k%2Fd c:collection1 s:shard2  x:collection1_shard2_replica_n41] o.a.s.r.ManagedResourceStorage Loaded null at path _rest_managed.json using ZooKeeperStorageIO:path=/configs/conf1
   [junit4]   2> 209018 INFO  (qtp2282550-5493) [n:127.0.0.1:36225_t_k%2Fd c:collection1 s:shard2  x:collection1_shard2_replica_n41] o.a.s.h.ReplicationHandler Commits will be reserved for  10000
   [junit4]   2> 209020 INFO  (searcherExecutor-603-thread-1-processing-n:127.0.0.1:36225_t_k%2Fd x:collection1_shard2_replica_n41 s:shard2 c:collection1) [n:127.0.0.1:36225_t_k%2Fd c:collection1 s:shard2  x:collection1_shard2_replica_n41] o.a.s.c.SolrCore [collection1_shard2_replica_n41] Registered new searcher Searcher@e17f19[collection1_shard2_replica_n41] main{ExitableDirectoryReader(UninvertingDirectoryReader())}
   [junit4]   2> 209020 INFO  (qtp2282550-5493) [n:127.0.0.1:36225_t_k%2Fd c:collection1 s:shard2  x:collection1_shard2_replica_n41] o.a.s.u.UpdateLog Could not find max version in index or recent updates, using new clock 1574812707481190400
   [junit4]   2> 209025 INFO  (qtp2282550-5493) [n:127.0.0.1:36225_t_k%2Fd c:collection1 s:shard2  x:collection1_shard2_replica_n41] o.a.s.c.ShardLeaderElectionContext Enough replicas found to continue.
   [junit4]   2> 209025 INFO  (qtp2282550-5493) [n:127.0.0.1:36225_t_k%2Fd c:collection1 s:shard2  x:collection1_shard2_replica_n41] o.a.s.c.ShardLeaderElectionContext I may be the new leader - try and sync
   [junit4]   2> 209025 INFO  (qtp2282550-5493) [n:127.0.0.1:36225_t_k%2Fd c:collection1 s:shard2  x:collection1_shard2_replica_n41] o.a.s.c.SyncStrategy Sync replicas to http://127.0.0.1:36225/t_k/d/collection1_shard2_replica_n41/
   [junit4]   2> 209025 INFO  (qtp2282550-5493) [n:127.0.0.1:36225_t_k%2Fd c:collection1 s:shard2  x:collection1_shard2_replica_n41] o.a.s.c.SyncStrategy Sync Success - now sync replicas to me
   [junit4]   2> 209025 INFO  (qtp2282550-5493) [n:127.0.0.1:36225_t_k%2Fd c:collection1 s:shard2  x:collection1_shard2_replica_n41] o.a.s.c.SyncStrategy http://127.0.0.1:36225/t_k/d/collection1_shard2_replica_n41/ has no replicas
   [junit4]   2> 209025 INFO  (qtp2282550-5493) [n:127.0.0.1:36225_t_k%2Fd c:collection1 s:shard2  x:collection1_shard2_replica_n41] o.a.s.c.ShardLeaderElectionContext Found all replicas participating in election, clear LIR
   [junit4]   2> 209027 INFO  (qtp2282550-5493) [n:127.0.0.1:36225_t_k%2Fd c:collection1 s:shard2  x:collection1_shard2_replica_n41] o.a.s.c.ShardLeaderElectionContext I am the new leader: http://127.0.0.1:36225/t_k/d/collection1_shard2_replica_n41/ shard2
   [junit4]   2> 209178 INFO  (qtp2282550-5493) [n:127.0.0.1:36225_t_k%2Fd c:collection1 s:shard2  x:collection1_shard2_replica_n41] o.a.s.c.ZkController I am the leader, no recovery necessary
   [junit4]   2> 209180 INFO  (qtp2282550-5493) [n:127.0.0.1:36225_t_k%2Fd c:collection1 s:shard2  x:collection1_shard2_replica_n41] o.a.s.s.HttpSolrCall [admin] webapp=null path=/admin/cores params={qt=/admin/cores&collection.configName=conf1&name=collection1_shard2_replica_n41&action=CREATE&collection=collection1&shard=shard2&wt=javabin&version=2&replicaType=NRT} status=0 QTime=1332
   [junit4]   2> 209184 INFO  (qtp13008956-5447) [n:127.0.0.1:45111_t_k%2Fd    ] o.a.s.s.HttpSolrCall [admin] webapp=null path=/admin/collections params={node=127.0.0.1:36225_t_k%252Fd&action=ADDREPLICA&collection=collection1&shard=shard2&type=NRT&wt=javabin&version=2} status=0 QTime=1345
   [junit4]   2> 209273 INFO  (TEST-TestSolrConfigHandlerConcurrent.test-seed#[99B0A63C28CEF9AF]) [    ] o.a.s.c.AbstractFullDistribZkTestBase create jetty 2 in directory /home/jenkins/workspace/Lucene-Solr-master-Linux/solr/build/solr-core/test/J2/temp/solr.handler.TestSolrConfigHandlerConcurrent_99B0A63C28CEF9AF-001/shard-2-001 of type NRT
   [junit4]   2> 209273 INFO  (TEST-TestSolrConfigHandlerConcurrent.test-seed#[99B0A63C28CEF9AF]) [    ] o.e.j.s.Server jetty-9.3.14.v20161028
   [junit4]   2> 209274 INFO  (TEST-TestSolrConfigHandlerConcurrent.test-seed#[99B0A63C28CEF9AF]) [    ] o.e.j.s.h.ContextHandler Started o.e.j.s.ServletContextHandler@10cf95a{/t_k/d,null,AVAILABLE}
   [junit4]   2> 209275 INFO  (TEST-TestSolrConfigHandlerConcurrent.test-seed#[99B0A63C28CEF9AF]) [    ] o.e.j.s.AbstractConnector Started ServerConnector@1296779{HTTP/1.1,[http/1.1]}{127.0.0.1:39493}
   [junit4]   2> 209275 INFO  (TEST-TestSolrConfigHandlerConcurrent.test-seed#[99B0A63C28CEF9AF]) [    ] o.e.j.s.Server Started @210290ms
   [junit4]   2> 209275 INFO  (TEST-TestSolrConfigHandlerConcurrent.test-seed#[99B0A63C28CEF9AF]) [    ] o.a.s.c.s.e.JettySolrRunner Jetty properties: {solr.data.dir=/home/jenkins/workspace/Lucene-Solr-master-Linux/solr/build/solr-core/test/J2/temp/solr.handler.TestSolrConfigHandlerConcurrent_99B0A63C28CEF9AF-001/tempDir-001/jetty2, solrconfig=solrconfig.xml, hostContext=/t_k/d, hostPort=39493, coreRootDirectory=/home/jenkins/workspace/Lucene-Solr-master-Linux/solr/build/solr-core/test/J2/../../../../../../../../../home/jenkins/workspace/Lucene-Solr-master-Linux/solr/build/solr-core/test/J2/temp/solr.handler.TestSolrConfigHandlerConcurrent_99B0A63C28CEF9AF-001/shard-2-001/cores}
   [junit4]   2> 209275 ERROR (TEST-TestSolrConfigHandlerConcurrent.test-seed#[99B0A63C28CEF9AF]) [    ] o.a.s.s.StartupLoggingUtils Missing Java Option solr.log.dir. Logging may be missing or incomplete.
   [junit4]   2> 209275 INFO  (TEST-TestSolrConfigHandlerConcurrent.test-seed#[99B0A63C28CEF9AF]) [    ] o.a.s.s.SolrDispatchFilter  ___      _       Welcome to Apache Solr™ version 8.0.0
   [junit4]   2> 209275 INFO  (TEST-TestSolrConfigHandlerConcurrent.test-seed#[99B0A63C28CEF9AF]) [    ] o.a.s.s.SolrDispatchFilter / __| ___| |_ _   Starting in cloud mode on port null
   [junit4]   2> 209275 INFO  (TEST-TestSolrConfigHandlerConcurrent.test-seed#[99B0A63C28CEF9AF]) [    ] o.a.s.s.SolrDispatchFilter \__ \/ _ \ | '_|  Install dir: null, Default config dir: null
   [junit4]   2> 209275 INFO  (TEST-TestSolrConfigHandlerConcurrent.test-seed#[99B0A63C28CEF9AF]) [    ] o.a.s.s.SolrDispatchFilter |___/\___/_|_|    Start time: 2017-08-04T14:53:52.530Z
   [junit4]   2> 209277 INFO  (TEST-TestSolrConfigHandlerConcurrent.test-seed#[99B0A63C28CEF9AF]) [    ] o.a.s.s.SolrDispatchFilter Loading solr.xml from SolrHome (not found in ZooKeeper)
   [junit4]   2> 209277 INFO  (TEST-TestSolrConfigHandlerConcurrent.test-seed#[99B0A63C28CEF9AF]) [    ] o.a.s.c.SolrXmlConfig Loading container configuration from /home/jenkins/workspace/Lucene-Solr-master-Linux/solr/build/solr-core/test/J2/temp/solr.handler.TestSolrConfigHandlerConcurrent_99B0A63C28CEF9AF-001/shard-2-001/solr.xml
   [junit4]   2> 209284 INFO  (TEST-TestSolrConfigHandlerConcurrent.test-seed#[99B0A63C28CEF9AF]) [    ] o.a.s.c.SolrXmlConfig MBean server found: com.sun.jmx.mbeanserver.JmxMBeanServer@1de406d, but no JMX reporters were configured - adding default JMX reporter.
   [junit4]   2> 209286 INFO  (TEST-TestSolrConfigHandlerConcurrent.test-seed#[99B0A63C28CEF9AF]) [    ] o.a.s.c.ZkContainer Zookeeper client=127.0.0.1:44263/solr
   [junit4]   2> 209293 INFO  (TEST-TestSolrConfigHandlerConcurrent.test-seed#[99B0A63C28CEF9AF]) [n:127.0.0.1:39493_t_k%2Fd    ] o.a.s.c.c.ZkStateReader Updated live nodes from ZooKeeper... (0) -> (2)
   [junit4]   2> 209294 INFO  (TEST-TestSolrConfigHandlerConcurrent.test-seed#[99B0A63C28CEF9AF]) [n:127.0.0.1:39493_t_k%2Fd    ] o.a.s.c.Overseer Overseer (id=null) closing
   [junit4]   2> 209295 INFO  (TEST-TestSolrConfigHandlerConcurrent.test-seed#[99B0A63C28CEF9AF]) [n:127.0.0.1:39493_t_k%2Fd    ] o.a.s.c.ZkController Register node as live in ZooKeeper:/live_nodes/127.0.0.1:39493_t_k%2Fd
   [junit4]   2> 209296 INFO  (zkCallback-235-thread-1) [    ] o.a.s.c.c.ZkStateReader Updated live nodes from ZooKeeper... (2) -> (3)
   [junit4]   2> 209296 INFO  (zkCallback-246-thread-1-processing-n:127.0.0.1:39493_t_k%2Fd) [n:127.0.0.1:39493_t_k%2Fd    ] o.a.s.c.c.ZkStateReader Updated live nodes from ZooKeeper... (2) -> (3)
   [junit4]   2> 209296 INFO  (zkCallback-240-thread-1-processing-n:127.0.0.1:36225_t_k%2Fd) [n:127.0.0.1:36225_t_k%2Fd    ] o.a.s.c.c.ZkStateReader Updated live nodes from ZooKeeper... (2) -> (3)
   [junit4]   2> 209296 INFO  (zkCallback-228-thread-1-processing-n:127.0.0.1:45111_t_k%2Fd) [n:127.0.0.1:45111_t_k%2Fd    ] o.a.s.c.c.ZkStateReader Updated live nodes from ZooKeeper... (2) -> (3)
   [junit4]   2> 209455 INFO  (TEST-TestSolrConfigHandlerConcurrent.test-seed#[99B0A63C28CEF9AF]) [n:127.0.0.1:39493_t_k%2Fd    ] o.a.s.m.r.SolrJmxReporter JMX monitoring for 'solr.node' (registry 'solr.node') enabled at server: com.sun.jmx.mbeanserver.JmxMBeanServer@1de406d
   [junit4]   2> 209459 INFO  (TEST-TestSolrConfigHandlerConcurrent.test-seed#[99B0A63C28CEF9AF]) [n:127.0.0.1:39493_t_k%2Fd    ] o.a.s.m.r.SolrJmxReporter JMX monitoring for 'solr.jvm' (registry 'solr.jvm') enabled at server: com.sun.jmx.mbeanserver.JmxMBeanServer@1de406d
   [junit4]   2> 209459 INFO  (TEST-TestSolrConfigHandlerConcurrent.test-seed#[99B0A63C28CEF9AF]) [n:127.0.0.1:39493_t_k%2Fd    ] o.a.s.m.r.SolrJmxReporter JMX monitoring for 'solr.jetty' (registry 'solr.jetty') enabled at server: com.sun.jmx.mbeanserver.JmxMBeanServer@1de406d
   [junit4]   2> 209461 INFO  (TEST-TestSolrConfigHandlerConcurrent.test-seed#[99B0A63C28CEF9AF]) [n:127.0.0.1:39493_t_k%2Fd    ] o.a.s.c.CorePropertiesLocator Found 0 core definitions underneath /home/jenkins/workspace/Lucene-Solr-master-Linux/solr/build/solr-core/test/J2/../../../../../../../../../home/jenkins/workspace/Lucene-Solr-master-Linux/solr/build/solr-core/test/J2/temp/solr.handler.TestSolrConfigHandlerConcurrent_99B0A63C28CEF9AF-001/shard-2-001/cores
   [junit4]   2> 209484 INFO  (qtp13008956-5448) [n:127.0.0.1:45111_t_k%2Fd    ] o.a.s.h.a.CollectionsHandler Invoked Collection Action :addreplica with params node=127.0.0.1:39493_t_k%252Fd&action=ADDREPLICA&collection=collection1&shard=shard1&type=NRT&wt=javabin&version=2 and sendToOCPQueue=true
   [junit4]   2> 209487 INFO  (OverseerThreadFactory-589-thread-4-processing-n:127.0.0.1:45111_t_k%2Fd) [n:127.0.0.1:45111_t_k%2Fd    ] o.a.s.c.AddReplicaCmd Node Identified 127.0.0.1:39493_t_k%2Fd for creating new replica
   [junit4]   2> 209487 INFO  (OverseerCollectionConfigSetProcessor-98425793899724804-127.0.0.1:45111_t_k%2Fd-n_0000000000) [n:127.0.0.1:45111_t_k%2Fd    ] o.a.s.c.OverseerTaskQueue Response ZK path: /overseer/collection-queue-work/qnr-0000000004 doesn't exist.  Requestor may have disconnected from ZooKeeper
   [junit4]   2> 209489 INFO  (qtp27665291-5522) [n:127.0.0.1:39493_t_k%2Fd    ] o.a.s.h.a.CoreAdminOperation core create command qt=/admin/cores&collection.configName=conf1&name=collection1_shard1_replica_n43&action=CREATE&collection=collection1&shard=shard1&wt=javabin&version=2&replicaType=NRT
   [junit4]   2> 209490 INFO  (qtp27665291-5522) [n:127.0.0.1:39493_t_k%2Fd    ] o.a.s.c.TransientSolrCoreCacheDefault Allocating transient cache for 4 transient cores
   [junit4]   2> 210525 INFO  (qtp27665291-5522) [n:127.0.0.1:39493_t_k%2Fd c:collection1 s:shard1  x:collection1_shard1_replica_n43] o.a.s.c.SolrConfig Using Lucene MatchVersion: 8.0.0
   [junit4]   2> 210557 INFO  (qtp27665291-5522) [n:127.0.0.1:39493_t_k%2Fd c:collection1 s:shard1  x:collection1_shard1_replica_n43] o.a.s.s.IndexSchema [collection1_shard1_replica_n43] Schema name=test
   [junit4]   2> 210641 INFO  (qtp27665291-5522) [n:127.0.0.1:39493_t_k%2Fd c:collection1 s:shard1  x:collection1_shard1_replica_n43] o.a.s.s.IndexSchema Loaded schema test/1.0 with uniqueid field id
   [junit4]   2> 210657 INFO  (qtp27665291-5522) [n:127.0.0.1:39493_t_k%2Fd c:collection1 s:shard1  x:collection1_shard1_replica_n43] o.a.s.c.CoreContainer Creating SolrCore 'collection1_shard1_replica_n43' using configuration from collection collection1, trusted=true
   [junit4]   2> 210658 INFO  (qtp27665291-5522) [n:127.0.0.1:39493_t_k%2Fd c:collection1 s:shard1  x:collection1_shard1_replica_n43] o.a.s.m.r.SolrJmxReporter JMX monitoring for 'solr.core.collection1.shard1.replica_n43' (registry 'solr.core.collection1.shard1.replica_n43') enabled at server: com.sun.jmx.mbeanserver.JmxMBeanServer@1de406d
   [junit4]   2> 210658 INFO  (qtp27665291-5522) [n:127.0.0.1:39493_t_k%2Fd c:collection1 s:shard1  x:collection1_shard1_replica_n43] o.a.s.c.SolrCore solr.RecoveryStrategy.Builder
   [junit4]   2> 210658 INFO  (qtp27665291-5522) [n:127.0.0.1:39493_t_k%2Fd c:collection1 s:shard1  x:collection1_shard1_replica_n43] o.a.s.c.SolrCore [[collection1_shard1_replica_n43] ] Opening new SolrCore at [/home/jenkins/workspace/Lucene-Solr-master-Linux/solr/build/solr-core/test/J2/temp/solr.handler.TestSolrConfigHandlerConcurrent_99B0A63C28CEF9AF-001/shard-2-001/cores/collection1_shard1_replica_n43], dataDir=[/home/jenkins/workspace/Lucene-Solr-master-Linux/solr/build/solr-core/test/J2/../../../../../../../../../home/jenkins/workspace/Lucene-Solr-master-Linux/solr/build/solr-core/test/J2/temp/solr.handler.TestSolrConfigHandlerConcurrent_99B0A63C28CEF9AF-001/shard-2-001/cores/collection1_shard1_replica_n43/data/]
   [junit4]   2> 210661 INFO  (qtp27665291-5522) [n:127.0.0.1:39493_t_k%2Fd c:collection1 s:shard1  x:collection1_shard1_replica_n43] o.a.s.u.RandomMergePolicy RandomMergePolicy wrapping class org.apache.lucene.index.TieredMergePolicy: [TieredMergePolicy: maxMergeAtOnce=40, maxMergeAtOnceExplicit=16, maxMergedSegmentMB=20.74609375, floorSegmentMB=2.0947265625, forceMergeDeletesPctAllowed=11.733083997195656, segmentsPerTier=49.0, maxCFSSegmentSizeMB=8.796093022207999E12, noCFSRatio=0.0
   [junit4]   2> 210663 WARN  (qtp27665291-5522) [n:127.0.0.1:39493_t_k%2Fd c:collection1 s:shard1  x:collection1_shard1_replica_n43] o.a.s.c.RequestHandlers INVALID paramSet a in requestHandler {type = requestHandler,name = /dump,class = DumpRequestHandler,attributes = {initParams=a, name=/dump, class=DumpRequestHandler},args = {defaults={a=A,b=B}}}
   [junit4]   2> 210696 INFO  (qtp27665291-5522) [n:127.0.0.1:39493_t_k%2Fd c:collection1 s:shard1  x:collection1_shard1_replica_n43] o.a.s.u.UpdateHandler Using UpdateLog implementation: org.apache.solr.update.UpdateLog
   [junit4]   2> 210696 INFO  (qtp27665291-5522) [n:127.0.0.1:39493_t_k%2Fd c:collection1 s:shard1  x:collection1_shard1_replica_n43] o.a.s.u.UpdateLog Initializing UpdateLog: dataDir= defaultSyncLevel=FLUSH numRecordsToKeep=100 maxNumLogsToKeep=10 numVersionBuckets=65536
   [junit4]   2> 210697 INFO  (qtp27665291-5522) [n:127.0.0.1:39493_t_k%2Fd c:collection1 s:shard1  x:collection1_shard1_replica_n43] o.a.s.u.CommitTracker Hard AutoCommit: disabled
   [junit4]   2> 210697 INFO  (qtp27665291-5522) [n:127.0.0.1:39493_t_k%2Fd c:collection1 s:shard1  x:collection1_shard1_replica_n43] o.a.s.u.CommitTracker Soft AutoCommit: disabled
   [junit4]   2> 210698 INFO  (qtp27665291-5522) [n:127.0.0.1:39493_t_k%2Fd c:collection1 s:shard1  x:collection1_shard1_replica_n43] o.a.s.u.RandomMergePolicy RandomMergePolicy wrapping class org.apache.lucene.index.LogDocMergePolicy: [LogDocMergePolicy: minMergeSize=1000, mergeFactor=39, maxMergeSize=9223372036854775807, maxMergeSizeForForcedMerge=9223372036854775807, calibrateSizeByDeletes=true, maxMergeDocs=2147483647, maxCFSSegmentSizeMB=8.796093022207999E12, noCFSRatio=1.0]
   [junit4]   2> 210698 INFO  (qtp27665291-5522) [n:127.0.0.1:39493_t_k%2Fd c:collection1 s:shard1  x:collection1_shard1_replica_n43] o.a.s.s.SolrIndexSearcher Opening [Searcher@1361d14[collection1_shard1_replica_n43] main]
   [junit4]   2> 210699 INFO  (qtp27665291-5522) [n:127.0.0.1:39493_t_k%2Fd c:collection1 s:shard1  x:collection1_shard1_replica_n43] o.a.s.r.ManagedResourceStorage Configured ZooKeeperStorageIO with znodeBase: /configs/conf1
   [junit4]   2> 210699 INFO  (qtp27665291-5522) [n:127.0.0.1:39493_t_k%2Fd c:collection1 s:shard1  x:collection1_shard1_replica_n43] o.a.s.r.ManagedResourceStorage Loaded null at path _rest_managed.json using ZooKeeperStorageIO:path=/configs/conf1
   [junit4]   2> 210700 INFO  (qtp27665291-5522) [n:127.0.0.1:39493_t_k%2Fd c:collection1 s:shard1  x:collection1_shard1_replica_n43] o.a.s.h.ReplicationHandler Commits will be reserved for  10000
   [junit4]   2> 210700 INFO  (qtp27665291-5522) [n:127.0.0.1:39493_t_k%2Fd c:collection1 s:shard1  x:collection1_shard1_replica_n43] o.a.s.u.UpdateLog Could not find max version in index or recent updates, using new clock 1574812709242798080
   [junit4]   2> 210701 INFO  (searcherExecutor-614-thread-1-processing-n:127.0.0.1:39493_t_k%2Fd x:collection1_shard1_replica_n43 s:shard1 c:collection1) [n:127.0.0.1:39493_t_k%2Fd c:collection1 s:shard1  x:collection1_shard1_replica_n43] o.a.s.c.SolrCore [collection1_shard1_replica_n43] Registered new searcher Searcher@1361d14[collection1_shard1_replica_n43] main{ExitableDirectoryReader(UninvertingDirectoryReader())}
   [junit4]   2> 210704 INFO  (qtp27665291-5522) [n:127.0.0.1:39493_t_k%2Fd c:collection1 s:shard1  x:collection1_shard1_replica_n43] o.a.s.c.ShardLeaderElectionContext Enough replicas found to continue.
   [junit4]   2> 210704 INFO  (qtp27665291-5522) [n:127.0.0.1:39493_t_k%2Fd c:collection1 s:shard1  x:collection1_shard1_replica_n43] o.a.s.c.ShardLeaderElectionContext I may be the new leader - try and sync
   [junit4]   2> 210704 INFO  (qtp27665291-5522) [n:127.0.0.1:39493_t_k%2Fd c:collection1 s:shard1  x:collection1_shard1_replica_n43] o.a.s.c.SyncStrategy Sync replicas to http://127.0.0.1:39493/t_k/d/collection1_shard1_replica_n43/
   [junit4]   2> 210704 INFO  (qtp27665291-5522) [n:127.0.0.1:39493_t_k%2Fd c:collection1 s:shard1  x:collection1_shard1_replica_n43] o.a.s.c.SyncStrategy Sync Success - now sync replicas to me
   [junit4]   2> 210704 INFO  (qtp27665291-5522) [n:127.0.0.1:39493_t_k%2Fd c:collection1 s:shard1  x:collection1_shard1_replica_n43] o.a.s.c.SyncStrategy http://127.0.0.1:39493/t_k/d/collection1_shard1_replica_n43/ has no replicas
   [junit4]   2> 210704 INFO  (qtp27665291-5522) [n:127.0.0.1:39493_t_k%2Fd c:collection1 s:shard1  x:collection1_shard1_replica_n43] o.a.s.c.ShardLeaderElectionContext Found all replicas participating in election, clear LIR
   [junit4]   2> 210706 INFO  (qtp27665291-5522) [n:127.0.0.1:39493_t_k%2Fd c:collection1 s:shard1  x:collection1_shard1_replica_n43] o.a.s.c.ShardLeaderElectionContext I am the new leader: http://127.0.0.1:39493/t_k/d/collection1_shard1_replica_n43/ shard1
   [junit4]   2> 210856 INFO  (qtp27665291-5522) [n:127.0.0.1:39493_t_k%2Fd c:collection1 s:shard1  x:collection1_shard1_replica_n43] o.a.s.c.ZkController I am the leader, no recovery necessary
   [junit4]   2> 210858 INFO  (qtp27665291-5522) [n:127.0.0.1:39493_t_k%2Fd c:collection1 s:shard1  x:collection1_shard1_replica_n43] o.a.s.s.HttpSolrCall [admin] webapp=null path=/admin/cores params={qt=/admin/cores&collection.configName=conf1&name=collection1_shard1_replica_n43&action=CREATE&collection=collection1&shard=shard1&wt=javabin&version=2&replicaType=NRT} status=0 QTime=1369
   [junit4]   2> 210862 INFO  (qtp13008956-5448) [n:127.0.0.1:45111_t_k%2Fd    ] o.a.s.s.HttpSolrCall [admin] webapp=null path=/admin/collections params={node=127.0.0.1:39493_t_k%252Fd&action=ADDREPLICA&collection=collection1&shard=shard1&type=NRT&wt=javabin&version=2} status=0 QTime=1378
   [junit4]   2> 211061 INFO  (TEST-TestSolrConfigHandlerConcurrent.test-seed#[99B0A63C28CEF9AF]) [    ] o.a.s.c.AbstractFullDistribZkTestBase create jetty 3 in directory /home/jenkins/workspace/Lucene-Solr-master-Linux/solr/build/solr-core/test/J2/temp/solr.handler.TestSolrConfigHandlerConcurrent_99B0A63C28CEF9AF-001/shard-3-001 of type NRT
   [junit4]   2> 211061 INFO  (TEST-TestSolrConfigHandlerConcurrent.test-seed#[99B0A63C28CEF9AF]) [    ] o.e.j.s.Server jetty-9.3.14.v20161028
   [junit4]   2> 211063 INFO  (TEST-TestSolrConfigHandlerConcurrent.test-seed#[99B0A63C28CEF9AF]) [    ] o.e.j.s.h.ContextHandler Started o.e.j.s.ServletContextHandler@1783eb9{/t_k/d,null,AVAILABLE}
   [junit4]   2> 211064 INFO  (TEST-TestSolrConfigHandlerConcurrent.test-seed#[99B0A63C28CEF9AF]) [    ] o.e.j.s.AbstractConnector Started ServerConnector@331743{HTTP/1.1,[http/1.1]}{127.0.0.1:33397}
   [junit4]   2> 211065 INFO  (TEST-TestSolrConfigHandlerConcurrent.test-seed#[99B0A63C28CEF9AF]) [    ] o.e.j.s.Server Started @212080ms
   [junit4]   2> 211065 INFO  (TEST-TestSolrConfigHandlerConcurrent.test-seed#[99B0A63C28CEF9AF]) [    ] o.a.s.c.s.e.JettySolrRunner Jetty properties: {solr.data.dir=/home/jenkins/workspace/Lucene-Solr-master-Linux/solr/build/solr-core/test/J2/temp/solr.handler.TestSolrConfigHandlerConcurrent_99B0A63C28CEF9AF-001/tempDir-001/jetty3, replicaType=NRT, solrconfig=solrconfig.xml, hostContext=/t_k/d, hostPort=33397, coreRootDirectory=/home/jenkins/workspace/Lucene-Solr-master-Linux/solr/build/solr-core/test/J2/../../../../../../../../../home/jenkins/workspace/Lucene-Solr-master-Linux/solr/build/solr-core/test/J2/temp/solr.handler.TestSolrConfigHandlerConcurrent_99B0A63C28CEF9AF-001/shard-3-001/cores}
   [junit4]   2> 211065 ERROR (TEST-TestSolrConfigHandlerConcurrent.test-seed#[99B0A63C28CEF9AF]) [    ] o.a.s.s.StartupLoggingUtils Missing Java Option solr.log.dir. Logging may be missing or incomplete.
   [junit4]   2> 211065 INFO  (TEST-TestSolrConfigHandlerConcurrent.test-seed#[99B0A63C28CEF9AF]) [    ] o.a.s.s.SolrDispatchFilter  ___      _       Welcome to Apache Solr™ version 8.0.0
   [junit4]   2> 211065 INFO  (TEST-TestSolrConfigHandlerConcurrent.test-seed#[99B0A63C28CEF9AF]) [    ] o.a.s.s.SolrDispatchFilter / __| ___| |_ _   Starting in cloud mode on port null
   [junit4]   2> 211065 INFO  (TEST-TestSolrConfigHandlerConcurrent.test-seed#[99B0A63C28CEF9AF]) [    ] o.a.s.s.SolrDispatchFilter \__ \/ _ \ | '_|  Install dir: null, Default config dir: null
   [junit4]   2> 211065 INFO  (TEST-TestSolrConfigHandlerConcurrent.test-seed#[99B0A63C28CEF9AF]) [    ] o.a.s.s.SolrDispatchFilter |___/\___/_|_|    Start time: 2017-08-04T14:53:54.320Z
   [junit4]   2> 211068 INFO  (TEST-TestSolrConfigHandlerConcurrent.test-seed#[99B0A63C28CEF9AF]) [    ] o.a.s.s.SolrDispatchFilter Loading solr.xml from SolrHome (not found in ZooKeeper)
   [junit4]   2> 211068 INFO  (TEST-TestSolrConfigHandlerConcurrent.test-seed#[99B0A63C28CEF9AF]) [    ] o.a.s.c.SolrXmlConfig Loading container configuration from /home/jenkins/workspace/Lucene-Solr-master-Linux/solr/build/solr-core/test/J2/temp/solr.handler.TestSolrConfigHandlerConcurrent_99B0A63C28CEF9AF-001/shard-3-001/solr.xml
   [junit4]   2> 211073 INFO  (TEST-TestSolrConfigHandlerConcurrent.test-seed#[99B0A63C28CEF9AF]) [    ] o.a.s.c.SolrXmlConfig MBean server found: com.sun.jmx.mbeanserver.JmxMBeanServer@1de406d, but no JMX reporters were configured - adding default JMX reporter.
   [junit4]   2> 211077 INFO  (TEST-TestSolrConfigHandlerConcurrent.test-seed#[99B0A63C28CEF9AF]) [    ] o.a.s.c.ZkContainer Zookeeper client=127.0.0.1:44263/solr
   [junit4]   2> 211085 INFO  (TEST-TestSolrConfigHandlerConcurrent.test-seed#[99B0A63C28CEF9AF]) [n:127.0.0.1:33397_t_k%2Fd    ] o.a.s.c.c.ZkStateReader Updated live nodes from ZooKeeper... (0) -> (3)
   [junit4]   2> 211086 INFO  (TEST-TestSolrConfigHandlerConcurrent.test-seed#[99B0A63C28CEF9AF]) [n:127.0.0.1:33397_t_k%2Fd    ] o.a.s.c.Overseer Overseer (id=null) closing
   [junit4]   2> 211087 INFO  (TEST-TestSolrConfigHandlerConcurrent.test-seed#[99B0A63C28CEF9AF]) [n:127.0.0.1:33397_t_k%2Fd    ] o.a.s.c.ZkController Register node as live in ZooKeeper:/live_nodes/127.0.0.1:33397_t_k%2Fd
   [junit4]   2> 211088 INFO  (zkCallback-235-thread-1) [    ] o.a.s.c.c.ZkStateReader Updated live nodes from ZooKeeper... (3) -> (4)
   [junit4]   2> 211088 INFO  (zkCallback-240-thread-1-processing-n:127.0.0.1:36225_t_k%2Fd) [n:127.0.0.1:36225_t_k%2Fd    ] o.a.s.c.c.ZkStateReader Updated live nodes from ZooKeeper... (3) -> (4)
   [junit4]   2> 211088 INFO  (zkCallback-228-thread-1-processing-n:127.0.0.1:45111_t_k%2Fd) [n:127.0.0.1:45111_t_k%2Fd    ] o.a.s.c.c.ZkStateReader Updated live nodes from ZooKeeper... (3) -> (4)
   [junit4]   2> 211089 INFO  (zkCallback-246-thread-1-processing-n:127.0.0.1:39493_t_k%2Fd) [n:127.0.0.1:39493_t_k%2Fd    ] o.a.s.c.c.ZkStateReader Updated live nodes from ZooKeeper... (3) -> (4)
   [junit4]   2> 211089 INFO  (zkCallback-252-thread-1-processing-n:127.0.0.1:33397_t_k%2Fd) [n:127.0.0.1:33397_t_k%2Fd    ] o.a.s.c.c.ZkStateReader Updated live nodes from ZooKeeper... (3) -> (4)
   [junit4]   2> 211486 INFO  (TEST-TestSolrConfigHandlerConcurrent.test-seed#[99B0A63C28CEF9AF]) [n:127.0.0.1:33397_t_k%2Fd    ] o.a.s.m.r.SolrJmxReporter JMX monitoring for 'solr.node' (registry 'solr.node') enabled at server: com.sun.jmx.mbeanserver.JmxMBeanServer@1de406d
   [junit4]   2> 211489 INFO  (OverseerCollectionConfigSetProcessor-98425793899724804-127.0.0.1:45111_t_k%2Fd-n_0000000000) [n:127.0.0.1:45111_t_k%2Fd    ] o.a.s.c.OverseerTaskQueue Response ZK path: /overseer/collection-queue-work/qnr-0000000006 doesn't exist.  Requestor may have disconnected from ZooKeeper
   [junit4]   2> 211493 INFO  (TEST-TestSolrConfigHandlerConcurrent.test-seed#[99B0A63C28CEF9AF]) [n:127.0.0.1:33397_t_k%2Fd    ] o.a.s.m.r.SolrJmxReporter JMX monitoring for 'solr.jvm' (registry 'solr.jvm') enabled at server: com.sun.jmx.mbeanserver.JmxMBeanServer@1de406d
   [junit4]   2> 211493 INFO  (TEST-TestSolrConfigHandlerConcurrent.test-seed#[99B0A63C28CEF9AF]) [n:127.0.0.1:33397_t_k%2Fd    ] o.a.s.m.r.SolrJmxReporter JMX monitoring for 'solr.jetty' (registry 'solr.jetty') enabled at server: com.sun.jmx.mbeanserver.JmxMBeanServer@1de406d
   [junit4]   2> 211494 INFO  (TEST-TestSolrConfigHandlerConcurrent.test-seed#[99B0A63C28CEF9AF]) [n:127.0.0.1:33397_t_k%2Fd    ] o.a.s.c.CorePropertiesLocator Found 0 core definitions underneath /home/jenkins/workspace/Lucene-Solr-master-Linux/solr/build/solr-core/test/J2/../../../../../../../../../home/jenkins/workspace/Lucene-Solr-master-Linux/solr/build/solr-core/test/J2/temp/solr.handler.TestSolrConfigHandlerConcurrent_99B0A63C28CEF9AF-001/shard-3-001/cores
   [junit4]   2> 211528 INFO  (qtp13008956-5449) [n:127.0.0.1:45111_t_k%2Fd    ] o.a.s.h.a.CollectionsHandler Invoked Collection Action :addreplica with params node=127.0.0.1:33397_t_k%252Fd&action=ADDREPLICA&collection=collection1&shard=shard2&type=NRT&wt=javabin&version=2 and sendToOCPQueue=true
   [junit4]   2> 211533 INFO  (OverseerThreadFactory-589-thread-5-processing-n:127.0.0.1:45111_t_k%2Fd) [n:127.0.0.1:45111_t_k%2Fd    ] o.a.s.c.AddReplicaCmd Node Identified 127.0.0.1:33397_t_k%2Fd for creating new replica
   [junit4]   2> 211537 INFO  (qtp27131866-5552) [n:127.0.0.1:33397_t_k%2Fd    ] o.a.s.h.a.CoreAdminOperation core create command qt=/admin/cores&collection.configName=conf1&name=collection1_shard2_replica_n45&action=CREATE&collection=collection1&shard=shard2&wt=javabin&version=2&replicaType=NRT
   [junit4]   2> 211537 INFO  (qtp27131866-5552) [n:127.0.0.1:33397_t_k%2Fd    ] o.a.s.c.TransientSolrCoreCacheDefault Allocating transient cache for 4 transient cores
   [junit4]   2> 212561 INFO  (qtp27131866-5552) [n:127.0.0.1:33397_t_k%2Fd c:collection1 s:shard2  x:collection1_shard2_replica_n45] o.a.s.c.SolrConfig Using Lucene MatchVersion: 8.0.0
   [junit4]   2> 212584 INFO  (qtp27131866-5552) [n:127.0.0.1:33397_t_k%2Fd c:collection1 s:shard2  x:collection1_shard2_replica_n45] o.a.s.s.IndexSchema [collection1_shard2_replica_n45] Schema name=test
   [junit4]   2> 212659 INFO  (qtp27131866-5552) [n:127.0.0.1:33397_t_k%2Fd c:collection1 s:shard2  x:collection1_shard2_replica_n45] o.a.s.s.IndexSchema Loaded schema test/1.0 with uniqueid field id
   [junit4]   2> 212674 INFO  (qtp27131866-5552) [n:127.0.0.1:33397_t_k%2Fd c:collection1 s:shard2  x:collection1_shard2_replica_n45] o.a.s.c.CoreContainer Creating SolrCore 'collection1_shard2_replica_n45' using configuration from collection collection1, trusted=true
   [junit4]   2> 212674 INFO  (qtp27131866-5552) [n:127.0.0.1:33397_t_k%2Fd c:collection1 s:shard2  x:collection1_shard2_replica_n45] o.a.s.m.r.SolrJmxReporter JMX monitoring for 'solr.core.collection1.shard2.replica_n45' (registry 'solr.core.collection1.shard2.replica_n45') enabled at server: com.sun.jmx.mbeanserver.JmxMBeanServer@1de406d
   [junit4]   2> 212674 INFO  (qtp27131866-5552) [n:127.0.0.1:33397_t_k%2Fd c:collection1 s:shard2  x:collection1_shard2_replica_n45] o.a.s.c.SolrCore solr.RecoveryStrategy.Builder
   [junit4]   2> 212674 INFO  (qtp27131866-5552) [n:127.0.0.1:33397_t_k%2Fd c:collection1 s:shard2  x:collection1_shard2_replica_n45] o.a.s.c.SolrCore [[collection1_shard2_replica_n45] ] Opening new SolrCore at [/home/jenkins/workspace/Lucene-Solr-master-Linux/solr/build/solr-core/test/J2/temp/solr.handler.TestSolrConfigHandlerConcurrent_99B0A63C28CEF9AF-001/shard-3-001/cores/collection1_shard2_replica_n45], dataDir=[/home/jenkins/workspace/Lucene-Solr-master-Linux/solr/build/solr-core/test/J2/../../../../../../../../../home/jenkins/workspace/Lucene-Solr-master-Linux/solr/build/solr-core/test/J2/temp/solr.handler.TestSolrConfigHandlerConcurrent_99B0A63C28CEF9AF-001/shard-3-001/cores/collection1_shard2_replica_n45/data/]
   [junit4]   2> 212677 INFO  (qtp27131866-5552) [n:127.0.0.1:33397_t_k%2Fd c:collection1 s:shard2  x:collection1_shard2_replica_n45] o.a.s.u.RandomMergePolicy RandomMergePolicy wrapping class org.apache.lucene.index.TieredMergePolicy: [TieredMergePolicy: maxMergeAtOnce=40, maxMergeAtOnceExplicit=16, maxMergedSegmentMB=20.74609375, floorSegmentMB=2.0947265625, forceMergeDeletesPctAllowed=11.733083997195656, segmentsPerTier=49.0, maxCFSSegmentSizeMB=8.796093022207999E12, noCFSRatio=0.0
   [junit4]   2> 212680 WARN  (qtp27131866-5552) [n:127.0.0.1:33397_t_k%2Fd c:collection1 s:shard2  x:collection1_shard2_replica_n45] o.a.s.c.RequestHandlers INVALID paramSet a in requestHandler {type = requestHandler,name = /dump,class = DumpRequestHandler,attributes = {initParams=a, name=/dump, class=DumpRequestHandler},args = {defaults={a=A,b=B}}}
   [junit4]   2> 212712 INFO  (qtp27131866-5552) [n:127.0.0.1:33397_t_k%2Fd c:collection1 s:shard2  x:collection1_shard2_replica_n45] o.a.s.u.UpdateHandler Using UpdateLog implementation: org.apache.solr.update.UpdateLog
   [junit4]   2> 212712 INFO  (qtp27131866-5552) [n:127.0.0.1:33397_t_k%2Fd c:collection1 s:shard2  x:collection1_shard2_replica_n45] o.a.s.u.UpdateLog Initializing UpdateLog: dataDir= defaultSyncLevel=FLUSH numRecordsToKeep=100 maxNumLogsToKeep=10 numVersionBuckets=65536
   [junit4]   2> 212713 INFO  (qtp27131866-5552) [n:127.0.0.1:33397_t_k%2Fd c:collection1 s:shard2  x:collection1_shard2_replica_n45] o.a.s.u.CommitTracker Hard AutoCommit: disabled
   [junit4]   2> 212713 INFO  (qtp27131866-5552) [n:127.0.0.1:33397_t_k%2Fd c:collection1 s:shard2  x:collection1_shard2_replica_n45] o.a.s.u.CommitTracker Soft AutoCommit: disabled
   [junit4]   2> 212714 INFO  (qtp27131866-5552) [n:127.0.0.1:33397_t_k%2Fd c:collection1 s:shard2  x:collection1_shard2_replica_n45] o.a.s.u.RandomMergePolicy RandomMergePolicy wrapping class org.apache.lucene.index.LogDocMergePolicy: [LogDocMergePolicy: minMergeSize=1000, mergeFactor=39, maxMergeSize=9223372036854775807, maxMergeSizeForForcedMerge=9223372036854775807, calibrateSizeByDeletes=true, maxMergeDocs=2147483647, maxCFSSegmentSizeMB=8.796093022207999E12, noCFSRatio=1.0]
   [junit4]   2> 212714 INFO  (qtp27131866-5552) [n:127.0.0.1:33397_t_k%2Fd c:collection1 s:shard2  x:collection1_shard2_replica_n45] o.a.s.s.SolrIndexSearcher Opening [Searcher@130de8c[collection1_shard2_replica_n45] main]
   [junit4]   2> 212715 INFO  (qtp27131866-5552) [n:127.0.0.1:33397_t_k%2Fd c:collection1 s:shard2  x:collection1_shard2_replica_n45] o.a.s.r.ManagedResourceStorage Configured ZooKeeperStorageIO with znodeBase: /configs/conf1
   [junit4]   2> 212716 INFO  (qtp27131866-5552) [n:127.0.0.1:33397_t_k%2Fd c:collection1 s:shard2  x:collection1_shard2_replica_n45] o.a.s.r.ManagedResourceStorage Loaded null at path _rest_managed.json using ZooKeeperStorageIO:path=/configs/conf1
   [junit4]   2> 212716 INFO  (qtp27131866-5552) [n:127.0.0.1:33397_t_k%2Fd c:collection1 s:shard2  x:collection1_shard2_replica_n45] o.a.s.h.ReplicationHandler Commits will be reserved for  10000
   [junit4]   2> 212716 INFO  (qtp27131866-5552) [n:127.0.0.1:33397_t_k%2Fd c:collection1 s:shard2  x:collection1_shard2_replica_n45] o.a.s.u.UpdateLog Could not find max version in index or recent updates, using new clock 1574812711356727296
   [junit4]   2> 212718 INFO  (searcherExecutor-625-thread-1-processing-n:127.0.0.1:33397_t_k%2Fd x:collection1_shard2_replica_n45 s:shard2 c:collection1) [n:127.0.0.1:33397_t_k%2Fd c:collection1 s:shard2  x:collection1_shard2_replica_n45] o.a.s.c.SolrCore [collection1_shard2_replica_n45] Registered new searcher Searcher@130de8c[collection1_shard2_replica_n45] main{ExitableDirectoryReader(UninvertingDirectoryReader())}
   [junit4]   2> 212719 INFO  (qtp27131866-5552) [n:127.0.0.1:33397_t_k%2Fd c:collection1 s:shard2  x:collection1_shard2_replica_n45] o.a.s.c.ZkController Core needs to recover:collection1_shard2_replica_n45
   [junit4]   2> 212719 INFO  (updateExecutor-249-thread-1-processing-n:127.0.0.1:33397_t_k%2Fd x:collection1_shard2_replica_n45 s:shard2 c:collection1) [n:127.0.0.1:33397_t_k%2Fd c:collection1 s:shard2 r:core_node46 x:collection1_shard2_replica_n45] o.a.s.u.DefaultSolrCoreState Running recovery
   [junit4]   2> 212719 INFO  (qtp27131866-5552) [n:127.0.0.1:33397_t_k%2Fd c:collection1 s:shard2  x:collection1_shard2_replica_n45] o.a.s.s.HttpSolrCall [admin] webapp=null path=/admin/cores params={qt=/admin/cores&collection.configName=conf1&name=collection1_shard2_replica_n45&action=CREATE&collection=collection1&shard=shard2&wt=javabin&version=2&replicaType=NRT} status=0 QTime=1182
   [junit4]   2> 212719 INFO  (recoveryExecutor-250-thread-1-processing-n:127.0.0.1:33397_t_k%2Fd x:collection1_shard2_replica_n45 s:shard2 c:collection1 r:core_node46) [n:127.0.0.1:33397_t_k%2Fd c:collection1 s:shard2 r:core_node46 x:collection1_shard2_replica_n45] o.a.s.c.RecoveryStrategy Starting recovery process. recoveringAfterStartup=true
   [junit4]   2> 212720 INFO  (recoveryExecutor-250-thread-1-processing-n:127.0.0.1:33397_t_k%2Fd x:collection1_shard2_replica_n45 s:shard2 c:collection1 r:core_node46) [n:127.0.0.1:33397_t_k%2Fd c:collection1 s:shard2 r:core_node46 x:collection1_shard2_replica_n45] o.a.s.c.RecoveryStrategy ###### startupVersions=[[]]
   [junit4]   2> 212720 INFO  (recoveryExecutor-250-thread-1-processing-n:127.0.0.1:33397_t_k%2Fd x:collection1_shard2_replica_n45 s:shard2 c:collection1 r:core_node46) [n:127.0.0.1:33397_t_k%2Fd c:collection1 s:shard2 r:core_node46 x:collection1_shard2_replica_n45] o.a.s.c.RecoveryStrategy Begin buffering updates. core=[collection1_shard2_replica_n45]
   [junit4]   2> 212720 INFO  (recoveryExecutor-250-thread-1-processing-n:127.0.0.1:33397_t_k%2Fd x:collection1_shard2_replica_n45 s:shard2 c:collection1 r:core_node46) [n:127.0.0.1:33397_t_k%2Fd c:collection1 s:shard2 r:core_node46 x:collection1_shard2_replica_n45] o.a.s.u.UpdateLog Starting to buffer updates. FSUpdateLog{state=ACTIVE, tlog=null}
   [junit4]   2> 212720 INFO  (recoveryExecutor-250-thread-1-processing-n:127.0.0.1:33397_t_k%2Fd x:collection1_shard2_replica_n45 s:shard2 c:collection1 r:core_node46) [n:127.0.0.1:33397_t_k%2Fd c:collection1 s:shard2 r:core_node46 x:collection1_shard2_replica_n45] o.a.s.c.RecoveryStrategy Publishing state of core [collection1_shard2_replica_n45] as recovering, leader is [http://127.0.0.1:36225/t_k/d/collection1_shard2_replica_n41/] and I am [http://127.0.0.1:33397/t_k/d/collection1_shard2_replica_n45/]
   [junit4]   2> 212722 INFO  (qtp13008956-5449) [n:127.0.0.1:45111_t_k%2Fd    ] o.a.s.s.HttpSolrCall [admin] webapp=null path=/admin/collections params={node=127.0.0.1:33397_t_k%252Fd&action=ADDREPLICA&collection=collection1&shard=shard2&type=NRT&wt=javabin&version=2} status=0 QTime=1194
   [junit4]   2> 212723 INFO  (recoveryExecutor-250-thread-1-processing-n:127.0.0.1:33397_t_k%2Fd x:collection1_shard2_replica_n45 s:shard2 c:collection1 r:core_node46) [n:127.0.0.1:33397_t_k%2Fd c:collection1 s:shard2 r:core_node46 x:collection1_shard2_replica_n45] o.a.s.c.RecoveryStrategy Sending prep recovery command to [http://127.0.0.1:36225/t_k/d]; [WaitForState: action=PREPRECOVERY&core=collection1_shard2_replica_n41&nodeName=127.0.0.1:33397_t_k%252Fd&coreNodeName=core_node46&state=recovering&checkLive=true&onlyIfLeader=true&onlyIfLeaderActive=true]
   [junit4]   2> 212724 INFO  (qtp2282550-5495) [n:127.0.0.1:36225_t_k%2Fd    ] o.a.s.h.a.PrepRecoveryOp Going to wait for coreNodeName: core_node46, state: recovering, checkLive: true, onlyIfLeader: true, onlyIfLeaderActive: true, maxTime: 183 s
   [junit4]   2> 212725 INFO  (qtp2282550-5495) [n:127.0.0.1:36225_t_k%2Fd    ] o.a.s.h.a.PrepRecoveryOp In WaitForState(recovering): collection=collection1, shard=shard2, thisCore=collection1_shard2_replica_n41, leaderDoesNotNeedRecovery=false, isLeader? true, live=true, checkLive=true, currentState=down, localState=active, nodeName=127.0.0.1:33397_t_k%2Fd, coreNodeName=core_node46, onlyIfActiveCheckResult=false, nodeProps: core_node46:{"core":"collection1_shard2_replica_n45","base_url":"http://127.0.0.1:33397/t_k/d","node_name":"127.0.0.1:33397_t_k%2Fd","state":"down","type":"NRT"}
   [junit4]   2> 212787 INFO  (TEST-TestSolrConfigHandlerConcurrent.test-seed#[99B0A63C28CEF9AF]) [    ] o.a.s.c.AbstractFullDistribZkTestBase create jetty 4 in directory /home/jenkins/workspace/Lucene-Solr-master-Linux/solr/build/solr-core/test/J2/temp/solr.handler.TestSolrConfigHandlerConcurrent_99B0A63C28CEF9AF-001/shard-4-001 of type NRT
   [junit4]   2> 212788 INFO  (TEST-TestSolrConfigHandlerConcurrent.test-seed#[99B0A63C28CEF9AF]) [    ] o.e.j.s.Server jetty-9.3.14.v20161028
   [junit4]   2> 212789 INFO  (TEST-TestSolrConfigHandlerConcurrent.test-seed#[99B0A63C28CEF9AF]) [    ] o.e.j.s.h.ContextHandler Started o.e.j.s.ServletContextHandler@8e7e4f{/t_k/d,null,AVAILABLE}
   [junit4]   2> 212789 INFO  (TEST-TestSolrConfigHandlerConcurrent.test-seed#[99B0A63C28CEF9AF]) [    ] o.e.j.s.AbstractConnector Started ServerConnector@1b4864c{HTTP/1.1,[http/1.1]}{127.0.0.1:39681}
   [junit4]   2> 212790 INFO  (TEST-TestSolrConfigHandlerConcurrent.test-seed#[99B0A63C28CEF9AF]) [    ] o.e.j.s.Server Started @213805ms
   [junit4]   2> 212790 INFO  (TEST-TestSolrConfigHandlerConcurrent.test-seed#[99B0A63C28CEF9AF]) [    ] o.a.s.c.s.e.JettySolrRunner Jetty properties: {solr.data.dir=/home/jenkins/workspace/Lucene-Solr-master-Linux/solr/build/solr-core/test/J2/temp/solr.handler.TestSolrConfigHandlerConcurrent_99B0A63C28CEF9AF-001/tempDir-001/jetty4, solrconfig=solrconfig.xml, hostContext=/t_k/d, hostPort=39681, coreRootDirectory=/home/jenkins/workspace/Lucene-Solr-master-Linux/solr/build/solr-core/test/J2/../../../../../../../../../home/jenkins/workspace/Lucene-Solr-master-Linux/solr/build/solr-core/test/J2/temp/solr.handler.TestSolrConfigHandlerConcurrent_99B0A63C28CEF9AF-001/shard-4-001/cores}
   [junit4]   2> 212790 ERROR (TEST-TestSolrConfigHandlerConcurrent.test-seed#[99B0A63C28CEF9AF]) [    ] o.a.s.s.StartupLoggingUtils Missing Java Option solr.log.dir. Logging may be missing or incomplete.
   [junit4]   2> 212790 INFO  (TEST-TestSolrConfigHandlerConcurrent.test-seed#[99B0A63C28CEF9AF]) [    ] o.a.s.s.SolrDispatchFilter  ___      _       Welcome to Apache Solr™ version 8.0.0
   [junit4]   2> 212790 INFO  (TEST-TestSolrConfigHandlerConcurrent.test-seed#[99B0A63C28CEF9AF]) [    ] o.a.s.s.SolrDispatchFilter / __| ___| |_ _   Starting in cloud mode on port null
   [junit4]   2> 212790 INFO  (TEST-TestSolrConfigHandlerConcurrent.test-seed#[99B0A63C28CEF9AF]) [    ] o.a.s.s.SolrDispatchFilter \__ \/ _ \ | '_|  Install dir: null, Default config dir: null
   [junit4]   2> 212790 INFO  (TEST-TestSolrConfigHandlerConcurrent.test-seed#[99B0A63C28CEF9AF]) [    ] o.a.s.s.SolrDispatchFilter |___/\___/_|_|    Start time: 2017-08-04T14:53:56.045Z
   [junit4]   2> 212793 INFO  (TEST-TestSolrConfigHandlerConcurrent.test-seed#[99B0A63C28CEF9AF]) [    ] o.a.s.s.SolrDispatchFilter Loading solr.xml from SolrHome (not found in ZooKeeper)
   [junit4]   2> 212793 INFO  (TEST-TestSolrConfigHandlerConcurrent.test-seed#[99B0A63C28CEF9AF]) [    ] o.a.s.c.SolrXmlConfig Loading container configuration from /home/jenkins/workspace/Lucene-Solr-master-Linux/solr/build/solr-core/test/J2/temp/solr.handler.TestSolrConfigHandlerConcurrent_99B0A63C28CEF9AF-001/shard-4-001/solr.xml
   [junit4]   2> 212797 INFO  (TEST-TestSolrConfigHandlerConcurrent.test-seed#[99B0A63C28CEF9AF]) [    ] o.a.s.c.SolrXmlConfig MBean server found: com.sun.jmx.mbeanserver.JmxMBeanServer@1de406d, but no JMX reporters were configured - adding default JMX reporter.
   [junit4]   2> 212799 INFO  (TEST-TestSolrConfigHandlerConcurrent.test-seed#[99B0A63C28CEF9AF]) [    ] o.a.s.c.ZkContainer Zookeeper client=127.0.0.1:44263/solr
   [junit4]   2> 212804 INFO  (TEST-TestSolrConfigHandlerConcurrent.test-seed#[99B0A63C28CEF9AF]) [n:127.0.0.1:39681_t_k%2Fd    ] o.a.s.c.c.ZkStateReader Updated live nodes from ZooKeeper... (0) -> (4)
   [junit4]   2> 212805 INFO  (TEST-TestSolrConfigHandlerConcurrent.test-seed#[99B0A63C28CEF9AF]) [n:127.0.0.1:39681_t_k%2Fd    ] o.a.s.c.Overseer Overseer (id=null) closing
   [junit4]   2> 212806 INFO  (TEST-TestSolrConfigHandlerConcurrent.test-seed#[99B0A63C28CEF9AF]) [n:127.0.0.1:39681_t_k%2Fd    ] o.a.s.c.ZkController Register node as live in ZooKeeper:/live_nodes/127.0.0.1:39681_t_k%2Fd
   [junit4]   2> 212807 INFO  (zkCallback-246-thread-1-processing-n:127.0.0.1:39493_t_k%2Fd) [n:127.0.0.1:39493_t_k%2Fd    ] o.a.s.c.c.ZkStateReader Updated live nodes from ZooKeeper... (4) -> (5)
   [junit4]   2> 212807 INFO  (zkCallback-235-thread-1) [    ] o.a.s.c.c.ZkStateReader Updated live nodes from ZooKeeper... (4) -> (5)
   [junit4]   2> 212808 INFO  (zkCallback-259-thread-1-processing-n:127.0.0.1:39681_t_k%2Fd) [n:127.0.0.1:39681_t_k%2Fd    ] o.a.s.c.c.ZkStateReader Updated live nodes from ZooKeeper... (4) -> (5)
   [junit4]   2> 212808 INFO  (zkCallback-240-thread-1-processing-n:127.0.0.1:36225_t_k%2Fd) [n:127.0.0.1:36225_t_k%2Fd    ] o.a.s.c.c.ZkStateReader Updated live nodes from ZooKeeper... (4) -> (5)
   [junit4]   2> 212808 INFO  (zkCallback-252-thread-1-processing-n:127.0.0.1:33397_t_k%2Fd) [n:127.0.0.1:33397_t_k%2Fd    ] o.a.s.c.c.ZkStateReader Updated live nodes from ZooKeeper... (4) -> (5)
   [junit4]   2> 212808 INFO  (zkCallback-228-thread-1-processing-n:127.0.0.1:45111_t_k%2Fd) [n:127.0.0.1:45111_t_k%2Fd    ] o.a.s.c.c.ZkStateReader Updated live nodes from ZooKeeper... (4) -> (5)
   [junit4]   2> 213049 INFO  (TEST-TestSolrConfigHandlerConcurrent.test-seed#[99B0A63C28CEF9AF]) [n:127.0.0.1:39681_t_k%2Fd    ] o.a.s.m.r.SolrJmxReporter JMX monitoring for 'solr.node' (registry 'solr.node') enabled at server: com.sun.jmx.mbeanserver.JmxMBeanServer@1de406d
   [junit4]   2> 213054 INFO  (TEST-TestSolrConfigHandlerConcurrent.test-seed#[99B0A63C28CEF9AF]) [n:127.0.0.1:39681_t_k%2Fd    ] o.a.s.m.r.SolrJmxReporter JMX monitoring for 'solr.jvm' (registry 'solr.jvm') enabled at server: com.sun.jmx.mbeanserver.JmxMBeanServer@1de406d
   [junit4]   2> 213054 INFO  (TEST-TestSolrConfigHandlerConcurrent.test-seed#[99B0A63C28CEF9AF]) [n:127.0.0.1:39681_t_k%2Fd    ] o.a.s.m.r.SolrJmxReporter JMX monitoring for 'solr.jetty' (registry 'solr.jetty') enabled at server: com.sun.jmx.mbeanserver.JmxMBeanServer@1de406d
   [junit4]   2> 213055 INFO  (TEST-TestSolrConfigHandlerConcurrent.test-seed#[99B0A63C28CEF9AF]) [n:127.0.0.1:39681_t_k%2Fd    ] o.a.s.c.CorePropertiesLocator Found 0 core definitions underneath /home/jenkins/workspace/Lucene-Solr-master-Linux/solr/build/solr-core/test/J2/../../../../../../../../../home/jenkins/workspace/Lucene-Solr-master-Linux/solr/build/solr-core/test/J2/temp/solr.handler.TestSolrConfigHandlerConcurrent_99B0A63C28CEF9AF-001/shard-4-001/cores
   [junit4]   2> 213098 INFO  (qtp11086863-5585) [n:127.0.0.1:39681_t_k%2Fd    ] o.a.s.h.a.CollectionsHandler Invoked Collection Action :addreplica with params node=127.0.0.1:39681_t_k%252Fd&action=ADDREPLICA&collection=collection1&shard=shard1&type=NRT&wt=javabin&version=2 and sendToOCPQueue=true
   [junit4]   2> 213100 INFO  (OverseerThreadFactory-589-thread-5-processing-n:127.0.0.1:45111_t_k%2Fd) [n:127.0.0.1:45111_t_k%2Fd    ] o.a.s.c.AddReplicaCmd Node Identified 127.0.0.1:39681_t_k%2Fd for creating new replica
   [junit4]   2> 213100 INFO  (OverseerCollectionConfigSetProcessor-98425793899724804-127.0.0.1:45111_t_k%2Fd-n_0000000000) [n:127.0.0.1:45111_t_k%2Fd    ] o.a.s.c.OverseerTaskQueue Response ZK path: /overseer/collection-queue-work/qnr-0000000008 doesn't exist.  Requestor may have disconnected from ZooKeeper
   [junit4]   2> 213103 INFO  (qtp11086863-5587) [n:127.0.0.1:39681_t_k%2Fd    ] o.a.s.h.a.CoreAdminOperation core create command qt=/admin/cores&collection.configName=conf1&name=collection1_shard1_replica_n47&action=CREATE&collection=collection1&shard=shard1&wt=javabin&version=2&replicaType=NRT
   [junit4]   2> 213103 INFO  (qtp11086863-5587) [n:127.0.0.1:39681_t_k%2Fd    ] o.a.s.c.TransientSolrCoreCacheDefault Allocating transient cache for 4 transient cores
   [junit4]   2> 213725 INFO  (qtp2282550-5495) [n:127.0.0.1:36225_t_k%2Fd    ] o.a.s.h.a.PrepRecoveryOp In WaitForState(recovering): collection=collection1, shard=shard2, thisCore=collection1_shard2_replica_n41, leaderDoesNotNeedRecovery=false, isLeader? true, live=true, checkLive=true, currentState=recovering, localState=active, nodeName=127.0.0.1:33397_t_k%2Fd, coreNodeName=core_node46, onlyIfActiveCheckResult=false, nodeProps: core_node46:{"core":"collection1_shard2_replica_n45","base_url":"http://127.0.0.1:33397/t_k/d","node_name":"127.0.0.1:33397_t_k%2Fd","state":"recovering","type":"NRT"}
   [junit4]   2> 213725 INFO  (qtp2282550-5495) [n:127.0.0.1:36225_t_k%2Fd    ] o.a.s.h.a.PrepRecoveryOp Waited coreNodeName: core_node46, state: recovering, checkLive: true, onlyIfLeader: true for: 1 seconds.
   [junit4]   2> 213725 INFO  (qtp2282550-5495) [n:127.0.0.1:36225_t_k%2Fd    ] o.a.s.s.HttpSolrCall [admin] webapp=null path=/admin/cores params={nodeName=127.0.0.1:33397_t_k%252Fd&onlyIfLeaderActive=true&core=collection1_shard2_replica_n41&coreNodeName=core_node46&action=PREPRECOVERY&checkLive=true&state=recovering&onlyIfLeader=true&wt=javabin&version=2} status=0 QTime=1000
   [junit4]   2> 214115 INFO  (qtp11086863-5587) [n:127.0.0.1:39681_t_k%2Fd c:collection1 s:shard1  x:collection1_shard1_replica_n47] o.a.s.c.SolrConfig Using Lucene MatchVersion: 8.0.0
   [junit4]   2> 214127 INFO  (qtp11086863-5587) [n:127.0.0.1:39681_t_k%2Fd c:collection1 s:shard1  x:collection1_shard1_replica_n47] o.a.s.s.IndexSchema [collection1_shard1_replica_n47] Schema name=test
   [junit4]   2> 214200 INFO  (qtp11086863-5587) [n:127.0.0.1:39681_t_k%2Fd c:collection1 s:shard1  x:collection1_shard1_replica_n47] o.a.s.s.IndexSchema Loaded schema test/1.0 with uniqueid field id
   [junit4]   2> 214213 INFO  (qtp11086863-5587) [n:127.0.0.1:39681_t_k%2Fd c:collection1 s:shard1  x:collection1_shard1_replica_n47] o.a.s.c.CoreContainer Creating SolrCore 'collection1_shard1_replica_n47' using configuration from collection collection1, trusted=true
   [junit4]   2> 214213 INFO  (qtp11086863-5587) [n:127.0.0.1:39681_t_k%2Fd c:collection1 s:shard1  x:collection1_shard1_replica_n47] o.a.s.m.r.SolrJmxReporter JMX monitoring for 'solr.core.collection1.shard1.replica_n47' (registry 'solr.core.collection1.shard1.replica_n47') enabled at server: com.sun.jmx.mbeanserver.JmxMBeanServer@1de406d
   [junit4]   2> 214213 INFO  (qtp11086863-5587) [n:127.0.0.1:39681_t_k%2Fd c:collection1 s:shard1  x:collection1_shard1_replica_n47] o.a.s.c.SolrCore solr.RecoveryStrategy.Builder
   [junit4]   2> 214213 INFO  (qtp11086863-5587) [n:127.0.0.1:39681_t_k%2Fd c:collection1 s:shard1  x:collection1_shard1_replica_n47] o.a.s.c.SolrCore [[collection1_shard1_replica_n47] ] Opening new SolrCore at [/home/

[...truncated too long message...]

lectionContext I am going to be the leader 127.0.0.1:39681_t_k%2Fd
   [junit4]   2> 217817 INFO  (zkCallback-259-thread-3-processing-n:127.0.0.1:39681_t_k%2Fd) [n:127.0.0.1:39681_t_k%2Fd    ] o.a.s.c.Overseer Overseer (id=98425793899724818-127.0.0.1:39681_t_k%2Fd-n_0000000004) starting
   [junit4]   2> 218805 WARN  (zkCallback-252-thread-1-processing-n:127.0.0.1:33397_t_k%2Fd) [n:127.0.0.1:33397_t_k%2Fd c:collection1 s:shard2 r:core_node46 x:collection1_shard2_replica_n45] o.a.s.c.SyncStrategy Closed, skipping sync up.
   [junit4]   2> 218805 INFO  (zkCallback-252-thread-1-processing-n:127.0.0.1:33397_t_k%2Fd) [n:127.0.0.1:33397_t_k%2Fd c:collection1 s:shard2 r:core_node46 x:collection1_shard2_replica_n45] o.a.s.c.ShardLeaderElectionContext We failed sync, but we have no versions - we can't sync in that case - we were active before, so become leader anyway
   [junit4]   2> 218805 INFO  (zkCallback-252-thread-1-processing-n:127.0.0.1:33397_t_k%2Fd) [n:127.0.0.1:33397_t_k%2Fd c:collection1 s:shard2 r:core_node46 x:collection1_shard2_replica_n45] o.a.s.c.SolrCore [collection1_shard2_replica_n45]  CLOSING SolrCore org.apache.solr.core.SolrCore@149985f
   [junit4]   2> 218808 INFO  (zkCallback-252-thread-1-processing-n:127.0.0.1:33397_t_k%2Fd) [n:127.0.0.1:33397_t_k%2Fd c:collection1 s:shard2 r:core_node46 x:collection1_shard2_replica_n45] o.a.s.m.SolrMetricManager Closing metric reporters for registry=solr.core.collection1.shard2.replica_n45, tag=21600351
   [junit4]   2> 218809 INFO  (zkCallback-252-thread-1-processing-n:127.0.0.1:33397_t_k%2Fd) [n:127.0.0.1:33397_t_k%2Fd c:collection1 s:shard2 r:core_node46 x:collection1_shard2_replica_n45] o.a.s.m.SolrMetricManager Closing metric reporters for registry=solr.collection.collection1.shard2.leader, tag=21600351
   [junit4]   2> 218810 INFO  (zkCallback-259-thread-1-processing-n:127.0.0.1:39681_t_k%2Fd) [n:127.0.0.1:39681_t_k%2Fd c:collection1 s:shard1 r:core_node48 x:collection1_shard1_replica_n47] o.a.s.c.SyncStrategy Sync replicas to http://127.0.0.1:39681/t_k/d/collection1_shard1_replica_n47/
   [junit4]   2> 218810 INFO  (zkCallback-259-thread-1-processing-n:127.0.0.1:39681_t_k%2Fd) [n:127.0.0.1:39681_t_k%2Fd c:collection1 s:shard1 r:core_node48 x:collection1_shard1_replica_n47] o.a.s.c.SyncStrategy Sync Success - now sync replicas to me
   [junit4]   2> 218810 INFO  (zkCallback-259-thread-1-processing-n:127.0.0.1:39681_t_k%2Fd) [n:127.0.0.1:39681_t_k%2Fd c:collection1 s:shard1 r:core_node48 x:collection1_shard1_replica_n47] o.a.s.c.SyncStrategy http://127.0.0.1:39681/t_k/d/collection1_shard1_replica_n47/ has no replicas
   [junit4]   2> 218811 INFO  (TEST-TestSolrConfigHandlerConcurrent.test-seed#[99B0A63C28CEF9AF]) [    ] o.e.j.s.AbstractConnector Stopped ServerConnector@331743{HTTP/1.1,[http/1.1]}{127.0.0.1:0}
   [junit4]   2> 218811 INFO  (TEST-TestSolrConfigHandlerConcurrent.test-seed#[99B0A63C28CEF9AF]) [    ] o.e.j.s.h.ContextHandler Stopped o.e.j.s.ServletContextHandler@1783eb9{/t_k/d,null,UNAVAILABLE}
   [junit4]   2> 218811 INFO  (TEST-TestSolrConfigHandlerConcurrent.test-seed#[99B0A63C28CEF9AF]) [    ] o.a.s.c.ChaosMonkey monkey: stop jetty! 39681
   [junit4]   2> 218811 INFO  (TEST-TestSolrConfigHandlerConcurrent.test-seed#[99B0A63C28CEF9AF]) [    ] o.a.s.c.CoreContainer Shutting down CoreContainer instance=33276584
   [junit4]   2> 218812 INFO  (TEST-TestSolrConfigHandlerConcurrent.test-seed#[99B0A63C28CEF9AF]) [    ] o.a.s.m.SolrMetricManager Closing metric reporters for registry=solr.node, tag=null
   [junit4]   2> 218812 INFO  (TEST-TestSolrConfigHandlerConcurrent.test-seed#[99B0A63C28CEF9AF]) [    ] o.a.s.m.SolrMetricManager Closing metric reporters for registry=solr.jvm, tag=null
   [junit4]   2> 218812 INFO  (TEST-TestSolrConfigHandlerConcurrent.test-seed#[99B0A63C28CEF9AF]) [    ] o.a.s.m.SolrMetricManager Closing metric reporters for registry=solr.jetty, tag=null
   [junit4]   2> 218813 INFO  (TEST-TestSolrConfigHandlerConcurrent.test-seed#[99B0A63C28CEF9AF]) [    ] o.a.s.m.SolrMetricManager Closing metric reporters for registry=solr.cluster, tag=null
   [junit4]   2> 218814 INFO  (zkCallback-259-thread-1-processing-n:127.0.0.1:39681_t_k%2Fd) [n:127.0.0.1:39681_t_k%2Fd c:collection1 s:shard1 r:core_node48 x:collection1_shard1_replica_n47] o.a.s.c.SolrCore [collection1_shard1_replica_n47]  CLOSING SolrCore org.apache.solr.core.SolrCore@e5e8d3
   [junit4]   2> 218816 INFO  (TEST-TestSolrConfigHandlerConcurrent.test-seed#[99B0A63C28CEF9AF]) [    ] o.a.s.c.Overseer Overseer (id=98425793899724818-127.0.0.1:39681_t_k%2Fd-n_0000000004) closing
   [junit4]   2> 218817 INFO  (OverseerStateUpdate-98425793899724818-127.0.0.1:39681_t_k%2Fd-n_0000000004) [n:127.0.0.1:39681_t_k%2Fd    ] o.a.s.c.Overseer Overseer Loop exiting : 127.0.0.1:39681_t_k%2Fd
   [junit4]   2> 218818 INFO  (zkCallback-259-thread-1-processing-n:127.0.0.1:39681_t_k%2Fd) [n:127.0.0.1:39681_t_k%2Fd c:collection1 s:shard1 r:core_node48 x:collection1_shard1_replica_n47] o.a.s.m.SolrMetricManager Closing metric reporters for registry=solr.core.collection1.shard1.replica_n47, tag=15067347
   [junit4]   2> 218818 INFO  (zkCallback-259-thread-1-processing-n:127.0.0.1:39681_t_k%2Fd) [n:127.0.0.1:39681_t_k%2Fd c:collection1 s:shard1 r:core_node48 x:collection1_shard1_replica_n47] o.a.s.m.SolrMetricManager Closing metric reporters for registry=solr.collection.collection1.shard1.leader, tag=15067347
   [junit4]   2> 218819 INFO  (zkCallback-259-thread-1-processing-n:127.0.0.1:39681_t_k%2Fd) [n:127.0.0.1:39681_t_k%2Fd c:collection1 s:shard1 r:core_node48 x:collection1_shard1_replica_n47] o.a.s.c.ShardLeaderElectionContext I am the new leader: http://127.0.0.1:39681/t_k/d/collection1_shard1_replica_n47/ shard1
   [junit4]   2> 218819 WARN  (zkCallback-259-thread-1-processing-n:127.0.0.1:39681_t_k%2Fd) [n:127.0.0.1:39681_t_k%2Fd    ] o.a.s.c.c.ZkStateReader ZooKeeper watch triggered, but Solr cannot talk to ZK: [KeeperErrorCode = Session expired for /live_nodes]
   [junit4]   2> 218820 INFO  (TEST-TestSolrConfigHandlerConcurrent.test-seed#[99B0A63C28CEF9AF]) [    ] o.e.j.s.AbstractConnector Stopped ServerConnector@1b4864c{HTTP/1.1,[http/1.1]}{127.0.0.1:0}
   [junit4]   2> 218820 INFO  (TEST-TestSolrConfigHandlerConcurrent.test-seed#[99B0A63C28CEF9AF]) [    ] o.e.j.s.h.ContextHandler Stopped o.e.j.s.ServletContextHandler@8e7e4f{/t_k/d,null,UNAVAILABLE}
   [junit4]   2> 218821 ERROR (TEST-TestSolrConfigHandlerConcurrent.test-seed#[99B0A63C28CEF9AF]) [    ] o.a.z.s.ZooKeeperServer ZKShutdownHandler is not registered, so ZooKeeper server won't take any action on ERROR or SHUTDOWN server state changes
   [junit4]   2> 218821 INFO  (TEST-TestSolrConfigHandlerConcurrent.test-seed#[99B0A63C28CEF9AF]) [    ] o.a.s.c.ZkTestServer connecting to 127.0.0.1:44263 44263
   [junit4]   2> 223855 INFO  (Thread-4408) [    ] o.a.s.c.ZkTestServer connecting to 127.0.0.1:44263 44263
   [junit4]   2> 223855 WARN  (Thread-4408) [    ] o.a.s.c.ZkTestServer Watch limit violations: 
   [junit4]   2> Maximum concurrent create/delete watches above limit:
   [junit4]   2> 
   [junit4]   2> 	11	/solr/configs/conf1
   [junit4]   2> 	7	/solr/aliases.json
   [junit4]   2> 	5	/solr/security.json
   [junit4]   2> 	4	/solr/collections/collection1/state.json
   [junit4]   2> 
   [junit4]   2> Maximum concurrent data watches above limit:
   [junit4]   2> 
   [junit4]   2> 	7	/solr/clusterstate.json
   [junit4]   2> 	7	/solr/clusterprops.json
   [junit4]   2> 
   [junit4]   2> Maximum concurrent children watches above limit:
   [junit4]   2> 
   [junit4]   2> 	7	/solr/live_nodes
   [junit4]   2> 	7	/solr/collections
   [junit4]   2> 	4	/solr/overseer/queue
   [junit4]   2> 	4	/solr/overseer/collection-queue-work
   [junit4]   2> 
   [junit4]   2> NOTE: reproduce with: ant test  -Dtestcase=TestSolrConfigHandlerConcurrent -Dtests.method=test -Dtests.seed=99B0A63C28CEF9AF -Dtests.multiplier=3 -Dtests.slow=true -Dtests.locale=mt -Dtests.timezone=Asia/Saigon -Dtests.asserts=true -Dtests.file.encoding=UTF-8
   [junit4] ERROR   19.7s J2 | TestSolrConfigHandlerConcurrent.test <<<
   [junit4]    > Throwable #1: java.lang.NullPointerException
   [junit4]    > 	at __randomizedtesting.SeedInfo.seed([99B0A63C28CEF9AF:11E499E686329457]:0)
   [junit4]    > 	at org.apache.solr.handler.TestSolrConfigHandlerConcurrent.test(TestSolrConfigHandlerConcurrent.java:109)
   [junit4]    > 	at org.apache.solr.BaseDistributedSearchTestCase$ShardsRepeatRule$ShardsFixedStatement.callStatement(BaseDistributedSearchTestCase.java:993)
   [junit4]    > 	at org.apache.solr.BaseDistributedSearchTestCase$ShardsRepeatRule$ShardsStatement.evaluate(BaseDistributedSearchTestCase.java:968)
   [junit4]    > 	at java.lang.Thread.run(Thread.java:748)
   [junit4]   2> NOTE: leaving temporary files on disk at: /home/jenkins/workspace/Lucene-Solr-master-Linux/solr/build/solr-core/test/J2/temp/solr.handler.TestSolrConfigHandlerConcurrent_99B0A63C28CEF9AF-001
   [junit4]   2> NOTE: test params are: codec=Asserting(Lucene70), sim=RandomSimilarity(queryNorm=false): {}, locale=mt, timezone=Asia/Saigon
   [junit4]   2> NOTE: Linux 4.10.0-27-generic i386/Oracle Corporation 1.8.0_141 (32-bit)/cpus=8,threads=1,free=82638912,total=267124736
   [junit4]   2> NOTE: All tests run in this JVM: [TestNumericTokenStream, TestCloudNestedDocsSort, CircularListTest, TestUseDocValuesAsStored, TestRTimerTree, DateRangeFieldTest, TestFieldCache, TestFieldCacheSortRandom, HdfsDirectoryTest, SolrCLIZkUtilsTest, VMParamsZkACLAndCredentialsProvidersTest, TestFieldTypeCollectionResource, OverseerStatusTest, TestHdfsUpdateLog, SpatialRPTFieldTypeTest, MigrateRouteKeyTest, TestSearcherReuse, TestReloadAndDeleteDocs, TestFoldingMultitermQuery, DocExpirationUpdateProcessorFactoryTest, BlockJoinFacetRandomTest, ExitableDirectoryReaderTest, PreAnalyzedUpdateProcessorTest, TestSolrConfigHandlerConcurrent]
   [junit4] Completed [92/728 (1!)] on J2 in 19.71s, 1 test, 1 error <<< FAILURES!

[...truncated 41479 lines...]

Mime
View raw message