lucene-dev mailing list archives

Site index · List index
Message view « Date » · « Thread »
Top « Date » · « Thread »
From Policeman Jenkins Server <jenk...@thetaphi.de>
Subject [JENKINS-EA] Lucene-Solr-7.x-Linux (64bit/jdk-9-ea+181) - Build # 267 - Still Unstable!
Date Wed, 16 Aug 2017 00:53:49 GMT
Build: https://jenkins.thetaphi.de/job/Lucene-Solr-7.x-Linux/267/
Java: 64bit/jdk-9-ea+181 -XX:+UseCompressedOops -XX:+UseParallelGC --illegal-access=deny

6 tests failed.
FAILED:  junit.framework.TestSuite.org.apache.solr.cloud.ChaosMonkeyNothingIsSafeTest

Error Message:
6 threads leaked from SUITE scope at org.apache.solr.cloud.ChaosMonkeyNothingIsSafeTest:     1) Thread[id=15967, name=zkCallback-2108-thread-3, state=TIMED_WAITING, group=TGRP-ChaosMonkeyNothingIsSafeTest]         at java.base@9/jdk.internal.misc.Unsafe.park(Native Method)         at java.base@9/java.util.concurrent.locks.LockSupport.parkNanos(LockSupport.java:234)         at java.base@9/java.util.concurrent.SynchronousQueue$TransferStack.awaitFulfill(SynchronousQueue.java:462)         at java.base@9/java.util.concurrent.SynchronousQueue$TransferStack.transfer(SynchronousQueue.java:361)         at java.base@9/java.util.concurrent.SynchronousQueue.poll(SynchronousQueue.java:937)         at java.base@9/java.util.concurrent.ThreadPoolExecutor.getTask(ThreadPoolExecutor.java:1091)         at java.base@9/java.util.concurrent.ThreadPoolExecutor.runWorker(ThreadPoolExecutor.java:1152)         at java.base@9/java.util.concurrent.ThreadPoolExecutor$Worker.run(ThreadPoolExecutor.java:641)         at java.base@9/java.lang.Thread.run(Thread.java:844)    2) Thread[id=16066, name=zkCallback-2108-thread-6, state=TIMED_WAITING, group=TGRP-ChaosMonkeyNothingIsSafeTest]         at java.base@9/jdk.internal.misc.Unsafe.park(Native Method)         at java.base@9/java.util.concurrent.locks.LockSupport.parkNanos(LockSupport.java:234)         at java.base@9/java.util.concurrent.SynchronousQueue$TransferStack.awaitFulfill(SynchronousQueue.java:462)         at java.base@9/java.util.concurrent.SynchronousQueue$TransferStack.transfer(SynchronousQueue.java:361)         at java.base@9/java.util.concurrent.SynchronousQueue.poll(SynchronousQueue.java:937)         at java.base@9/java.util.concurrent.ThreadPoolExecutor.getTask(ThreadPoolExecutor.java:1091)         at java.base@9/java.util.concurrent.ThreadPoolExecutor.runWorker(ThreadPoolExecutor.java:1152)         at java.base@9/java.util.concurrent.ThreadPoolExecutor$Worker.run(ThreadPoolExecutor.java:641)         at java.base@9/java.lang.Thread.run(Thread.java:844)    3) Thread[id=15805, name=TEST-ChaosMonkeyNothingIsSafeTest.test-seed#[55F4CF5A08389B26]-EventThread, state=WAITING, group=TGRP-ChaosMonkeyNothingIsSafeTest]         at java.base@9/jdk.internal.misc.Unsafe.park(Native Method)         at java.base@9/java.util.concurrent.locks.LockSupport.park(LockSupport.java:194)         at java.base@9/java.util.concurrent.locks.AbstractQueuedSynchronizer$ConditionObject.await(AbstractQueuedSynchronizer.java:2062)         at java.base@9/java.util.concurrent.LinkedBlockingQueue.take(LinkedBlockingQueue.java:435)         at app//org.apache.zookeeper.ClientCnxn$EventThread.run(ClientCnxn.java:501)    4) Thread[id=16065, name=zkCallback-2108-thread-5, state=TIMED_WAITING, group=TGRP-ChaosMonkeyNothingIsSafeTest]         at java.base@9/jdk.internal.misc.Unsafe.park(Native Method)         at java.base@9/java.util.concurrent.locks.LockSupport.parkNanos(LockSupport.java:234)         at java.base@9/java.util.concurrent.SynchronousQueue$TransferStack.awaitFulfill(SynchronousQueue.java:462)         at java.base@9/java.util.concurrent.SynchronousQueue$TransferStack.transfer(SynchronousQueue.java:361)         at java.base@9/java.util.concurrent.SynchronousQueue.poll(SynchronousQueue.java:937)         at java.base@9/java.util.concurrent.ThreadPoolExecutor.getTask(ThreadPoolExecutor.java:1091)         at java.base@9/java.util.concurrent.ThreadPoolExecutor.runWorker(ThreadPoolExecutor.java:1152)         at java.base@9/java.util.concurrent.ThreadPoolExecutor$Worker.run(ThreadPoolExecutor.java:641)         at java.base@9/java.lang.Thread.run(Thread.java:844)    5) Thread[id=15803, name=Connection evictor, state=TIMED_WAITING, group=TGRP-ChaosMonkeyNothingIsSafeTest]         at java.base@9/java.lang.Thread.sleep(Native Method)         at app//org.apache.http.impl.client.IdleConnectionEvictor$1.run(IdleConnectionEvictor.java:66)         at java.base@9/java.lang.Thread.run(Thread.java:844)    6) Thread[id=15804, name=TEST-ChaosMonkeyNothingIsSafeTest.test-seed#[55F4CF5A08389B26]-SendThread(127.0.0.1:46783), state=TIMED_WAITING, group=TGRP-ChaosMonkeyNothingIsSafeTest]         at java.base@9/java.lang.Thread.sleep(Native Method)         at app//org.apache.zookeeper.client.StaticHostProvider.next(StaticHostProvider.java:101)         at app//org.apache.zookeeper.ClientCnxn$SendThread.startConnect(ClientCnxn.java:997)         at app//org.apache.zookeeper.ClientCnxn$SendThread.run(ClientCnxn.java:1060)

Stack Trace:
com.carrotsearch.randomizedtesting.ThreadLeakError: 6 threads leaked from SUITE scope at org.apache.solr.cloud.ChaosMonkeyNothingIsSafeTest: 
   1) Thread[id=15967, name=zkCallback-2108-thread-3, state=TIMED_WAITING, group=TGRP-ChaosMonkeyNothingIsSafeTest]
        at java.base@9/jdk.internal.misc.Unsafe.park(Native Method)
        at java.base@9/java.util.concurrent.locks.LockSupport.parkNanos(LockSupport.java:234)
        at java.base@9/java.util.concurrent.SynchronousQueue$TransferStack.awaitFulfill(SynchronousQueue.java:462)
        at java.base@9/java.util.concurrent.SynchronousQueue$TransferStack.transfer(SynchronousQueue.java:361)
        at java.base@9/java.util.concurrent.SynchronousQueue.poll(SynchronousQueue.java:937)
        at java.base@9/java.util.concurrent.ThreadPoolExecutor.getTask(ThreadPoolExecutor.java:1091)
        at java.base@9/java.util.concurrent.ThreadPoolExecutor.runWorker(ThreadPoolExecutor.java:1152)
        at java.base@9/java.util.concurrent.ThreadPoolExecutor$Worker.run(ThreadPoolExecutor.java:641)
        at java.base@9/java.lang.Thread.run(Thread.java:844)
   2) Thread[id=16066, name=zkCallback-2108-thread-6, state=TIMED_WAITING, group=TGRP-ChaosMonkeyNothingIsSafeTest]
        at java.base@9/jdk.internal.misc.Unsafe.park(Native Method)
        at java.base@9/java.util.concurrent.locks.LockSupport.parkNanos(LockSupport.java:234)
        at java.base@9/java.util.concurrent.SynchronousQueue$TransferStack.awaitFulfill(SynchronousQueue.java:462)
        at java.base@9/java.util.concurrent.SynchronousQueue$TransferStack.transfer(SynchronousQueue.java:361)
        at java.base@9/java.util.concurrent.SynchronousQueue.poll(SynchronousQueue.java:937)
        at java.base@9/java.util.concurrent.ThreadPoolExecutor.getTask(ThreadPoolExecutor.java:1091)
        at java.base@9/java.util.concurrent.ThreadPoolExecutor.runWorker(ThreadPoolExecutor.java:1152)
        at java.base@9/java.util.concurrent.ThreadPoolExecutor$Worker.run(ThreadPoolExecutor.java:641)
        at java.base@9/java.lang.Thread.run(Thread.java:844)
   3) Thread[id=15805, name=TEST-ChaosMonkeyNothingIsSafeTest.test-seed#[55F4CF5A08389B26]-EventThread, state=WAITING, group=TGRP-ChaosMonkeyNothingIsSafeTest]
        at java.base@9/jdk.internal.misc.Unsafe.park(Native Method)
        at java.base@9/java.util.concurrent.locks.LockSupport.park(LockSupport.java:194)
        at java.base@9/java.util.concurrent.locks.AbstractQueuedSynchronizer$ConditionObject.await(AbstractQueuedSynchronizer.java:2062)
        at java.base@9/java.util.concurrent.LinkedBlockingQueue.take(LinkedBlockingQueue.java:435)
        at app//org.apache.zookeeper.ClientCnxn$EventThread.run(ClientCnxn.java:501)
   4) Thread[id=16065, name=zkCallback-2108-thread-5, state=TIMED_WAITING, group=TGRP-ChaosMonkeyNothingIsSafeTest]
        at java.base@9/jdk.internal.misc.Unsafe.park(Native Method)
        at java.base@9/java.util.concurrent.locks.LockSupport.parkNanos(LockSupport.java:234)
        at java.base@9/java.util.concurrent.SynchronousQueue$TransferStack.awaitFulfill(SynchronousQueue.java:462)
        at java.base@9/java.util.concurrent.SynchronousQueue$TransferStack.transfer(SynchronousQueue.java:361)
        at java.base@9/java.util.concurrent.SynchronousQueue.poll(SynchronousQueue.java:937)
        at java.base@9/java.util.concurrent.ThreadPoolExecutor.getTask(ThreadPoolExecutor.java:1091)
        at java.base@9/java.util.concurrent.ThreadPoolExecutor.runWorker(ThreadPoolExecutor.java:1152)
        at java.base@9/java.util.concurrent.ThreadPoolExecutor$Worker.run(ThreadPoolExecutor.java:641)
        at java.base@9/java.lang.Thread.run(Thread.java:844)
   5) Thread[id=15803, name=Connection evictor, state=TIMED_WAITING, group=TGRP-ChaosMonkeyNothingIsSafeTest]
        at java.base@9/java.lang.Thread.sleep(Native Method)
        at app//org.apache.http.impl.client.IdleConnectionEvictor$1.run(IdleConnectionEvictor.java:66)
        at java.base@9/java.lang.Thread.run(Thread.java:844)
   6) Thread[id=15804, name=TEST-ChaosMonkeyNothingIsSafeTest.test-seed#[55F4CF5A08389B26]-SendThread(127.0.0.1:46783), state=TIMED_WAITING, group=TGRP-ChaosMonkeyNothingIsSafeTest]
        at java.base@9/java.lang.Thread.sleep(Native Method)
        at app//org.apache.zookeeper.client.StaticHostProvider.next(StaticHostProvider.java:101)
        at app//org.apache.zookeeper.ClientCnxn$SendThread.startConnect(ClientCnxn.java:997)
        at app//org.apache.zookeeper.ClientCnxn$SendThread.run(ClientCnxn.java:1060)
	at __randomizedtesting.SeedInfo.seed([55F4CF5A08389B26]:0)


FAILED:  junit.framework.TestSuite.org.apache.solr.cloud.ChaosMonkeyNothingIsSafeTest

Error Message:
There are still zombie threads that couldn't be terminated:    1) Thread[id=15967, name=zkCallback-2108-thread-3, state=TIMED_WAITING, group=TGRP-ChaosMonkeyNothingIsSafeTest]         at java.base@9/jdk.internal.misc.Unsafe.park(Native Method)         at java.base@9/java.util.concurrent.locks.LockSupport.parkNanos(LockSupport.java:234)         at java.base@9/java.util.concurrent.SynchronousQueue$TransferStack.awaitFulfill(SynchronousQueue.java:462)         at java.base@9/java.util.concurrent.SynchronousQueue$TransferStack.transfer(SynchronousQueue.java:361)         at java.base@9/java.util.concurrent.SynchronousQueue.poll(SynchronousQueue.java:937)         at java.base@9/java.util.concurrent.ThreadPoolExecutor.getTask(ThreadPoolExecutor.java:1091)         at java.base@9/java.util.concurrent.ThreadPoolExecutor.runWorker(ThreadPoolExecutor.java:1152)         at java.base@9/java.util.concurrent.ThreadPoolExecutor$Worker.run(ThreadPoolExecutor.java:641)         at java.base@9/java.lang.Thread.run(Thread.java:844)    2) Thread[id=16066, name=zkCallback-2108-thread-6, state=TIMED_WAITING, group=TGRP-ChaosMonkeyNothingIsSafeTest]         at java.base@9/jdk.internal.misc.Unsafe.park(Native Method)         at java.base@9/java.util.concurrent.locks.LockSupport.parkNanos(LockSupport.java:234)         at java.base@9/java.util.concurrent.SynchronousQueue$TransferStack.awaitFulfill(SynchronousQueue.java:462)         at java.base@9/java.util.concurrent.SynchronousQueue$TransferStack.transfer(SynchronousQueue.java:361)         at java.base@9/java.util.concurrent.SynchronousQueue.poll(SynchronousQueue.java:937)         at java.base@9/java.util.concurrent.ThreadPoolExecutor.getTask(ThreadPoolExecutor.java:1091)         at java.base@9/java.util.concurrent.ThreadPoolExecutor.runWorker(ThreadPoolExecutor.java:1152)         at java.base@9/java.util.concurrent.ThreadPoolExecutor$Worker.run(ThreadPoolExecutor.java:641)         at java.base@9/java.lang.Thread.run(Thread.java:844)    3) Thread[id=16065, name=zkCallback-2108-thread-5, state=TIMED_WAITING, group=TGRP-ChaosMonkeyNothingIsSafeTest]         at java.base@9/jdk.internal.misc.Unsafe.park(Native Method)         at java.base@9/java.util.concurrent.locks.LockSupport.parkNanos(LockSupport.java:234)         at java.base@9/java.util.concurrent.SynchronousQueue$TransferStack.awaitFulfill(SynchronousQueue.java:462)         at java.base@9/java.util.concurrent.SynchronousQueue$TransferStack.transfer(SynchronousQueue.java:361)         at java.base@9/java.util.concurrent.SynchronousQueue.poll(SynchronousQueue.java:937)         at java.base@9/java.util.concurrent.ThreadPoolExecutor.getTask(ThreadPoolExecutor.java:1091)         at java.base@9/java.util.concurrent.ThreadPoolExecutor.runWorker(ThreadPoolExecutor.java:1152)         at java.base@9/java.util.concurrent.ThreadPoolExecutor$Worker.run(ThreadPoolExecutor.java:641)         at java.base@9/java.lang.Thread.run(Thread.java:844)    4) Thread[id=15804, name=TEST-ChaosMonkeyNothingIsSafeTest.test-seed#[55F4CF5A08389B26]-SendThread(127.0.0.1:46783), state=TIMED_WAITING, group=TGRP-ChaosMonkeyNothingIsSafeTest]         at java.base@9/java.lang.Thread.sleep(Native Method)         at app//org.apache.zookeeper.client.StaticHostProvider.next(StaticHostProvider.java:101)         at app//org.apache.zookeeper.ClientCnxn$SendThread.startConnect(ClientCnxn.java:997)         at app//org.apache.zookeeper.ClientCnxn$SendThread.run(ClientCnxn.java:1060)

Stack Trace:
com.carrotsearch.randomizedtesting.ThreadLeakError: There are still zombie threads that couldn't be terminated:
   1) Thread[id=15967, name=zkCallback-2108-thread-3, state=TIMED_WAITING, group=TGRP-ChaosMonkeyNothingIsSafeTest]
        at java.base@9/jdk.internal.misc.Unsafe.park(Native Method)
        at java.base@9/java.util.concurrent.locks.LockSupport.parkNanos(LockSupport.java:234)
        at java.base@9/java.util.concurrent.SynchronousQueue$TransferStack.awaitFulfill(SynchronousQueue.java:462)
        at java.base@9/java.util.concurrent.SynchronousQueue$TransferStack.transfer(SynchronousQueue.java:361)
        at java.base@9/java.util.concurrent.SynchronousQueue.poll(SynchronousQueue.java:937)
        at java.base@9/java.util.concurrent.ThreadPoolExecutor.getTask(ThreadPoolExecutor.java:1091)
        at java.base@9/java.util.concurrent.ThreadPoolExecutor.runWorker(ThreadPoolExecutor.java:1152)
        at java.base@9/java.util.concurrent.ThreadPoolExecutor$Worker.run(ThreadPoolExecutor.java:641)
        at java.base@9/java.lang.Thread.run(Thread.java:844)
   2) Thread[id=16066, name=zkCallback-2108-thread-6, state=TIMED_WAITING, group=TGRP-ChaosMonkeyNothingIsSafeTest]
        at java.base@9/jdk.internal.misc.Unsafe.park(Native Method)
        at java.base@9/java.util.concurrent.locks.LockSupport.parkNanos(LockSupport.java:234)
        at java.base@9/java.util.concurrent.SynchronousQueue$TransferStack.awaitFulfill(SynchronousQueue.java:462)
        at java.base@9/java.util.concurrent.SynchronousQueue$TransferStack.transfer(SynchronousQueue.java:361)
        at java.base@9/java.util.concurrent.SynchronousQueue.poll(SynchronousQueue.java:937)
        at java.base@9/java.util.concurrent.ThreadPoolExecutor.getTask(ThreadPoolExecutor.java:1091)
        at java.base@9/java.util.concurrent.ThreadPoolExecutor.runWorker(ThreadPoolExecutor.java:1152)
        at java.base@9/java.util.concurrent.ThreadPoolExecutor$Worker.run(ThreadPoolExecutor.java:641)
        at java.base@9/java.lang.Thread.run(Thread.java:844)
   3) Thread[id=16065, name=zkCallback-2108-thread-5, state=TIMED_WAITING, group=TGRP-ChaosMonkeyNothingIsSafeTest]
        at java.base@9/jdk.internal.misc.Unsafe.park(Native Method)
        at java.base@9/java.util.concurrent.locks.LockSupport.parkNanos(LockSupport.java:234)
        at java.base@9/java.util.concurrent.SynchronousQueue$TransferStack.awaitFulfill(SynchronousQueue.java:462)
        at java.base@9/java.util.concurrent.SynchronousQueue$TransferStack.transfer(SynchronousQueue.java:361)
        at java.base@9/java.util.concurrent.SynchronousQueue.poll(SynchronousQueue.java:937)
        at java.base@9/java.util.concurrent.ThreadPoolExecutor.getTask(ThreadPoolExecutor.java:1091)
        at java.base@9/java.util.concurrent.ThreadPoolExecutor.runWorker(ThreadPoolExecutor.java:1152)
        at java.base@9/java.util.concurrent.ThreadPoolExecutor$Worker.run(ThreadPoolExecutor.java:641)
        at java.base@9/java.lang.Thread.run(Thread.java:844)
   4) Thread[id=15804, name=TEST-ChaosMonkeyNothingIsSafeTest.test-seed#[55F4CF5A08389B26]-SendThread(127.0.0.1:46783), state=TIMED_WAITING, group=TGRP-ChaosMonkeyNothingIsSafeTest]
        at java.base@9/java.lang.Thread.sleep(Native Method)
        at app//org.apache.zookeeper.client.StaticHostProvider.next(StaticHostProvider.java:101)
        at app//org.apache.zookeeper.ClientCnxn$SendThread.startConnect(ClientCnxn.java:997)
        at app//org.apache.zookeeper.ClientCnxn$SendThread.run(ClientCnxn.java:1060)
	at __randomizedtesting.SeedInfo.seed([55F4CF5A08389B26]:0)


FAILED:  junit.framework.TestSuite.org.apache.solr.core.TestJmxIntegration

Error Message:
JMX not enabled

Stack Trace:
java.lang.AssertionError: JMX not enabled
	at __randomizedtesting.SeedInfo.seed([55F4CF5A08389B26]:0)
	at org.junit.Assert.fail(Assert.java:93)
	at org.junit.Assert.assertTrue(Assert.java:43)
	at org.apache.solr.core.TestJmxIntegration.beforeClass(TestJmxIntegration.java:74)
	at java.base/jdk.internal.reflect.NativeMethodAccessorImpl.invoke0(Native Method)
	at java.base/jdk.internal.reflect.NativeMethodAccessorImpl.invoke(NativeMethodAccessorImpl.java:62)
	at java.base/jdk.internal.reflect.DelegatingMethodAccessorImpl.invoke(DelegatingMethodAccessorImpl.java:43)
	at java.base/java.lang.reflect.Method.invoke(Method.java:564)
	at com.carrotsearch.randomizedtesting.RandomizedRunner.invoke(RandomizedRunner.java:1713)
	at com.carrotsearch.randomizedtesting.RandomizedRunner$6.evaluate(RandomizedRunner.java:847)
	at com.carrotsearch.randomizedtesting.RandomizedRunner$7.evaluate(RandomizedRunner.java:863)
	at com.carrotsearch.randomizedtesting.rules.StatementAdapter.evaluate(StatementAdapter.java:36)
	at com.carrotsearch.randomizedtesting.rules.SystemPropertiesRestoreRule$1.evaluate(SystemPropertiesRestoreRule.java:57)
	at org.apache.lucene.util.AbstractBeforeAfterRule$1.evaluate(AbstractBeforeAfterRule.java:45)
	at com.carrotsearch.randomizedtesting.rules.StatementAdapter.evaluate(StatementAdapter.java:36)
	at org.apache.lucene.util.TestRuleStoreClassName$1.evaluate(TestRuleStoreClassName.java:41)
	at com.carrotsearch.randomizedtesting.rules.NoShadowingOrOverridesOnMethodsRule$1.evaluate(NoShadowingOrOverridesOnMethodsRule.java:40)
	at com.carrotsearch.randomizedtesting.rules.NoShadowingOrOverridesOnMethodsRule$1.evaluate(NoShadowingOrOverridesOnMethodsRule.java:40)
	at com.carrotsearch.randomizedtesting.rules.StatementAdapter.evaluate(StatementAdapter.java:36)
	at com.carrotsearch.randomizedtesting.rules.StatementAdapter.evaluate(StatementAdapter.java:36)
	at org.apache.lucene.util.TestRuleAssertionsRequired$1.evaluate(TestRuleAssertionsRequired.java:53)
	at org.apache.lucene.util.TestRuleMarkFailure$1.evaluate(TestRuleMarkFailure.java:47)
	at org.apache.lucene.util.TestRuleIgnoreAfterMaxFailures$1.evaluate(TestRuleIgnoreAfterMaxFailures.java:64)
	at org.apache.lucene.util.TestRuleIgnoreTestSuites$1.evaluate(TestRuleIgnoreTestSuites.java:54)
	at com.carrotsearch.randomizedtesting.rules.StatementAdapter.evaluate(StatementAdapter.java:36)
	at com.carrotsearch.randomizedtesting.ThreadLeakControl$StatementRunner.run(ThreadLeakControl.java:368)
	at java.base/java.lang.Thread.run(Thread.java:844)


FAILED:  org.apache.solr.cloud.ChaosMonkeyNothingIsSafeTest.test

Error Message:
Timeout occured while waiting response from server at: http://127.0.0.1:36577/collection1

Stack Trace:
org.apache.solr.client.solrj.SolrServerException: Timeout occured while waiting response from server at: http://127.0.0.1:36577/collection1
	at __randomizedtesting.SeedInfo.seed([55F4CF5A08389B26:DDA0F080A6C4F6DE]:0)
	at org.apache.solr.client.solrj.impl.HttpSolrClient.executeMethod(HttpSolrClient.java:638)
	at org.apache.solr.client.solrj.impl.HttpSolrClient.request(HttpSolrClient.java:253)
	at org.apache.solr.client.solrj.impl.HttpSolrClient.request(HttpSolrClient.java:242)
	at org.apache.solr.client.solrj.impl.LBHttpSolrClient.doRequest(LBHttpSolrClient.java:483)
	at org.apache.solr.client.solrj.impl.LBHttpSolrClient.request(LBHttpSolrClient.java:413)
	at org.apache.solr.client.solrj.impl.CloudSolrClient.sendRequest(CloudSolrClient.java:1121)
	at org.apache.solr.client.solrj.impl.CloudSolrClient.requestWithRetryOnStaleState(CloudSolrClient.java:862)
	at org.apache.solr.client.solrj.impl.CloudSolrClient.request(CloudSolrClient.java:793)
	at org.apache.solr.client.solrj.SolrRequest.process(SolrRequest.java:178)
	at org.apache.solr.client.solrj.SolrClient.commit(SolrClient.java:484)
	at org.apache.solr.client.solrj.SolrClient.commit(SolrClient.java:463)
	at org.apache.solr.cloud.AbstractFullDistribZkTestBase.commit(AbstractFullDistribZkTestBase.java:1583)
	at org.apache.solr.cloud.ChaosMonkeyNothingIsSafeTest.test(ChaosMonkeyNothingIsSafeTest.java:213)
	at java.base/jdk.internal.reflect.NativeMethodAccessorImpl.invoke0(Native Method)
	at java.base/jdk.internal.reflect.NativeMethodAccessorImpl.invoke(NativeMethodAccessorImpl.java:62)
	at java.base/jdk.internal.reflect.DelegatingMethodAccessorImpl.invoke(DelegatingMethodAccessorImpl.java:43)
	at java.base/java.lang.reflect.Method.invoke(Method.java:564)
	at com.carrotsearch.randomizedtesting.RandomizedRunner.invoke(RandomizedRunner.java:1713)
	at com.carrotsearch.randomizedtesting.RandomizedRunner$8.evaluate(RandomizedRunner.java:907)
	at com.carrotsearch.randomizedtesting.RandomizedRunner$9.evaluate(RandomizedRunner.java:943)
	at com.carrotsearch.randomizedtesting.RandomizedRunner$10.evaluate(RandomizedRunner.java:957)
	at org.apache.solr.BaseDistributedSearchTestCase$ShardsRepeatRule$ShardsFixedStatement.callStatement(BaseDistributedSearchTestCase.java:993)
	at org.apache.solr.BaseDistributedSearchTestCase$ShardsRepeatRule$ShardsStatement.evaluate(BaseDistributedSearchTestCase.java:968)
	at com.carrotsearch.randomizedtesting.rules.SystemPropertiesRestoreRule$1.evaluate(SystemPropertiesRestoreRule.java:57)
	at org.apache.lucene.util.TestRuleSetupTeardownChained$1.evaluate(TestRuleSetupTeardownChained.java:49)
	at org.apache.lucene.util.AbstractBeforeAfterRule$1.evaluate(AbstractBeforeAfterRule.java:45)
	at org.apache.lucene.util.TestRuleThreadAndTestName$1.evaluate(TestRuleThreadAndTestName.java:48)
	at org.apache.lucene.util.TestRuleIgnoreAfterMaxFailures$1.evaluate(TestRuleIgnoreAfterMaxFailures.java:64)
	at org.apache.lucene.util.TestRuleMarkFailure$1.evaluate(TestRuleMarkFailure.java:47)
	at com.carrotsearch.randomizedtesting.rules.StatementAdapter.evaluate(StatementAdapter.java:36)
	at com.carrotsearch.randomizedtesting.ThreadLeakControl$StatementRunner.run(ThreadLeakControl.java:368)
	at com.carrotsearch.randomizedtesting.ThreadLeakControl.forkTimeoutingTask(ThreadLeakControl.java:817)
	at com.carrotsearch.randomizedtesting.ThreadLeakControl$3.evaluate(ThreadLeakControl.java:468)
	at com.carrotsearch.randomizedtesting.RandomizedRunner.runSingleTest(RandomizedRunner.java:916)
	at com.carrotsearch.randomizedtesting.RandomizedRunner$5.evaluate(RandomizedRunner.java:802)
	at com.carrotsearch.randomizedtesting.RandomizedRunner$6.evaluate(RandomizedRunner.java:852)
	at com.carrotsearch.randomizedtesting.RandomizedRunner$7.evaluate(RandomizedRunner.java:863)
	at com.carrotsearch.randomizedtesting.rules.StatementAdapter.evaluate(StatementAdapter.java:36)
	at com.carrotsearch.randomizedtesting.rules.SystemPropertiesRestoreRule$1.evaluate(SystemPropertiesRestoreRule.java:57)
	at org.apache.lucene.util.AbstractBeforeAfterRule$1.evaluate(AbstractBeforeAfterRule.java:45)
	at com.carrotsearch.randomizedtesting.rules.StatementAdapter.evaluate(StatementAdapter.java:36)
	at org.apache.lucene.util.TestRuleStoreClassName$1.evaluate(TestRuleStoreClassName.java:41)
	at com.carrotsearch.randomizedtesting.rules.NoShadowingOrOverridesOnMethodsRule$1.evaluate(NoShadowingOrOverridesOnMethodsRule.java:40)
	at com.carrotsearch.randomizedtesting.rules.NoShadowingOrOverridesOnMethodsRule$1.evaluate(NoShadowingOrOverridesOnMethodsRule.java:40)
	at com.carrotsearch.randomizedtesting.rules.StatementAdapter.evaluate(StatementAdapter.java:36)
	at com.carrotsearch.randomizedtesting.rules.StatementAdapter.evaluate(StatementAdapter.java:36)
	at org.apache.lucene.util.TestRuleAssertionsRequired$1.evaluate(TestRuleAssertionsRequired.java:53)
	at org.apache.lucene.util.TestRuleMarkFailure$1.evaluate(TestRuleMarkFailure.java:47)
	at org.apache.lucene.util.TestRuleIgnoreAfterMaxFailures$1.evaluate(TestRuleIgnoreAfterMaxFailures.java:64)
	at org.apache.lucene.util.TestRuleIgnoreTestSuites$1.evaluate(TestRuleIgnoreTestSuites.java:54)
	at com.carrotsearch.randomizedtesting.rules.StatementAdapter.evaluate(StatementAdapter.java:36)
	at com.carrotsearch.randomizedtesting.ThreadLeakControl$StatementRunner.run(ThreadLeakControl.java:368)
	at java.base/java.lang.Thread.run(Thread.java:844)
Caused by: java.net.SocketTimeoutException: Read timed out
	at java.base/java.net.SocketInputStream.socketRead0(Native Method)
	at java.base/java.net.SocketInputStream.socketRead(SocketInputStream.java:116)
	at java.base/java.net.SocketInputStream.read(SocketInputStream.java:171)
	at java.base/java.net.SocketInputStream.read(SocketInputStream.java:141)
	at org.apache.http.impl.io.SessionInputBufferImpl.streamRead(SessionInputBufferImpl.java:139)
	at org.apache.http.impl.io.SessionInputBufferImpl.fillBuffer(SessionInputBufferImpl.java:155)
	at org.apache.http.impl.io.SessionInputBufferImpl.readLine(SessionInputBufferImpl.java:284)
	at org.apache.http.impl.conn.DefaultHttpResponseParser.parseHead(DefaultHttpResponseParser.java:140)
	at org.apache.http.impl.conn.DefaultHttpResponseParser.parseHead(DefaultHttpResponseParser.java:57)
	at org.apache.http.impl.io.AbstractMessageParser.parse(AbstractMessageParser.java:261)
	at org.apache.http.impl.DefaultBHttpClientConnection.receiveResponseHeader(DefaultBHttpClientConnection.java:165)
	at org.apache.http.impl.conn.CPoolProxy.receiveResponseHeader(CPoolProxy.java:167)
	at org.apache.http.protocol.HttpRequestExecutor.doReceiveResponse(HttpRequestExecutor.java:272)
	at org.apache.http.protocol.HttpRequestExecutor.execute(HttpRequestExecutor.java:124)
	at org.apache.http.impl.execchain.MainClientExec.execute(MainClientExec.java:271)
	at org.apache.http.impl.execchain.ProtocolExec.execute(ProtocolExec.java:184)
	at org.apache.http.impl.execchain.RetryExec.execute(RetryExec.java:88)
	at org.apache.http.impl.execchain.RedirectExec.execute(RedirectExec.java:110)
	at org.apache.http.impl.client.InternalHttpClient.doExecute(InternalHttpClient.java:184)
	at org.apache.http.impl.client.CloseableHttpClient.execute(CloseableHttpClient.java:82)
	at org.apache.http.impl.client.CloseableHttpClient.execute(CloseableHttpClient.java:55)
	at org.apache.solr.client.solrj.impl.HttpSolrClient.executeMethod(HttpSolrClient.java:526)
	... 52 more


FAILED:  org.apache.solr.cloud.CollectionsAPIDistributedZkTest.testCollectionsAPI

Error Message:
Something is broken in the assert for no shards using the same indexDir - probably something was changed in the attributes published in the MBean of SolrCore : {}

Stack Trace:
java.lang.AssertionError: Something is broken in the assert for no shards using the same indexDir - probably something was changed in the attributes published in the MBean of SolrCore : {}
	at __randomizedtesting.SeedInfo.seed([55F4CF5A08389B26:1D81BBEE0E0BB4B3]:0)
	at org.junit.Assert.fail(Assert.java:93)
	at org.junit.Assert.assertTrue(Assert.java:43)
	at org.apache.solr.cloud.CollectionsAPIDistributedZkTest.checkNoTwoShardsUseTheSameIndexDir(CollectionsAPIDistributedZkTest.java:581)
	at org.apache.solr.cloud.CollectionsAPIDistributedZkTest.testCollectionsAPI(CollectionsAPIDistributedZkTest.java:462)
	at java.base/jdk.internal.reflect.NativeMethodAccessorImpl.invoke0(Native Method)
	at java.base/jdk.internal.reflect.NativeMethodAccessorImpl.invoke(NativeMethodAccessorImpl.java:62)
	at java.base/jdk.internal.reflect.DelegatingMethodAccessorImpl.invoke(DelegatingMethodAccessorImpl.java:43)
	at java.base/java.lang.reflect.Method.invoke(Method.java:564)
	at com.carrotsearch.randomizedtesting.RandomizedRunner.invoke(RandomizedRunner.java:1713)
	at com.carrotsearch.randomizedtesting.RandomizedRunner$8.evaluate(RandomizedRunner.java:907)
	at com.carrotsearch.randomizedtesting.RandomizedRunner$9.evaluate(RandomizedRunner.java:943)
	at com.carrotsearch.randomizedtesting.RandomizedRunner$10.evaluate(RandomizedRunner.java:957)
	at com.carrotsearch.randomizedtesting.rules.SystemPropertiesRestoreRule$1.evaluate(SystemPropertiesRestoreRule.java:57)
	at org.apache.lucene.util.TestRuleSetupTeardownChained$1.evaluate(TestRuleSetupTeardownChained.java:49)
	at org.apache.lucene.util.AbstractBeforeAfterRule$1.evaluate(AbstractBeforeAfterRule.java:45)
	at org.apache.lucene.util.TestRuleThreadAndTestName$1.evaluate(TestRuleThreadAndTestName.java:48)
	at org.apache.lucene.util.TestRuleIgnoreAfterMaxFailures$1.evaluate(TestRuleIgnoreAfterMaxFailures.java:64)
	at org.apache.lucene.util.TestRuleMarkFailure$1.evaluate(TestRuleMarkFailure.java:47)
	at com.carrotsearch.randomizedtesting.rules.StatementAdapter.evaluate(StatementAdapter.java:36)
	at com.carrotsearch.randomizedtesting.ThreadLeakControl$StatementRunner.run(ThreadLeakControl.java:368)
	at com.carrotsearch.randomizedtesting.ThreadLeakControl.forkTimeoutingTask(ThreadLeakControl.java:817)
	at com.carrotsearch.randomizedtesting.ThreadLeakControl$3.evaluate(ThreadLeakControl.java:468)
	at com.carrotsearch.randomizedtesting.RandomizedRunner.runSingleTest(RandomizedRunner.java:916)
	at com.carrotsearch.randomizedtesting.RandomizedRunner$5.evaluate(RandomizedRunner.java:802)
	at com.carrotsearch.randomizedtesting.RandomizedRunner$6.evaluate(RandomizedRunner.java:852)
	at com.carrotsearch.randomizedtesting.RandomizedRunner$7.evaluate(RandomizedRunner.java:863)
	at com.carrotsearch.randomizedtesting.rules.StatementAdapter.evaluate(StatementAdapter.java:36)
	at com.carrotsearch.randomizedtesting.rules.SystemPropertiesRestoreRule$1.evaluate(SystemPropertiesRestoreRule.java:57)
	at org.apache.lucene.util.AbstractBeforeAfterRule$1.evaluate(AbstractBeforeAfterRule.java:45)
	at com.carrotsearch.randomizedtesting.rules.StatementAdapter.evaluate(StatementAdapter.java:36)
	at org.apache.lucene.util.TestRuleStoreClassName$1.evaluate(TestRuleStoreClassName.java:41)
	at com.carrotsearch.randomizedtesting.rules.NoShadowingOrOverridesOnMethodsRule$1.evaluate(NoShadowingOrOverridesOnMethodsRule.java:40)
	at com.carrotsearch.randomizedtesting.rules.NoShadowingOrOverridesOnMethodsRule$1.evaluate(NoShadowingOrOverridesOnMethodsRule.java:40)
	at com.carrotsearch.randomizedtesting.rules.StatementAdapter.evaluate(StatementAdapter.java:36)
	at com.carrotsearch.randomizedtesting.rules.StatementAdapter.evaluate(StatementAdapter.java:36)
	at org.apache.lucene.util.TestRuleAssertionsRequired$1.evaluate(TestRuleAssertionsRequired.java:53)
	at org.apache.lucene.util.TestRuleMarkFailure$1.evaluate(TestRuleMarkFailure.java:47)
	at org.apache.lucene.util.TestRuleIgnoreAfterMaxFailures$1.evaluate(TestRuleIgnoreAfterMaxFailures.java:64)
	at org.apache.lucene.util.TestRuleIgnoreTestSuites$1.evaluate(TestRuleIgnoreTestSuites.java:54)
	at com.carrotsearch.randomizedtesting.rules.StatementAdapter.evaluate(StatementAdapter.java:36)
	at com.carrotsearch.randomizedtesting.ThreadLeakControl$StatementRunner.run(ThreadLeakControl.java:368)
	at java.base/java.lang.Thread.run(Thread.java:844)


FAILED:  org.apache.solr.update.AutoCommitTest.testMaxDocs

Error Message:
Exception during query

Stack Trace:
java.lang.RuntimeException: Exception during query
	at __randomizedtesting.SeedInfo.seed([55F4CF5A08389B26:EC75198524D29FAC]:0)
	at org.apache.solr.SolrTestCaseJ4.assertQ(SolrTestCaseJ4.java:886)
	at org.apache.solr.update.AutoCommitTest.testMaxDocs(AutoCommitTest.java:225)
	at java.base/jdk.internal.reflect.NativeMethodAccessorImpl.invoke0(Native Method)
	at java.base/jdk.internal.reflect.NativeMethodAccessorImpl.invoke(NativeMethodAccessorImpl.java:62)
	at java.base/jdk.internal.reflect.DelegatingMethodAccessorImpl.invoke(DelegatingMethodAccessorImpl.java:43)
	at java.base/java.lang.reflect.Method.invoke(Method.java:564)
	at com.carrotsearch.randomizedtesting.RandomizedRunner.invoke(RandomizedRunner.java:1713)
	at com.carrotsearch.randomizedtesting.RandomizedRunner$8.evaluate(RandomizedRunner.java:907)
	at com.carrotsearch.randomizedtesting.RandomizedRunner$9.evaluate(RandomizedRunner.java:943)
	at com.carrotsearch.randomizedtesting.RandomizedRunner$10.evaluate(RandomizedRunner.java:957)
	at com.carrotsearch.randomizedtesting.rules.SystemPropertiesRestoreRule$1.evaluate(SystemPropertiesRestoreRule.java:57)
	at org.apache.lucene.util.TestRuleSetupTeardownChained$1.evaluate(TestRuleSetupTeardownChained.java:49)
	at org.apache.lucene.util.AbstractBeforeAfterRule$1.evaluate(AbstractBeforeAfterRule.java:45)
	at org.apache.lucene.util.TestRuleThreadAndTestName$1.evaluate(TestRuleThreadAndTestName.java:48)
	at org.apache.lucene.util.TestRuleIgnoreAfterMaxFailures$1.evaluate(TestRuleIgnoreAfterMaxFailures.java:64)
	at org.apache.lucene.util.TestRuleMarkFailure$1.evaluate(TestRuleMarkFailure.java:47)
	at com.carrotsearch.randomizedtesting.rules.StatementAdapter.evaluate(StatementAdapter.java:36)
	at com.carrotsearch.randomizedtesting.ThreadLeakControl$StatementRunner.run(ThreadLeakControl.java:368)
	at com.carrotsearch.randomizedtesting.ThreadLeakControl.forkTimeoutingTask(ThreadLeakControl.java:817)
	at com.carrotsearch.randomizedtesting.ThreadLeakControl$3.evaluate(ThreadLeakControl.java:468)
	at com.carrotsearch.randomizedtesting.RandomizedRunner.runSingleTest(RandomizedRunner.java:916)
	at com.carrotsearch.randomizedtesting.RandomizedRunner$5.evaluate(RandomizedRunner.java:802)
	at com.carrotsearch.randomizedtesting.RandomizedRunner$6.evaluate(RandomizedRunner.java:852)
	at com.carrotsearch.randomizedtesting.RandomizedRunner$7.evaluate(RandomizedRunner.java:863)
	at com.carrotsearch.randomizedtesting.rules.StatementAdapter.evaluate(StatementAdapter.java:36)
	at com.carrotsearch.randomizedtesting.rules.SystemPropertiesRestoreRule$1.evaluate(SystemPropertiesRestoreRule.java:57)
	at org.apache.lucene.util.AbstractBeforeAfterRule$1.evaluate(AbstractBeforeAfterRule.java:45)
	at com.carrotsearch.randomizedtesting.rules.StatementAdapter.evaluate(StatementAdapter.java:36)
	at org.apache.lucene.util.TestRuleStoreClassName$1.evaluate(TestRuleStoreClassName.java:41)
	at com.carrotsearch.randomizedtesting.rules.NoShadowingOrOverridesOnMethodsRule$1.evaluate(NoShadowingOrOverridesOnMethodsRule.java:40)
	at com.carrotsearch.randomizedtesting.rules.NoShadowingOrOverridesOnMethodsRule$1.evaluate(NoShadowingOrOverridesOnMethodsRule.java:40)
	at com.carrotsearch.randomizedtesting.rules.StatementAdapter.evaluate(StatementAdapter.java:36)
	at com.carrotsearch.randomizedtesting.rules.StatementAdapter.evaluate(StatementAdapter.java:36)
	at org.apache.lucene.util.TestRuleAssertionsRequired$1.evaluate(TestRuleAssertionsRequired.java:53)
	at org.apache.lucene.util.TestRuleMarkFailure$1.evaluate(TestRuleMarkFailure.java:47)
	at org.apache.lucene.util.TestRuleIgnoreAfterMaxFailures$1.evaluate(TestRuleIgnoreAfterMaxFailures.java:64)
	at org.apache.lucene.util.TestRuleIgnoreTestSuites$1.evaluate(TestRuleIgnoreTestSuites.java:54)
	at com.carrotsearch.randomizedtesting.rules.StatementAdapter.evaluate(StatementAdapter.java:36)
	at com.carrotsearch.randomizedtesting.ThreadLeakControl$StatementRunner.run(ThreadLeakControl.java:368)
	at java.base/java.lang.Thread.run(Thread.java:844)
Caused by: java.lang.RuntimeException: REQUEST FAILED: xpath=//result[@numFound=1]
	xml response was: <?xml version="1.0" encoding="UTF-8"?>
<response>
<lst name="responseHeader"><int name="status">0</int><int name="QTime">0</int></lst><result name="response" numFound="0" start="0"></result>
</response>

	request was:q=id:14&qt=&start=0&rows=20&version=2.2
	at org.apache.solr.SolrTestCaseJ4.assertQ(SolrTestCaseJ4.java:879)
	... 39 more




Build Log:
[...truncated 11723 lines...]
   [junit4] Suite: org.apache.solr.update.AutoCommitTest
   [junit4]   2> 879765 INFO  (SUITE-AutoCommitTest-seed#[55F4CF5A08389B26]-worker) [    ] o.a.s.SolrTestCaseJ4 SecureRandom sanity checks: test.solr.allowed.securerandom=null & java.security.egd=file:/dev/./urandom
   [junit4]   2> Creating dataDir: /home/jenkins/workspace/Lucene-Solr-7.x-Linux/solr/build/solr-core/test/J2/temp/solr.update.AutoCommitTest_55F4CF5A08389B26-001/init-core-data-001
   [junit4]   2> 879766 INFO  (SUITE-AutoCommitTest-seed#[55F4CF5A08389B26]-worker) [    ] o.a.s.SolrTestCaseJ4 Using PointFields (NUMERIC_POINTS_SYSPROP=true) w/NUMERIC_DOCVALUES_SYSPROP=false
   [junit4]   2> 879766 INFO  (SUITE-AutoCommitTest-seed#[55F4CF5A08389B26]-worker) [    ] o.a.s.SolrTestCaseJ4 Randomized ssl (true) and clientAuth (false) via: @org.apache.solr.util.RandomizeSSL(reason="", ssl=0.0/0.0, value=0.0/0.0, clientAuth=0.0/0.0)
   [junit4]   2> 879767 INFO  (SUITE-AutoCommitTest-seed#[55F4CF5A08389B26]-worker) [    ] o.a.s.SolrTestCaseJ4 ####initCore
   [junit4]   2> 879767 INFO  (SUITE-AutoCommitTest-seed#[55F4CF5A08389B26]-worker) [    ] o.a.s.c.SolrResourceLoader [null] Added 2 libs to classloader, from paths: [/home/jenkins/workspace/Lucene-Solr-7.x-Linux/solr/core/src/test-files/solr/collection1/lib, /home/jenkins/workspace/Lucene-Solr-7.x-Linux/solr/core/src/test-files/solr/collection1/lib/classes]
   [junit4]   2> 879787 INFO  (SUITE-AutoCommitTest-seed#[55F4CF5A08389B26]-worker) [    ] o.a.s.c.SolrConfig Using Lucene MatchVersion: 7.1.0
   [junit4]   2> 879805 INFO  (SUITE-AutoCommitTest-seed#[55F4CF5A08389B26]-worker) [    ] o.a.s.s.IndexSchema [null] Schema name=test
   [junit4]   2> 879857 INFO  (SUITE-AutoCommitTest-seed#[55F4CF5A08389B26]-worker) [    ] o.a.s.s.IndexSchema Loaded schema test/1.0 with uniqueid field id
   [junit4]   2> 879873 WARN  (SUITE-AutoCommitTest-seed#[55F4CF5A08389B26]-worker) [    ] o.a.s.m.r.SolrJmxReporter No JMX server found. Not exposing Solr metrics via JMX.
   [junit4]   2> 879873 WARN  (SUITE-AutoCommitTest-seed#[55F4CF5A08389B26]-worker) [    ] o.a.s.m.r.SolrJmxReporter No JMX server found. Not exposing Solr metrics via JMX.
   [junit4]   2> 879873 WARN  (SUITE-AutoCommitTest-seed#[55F4CF5A08389B26]-worker) [    ] o.a.s.m.r.SolrJmxReporter No JMX server found. Not exposing Solr metrics via JMX.
   [junit4]   2> 879874 INFO  (coreLoadExecutor-3878-thread-1) [    ] o.a.s.c.SolrResourceLoader [null] Added 2 libs to classloader, from paths: [/home/jenkins/workspace/Lucene-Solr-7.x-Linux/solr/core/src/test-files/solr/collection1/lib, /home/jenkins/workspace/Lucene-Solr-7.x-Linux/solr/core/src/test-files/solr/collection1/lib/classes]
   [junit4]   2> 879894 INFO  (coreLoadExecutor-3878-thread-1) [    ] o.a.s.c.SolrConfig Using Lucene MatchVersion: 7.1.0
   [junit4]   2> 879908 INFO  (coreLoadExecutor-3878-thread-1) [    ] o.a.s.s.IndexSchema [collection1] Schema name=test
   [junit4]   2> 879956 INFO  (coreLoadExecutor-3878-thread-1) [    ] o.a.s.s.IndexSchema Loaded schema test/1.0 with uniqueid field id
   [junit4]   2> 879960 INFO  (coreLoadExecutor-3878-thread-1) [    ] o.a.s.c.CoreContainer Creating SolrCore 'collection1' using configuration from instancedir /home/jenkins/workspace/Lucene-Solr-7.x-Linux/solr/core/src/test-files/solr/collection1, trusted=true
   [junit4]   2> 879960 WARN  (coreLoadExecutor-3878-thread-1) [    ] o.a.s.m.r.SolrJmxReporter No JMX server found. Not exposing Solr metrics via JMX.
   [junit4]   2> 879961 INFO  (coreLoadExecutor-3878-thread-1) [    ] o.a.s.c.SolrCore solr.RecoveryStrategy.Builder
   [junit4]   2> 879961 INFO  (coreLoadExecutor-3878-thread-1) [    ] o.a.s.c.SolrCore [[collection1] ] Opening new SolrCore at [/home/jenkins/workspace/Lucene-Solr-7.x-Linux/solr/core/src/test-files/solr/collection1], dataDir=[/home/jenkins/workspace/Lucene-Solr-7.x-Linux/solr/build/solr-core/test/J2/temp/solr.update.AutoCommitTest_55F4CF5A08389B26-001/init-core-data-001/]
   [junit4]   2> 879962 INFO  (coreLoadExecutor-3878-thread-1) [    ] o.a.s.u.RandomMergePolicy RandomMergePolicy wrapping class org.apache.lucene.index.AlcoholicMergePolicy: [AlcoholicMergePolicy: minMergeSize=0, mergeFactor=10, maxMergeSize=278539049, maxMergeSizeForForcedMerge=9223372036854775807, calibrateSizeByDeletes=true, maxMergeDocs=2147483647, maxCFSSegmentSizeMB=8.796093022207999E12, noCFSRatio=0.1]
   [junit4]   2> 879985 INFO  (coreLoadExecutor-3878-thread-1) [    ] o.a.s.u.UpdateHandler Using UpdateLog implementation: org.apache.solr.update.UpdateLog
   [junit4]   2> 879985 INFO  (coreLoadExecutor-3878-thread-1) [    ] o.a.s.u.UpdateLog Initializing UpdateLog: dataDir= defaultSyncLevel=FLUSH numRecordsToKeep=100 maxNumLogsToKeep=10 numVersionBuckets=65536
   [junit4]   2> 879986 INFO  (coreLoadExecutor-3878-thread-1) [    ] o.a.s.u.CommitTracker Hard AutoCommit: disabled
   [junit4]   2> 879986 INFO  (coreLoadExecutor-3878-thread-1) [    ] o.a.s.u.CommitTracker Soft AutoCommit: disabled
   [junit4]   2> 879986 INFO  (coreLoadExecutor-3878-thread-1) [    ] o.a.s.u.RandomMergePolicy RandomMergePolicy wrapping class org.apache.lucene.index.TieredMergePolicy: [TieredMergePolicy: maxMergeAtOnce=34, maxMergeAtOnceExplicit=36, maxMergedSegmentMB=79.142578125, floorSegmentMB=0.396484375, forceMergeDeletesPctAllowed=1.2413108845797893, segmentsPerTier=49.0, maxCFSSegmentSizeMB=8.796093022207999E12, noCFSRatio=0.8656940255487766
   [junit4]   2> 879986 INFO  (coreLoadExecutor-3878-thread-1) [    ] o.a.s.s.SolrIndexSearcher Opening [Searcher@1f4f0f66[collection1] main]
   [junit4]   2> 879987 INFO  (coreLoadExecutor-3878-thread-1) [    ] o.a.s.h.c.SpellCheckComponent Initializing spell checkers
   [junit4]   2> 880016 INFO  (coreLoadExecutor-3878-thread-1) [    ] o.a.s.s.DirectSolrSpellChecker init: {name=direct,classname=DirectSolrSpellChecker,field=lowerfilt,minQueryLength=3}
   [junit4]   2> 880090 INFO  (coreLoadExecutor-3878-thread-1) [    ] o.a.s.h.ReplicationHandler Commits will be reserved for  10000
   [junit4]   2> 880090 INFO  (searcherExecutor-3879-thread-1) [    ] o.a.s.h.c.SpellCheckComponent Loading spell index for spellchecker: default
   [junit4]   2> 880090 INFO  (coreLoadExecutor-3878-thread-1) [    ] o.a.s.u.UpdateLog Could not find max version in index or recent updates, using new clock 1575845305668075520
   [junit4]   2> 880091 INFO  (searcherExecutor-3879-thread-1) [    ] o.a.s.h.c.SpellCheckComponent Loading spell index for spellchecker: direct
   [junit4]   2> 880091 INFO  (searcherExecutor-3879-thread-1) [    ] o.a.s.h.c.SpellCheckComponent Loading spell index for spellchecker: wordbreak
   [junit4]   2> 880091 INFO  (searcherExecutor-3879-thread-1) [    ] o.a.s.h.c.SpellCheckComponent Loading spell index for spellchecker: multipleFields
   [junit4]   2> 880091 INFO  (searcherExecutor-3879-thread-1) [    ] o.a.s.h.c.SpellCheckComponent Loading spell index for spellchecker: jarowinkler
   [junit4]   2> 880092 INFO  (searcherExecutor-3879-thread-1) [    ] o.a.s.h.c.SpellCheckComponent Loading spell index for spellchecker: external
   [junit4]   2> 880092 INFO  (searcherExecutor-3879-thread-1) [    ] o.a.s.h.c.SpellCheckComponent Loading spell index for spellchecker: freq
   [junit4]   2> 880092 INFO  (searcherExecutor-3879-thread-1) [    ] o.a.s.h.c.SpellCheckComponent Loading spell index for spellchecker: fqcn
   [junit4]   2> 880093 INFO  (searcherExecutor-3879-thread-1) [    ] o.a.s.h.c.SpellCheckComponent Loading spell index for spellchecker: perDict
   [junit4]   2> 880093 INFO  (SUITE-AutoCommitTest-seed#[55F4CF5A08389B26]-worker) [    ] o.a.s.SolrTestCaseJ4 ####initCore end
   [junit4]   2> 880093 INFO  (searcherExecutor-3879-thread-1) [    ] o.a.s.c.SolrCore [collection1] Registered new searcher Searcher@1f4f0f66[collection1] main{ExitableDirectoryReader(UninvertingDirectoryReader())}
   [junit4]   2> 880094 INFO  (TEST-AutoCommitTest.testMaxTime-seed#[55F4CF5A08389B26]) [    ] o.a.s.SolrTestCaseJ4 ###Starting testMaxTime
   [junit4]   2> 880095 INFO  (TEST-AutoCommitTest.testMaxTime-seed#[55F4CF5A08389B26]) [    ] o.a.s.u.DirectUpdateHandler2 [collection1] REMOVING ALL DOCUMENTS FROM INDEX
   [junit4]   2> 880095 INFO  (TEST-AutoCommitTest.testMaxTime-seed#[55F4CF5A08389B26]) [    ] o.a.s.s.SolrIndexSearcher Opening [Searcher@542fc7e5[collection1] realtime]
   [junit4]   2> 880096 INFO  (TEST-AutoCommitTest.testMaxTime-seed#[55F4CF5A08389B26]) [    ] o.a.s.u.p.LogUpdateProcessorFactory [collection1]  webapp=null path=null params={_version_=-9223372036854775807&update.distrib=FROMLEADER&versions=true&wt=json&indent=true}{deleteByQuery=*:* (-9223372036854775807)} 0 1
   [junit4]   2> 880096 ERROR (TEST-AutoCommitTest.testMaxTime-seed#[55F4CF5A08389B26]) [    ] o.a.s.c.CorePropertiesLocator Couldn't load core descriptor from /home/jenkins/workspace/Lucene-Solr-7.x-Linux/solr/core/src/test-files/solr/collection1/core.properties:java.nio.file.NoSuchFileException: /home/jenkins/workspace/Lucene-Solr-7.x-Linux/solr/core/src/test-files/solr/collection1/core.properties
   [junit4]   2> 880096 INFO  (TEST-AutoCommitTest.testMaxTime-seed#[55F4CF5A08389B26]) [    ] o.a.s.c.SolrResourceLoader [null] Added 2 libs to classloader, from paths: [/home/jenkins/workspace/Lucene-Solr-7.x-Linux/solr/core/src/test-files/solr/collection1/lib, /home/jenkins/workspace/Lucene-Solr-7.x-Linux/solr/core/src/test-files/solr/collection1/lib/classes]
   [junit4]   2> 880121 INFO  (TEST-AutoCommitTest.testMaxTime-seed#[55F4CF5A08389B26]) [    ] o.a.s.c.SolrConfig Using Lucene MatchVersion: 7.1.0
   [junit4]   2> 880147 INFO  (TEST-AutoCommitTest.testMaxTime-seed#[55F4CF5A08389B26]) [    ] o.a.s.s.IndexSchema [collection1] Schema name=test
   [junit4]   2> 880215 INFO  (TEST-AutoCommitTest.testMaxTime-seed#[55F4CF5A08389B26]) [    ] o.a.s.s.IndexSchema Loaded schema test/1.0 with uniqueid field id
   [junit4]   2> 880221 INFO  (TEST-AutoCommitTest.testMaxTime-seed#[55F4CF5A08389B26]) [    ] o.a.s.c.CoreContainer Reloading SolrCore 'collection1' using configuration from instancedir /home/jenkins/workspace/Lucene-Solr-7.x-Linux/solr/core/src/test-files/solr/collection1
   [junit4]   2> 880221 WARN  (TEST-AutoCommitTest.testMaxTime-seed#[55F4CF5A08389B26]) [    ] o.a.s.m.r.SolrJmxReporter No JMX server found. Not exposing Solr metrics via JMX.
   [junit4]   2> 880221 INFO  (TEST-AutoCommitTest.testMaxTime-seed#[55F4CF5A08389B26]) [    ] o.a.s.c.SolrCore [[collection1] ] Opening new SolrCore at [/home/jenkins/workspace/Lucene-Solr-7.x-Linux/solr/core/src/test-files/solr/collection1], dataDir=[/home/jenkins/workspace/Lucene-Solr-7.x-Linux/solr/build/solr-core/test/J2/temp/solr.update.AutoCommitTest_55F4CF5A08389B26-001/init-core-data-001/]
   [junit4]   2> 880249 INFO  (TEST-AutoCommitTest.testMaxTime-seed#[55F4CF5A08389B26]) [    ] o.a.s.u.CommitTracker Hard AutoCommit: disabled
   [junit4]   2> 880249 INFO  (TEST-AutoCommitTest.testMaxTime-seed#[55F4CF5A08389B26]) [    ] o.a.s.u.CommitTracker Soft AutoCommit: disabled
   [junit4]   2> 880249 INFO  (TEST-AutoCommitTest.testMaxTime-seed#[55F4CF5A08389B26]) [    ] o.a.s.s.SolrIndexSearcher Opening [Searcher@f79ffd1[collection1] main]
   [junit4]   2> 880250 INFO  (TEST-AutoCommitTest.testMaxTime-seed#[55F4CF5A08389B26]) [    ] o.a.s.h.c.SpellCheckComponent Initializing spell checkers
   [junit4]   2> 880250 INFO  (TEST-AutoCommitTest.testMaxTime-seed#[55F4CF5A08389B26]) [    ] o.a.s.s.DirectSolrSpellChecker init: {name=direct,classname=DirectSolrSpellChecker,field=lowerfilt,minQueryLength=3}
   [junit4]   2> 880252 INFO  (TEST-AutoCommitTest.testMaxTime-seed#[55F4CF5A08389B26]) [    ] o.a.s.h.ReplicationHandler Commits will be reserved for  10000
   [junit4]   2> 880253 INFO  (searcherExecutor-3884-thread-1) [    ] o.a.s.h.c.SpellCheckComponent Loading spell index for spellchecker: default
   [junit4]   2> 880253 INFO  (TEST-AutoCommitTest.testMaxTime-seed#[55F4CF5A08389B26]) [    ] o.a.s.u.UpdateLog Could not find max version in index or recent updates, using new clock 1575845305838993408
   [junit4]   2> 880253 INFO  (searcherExecutor-3884-thread-1) [    ] o.a.s.h.c.SpellCheckComponent Loading spell index for spellchecker: direct
   [junit4]   2> 880253 INFO  (searcherExecutor-3884-thread-1) [    ] o.a.s.h.c.SpellCheckComponent Loading spell index for spellchecker: wordbreak
   [junit4]   2> 880253 INFO  (searcherExecutor-3884-thread-1) [    ] o.a.s.h.c.SpellCheckComponent Loading spell index for spellchecker: multipleFields
   [junit4]   2> 880253 INFO  (searcherExecutor-3884-thread-1) [    ] o.a.s.h.c.SpellCheckComponent Loading spell index for spellchecker: jarowinkler
   [junit4]   2> 880253 INFO  (searcherExecutor-3884-thread-1) [    ] o.a.s.h.c.SpellCheckComponent Loading spell index for spellchecker: external
   [junit4]   2> 880253 INFO  (searcherExecutor-3884-thread-1) [    ] o.a.s.h.c.SpellCheckComponent Loading spell index for spellchecker: freq
   [junit4]   2> 880254 INFO  (searcherExecutor-3884-thread-1) [    ] o.a.s.h.c.SpellCheckComponent Loading spell index for spellchecker: fqcn
   [junit4]   2> 880254 INFO  (searcherExecutor-3884-thread-1) [    ] o.a.s.h.c.SpellCheckComponent Loading spell index for spellchecker: perDict
   [junit4]   2> 880254 INFO  (searcherExecutor-3884-thread-1) [    ] o.a.s.c.SolrCore [collection1] Registered new searcher Searcher@f79ffd1[collection1] main{ExitableDirectoryReader(UninvertingDirectoryReader())}
   [junit4]   2> 880255 INFO  (TEST-AutoCommitTest.testMaxTime-seed#[55F4CF5A08389B26]) [    ] o.a.s.u.RandomMergePolicy RandomMergePolicy wrapping class org.apache.lucene.index.LogByteSizeMergePolicy: [LogByteSizeMergePolicy: minMergeSize=1677721, mergeFactor=45, maxMergeSize=2147483648, maxMergeSizeForForcedMerge=9223372036854775807, calibrateSizeByDeletes=true, maxMergeDocs=2147483647, maxCFSSegmentSizeMB=8.796093022207999E12, noCFSRatio=1.0]
   [junit4]   2> 880255 INFO  (TEST-AutoCommitTest.testMaxTime-seed#[55F4CF5A08389B26]) [    ] o.a.s.u.DefaultSolrCoreState New IndexWriter is ready to be used.
   [junit4]   2> 880255 INFO  (TEST-AutoCommitTest.testMaxTime-seed#[55F4CF5A08389B26]) [    ] o.a.s.s.SolrIndexSearcher Opening [Searcher@4f9d52b4[collection1] main]
   [junit4]   2> 880255 INFO  (TEST-AutoCommitTest.testMaxTime-seed#[55F4CF5A08389B26]) [    ] o.a.s.c.SolrCore [collection1]  CLOSING SolrCore org.apache.solr.core.SolrCore@47c7decd
   [junit4]   2> 880255 INFO  (TEST-AutoCommitTest.testMaxTime-seed#[55F4CF5A08389B26]) [    ] o.a.s.m.SolrMetricManager Closing metric reporters for registry=solr.core.collection1, tag=1204281037
   [junit4]   2> 880255 INFO  (TEST-AutoCommitTest.testMaxTime-seed#[55F4CF5A08389B26]) [    ] o.a.s.m.r.SolrJmxReporter Closing reporter [org.apache.solr.metrics.reporters.SolrJmxReporter@3432fd7: rootName = null, domain = solr.core.collection1, service url = null, agent id = null] for registry solr.core.collection1 / null
   [junit4]   2> 880255 INFO  (searcherExecutor-3884-thread-1) [    ] o.a.s.c.SolrCore [collection1] Registered new searcher Searcher@4f9d52b4[collection1] main{ExitableDirectoryReader(UninvertingDirectoryReader())}
   [junit4]   2> 880258 INFO  (TEST-AutoCommitTest.testMaxTime-seed#[55F4CF5A08389B26]) [    ] o.a.s.u.p.LogUpdateProcessorFactory [collection1] {add=[529 (1575845305843187712)]} 0 1
   [junit4]   2> 880258 INFO  (TEST-AutoCommitTest.testMaxTime-seed#[55F4CF5A08389B26]) [    ] o.a.s.c.S.Request [collection1]  webapp=null path=null params={q=id:529&qt=&start=0&rows=20&version=2.2} hits=0 status=0 QTime=0
   [junit4]   2> 881758 INFO  (commitScheduler-3887-thread-1) [    ] o.a.s.u.DirectUpdateHandler2 start commit{,optimize=false,openSearcher=true,waitSearcher=true,expungeDeletes=false,softCommit=true,prepareCommit=false}
   [junit4]   2> 881761 INFO  (commitScheduler-3887-thread-1) [    ] o.a.s.s.SolrIndexSearcher Opening [Searcher@3b0a86aa[collection1] main]
   [junit4]   2> 881761 INFO  (commitScheduler-3887-thread-1) [    ] o.a.s.u.DirectUpdateHandler2 end_commit_flush
   [junit4]   2> 881762 INFO  (searcherExecutor-3884-thread-1) [    ] o.a.s.c.SolrCore [collection1] Registered new searcher Searcher@3b0a86aa[collection1] main{ExitableDirectoryReader(UninvertingDirectoryReader(Uninverting(_0(7.1.0):C1)))}
   [junit4]   2> 882011 INFO  (TEST-AutoCommitTest.testMaxTime-seed#[55F4CF5A08389B26]) [    ] o.a.s.u.p.LogUpdateProcessorFactory [collection1] {add=[530 (1575845307681341440)]} 0 1754
   [junit4]   2> 882011 INFO  (TEST-AutoCommitTest.testMaxTime-seed#[55F4CF5A08389B26]) [    ] o.a.s.c.S.Request [collection1]  webapp=null path=null params={q=id:529&qt=&start=0&rows=20&version=2.2} hits=1 status=0 QTime=0
   [junit4]   2> 882012 INFO  (TEST-AutoCommitTest.testMaxTime-seed#[55F4CF5A08389B26]) [    ] o.a.s.c.S.Request [collection1]  webapp=null path=null params={q=id:530&qt=&start=0&rows=20&version=2.2} hits=0 status=0 QTime=0
   [junit4]   2> 882012 INFO  (TEST-AutoCommitTest.testMaxTime-seed#[55F4CF5A08389B26]) [    ] o.a.s.u.p.LogUpdateProcessorFactory [collection1]  webapp=null path=null params={}{delete=[529 (-1575845307683438592)]} 0 0
   [junit4]   2> 882013 INFO  (TEST-AutoCommitTest.testMaxTime-seed#[55F4CF5A08389B26]) [    ] o.a.s.c.S.Request [collection1]  webapp=null path=null params={q=id:529&qt=&start=0&rows=20&version=2.2} hits=1 status=0 QTime=0
   [junit4]   2> 883511 INFO  (commitScheduler-3887-thread-1) [    ] o.a.s.u.DirectUpdateHandler2 start commit{,optimize=false,openSearcher=true,waitSearcher=true,expungeDeletes=false,softCommit=true,prepareCommit=false}
   [junit4]   2> 883514 INFO  (commitScheduler-3887-thread-1) [    ] o.a.s.s.SolrIndexSearcher Opening [Searcher@5b9937ef[collection1] main]
   [junit4]   2> 883514 INFO  (commitScheduler-3887-thread-1) [    ] o.a.s.u.DirectUpdateHandler2 end_commit_flush
   [junit4]   2> 883514 INFO  (searcherExecutor-3884-thread-1) [    ] o.a.s.c.SolrCore [collection1] Registered new searcher Searcher@5b9937ef[collection1] main{ExitableDirectoryReader(UninvertingDirectoryReader(Uninverting(_1(7.1.0):C1)))}
   [junit4]   2> 883764 INFO  (TEST-AutoCommitTest.testMaxTime-seed#[55F4CF5A08389B26]) [    ] o.a.s.u.p.LogUpdateProcessorFactory [collection1] {add=[550 (1575845309520543744)]} 0 3507
   [junit4]   2> 883765 INFO  (TEST-AutoCommitTest.testMaxTime-seed#[55F4CF5A08389B26]) [    ] o.a.s.c.S.Request [collection1]  webapp=null path=null params={q=id:529&qt=&start=0&rows=20&version=2.2} hits=0 status=0 QTime=0
   [junit4]   2> 883765 INFO  (TEST-AutoCommitTest.testMaxTime-seed#[55F4CF5A08389B26]) [    ] o.a.s.u.p.LogUpdateProcessorFactory [collection1] {add=[500 (1575845309521592320)]} 0 3508
   [junit4]   2> 883765 INFO  (TEST-AutoCommitTest.testMaxTime-seed#[55F4CF5A08389B26]) [    ] o.a.s.u.p.LogUpdateProcessorFactory [collection1] {add=[500 (1575845309521592321)]} 0 3508
   [junit4]   2> 883766 INFO  (TEST-AutoCommitTest.testMaxTime-seed#[55F4CF5A08389B26]) [    ] o.a.s.u.p.LogUpdateProcessorFactory [collection1] {add=[500 (1575845309522640896)]} 0 3508
   [junit4]   2> 883766 INFO  (TEST-AutoCommitTest.testMaxTime-seed#[55F4CF5A08389B26]) [    ] o.a.s.u.p.LogUpdateProcessorFactory [collection1] {add=[500 (1575845309522640897)]} 0 3509
   [junit4]   2> 883766 INFO  (TEST-AutoCommitTest.testMaxTime-seed#[55F4CF5A08389B26]) [    ] o.a.s.u.p.LogUpdateProcessorFactory [collection1] {add=[500 (1575845309522640898)]} 0 3509
   [junit4]   2> 883766 INFO  (TEST-AutoCommitTest.testMaxTime-seed#[55F4CF5A08389B26]) [    ] o.a.s.u.p.LogUpdateProcessorFactory [collection1] {add=[500 (1575845309522640899)]} 0 3509
   [junit4]   2> 883766 INFO  (TEST-AutoCommitTest.testMaxTime-seed#[55F4CF5A08389B26]) [    ] o.a.s.u.p.LogUpdateProcessorFactory [collection1] {add=[500 (1575845309522640900)]} 0 3509
   [junit4]   2> 883766 INFO  (TEST-AutoCommitTest.testMaxTime-seed#[55F4CF5A08389B26]) [    ] o.a.s.u.p.LogUpdateProcessorFactory [collection1] {add=[500 (1575845309522640901)]} 0 3509
   [junit4]   2> 883767 INFO  (TEST-AutoCommitTest.testMaxTime-seed#[55F4CF5A08389B26]) [    ] o.a.s.u.p.LogUpdateProcessorFactory [collection1] {add=[500 (1575845309523689472)]} 0 3509
   [junit4]   2> 883767 INFO  (TEST-AutoCommitTest.testMaxTime-seed#[55F4CF5A08389B26]) [    ] o.a.s.u.p.LogUpdateProcessorFactory [collection1] {add=[500 (1575845309523689473)]} 0 3510
   [junit4]   2> 883767 INFO  (TEST-AutoCommitTest.testMaxTime-seed#[55F4CF5A08389B26]) [    ] o.a.s.c.S.Request [collection1]  webapp=null path=null params={q=id:500&qt=&start=0&rows=20&version=2.2} hits=0 status=0 QTime=0
   [junit4]   2> 885264 INFO  (commitScheduler-3887-thread-1) [    ] o.a.s.u.DirectUpdateHandler2 start commit{,optimize=false,openSearcher=true,waitSearcher=true,expungeDeletes=false,softCommit=true,prepareCommit=false}
   [junit4]   2> 885268 INFO  (commitScheduler-3887-thread-1) [    ] o.a.s.s.SolrIndexSearcher Opening [Searcher@46a54baa[collection1] main]
   [junit4]   2> 885268 INFO  (commitScheduler-3887-thread-1) [    ] o.a.s.u.DirectUpdateHandler2 end_commit_flush
   [junit4]   2> 885268 INFO  (searcherExecutor-3884-thread-1) [    ] o.a.s.c.SolrCore [collection1] Registered new searcher Searcher@46a54baa[collection1] main{ExitableDirectoryReader(UninvertingDirectoryReader(Uninverting(_1(7.1.0):C1) Uninverting(_2(7.1.0):C11/9:delGen=1)))}
   [junit4]   2> 885519 INFO  (TEST-AutoCommitTest.testMaxTime-seed#[55F4CF5A08389B26]) [    ] o.a.s.u.p.LogUpdateProcessorFactory [collection1] {add=[531 (1575845311359746048)]} 0 5262
   [junit4]   2> 885519 INFO  (TEST-AutoCommitTest.testMaxTime-seed#[55F4CF5A08389B26]) [    ] o.a.s.c.S.Request [collection1]  webapp=null path=null params={q=id:500&qt=&start=0&rows=20&version=2.2} hits=1 status=0 QTime=0
   [junit4]   2> 885520 INFO  (TEST-AutoCommitTest.testMaxTime-seed#[55F4CF5A08389B26]) [    ] o.a.s.SolrTestCaseJ4 ###Ending testMaxTime
   [junit4]   2> 885522 INFO  (TEST-AutoCommitTest.testCommitWithin-seed#[55F4CF5A08389B26]) [    ] o.a.s.SolrTestCaseJ4 ###Starting testCommitWithin
   [junit4]   2> 885522 INFO  (TEST-AutoCommitTest.testCommitWithin-seed#[55F4CF5A08389B26]) [    ] o.a.s.u.DirectUpdateHandler2 [collection1] REMOVING ALL DOCUMENTS FROM INDEX
   [junit4]   2> 885522 INFO  (TEST-AutoCommitTest.testCommitWithin-seed#[55F4CF5A08389B26]) [    ] o.a.s.s.SolrIndexSearcher Opening [Searcher@13d98be[collection1] realtime]
   [junit4]   2> 885522 INFO  (TEST-AutoCommitTest.testCommitWithin-seed#[55F4CF5A08389B26]) [    ] o.a.s.u.p.LogUpdateProcessorFactory [collection1]  webapp=null path=null params={_version_=-9223372036854775807&update.distrib=FROMLEADER&versions=true&wt=json&indent=true}{deleteByQuery=*:* (-9223372036854775807)} 0 0
   [junit4]   2> 885523 ERROR (TEST-AutoCommitTest.testCommitWithin-seed#[55F4CF5A08389B26]) [    ] o.a.s.c.CorePropertiesLocator Couldn't load core descriptor from /home/jenkins/workspace/Lucene-Solr-7.x-Linux/solr/core/src/test-files/solr/collection1/core.properties:java.nio.file.NoSuchFileException: /home/jenkins/workspace/Lucene-Solr-7.x-Linux/solr/core/src/test-files/solr/collection1/core.properties
   [junit4]   2> 885523 INFO  (TEST-AutoCommitTest.testCommitWithin-seed#[55F4CF5A08389B26]) [    ] o.a.s.c.SolrResourceLoader [null] Added 2 libs to classloader, from paths: [/home/jenkins/workspace/Lucene-Solr-7.x-Linux/solr/core/src/test-files/solr/collection1/lib, /home/jenkins/workspace/Lucene-Solr-7.x-Linux/solr/core/src/test-files/solr/collection1/lib/classes]
   [junit4]   2> 885534 INFO  (TEST-AutoCommitTest.testCommitWithin-seed#[55F4CF5A08389B26]) [    ] o.a.s.c.SolrConfig Using Lucene MatchVersion: 7.1.0
   [junit4]   2> 885544 INFO  (TEST-AutoCommitTest.testCommitWithin-seed#[55F4CF5A08389B26]) [    ] o.a.s.s.IndexSchema [collection1] Schema name=test
   [junit4]   2> 885584 INFO  (TEST-AutoCommitTest.testCommitWithin-seed#[55F4CF5A08389B26]) [    ] o.a.s.s.IndexSchema Loaded schema test/1.0 with uniqueid field id
   [junit4]   2> 885587 INFO  (TEST-AutoCommitTest.testCommitWithin-seed#[55F4CF5A08389B26]) [    ] o.a.s.c.CoreContainer Reloading SolrCore 'collection1' using configuration from instancedir /home/jenkins/workspace/Lucene-Solr-7.x-Linux/solr/core/src/test-files/solr/collection1
   [junit4]   2> 885587 WARN  (TEST-AutoCommitTest.testCommitWithin-seed#[55F4CF5A08389B26]) [    ] o.a.s.m.r.SolrJmxReporter No JMX server found. Not exposing Solr metrics via JMX.
   [junit4]   2> 885587 INFO  (TEST-AutoCommitTest.testCommitWithin-seed#[55F4CF5A08389B26]) [    ] o.a.s.c.SolrCore [[collection1] ] Opening new SolrCore at [/home/jenkins/workspace/Lucene-Solr-7.x-Linux/solr/core/src/test-files/solr/collection1], dataDir=[/home/jenkins/workspace/Lucene-Solr-7.x-Linux/solr/build/solr-core/test/J2/temp/solr.update.AutoCommitTest_55F4CF5A08389B26-001/init-core-data-001/]
   [junit4]   2> 885609 INFO  (TEST-AutoCommitTest.testCommitWithin-seed#[55F4CF5A08389B26]) [    ] o.a.s.u.CommitTracker Hard AutoCommit: disabled
   [junit4]   2> 885609 INFO  (TEST-AutoCommitTest.testCommitWithin-seed#[55F4CF5A08389B26]) [    ] o.a.s.u.CommitTracker Soft AutoCommit: disabled
   [junit4]   2> 885609 INFO  (TEST-AutoCommitTest.testCommitWithin-seed#[55F4CF5A08389B26]) [    ] o.a.s.s.SolrIndexSearcher Opening [Searcher@12937d0f[collection1] main]
   [junit4]   2> 885610 INFO  (TEST-AutoCommitTest.testCommitWithin-seed#[55F4CF5A08389B26]) [    ] o.a.s.h.c.SpellCheckComponent Initializing spell checkers
   [junit4]   2> 885610 INFO  (TEST-AutoCommitTest.testCommitWithin-seed#[55F4CF5A08389B26]) [    ] o.a.s.s.DirectSolrSpellChecker init: {name=direct,classname=DirectSolrSpellChecker,field=lowerfilt,minQueryLength=3}
   [junit4]   2> 885612 INFO  (TEST-AutoCommitTest.testCommitWithin-seed#[55F4CF5A08389B26]) [    ] o.a.s.h.ReplicationHandler Commits will be reserved for  10000
   [junit4]   2> 885612 INFO  (searcherExecutor-3888-thread-1) [    ] o.a.s.h.c.SpellCheckComponent Loading spell index for spellchecker: default
   [junit4]   2> 885612 INFO  (searcherExecutor-3888-thread-1) [    ] o.a.s.h.c.SpellCheckComponent Loading spell index for spellchecker: direct
   [junit4]   2> 885612 INFO  (searcherExecutor-3888-thread-1) [    ] o.a.s.h.c.SpellCheckComponent Loading spell index for spellchecker: wordbreak
   [junit4]   2> 885612 INFO  (searcherExecutor-3888-thread-1) [    ] o.a.s.h.c.SpellCheckComponent Loading spell index for spellchecker: multipleFields
   [junit4]   2> 885612 INFO  (searcherExecutor-3888-thread-1) [    ] o.a.s.h.c.SpellCheckComponent Loading spell index for spellchecker: jarowinkler
   [junit4]   2> 885612 INFO  (searcherExecutor-3888-thread-1) [    ] o.a.s.h.c.SpellCheckComponent Loading spell index for spellchecker: external
   [junit4]   2> 885612 INFO  (searcherExecutor-3888-thread-1) [    ] o.a.s.h.c.SpellCheckComponent Loading spell index for spellchecker: freq
   [junit4]   2> 885613 INFO  (searcherExecutor-3888-thread-1) [    ] o.a.s.h.c.SpellCheckComponent Loading spell index for spellchecker: fqcn
   [junit4]   2> 885613 INFO  (searcherExecutor-3888-thread-1) [    ] o.a.s.h.c.SpellCheckComponent Loading spell index for spellchecker: perDict
   [junit4]   2> 885613 INFO  (searcherExecutor-3888-thread-1) [    ] o.a.s.c.SolrCore [collection1] Registered new searcher Searcher@12937d0f[collection1] main{ExitableDirectoryReader(UninvertingDirectoryReader())}
   [junit4]   2> 885613 INFO  (TEST-AutoCommitTest.testCommitWithin-seed#[55F4CF5A08389B26]) [    ] o.a.s.u.RandomMergePolicy RandomMergePolicy wrapping class org.apache.lucene.index.TieredMergePolicy: [TieredMergePolicy: maxMergeAtOnce=35, maxMergeAtOnceExplicit=31, maxMergedSegmentMB=4.3779296875, floorSegmentMB=1.796875, forceMergeDeletesPctAllowed=7.124570937416439, segmentsPerTier=48.0, maxCFSSegmentSizeMB=8.796093022207999E12, noCFSRatio=1.0
   [junit4]   2> 885614 INFO  (TEST-AutoCommitTest.testCommitWithin-seed#[55F4CF5A08389B26]) [    ] o.a.s.u.DefaultSolrCoreState New IndexWriter is ready to be used.
   [junit4]   2> 885614 INFO  (TEST-AutoCommitTest.testCommitWithin-seed#[55F4CF5A08389B26]) [    ] o.a.s.s.SolrIndexSearcher Opening [Searcher@12f3cc1d[collection1] main]
   [junit4]   2> 885614 INFO  (TEST-AutoCommitTest.testCommitWithin-seed#[55F4CF5A08389B26]) [    ] o.a.s.c.SolrCore [collection1]  CLOSING SolrCore org.apache.solr.core.SolrCore@1e7c93cc
   [junit4]   2> 885614 INFO  (TEST-AutoCommitTest.testCommitWithin-seed#[55F4CF5A08389B26]) [    ] o.a.s.m.SolrMetricManager Closing metric reporters for registry=solr.core.collection1, tag=511480780
   [junit4]   2> 885614 INFO  (TEST-AutoCommitTest.testCommitWithin-seed#[55F4CF5A08389B26]) [    ] o.a.s.m.r.SolrJmxReporter Closing reporter [org.apache.solr.metrics.reporters.SolrJmxReporter@18c973e0: rootName = null, domain = solr.core.collection1, service url = null, agent id = null] for registry solr.core.collection1 / null
   [junit4]   2> 885614 INFO  (searcherExecutor-3888-thread-1) [    ] o.a.s.c.SolrCore [collection1] Registered new searcher Searcher@12f3cc1d[collection1] main{ExitableDirectoryReader(UninvertingDirectoryReader())}
   [junit4]   2> 885615 INFO  (TEST-AutoCommitTest.testCommitWithin-seed#[55F4CF5A08389B26]) [    ] o.a.s.u.p.LogUpdateProcessorFactory [collection1] {add=[529 (1575845311461457920)]} 0 0
   [junit4]   2> 885615 INFO  (TEST-AutoCommitTest.testCommitWithin-seed#[55F4CF5A08389B26]) [    ] o.a.s.c.S.Request [collection1]  webapp=null path=null params={q=id:529&qt=&start=0&rows=20&version=2.2} hits=0 status=0 QTime=0
   [junit4]   2> 889616 INFO  (commitScheduler-3891-thread-1) [    ] o.a.s.u.DirectUpdateHandler2 start commit{,optimize=false,openSearcher=true,waitSearcher=true,expungeDeletes=false,softCommit=true,prepareCommit=false}
   [junit4]   2> 889618 INFO  (commitScheduler-3891-thread-1) [    ] o.a.s.s.SolrIndexSearcher Opening [Searcher@5fcc794d[collection1] main]
   [junit4]   2> 889619 INFO  (commitScheduler-3891-thread-1) [    ] o.a.s.u.DirectUpdateHandler2 end_commit_flush
   [junit4]   2> 889619 INFO  (searcherExecutor-3888-thread-1) [    ] o.a.s.c.SolrCore [collection1] Registered new searcher Searcher@5fcc794d[collection1] main{ExitableDirectoryReader(UninvertingDirectoryReader(Uninverting(_4(7.1.0):C1)))}
   [junit4]   2> 889868 INFO  (TEST-AutoCommitTest.testCommitWithin-seed#[55F4CF5A08389B26]) [    ] o.a.s.u.p.LogUpdateProcessorFactory [collection1] {add=[530 (1575845315920003072)]} 0 4253
   [junit4]   2> 889868 INFO  (TEST-AutoCommitTest.testCommitWithin-seed#[55F4CF5A08389B26]) [    ] o.a.s.c.S.Request [collection1]  webapp=null path=null params={q=id:530&qt=&start=0&rows=20&version=2.2} hits=0 status=0 QTime=0
   [junit4]   2> 889869 INFO  (TEST-AutoCommitTest.testCommitWithin-seed#[55F4CF5A08389B26]) [    ] o.a.s.u.p.LogUpdateProcessorFactory [collection1] {delete=[529 (-1575845315922100224)]} 0 4254
   [junit4]   2> 889869 INFO  (TEST-AutoCommitTest.testCommitWithin-seed#[55F4CF5A08389B26]) [    ] o.a.s.c.S.Request [collection1]  webapp=null path=null params={q=id:529&qt=&start=0&rows=20&version=2.2} hits=1 status=0 QTime=0
   [junit4]   2> 891869 INFO  (commitScheduler-3891-thread-1) [    ] o.a.s.u.DirectUpdateHandler2 start commit{,optimize=false,openSearcher=true,waitSearcher=true,expungeDeletes=false,softCommit=true,prepareCommit=false}
   [junit4]   2> 891871 INFO  (commitScheduler-3891-thread-1) [    ] o.a.s.s.SolrIndexSearcher Opening [Searcher@71b4f66[collection1] main]
   [junit4]   2> 891871 INFO  (commitScheduler-3891-thread-1) [    ] o.a.s.u.DirectUpdateHandler2 end_commit_flush
   [junit4]   2> 891872 INFO  (searcherExecutor-3888-thread-1) [    ] o.a.s.c.SolrCore [collection1] Registered new searcher Searcher@71b4f66[collection1] main{ExitableDirectoryReader(UninvertingDirectoryReader(Uninverting(_5(7.1.0):C1)))}
   [junit4]   2> 892120 INFO  (TEST-AutoCommitTest.testCommitWithin-seed#[55F4CF5A08389B26]) [    ] o.a.s.c.S.Request [collection1]  webapp=null path=null params={q=id:529&qt=&start=0&rows=20&version=2.2} hits=0 status=0 QTime=0
   [junit4]   2> 892121 INFO  (TEST-AutoCommitTest.testCommitWithin-seed#[55F4CF5A08389B26]) [    ] o.a.s.c.S.Request [collection1]  webapp=null path=null params={q=id:530&qt=&start=0&rows=20&version=2.2} hits=1 status=0 QTime=0
   [junit4]   2> 892121 INFO  (TEST-AutoCommitTest.testCommitWithin-seed#[55F4CF5A08389B26]) [    ] o.a.s.u.p.LogUpdateProcessorFactory [collection1] {add=[500 (1575845318283493376)]} 0 6506
   [junit4]   2> 892122 INFO  (TEST-AutoCommitTest.testCommitWithin-seed#[55F4CF5A08389B26]) [    ] o.a.s.u.p.LogUpdateProcessorFactory [collection1] {add=[500 (1575845318283493377)]} 0 6506
   [junit4]   2> 892122 INFO  (TEST-AutoCommitTest.testCommitWithin-seed#[55F4CF5A08389B26]) [    ] o.a.s.u.p.LogUpdateProcessorFactory [collection1] {add=[500 (1575845318284541952)]} 0 6507
   [junit4]   2> 892122 INFO  (TEST-AutoCommitTest.testCommitWithin-seed#[55F4CF5A08389B26]) [    ] o.a.s.u.p.LogUpdateProcessorFactory [collection1] {add=[500 (1575845318284541953)]} 0 6507
   [junit4]   2> 892122 INFO  (TEST-AutoCommitTest.testCommitWithin-seed#[55F4CF5A08389B26]) [    ] o.a.s.u.p.LogUpdateProcessorFactory [collection1] {add=[500 (1575845318284541954)]} 0 6507
   [junit4]   2> 892122 INFO  (TEST-AutoCommitTest.testCommitWithin-seed#[55F4CF5A08389B26]) [    ] o.a.s.u.p.LogUpdateProcessorFactory [collection1] {add=[500 (1575845318284541955)]} 0 6507
   [junit4]   2> 892122 INFO  (TEST-AutoCommitTest.testCommitWithin-seed#[55F4CF5A08389B26]) [    ] o.a.s.u.p.LogUpdateProcessorFactory [collection1] {add=[500 (1575845318284541956)]} 0 6507
   [junit4]   2> 892122 INFO  (TEST-AutoCommitTest.testCommitWithin-seed#[55F4CF5A08389B26]) [    ] o.a.s.u.p.LogUpdateProcessorFactory [collection1] {add=[500 (1575845318284541957)]} 0 6507
   [junit4]   2> 892122 INFO  (TEST-AutoCommitTest.testCommitWithin-seed#[55F4CF5A08389B26]) [    ] o.a.s.u.p.LogUpdateProcessorFactory [collection1] {add=[500 (1575845318284541958)]} 0 6507
   [junit4]   2> 892122 INFO  (TEST-AutoCommitTest.testCommitWithin-seed#[55F4CF5A08389B26]) [    ] o.a.s.u.p.LogUpdateProcessorFactory [collection1] {add=[500 (1575845318284541959)]} 0 6507
   [junit4]   2> 892123 INFO  (TEST-AutoCommitTest.testCommitWithin-seed#[55F4CF5A08389B26]) [    ] o.a.s.c.S.Request [collection1]  webapp=null path=null params={q=id:500&qt=&start=0&rows=20&version=2.2} hits=0 status=0 QTime=0
   [junit4]   2> 892123 INFO  (TEST-AutoCommitTest.testCommitWithin-seed#[55F4CF5A08389B26]) [    ] o.a.s.u.p.LogUpdateProcessorFactory [collection1] {delete=[530 (-1575845318285590528)]} 0 6508
   [junit4]   2> 892123 INFO  (TEST-AutoCommitTest.testCommitWithin-seed#[55F4CF5A08389B26]) [    ] o.a.s.u.p.LogUpdateProcessorFactory [collection1] {delete=[530 (-1575845318285590529)]} 0 6508
   [junit4]   2> 892123 INFO  (TEST-AutoCommitTest.testCommitWithin-seed#[55F4CF5A08389B26]) [    ] o.a.s.u.p.LogUpdateProcessorFactory [collection1] {delete=[530 (-1575845318285590530)]} 0 6508
   [junit4]   2> 892123 INFO  (TEST-AutoCommitTest.testCommitWithin-seed#[55F4CF5A08389B26]) [    ] o.a.s.u.p.LogUpdateProcessorFactory [collection1] {delete=[530 (-1575845318285590531)]} 0 6508
   [junit4]   2> 892123 INFO  (TEST-AutoCommitTest.testCommitWithin-seed#[55F4CF5A08389B26]) [    ] o.a.s.u.p.LogUpdateProcessorFactory [collection1] {delete=[530 (-1575845318285590532)]} 0 6508
   [junit4]   2> 892123 INFO  (TEST-AutoCommitTest.testCommitWithin-seed#[55F4CF5A08389B26]) [    ] o.a.s.u.p.LogUpdateProcessorFactory [collection1] {delete=[530 (-1575845318285590533)]} 0 6508
   [junit4]   2> 892123 INFO  (TEST-AutoCommitTest.testCommitWithin-seed#[55F4CF5A08389B26]) [    ] o.a.s.u.p.LogUpdateProcessorFactory [collection1] {delete=[530 (-1575845318285590534)]} 0 6508
   [junit4]   2> 892124 INFO  (TEST-AutoCommitTest.testCommitWithin-seed#[55F4CF5A08389B26]) [    ] o.a.s.u.p.LogUpdateProcessorFactory [collection1] {delete=[530 (-1575845318286639104)]} 0 6508
   [junit4]   2> 892124 INFO  (TEST-AutoCommitTest.testCommitWithin-seed#[55F4CF5A08389B26]) [    ] o.a.s.u.p.LogUpdateProcessorFactory [collection1] {delete=[530 (-1575845318286639105)]} 0 6508
   [junit4]   2> 892124 INFO  (TEST-AutoCommitTest.testCommitWithin-seed#[55F4CF5A08389B26]) [    ] o.a.s.u.p.LogUpdateProcessorFactory [collection1] {delete=[530 (-1575845318286639106)]} 0 6509
   [junit4]   2> 892124 INFO  (TEST-AutoCommitTest.testCommitWithin-seed#[55F4CF5A08389B26]) [    ] o.a.s.c.S.Request [collection1]  webapp=null path=null params={q=id:530&qt=&start=0&rows=20&version=2.2} hits=1 status=0 QTime=0
   [junit4]   2> 893123 INFO  (commitScheduler-3891-thread-1) [    ] o.a.s.u.DirectUpdateHandler2 start commit{,optimize=false,openSearcher=true,waitSearcher=true,expungeDeletes=false,softCommit=true,prepareCommit=false}
   [junit4]   2> 893126 INFO  (commitScheduler-3891-thread-1) [    ] o.a.s.s.SolrIndexSearcher Opening [Searcher@61c5dd38[collection1] main]
   [junit4]   2> 893126 INFO  (commitScheduler-3891-thread-1) [    ] o.a.s.u.DirectUpdateHandler2 end_commit_flush
   [junit4]   2> 893127 INFO  (searcherExecutor-3888-thread-1) [    ] o.a.s.c.SolrCore [collection1] Registered new searcher Searcher@61c5dd38[collection1] main{ExitableDirectoryReader(UninvertingDirectoryReader(Uninverting(_6(7.1.0):C10/9:delGen=1)))}
   [junit4]   2> 893375 INFO  (TEST-AutoCommitTest.testCommitWithin-seed#[55F4CF5A08389B26]) [    ] o.a.s.c.S.Request [collection1]  webapp=null path=null params={q=id:500&qt=&start=0&rows=20&version=2.2} hits=1 status=0 QTime=0
   [junit4]   2> 893375 INFO  (TEST-AutoCommitTest.testCommitWithin-seed#[55F4CF5A08389B26]) [    ] o.a.s.c.S.Request [collection1]  webapp=null path=null params={q=id:530&qt=&start=0&rows=20&version=2.2} hits=0 status=0 QTime=0
   [junit4]   2> 893376 INFO  (TEST-AutoCommitTest.testCommitWithin-seed#[55F4CF5A08389B26]) [    ] o.a.s.SolrTestCaseJ4 ###Ending testCommitWithin
   [junit4]   2> 893377 INFO  (TEST-AutoCommitTest.testMaxDocs-seed#[55F4CF5A08389B26]) [    ] o.a.s.SolrTestCaseJ4 ###Starting testMaxDocs
   [junit4]   2> 893377 INFO  (TEST-AutoCommitTest.testMaxDocs-seed#[55F4CF5A08389B26]) [    ] o.a.s.u.DirectUpdateHandler2 [collection1] REMOVING ALL DOCUMENTS FROM INDEX
   [junit4]   2> 893378 INFO  (TEST-AutoCommitTest.testMaxDocs-seed#[55F4CF5A08389B26]) [    ] o.a.s.s.SolrIndexSearcher Opening [Searcher@5be8489f[collection1] realtime]
   [junit4]   2> 893378 INFO  (TEST-AutoCommitTest.testMaxDocs-seed#[55F4CF5A08389B26]) [    ] o.a.s.u.p.LogUpdateProcessorFactory [collection1]  webapp=null path=null params={_version_=-9223372036854775807&update.distrib=FROMLEADER&versions=true&wt=json&indent=true}{deleteByQuery=*:* (-9223372036854775807)} 0 0
   [junit4]   2> 893378 ERROR (TEST-AutoCommitTest.testMaxDocs-seed#[55F4CF5A08389B26]) [    ] o.a.s.c.CorePropertiesLocator Couldn't load core descriptor from /home/jenkins/workspace/Lucene-Solr-7.x-Linux/solr/core/src/test-files/solr/collection1/core.properties:java.nio.file.NoSuchFileException: /home/jenkins/workspace/Lucene-Solr-7.x-Linux/solr/core/src/test-files/solr/collection1/core.properties
   [junit4]   2> 893378 INFO  (TEST-AutoCommitTest.testMaxDocs-seed#[55F4CF5A08389B26]) [    ] o.a.s.c.SolrResourceLoader [null] Added 2 libs to classloader, from paths: [/home/jenkins/workspace/Lucene-Solr-7.x-Linux/solr/core/src/test-files/solr/collection1/lib, /home/jenkins/workspace/Lucene-Solr-7.x-Linux/solr/core/src/test-files/solr/collection1/lib/classes]
   [junit4]   2> 893397 INFO  (TEST-AutoCommitTest.testMaxDocs-seed#[55F4CF5A08389B26]) [    ] o.a.s.c.SolrConfig Using Lucene MatchVersion: 7.1.0
   [junit4]   2> 893411 INFO  (TEST-AutoCommitTest.testMaxDocs-seed#[55F4CF5A08389B26]) [    ] o.a.s.s.IndexSchema [collection1] Schema name=test
   [junit4]   2> 893476 INFO  (TEST-AutoCommitTest.testMaxDocs-seed#[55F4CF5A08389B26]) [    ] o.a.s.s.IndexSchema Loaded schema test/1.0 with uniqueid field id
   [junit4]   2> 893481 INFO  (TEST-AutoCommitTest.testMaxDocs-seed#[55F4CF5A08389B26]) [    ] o.a.s.c.CoreContainer Reloading SolrCore 'collection1' using configuration from instancedir /home/jenkins/workspace/Lucene-Solr-7.x-Linux/solr/core/src/test-files/solr/collection1
   [junit4]   2> 893481 WARN  (TEST-AutoCommitTest.testMaxDocs-seed#[55F4CF5A08389B26]) [    ] o.a.s.m.r.SolrJmxReporter No JMX server found. Not exposing Solr metrics via JMX.
   [junit4]   2> 893481 INFO  (TEST-AutoCommitTest.testMaxDocs-seed#[55F4CF5A08389B26]) [    ] o.a.s.c.SolrCore [[collection1] ] Opening new SolrCore at [/home/jenkins/workspace/Lucene-Solr-7.x-Linux/solr/core/src/test-files/solr/collection1], dataDir=[/home/jenkins/workspace/Lucene-Solr-7.x-Linux/solr/build/solr-core/test/J2/temp/solr.update.AutoCommitTest_55F4CF5A08389B26-001/init-core-data-001/]
   [junit4]   2> 893511 INFO  (TEST-AutoCommitTest.testMaxDocs-seed#[55F4CF5A08389B26]) [    ] o.a.s.u.CommitTracker Hard AutoCommit: disabled
   [junit4]   2> 893511 INFO  (TEST-AutoCommitTest.testMaxDocs-seed#[55F4CF5A08389B26]) [    ] o.a.s.u.CommitTracker Soft AutoCommit: disabled
   [junit4]   2> 893511 INFO  (TEST-AutoCommitTest.testMaxDocs-seed#[55F4CF5A08389B26]) [    ] o.a.s.s.SolrIndexSearcher Opening [Searcher@c135c57[collection1] main]
   [junit4]   2> 893511 INFO  (TEST-AutoCommitTest.testMaxDocs-seed#[55F4CF5A08389B26]) [    ] o.a.s.h.c.SpellCheckComponent Initializing spell checkers
   [junit4]   2> 893512 INFO  (TEST-AutoCommitTest.testMaxDocs-seed#[55F4CF5A08389B26]) [    ] o.a.s.s.DirectSolrSpellChecker init: {name=direct,classname=DirectSolrSpellChecker,field=lowerfilt,minQueryLength=3}
   [junit4]   2> 893514 INFO  (TEST-AutoCommitTest.testMaxDocs-seed#[55F4CF5A08389B26]) [    ] o.a.s.h.ReplicationHandler Commits will be reserved for  10000
   [junit4]   2> 893514 INFO  (searcherExecutor-3892-thread-1) [    ] o.a.s.h.c.SpellCheckComponent Loading spell index for spellchecker: default
   [junit4]   2> 893514 INFO  (searcherExecutor-3892-thread-1) [    ] o.a.s.h.c.SpellCheckComponent Loading spell index for spellchecker: direct
   [junit4]   2> 893514 INFO  (searcherExecutor-3892-thread-1) [    ] o.a.s.h.c.SpellCheckComponent Loading spell index for spellchecker: wordbreak
   [junit4]   2> 893514 INFO  (searcherExecutor-3892-thread-1) [    ] o.a.s.h.c.SpellCheckComponent Loading spell index for spellchecker: multipleFields
   [junit4]   2> 893515 INFO  (searcherExecutor-3892-thread-1) [    ] o.a.s.h.c.SpellCheckComponent Loading spell index for spellchecker: jarowinkler
   [junit4]   2> 893515 INFO  (searcherExecutor-3892-thread-1) [    ] o.a.s.h.c.SpellCheckComponent Loading spell index for spellchecker: external
   [junit4]   2> 893515 INFO  (searcherExecutor-3892-thread-1) [    ] o.a.s.h.c.SpellCheckComponent Loading spell index for spellchecker: freq
   [junit4]   2> 893521 INFO  (searcherExecutor-3892-thread-1) [    ] o.a.s.h.c.SpellCheckComponent Loading spell index for spellchecker: fqcn
   [junit4]   2> 893521 INFO  (searcherExecutor-3892-thread-1) [    ] o.a.s.h.c.SpellCheckComponent Loading spell index for spellchecker: perDict
   [junit4]   2> 893521 INFO  (searcherExecutor-3892-thread-1) [    ] o.a.s.c.SolrCore [collection1] Registered new searcher Searcher@c135c57[collection1] main{ExitableDirectoryReader(UninvertingDirectoryReader())}
   [junit4]   2> 893521 INFO  (TEST-AutoCommitTest.testMaxDocs-seed#[55F4CF5A08389B26]) [    ] o.a.s.u.RandomMergePolicy RandomMergePolicy wrapping class org.apache.lucene.index.LogByteSizeMergePolicy: [LogByteSizeMergePolicy: minMergeSize=1677721, mergeFactor=20, maxMergeSize=2147483648, maxMergeSizeForForcedMerge=9223372036854775807, calibrateSizeByDeletes=false, maxMergeDocs=2147483647, maxCFSSegmentSizeMB=8.796093022207999E12, noCFSRatio=0.0]
   [junit4]   2> 893522 INFO  (TEST-AutoCommitTest.testMaxDocs-seed#[55F4CF5A08389B26]) [    ] o.a.s.u.DefaultSolrCoreState New IndexWriter is ready to be used.
   [junit4]   2> 893522 INFO  (TEST-AutoCommitTest.testMaxDocs-seed#[55F4CF5A08389B26]) [    ] o.a.s.s.SolrIndexSearcher Opening [Searcher@4aa4c126[collection1] main]
   [junit4]   2> 893522 INFO  (TEST-AutoCommitTest.testMaxDocs-seed#[55F4CF5A08389B26]) [    ] o.a.s.c.SolrCore [collection1]  CLOSING SolrCore org.apache.solr.core.SolrCore@6fdf44ca
   [junit4]   2> 893522 INFO  (TEST-AutoCommitTest.testMaxDocs-seed#[55F4CF5A08389B26]) [    ] o.a.s.m.SolrMetricManager Closing metric reporters for registry=solr.core.collection1, tag=1876903114
   [junit4]   2> 893522 INFO  (TEST-AutoCommitTest.testMaxDocs-seed#[55F4CF5A08389B26]) [    ] o.a.s.m.r.SolrJmxReporter Closing reporter [org.apache.solr.metrics.reporters.SolrJmxReporter@7b0c543c: rootName = null, domain = solr.core.collection1, service url = null, agent id = null] for registry solr.core.collection1 / null
   [junit4]   2> 893523 INFO  (searcherExecutor-3892-thread-1) [    ] o.a.s.c.SolrCore [collection1] Registered new searcher Searcher@4aa4c126[collection1] main{ExitableDirectoryReader(UninvertingDirectoryReader())}
   [junit4]   2> 893523 INFO  (TEST-AutoCommitTest.testMaxDocs-seed#[55F4CF5A08389B26]) [    ] o.a.s.u.p.LogUpdateProcessorFactory [collection1] {add=[0 (1575845319753596928)]} 0 0
   [junit4]   2> 893524 INFO  (TEST-AutoCommitTest.testMaxDocs-seed#[55F4CF5A08389B26]) [    ] o.a.s.u.p.LogUpdateProcessorFactory [collection1] {add=[1 (1575845319754645504)]} 0 0
   [junit4]   2> 893524 INFO  (TEST-AutoCommitTest.testMaxDocs-seed#[55F4CF5A08389B26]) [    ] o.a.s.u.p.LogUpdateProcessorFactory [collection1] {add=[2 (1575845319754645505)]} 0 0
   [junit4]   2> 893524 INFO  (TEST-AutoCommitTest.testMaxDocs-seed#[55F4CF5A08389B26]) [    ] o.a.s.u.p.LogUpdateProcessorFactory [collection1] {add=[3 (1575845319754645506)]} 0 0
   [junit4]   2> 893524 INFO  (TEST-AutoCommitTest.testMaxDocs-seed#[55F4CF5A08389B26]) [    ] o.a.s.u.p.LogUpdateProcessorFactory [collection1] {add=[4 (1575845319754645507)]} 0 1
   [junit4]   2> 893524 INFO  (TEST-AutoCommitTest.testMaxDocs-seed#[55F4CF5A08389B26]) [    ] o.a.s.u.p.LogUpdateProcessorFactory [collection1] {add=[5 (1575845319754645508)]} 0 1
   [junit4]   2> 893524 INFO  (TEST-AutoCommitTest.testMaxDocs-seed#[55F4CF5A08389B26]) [    ] o.a.s.u.p.LogUpdateProcessorFactory [collection1] {add=[6 (1575845319754645509)]} 0 1
   [junit4]   2> 893524 INFO  (TEST-AutoCommitTest.testMaxDocs-seed#[55F4CF5A08389B26]) [    ] o.a.s.u.p.LogUpdateProcessorFactory [collection1] {add=[7 (1575845319754645510)]} 0 1
   [junit4]   2> 893524 INFO  (TEST-AutoCommitTest.testMaxDocs-seed#[55F4CF5A08389B26]) [    ] o.a.s.u.p.LogUpdateProcessorFactory [collection1] {add=[8 (1575845319754645511)]} 0 1
   [junit4]   2> 893525 INFO  (TEST-AutoCommitTest.testMaxDocs-seed#[55F4CF5A08389B26]) [    ] o.a.s.u.p.LogUpdateProcessorFactory [collection1] {add=[9 (1575845319755694080)]} 0 1
   [junit4]   2> 893525 INFO  (TEST-AutoCommitTest.testMaxDocs-seed#[55F4CF5A08389B26]) [    ] o.a.s.u.p.LogUpdateProcessorFactory [collection1] {add=[10 (1575845319755694081)]} 0 1
   [junit4]   2> 893525 INFO  (TEST-AutoCommitTest.testMaxDocs-seed#[55F4CF5A08389B26]) [    ] o.a.s.u.p.LogUpdateProcessorFactory [collection1] {add=[11 (1575845319755694082)]} 0 1
   [junit4]   2> 893525 INFO  (TEST-AutoCommitTest.testMaxDocs-seed#[55F4CF5A08389B26]) [    ] o.a.s.u.p.LogUpdateProcessorFactory [collection1] {add=[12 (1575845319755694083)]} 0 1
   [junit4]   2> 893525 INFO  (TEST-AutoCommitTest.testMaxDocs-seed#[55F4CF5A08389B26]) [    ] o.a.s.u.p.LogUpdateProcessorFactory [collection1] {add=[13 (1575845319755694084)]} 0 2
   [junit4]   2> 893525 INFO  (TEST-AutoCommitTest.testMaxDocs-seed#[55F4CF5A08389B26]) [    ] o.a.s.c.S.Request [collection1]  webapp=null path=null params={q=id:1&qt=&start=0&rows=20&version=2.2} hits=0 status=0 QTime=0
   [junit4]   2> 893526 INFO  (TEST-AutoCommitTest.testMaxDocs-seed#[55F4CF5A08389B26]) [    ] o.a.s.u.p.LogUpdateProcessorFactory [collection1] {add=[14 (1575845319755694085)]} 0 2
   [junit4]   2> 893526 INFO  (TEST-AutoCommitTest.testMaxDocs-seed#[55F4CF5A08389B26]) [    ] o.a.s.u.p.LogUpdateProcessorFactory [collection1] {add=[15 (1575845319756742656)]} 0 2
   [junit4]   2> 893526 INFO  (TEST-AutoCommitTest.testMaxDocs-seed#[55F4CF5A08389B26]) [    ] o.a.s.c.S.Request [collection1]  webapp=null path=null params={q=id:14&qt=&start=0&rows=20&version=2.2} hits=0 status=0 QTime=0
   [junit4]   2> 893526 ERROR (TEST-AutoCommitTest.testMaxDocs-seed#[55F4CF5A08389B26]) [    ] o.a.s.SolrTestCaseJ4 REQUEST FAILED: xpath=//result[@numFound=1]
   [junit4]   2> 	xml response was: <?xml version="1.0" encoding="UTF-8"?>
   [junit4]   2> <response>
   [junit4]   2> <lst name="responseHeader"><int name="status">0</int><int name="QTime">0</int></lst><result name="response" numFound="0" start="0"></result>
   [junit4]   2> </response>
   [junit4]   2> 
   [junit4]   2> 	request was:q=id:14&qt=&start=0&rows=20&version=2.2
   [junit4]   2> 893526 ERROR (TEST-AutoCommitTest.testMaxDocs-seed#[55F4CF5A08389B26]) [    ] o.a.s.SolrTestCaseJ4 REQUEST FAILED: q=id:14&qt=&start=0&rows=20&version=2.2:java.lang.RuntimeException: REQUEST FAILED: xpath=//result[@numFound=1]
   [junit4]   2> 	xml response was: <?xml version="1.0" encoding="UTF-8"?>
   [junit4]   2> <response>
   [junit4]   2> <lst name="responseHeader"><int name="status">0</int><int name="QTime">0</int></lst><result name="response" numFound="0" start="0"></result>
   [junit4]   2> </response>
   [junit4]   2> 
   [junit4]   2> 	request was:q=id:14&qt=&start=0&rows=20&version=2.2
   [junit4]   2> 	at org.apache.solr.SolrTestCaseJ4.assertQ(SolrTestCaseJ4.java:879)
   [junit4]   2> 	at org.apache.solr.update.AutoCommitTest.testMaxDocs(AutoCommitTest.java:225)
   [junit4]   2> 	at java.base/jdk.internal.reflect.NativeMethodAccessorImpl.invoke0(Native Method)
   [junit4]   2> 	at java.base/jdk.internal.reflect.NativeMethodAccessorImpl.invoke(NativeMethodAccessorImpl.java:62)
   [junit4]   2> 	at java.base/jdk.internal.reflect.DelegatingMethodAccessorImpl.invoke(DelegatingMethodAccessorImpl.java:43)
   [junit4]   2> 	at java.base/java.lang.reflect.Method.invoke(Method.java:564)
   [junit4]   2> 	at com.carrotsearch.randomizedtesting.RandomizedRunner.invoke(RandomizedRunner.java:1713)
   [junit4]   2> 	at com.carrotsearch.randomizedtesting.RandomizedRunner$8.evaluate(RandomizedRunner.java:907)
   [junit4]   2> 	at com.carrotsearch.randomizedtesting.RandomizedRunner$9.evaluate(RandomizedRunner.java:943)
   [junit4]   2> 	at com.carrotsearch.randomizedtesting.RandomizedRunner$10.evaluate(RandomizedRunner.java:957)
   [junit4]   2> 	at com.carrotsearch.randomizedtesting.rules.SystemPropertiesRestoreRule$1.evaluate(SystemPropertiesRestoreRule.java:57)
   [junit4]   2> 	at org.apache.lucene.util.TestRuleSetupTeardownChained$1.evaluate(TestRuleSetupTeardownChained.java:49)
   [junit4]   2> 	at org.apache.lucene.util.AbstractBeforeAfterRule$1.evaluate(AbstractBeforeAfterRule.java:45)
   [junit4]   2> 	at org.apache.lucene.util.TestRuleThreadAndTestName$1.evaluate(TestRuleThreadAndTestName.java:48)
   [junit4]   2> 	at org.apache.lucene.util.TestRuleIgnoreAfterMaxFailures$1.evaluate(TestRuleIgnoreAfterMaxFailures.java:64)
   [junit4]   2> 	at org.apache.lucene.util.TestRuleMarkFailure$1.evaluate(TestRuleMarkFailure.java:47)
   [junit4]   2> 	at com.carrotsearch.randomizedtesting.rules.StatementAdapter.evaluate(StatementAdapter.java:36)
   [junit4]   2> 	at com.carrotsearch.randomizedtesting.ThreadLeakControl$StatementRunner.run(ThreadLeakControl.java:368)
   [junit4]   2> 	at com.carrotsearch.randomizedtesting.ThreadLeakControl.forkTimeoutingTask(ThreadLeakControl.java:817)
   [junit4]   2> 	at com.carrotsearch.randomizedtesting.ThreadLeakControl$3.evaluate(ThreadLeakControl.java:468)
   [junit4]   2> 	at com.carrotsearch.randomizedtesting.RandomizedRunner.runSingleTest(RandomizedRunner.java:916)
   [junit4]   2> 	at com.carrotsearch.randomizedtesting.RandomizedRunner$5.evaluate(RandomizedRunner.java:802)
   [junit4]   2> 	at com.carrotsearch.randomizedtesting.RandomizedRunner$6.evaluate(RandomizedRunner.java:852)
   [junit4]   2> 	at com.carrotsearch.randomizedtesting.RandomizedRunner$7.evaluate(RandomizedRunner.java:863)
   [junit4]   2> 	at com.carrotsearch.randomizedtesting.rules.StatementAdapter.evaluate(StatementAdapter.java:36)
   [junit4]   2> 	at com.carrotsearch.randomizedtesting.rules.SystemPropertiesRestoreRule$1.evaluate(SystemPropertiesRestoreRule.java:57)
   [junit4]   2> 	at org.apache.lucene.util.AbstractBeforeAfterRule$1.evaluate(AbstractBeforeAfterRule.java:45)
   [junit4]   2> 	at com.carrotsearch.randomizedtesting.rules.StatementAdapter.evaluate(StatementAdapter.java:36)
   [junit4]   2> 	at org.apache.lucene.util.TestRuleStoreClassName$1.evaluate(TestRuleStoreClassName.java:41)
   [junit4]   2> 	at com.carrotsearch.randomizedtesting.rules.NoShadowingOrOverridesOnMethodsRule$1.evaluate(NoShadowingOrOverridesOnMethodsRule.java:40)
   [junit4]   2> 	at com.carrotsearch.randomizedtesting.rules.NoShadowingOrOverridesOnMethodsRule$1.evaluate(NoShadowingOrOverridesOnMethodsRule.java:40)
   [junit4]   2> 	at com.carrotsearch.randomizedtesting.rules.StatementAdapter.evaluate(StatementAdapter.java:36)
   [junit4]   2> 	at com.carrotsearch.randomizedtesting.rules.StatementAdapter.evaluate(StatementAdapter.java:36)
   [junit4]   2> 	at org.apache.lucene.util.TestRuleAssertionsRequired$1.evaluate(TestRuleAssertionsRequired.java:53)
   [junit4]   2> 	at org.apache.lucene.util.TestRuleMarkFailure$1.evaluate(TestRuleMarkFailure.java:47)
   [junit4]   2> 	at org.apache.lucene.util.TestRuleIgnoreAfterMaxFailures$1.evaluate(TestRuleIgnoreAfterMaxFailures.java:64)
   [junit4]   2> 	at org.apache.lucene.util.TestRuleIgnoreTestSuites$1.evaluate(TestRuleIgnoreTestSuites.java:54)
   [junit4]   2> 	at com.carrotsearch.randomizedtesting.rules.StatementAdapter.evaluate(StatementAdapter.java:36)
   [junit4]   2> 	at com.carrotsearch.randomizedtesting.ThreadLeakControl$StatementRunner.run(ThreadLeakControl.java:368

[...truncated too long message...]

=ChaosMonkeyNothingIsSafeTest -Dtests.seed=55F4CF5A08389B26 -Dtests.multiplier=3 -Dtests.slow=true -Dtests.locale=pa-PK -Dtests.timezone=Singapore -Dtests.asserts=true -Dtests.file.encoding=ISO-8859-1
   [junit4] ERROR   0.00s J0 | ChaosMonkeyNothingIsSafeTest (suite) <<<
   [junit4]    > Throwable #1: com.carrotsearch.randomizedtesting.ThreadLeakError: 6 threads leaked from SUITE scope at org.apache.solr.cloud.ChaosMonkeyNothingIsSafeTest: 
   [junit4]    >    1) Thread[id=15967, name=zkCallback-2108-thread-3, state=TIMED_WAITING, group=TGRP-ChaosMonkeyNothingIsSafeTest]
   [junit4]    >         at java.base@9/jdk.internal.misc.Unsafe.park(Native Method)
   [junit4]    >         at java.base@9/java.util.concurrent.locks.LockSupport.parkNanos(LockSupport.java:234)
   [junit4]    >         at java.base@9/java.util.concurrent.SynchronousQueue$TransferStack.awaitFulfill(SynchronousQueue.java:462)
   [junit4]    >         at java.base@9/java.util.concurrent.SynchronousQueue$TransferStack.transfer(SynchronousQueue.java:361)
   [junit4]    >         at java.base@9/java.util.concurrent.SynchronousQueue.poll(SynchronousQueue.java:937)
   [junit4]    >         at java.base@9/java.util.concurrent.ThreadPoolExecutor.getTask(ThreadPoolExecutor.java:1091)
   [junit4]    >         at java.base@9/java.util.concurrent.ThreadPoolExecutor.runWorker(ThreadPoolExecutor.java:1152)
   [junit4]    >         at java.base@9/java.util.concurrent.ThreadPoolExecutor$Worker.run(ThreadPoolExecutor.java:641)
   [junit4]    >         at java.base@9/java.lang.Thread.run(Thread.java:844)
   [junit4]    >    2) Thread[id=16066, name=zkCallback-2108-thread-6, state=TIMED_WAITING, group=TGRP-ChaosMonkeyNothingIsSafeTest]
   [junit4]    >         at java.base@9/jdk.internal.misc.Unsafe.park(Native Method)
   [junit4]    >         at java.base@9/java.util.concurrent.locks.LockSupport.parkNanos(LockSupport.java:234)
   [junit4]    >         at java.base@9/java.util.concurrent.SynchronousQueue$TransferStack.awaitFulfill(SynchronousQueue.java:462)
   [junit4]    >         at java.base@9/java.util.concurrent.SynchronousQueue$TransferStack.transfer(SynchronousQueue.java:361)
   [junit4]    >         at java.base@9/java.util.concurrent.SynchronousQueue.poll(SynchronousQueue.java:937)
   [junit4]    >         at java.base@9/java.util.concurrent.ThreadPoolExecutor.getTask(ThreadPoolExecutor.java:1091)
   [junit4]    >         at java.base@9/java.util.concurrent.ThreadPoolExecutor.runWorker(ThreadPoolExecutor.java:1152)
   [junit4]    >         at java.base@9/java.util.concurrent.ThreadPoolExecutor$Worker.run(ThreadPoolExecutor.java:641)
   [junit4]    >         at java.base@9/java.lang.Thread.run(Thread.java:844)
   [junit4]    >    3) Thread[id=15805, name=TEST-ChaosMonkeyNothingIsSafeTest.test-seed#[55F4CF5A08389B26]-EventThread, state=WAITING, group=TGRP-ChaosMonkeyNothingIsSafeTest]
   [junit4]    >         at java.base@9/jdk.internal.misc.Unsafe.park(Native Method)
   [junit4]    >         at java.base@9/java.util.concurrent.locks.LockSupport.park(LockSupport.java:194)
   [junit4]    >         at java.base@9/java.util.concurrent.locks.AbstractQueuedSynchronizer$ConditionObject.await(AbstractQueuedSynchronizer.java:2062)
   [junit4]    >         at java.base@9/java.util.concurrent.LinkedBlockingQueue.take(LinkedBlockingQueue.java:435)
   [junit4]    >         at app//org.apache.zookeeper.ClientCnxn$EventThread.run(ClientCnxn.java:501)
   [junit4]    >    4) Thread[id=16065, name=zkCallback-2108-thread-5, state=TIMED_WAITING, group=TGRP-ChaosMonkeyNothingIsSafeTest]
   [junit4]    >         at java.base@9/jdk.internal.misc.Unsafe.park(Native Method)
   [junit4]    >         at java.base@9/java.util.concurrent.locks.LockSupport.parkNanos(LockSupport.java:234)
   [junit4]    >         at java.base@9/java.util.concurrent.SynchronousQueue$TransferStack.awaitFulfill(SynchronousQueue.java:462)
   [junit4]    >         at java.base@9/java.util.concurrent.SynchronousQueue$TransferStack.transfer(SynchronousQueue.java:361)
   [junit4]    >         at java.base@9/java.util.concurrent.SynchronousQueue.poll(SynchronousQueue.java:937)
   [junit4]    >         at java.base@9/java.util.concurrent.ThreadPoolExecutor.getTask(ThreadPoolExecutor.java:1091)
   [junit4]    >         at java.base@9/java.util.concurrent.ThreadPoolExecutor.runWorker(ThreadPoolExecutor.java:1152)
   [junit4]    >         at java.base@9/java.util.concurrent.ThreadPoolExecutor$Worker.run(ThreadPoolExecutor.java:641)
   [junit4]    >         at java.base@9/java.lang.Thread.run(Thread.java:844)
   [junit4]    >    5) Thread[id=15803, name=Connection evictor, state=TIMED_WAITING, group=TGRP-ChaosMonkeyNothingIsSafeTest]
   [junit4]    >         at java.base@9/java.lang.Thread.sleep(Native Method)
   [junit4]    >         at app//org.apache.http.impl.client.IdleConnectionEvictor$1.run(IdleConnectionEvictor.java:66)
   [junit4]    >         at java.base@9/java.lang.Thread.run(Thread.java:844)
   [junit4]    >    6) Thread[id=15804, name=TEST-ChaosMonkeyNothingIsSafeTest.test-seed#[55F4CF5A08389B26]-SendThread(127.0.0.1:46783), state=TIMED_WAITING, group=TGRP-ChaosMonkeyNothingIsSafeTest]
   [junit4]    >         at java.base@9/java.lang.Thread.sleep(Native Method)
   [junit4]    >         at app//org.apache.zookeeper.client.StaticHostProvider.next(StaticHostProvider.java:101)
   [junit4]    >         at app//org.apache.zookeeper.ClientCnxn$SendThread.startConnect(ClientCnxn.java:997)
   [junit4]    >         at app//org.apache.zookeeper.ClientCnxn$SendThread.run(ClientCnxn.java:1060)
   [junit4]    > 	at __randomizedtesting.SeedInfo.seed([55F4CF5A08389B26]:0)Throwable #2: com.carrotsearch.randomizedtesting.ThreadLeakError: There are still zombie threads that couldn't be terminated:
   [junit4]    >    1) Thread[id=15967, name=zkCallback-2108-thread-3, state=TIMED_WAITING, group=TGRP-ChaosMonkeyNothingIsSafeTest]
   [junit4]    >         at java.base@9/jdk.internal.misc.Unsafe.park(Native Method)
   [junit4]    >         at java.base@9/java.util.concurrent.locks.LockSupport.parkNanos(LockSupport.java:234)
   [junit4]    >         at java.base@9/java.util.concurrent.SynchronousQueue$TransferStack.awaitFulfill(SynchronousQueue.java:462)
   [junit4]    >         at java.base@9/java.util.concurrent.SynchronousQueue$TransferStack.transfer(SynchronousQueue.java:361)
   [junit4]    >         at java.base@9/java.util.concurrent.SynchronousQueue.poll(SynchronousQueue.java:937)
   [junit4]    >         at java.base@9/java.util.concurrent.ThreadPoolExecutor.getTask(ThreadPoolExecutor.java:1091)
   [junit4]    >         at java.base@9/java.util.concurrent.ThreadPoolExecutor.runWorker(ThreadPoolExecutor.java:1152)
   [junit4]    >         at java.base@9/java.util.concurrent.ThreadPoolExecutor$Worker.run(ThreadPoolExecutor.java:641)
   [junit4]    >         at java.base@9/java.lang.Thread.run(Thread.java:844)
   [junit4]    >    2) Thread[id=16066, name=zkCallback-2108-thread-6, state=TIMED_WAITING, group=TGRP-ChaosMonkeyNothingIsSafeTest]
   [junit4]    >         at java.base@9/jdk.internal.misc.Unsafe.park(Native Method)
   [junit4]    >         at java.base@9/java.util.concurrent.locks.LockSupport.parkNanos(LockSupport.java:234)
   [junit4]    >         at java.base@9/java.util.concurrent.SynchronousQueue$TransferStack.awaitFulfill(SynchronousQueue.java:462)
   [junit4]    >         at java.base@9/java.util.concurrent.SynchronousQueue$TransferStack.transfer(SynchronousQueue.java:361)
   [junit4]    >         at java.base@9/java.util.concurrent.SynchronousQueue.poll(SynchronousQueue.java:937)
   [junit4]    >         at java.base@9/java.util.concurrent.ThreadPoolExecutor.getTask(ThreadPoolExecutor.java:1091)
   [junit4]    >         at java.base@9/java.util.concurrent.ThreadPoolExecutor.runWorker(ThreadPoolExecutor.java:1152)
   [junit4]    >         at java.base@9/java.util.concurrent.ThreadPoolExecutor$Worker.run(ThreadPoolExecutor.java:641)
   [junit4]    >         at java.base@9/java.lang.Thread.run(Thread.java:844)
   [junit4]    >    3) Thread[id=16065, name=zkCallback-2108-thread-5, state=TIMED_WAITING, group=TGRP-ChaosMonkeyNothingIsSafeTest]
   [junit4]    >         at java.base@9/jdk.internal.misc.Unsafe.park(Native Method)
   [junit4]    >         at java.base@9/java.util.concurrent.locks.LockSupport.parkNanos(LockSupport.java:234)
   [junit4]    >         at java.base@9/java.util.concurrent.SynchronousQueue$TransferStack.awaitFulfill(SynchronousQueue.java:462)
   [junit4]    >         at java.base@9/java.util.concurrent.SynchronousQueue$TransferStack.transfer(SynchronousQueue.java:361)
   [junit4]    >         at java.base@9/java.util.concurrent.SynchronousQueue.poll(SynchronousQueue.java:937)
   [junit4]    >         at java.base@9/java.util.concurrent.ThreadPoolExecutor.getTask(ThreadPoolExecutor.java:1091)
   [junit4]    >         at java.base@9/java.util.concurrent.ThreadPoolExecutor.runWorker(ThreadPoolExecutor.java:1152)
   [junit4]    >         at java.base@9/java.util.concurrent.ThreadPoolExecutor$Worker.run(ThreadPoolExecutor.java:641)
   [junit4]    >         at java.base@9/java.lang.Thread.run(Thread.java:844)
   [junit4]    >    4) Thread[id=15804, name=TEST-ChaosMonkeyNothingIsSafeTest.test-seed#[55F4CF5A08389B26]-SendThread(127.0.0.1:46783), state=TIMED_WAITING, group=TGRP-ChaosMonkeyNothingIsSafeTest]
   [junit4]    >         at java.base@9/java.lang.Thread.sleep(Native Method)
   [junit4]    >         at app//org.apache.zookeeper.client.StaticHostProvider.next(StaticHostProvider.java:101)
   [junit4]    >         at app//org.apache.zookeeper.ClientCnxn$SendThread.startConnect(ClientCnxn.java:997)
   [junit4]    >         at app//org.apache.zookeeper.ClientCnxn$SendThread.run(ClientCnxn.java:1060)
   [junit4]    > 	at __randomizedtesting.SeedInfo.seed([55F4CF5A08389B26]:0)
   [junit4] Completed [448/729 (4!)] on J0 in 114.92s, 1 test, 3 errors <<< FAILURES!

[...truncated 37446 lines...]

Mime
View raw message