lucene-dev mailing list archives

Site index · List index
Message view « Date » · « Thread »
Top « Date » · « Thread »
From Apache Jenkins Server <jenk...@builds.apache.org>
Subject [JENKINS] Lucene-Solr-NightlyTests-master - Build # 1373 - Still Unstable
Date Sat, 12 Aug 2017 17:28:31 GMT
Build: https://builds.apache.org/job/Lucene-Solr-NightlyTests-master/1373/

4 tests failed.
FAILED:  org.apache.solr.cloud.ForceLeaderTest.testReplicasInLIRNoLeader

Error Message:
Doc with id=1 not found in http://127.0.0.1:44808/forceleader_test_collection due to: Path not found: /id; rsp={doc=null}

Stack Trace:
java.lang.AssertionError: Doc with id=1 not found in http://127.0.0.1:44808/forceleader_test_collection due to: Path not found: /id; rsp={doc=null}
	at __randomizedtesting.SeedInfo.seed([5E33055001FC95BA:B8A43190387E6CDB]:0)
	at org.junit.Assert.fail(Assert.java:93)
	at org.junit.Assert.assertTrue(Assert.java:43)
	at org.apache.solr.cloud.HttpPartitionTest.assertDocExists(HttpPartitionTest.java:603)
	at org.apache.solr.cloud.HttpPartitionTest.assertDocsExistInAllReplicas(HttpPartitionTest.java:556)
	at org.apache.solr.cloud.ForceLeaderTest.testReplicasInLIRNoLeader(ForceLeaderTest.java:142)
	at sun.reflect.NativeMethodAccessorImpl.invoke0(Native Method)
	at sun.reflect.NativeMethodAccessorImpl.invoke(NativeMethodAccessorImpl.java:62)
	at sun.reflect.DelegatingMethodAccessorImpl.invoke(DelegatingMethodAccessorImpl.java:43)
	at java.lang.reflect.Method.invoke(Method.java:498)
	at com.carrotsearch.randomizedtesting.RandomizedRunner.invoke(RandomizedRunner.java:1713)
	at com.carrotsearch.randomizedtesting.RandomizedRunner$8.evaluate(RandomizedRunner.java:907)
	at com.carrotsearch.randomizedtesting.RandomizedRunner$9.evaluate(RandomizedRunner.java:943)
	at com.carrotsearch.randomizedtesting.RandomizedRunner$10.evaluate(RandomizedRunner.java:957)
	at org.apache.solr.BaseDistributedSearchTestCase$ShardsRepeatRule$ShardsFixedStatement.callStatement(BaseDistributedSearchTestCase.java:993)
	at org.apache.solr.BaseDistributedSearchTestCase$ShardsRepeatRule$ShardsStatement.evaluate(BaseDistributedSearchTestCase.java:968)
	at com.carrotsearch.randomizedtesting.rules.SystemPropertiesRestoreRule$1.evaluate(SystemPropertiesRestoreRule.java:57)
	at org.apache.lucene.util.TestRuleSetupTeardownChained$1.evaluate(TestRuleSetupTeardownChained.java:49)
	at org.apache.lucene.util.AbstractBeforeAfterRule$1.evaluate(AbstractBeforeAfterRule.java:45)
	at org.apache.lucene.util.TestRuleThreadAndTestName$1.evaluate(TestRuleThreadAndTestName.java:48)
	at org.apache.lucene.util.TestRuleIgnoreAfterMaxFailures$1.evaluate(TestRuleIgnoreAfterMaxFailures.java:64)
	at org.apache.lucene.util.TestRuleMarkFailure$1.evaluate(TestRuleMarkFailure.java:47)
	at com.carrotsearch.randomizedtesting.rules.StatementAdapter.evaluate(StatementAdapter.java:36)
	at com.carrotsearch.randomizedtesting.ThreadLeakControl$StatementRunner.run(ThreadLeakControl.java:368)
	at com.carrotsearch.randomizedtesting.ThreadLeakControl.forkTimeoutingTask(ThreadLeakControl.java:817)
	at com.carrotsearch.randomizedtesting.ThreadLeakControl$3.evaluate(ThreadLeakControl.java:468)
	at com.carrotsearch.randomizedtesting.RandomizedRunner.runSingleTest(RandomizedRunner.java:916)
	at com.carrotsearch.randomizedtesting.RandomizedRunner$5.evaluate(RandomizedRunner.java:802)
	at com.carrotsearch.randomizedtesting.RandomizedRunner$6.evaluate(RandomizedRunner.java:852)
	at com.carrotsearch.randomizedtesting.RandomizedRunner$7.evaluate(RandomizedRunner.java:863)
	at com.carrotsearch.randomizedtesting.rules.StatementAdapter.evaluate(StatementAdapter.java:36)
	at com.carrotsearch.randomizedtesting.rules.SystemPropertiesRestoreRule$1.evaluate(SystemPropertiesRestoreRule.java:57)
	at org.apache.lucene.util.AbstractBeforeAfterRule$1.evaluate(AbstractBeforeAfterRule.java:45)
	at com.carrotsearch.randomizedtesting.rules.StatementAdapter.evaluate(StatementAdapter.java:36)
	at org.apache.lucene.util.TestRuleStoreClassName$1.evaluate(TestRuleStoreClassName.java:41)
	at com.carrotsearch.randomizedtesting.rules.NoShadowingOrOverridesOnMethodsRule$1.evaluate(NoShadowingOrOverridesOnMethodsRule.java:40)
	at com.carrotsearch.randomizedtesting.rules.NoShadowingOrOverridesOnMethodsRule$1.evaluate(NoShadowingOrOverridesOnMethodsRule.java:40)
	at com.carrotsearch.randomizedtesting.rules.StatementAdapter.evaluate(StatementAdapter.java:36)
	at com.carrotsearch.randomizedtesting.rules.StatementAdapter.evaluate(StatementAdapter.java:36)
	at com.carrotsearch.randomizedtesting.rules.StatementAdapter.evaluate(StatementAdapter.java:36)
	at org.apache.lucene.util.TestRuleAssertionsRequired$1.evaluate(TestRuleAssertionsRequired.java:53)
	at org.apache.lucene.util.TestRuleMarkFailure$1.evaluate(TestRuleMarkFailure.java:47)
	at org.apache.lucene.util.TestRuleIgnoreAfterMaxFailures$1.evaluate(TestRuleIgnoreAfterMaxFailures.java:64)
	at org.apache.lucene.util.TestRuleIgnoreTestSuites$1.evaluate(TestRuleIgnoreTestSuites.java:54)
	at com.carrotsearch.randomizedtesting.rules.StatementAdapter.evaluate(StatementAdapter.java:36)
	at com.carrotsearch.randomizedtesting.ThreadLeakControl$StatementRunner.run(ThreadLeakControl.java:368)
	at java.lang.Thread.run(Thread.java:748)


FAILED:  org.apache.solr.cloud.TestStressCloudBlindAtomicUpdates.test_dv

Error Message:
java.lang.RuntimeException: Error from server at http://127.0.0.1:58968/solr/test_col: Async exception during distributed update: Error from server at http://127.0.0.1:48417/solr/test_col_shard1_replica_n1: Server Error    request: http://127.0.0.1:48417/solr/test_col_shard1_replica_n1/update?update.distrib=TOLEADER&distrib.from=http%3A%2F%2F127.0.0.1%3A58968%2Fsolr%2Ftest_col_shard5_replica_n18%2F&wt=javabin&version=2 Remote error message: Failed synchronous update on shard StdNode: http://127.0.0.1:32965/solr/test_col_shard1_replica_n2/ update: org.apache.solr.client.solrj.request.UpdateRequest@48a407b8

Stack Trace:
java.util.concurrent.ExecutionException: java.lang.RuntimeException: Error from server at http://127.0.0.1:58968/solr/test_col: Async exception during distributed update: Error from server at http://127.0.0.1:48417/solr/test_col_shard1_replica_n1: Server Error



request: http://127.0.0.1:48417/solr/test_col_shard1_replica_n1/update?update.distrib=TOLEADER&distrib.from=http%3A%2F%2F127.0.0.1%3A58968%2Fsolr%2Ftest_col_shard5_replica_n18%2F&wt=javabin&version=2
Remote error message: Failed synchronous update on shard StdNode: http://127.0.0.1:32965/solr/test_col_shard1_replica_n2/ update: org.apache.solr.client.solrj.request.UpdateRequest@48a407b8
	at __randomizedtesting.SeedInfo.seed([5E33055001FC95BA:682767168BA1AFAB]:0)
	at java.util.concurrent.FutureTask.report(FutureTask.java:122)
	at java.util.concurrent.FutureTask.get(FutureTask.java:192)
	at org.apache.solr.cloud.TestStressCloudBlindAtomicUpdates.checkField(TestStressCloudBlindAtomicUpdates.java:283)
	at org.apache.solr.cloud.TestStressCloudBlindAtomicUpdates.test_dv(TestStressCloudBlindAtomicUpdates.java:195)
	at sun.reflect.NativeMethodAccessorImpl.invoke0(Native Method)
	at sun.reflect.NativeMethodAccessorImpl.invoke(NativeMethodAccessorImpl.java:62)
	at sun.reflect.DelegatingMethodAccessorImpl.invoke(DelegatingMethodAccessorImpl.java:43)
	at java.lang.reflect.Method.invoke(Method.java:498)
	at com.carrotsearch.randomizedtesting.RandomizedRunner.invoke(RandomizedRunner.java:1713)
	at com.carrotsearch.randomizedtesting.RandomizedRunner$8.evaluate(RandomizedRunner.java:907)
	at com.carrotsearch.randomizedtesting.RandomizedRunner$9.evaluate(RandomizedRunner.java:943)
	at com.carrotsearch.randomizedtesting.RandomizedRunner$10.evaluate(RandomizedRunner.java:957)
	at com.carrotsearch.randomizedtesting.rules.SystemPropertiesRestoreRule$1.evaluate(SystemPropertiesRestoreRule.java:57)
	at org.apache.lucene.util.TestRuleSetupTeardownChained$1.evaluate(TestRuleSetupTeardownChained.java:49)
	at org.apache.lucene.util.AbstractBeforeAfterRule$1.evaluate(AbstractBeforeAfterRule.java:45)
	at org.apache.lucene.util.TestRuleThreadAndTestName$1.evaluate(TestRuleThreadAndTestName.java:48)
	at org.apache.lucene.util.TestRuleIgnoreAfterMaxFailures$1.evaluate(TestRuleIgnoreAfterMaxFailures.java:64)
	at org.apache.lucene.util.TestRuleMarkFailure$1.evaluate(TestRuleMarkFailure.java:47)
	at com.carrotsearch.randomizedtesting.rules.StatementAdapter.evaluate(StatementAdapter.java:36)
	at com.carrotsearch.randomizedtesting.ThreadLeakControl$StatementRunner.run(ThreadLeakControl.java:368)
	at com.carrotsearch.randomizedtesting.ThreadLeakControl.forkTimeoutingTask(ThreadLeakControl.java:817)
	at com.carrotsearch.randomizedtesting.ThreadLeakControl$3.evaluate(ThreadLeakControl.java:468)
	at com.carrotsearch.randomizedtesting.RandomizedRunner.runSingleTest(RandomizedRunner.java:916)
	at com.carrotsearch.randomizedtesting.RandomizedRunner$5.evaluate(RandomizedRunner.java:802)
	at com.carrotsearch.randomizedtesting.RandomizedRunner$6.evaluate(RandomizedRunner.java:852)
	at com.carrotsearch.randomizedtesting.RandomizedRunner$7.evaluate(RandomizedRunner.java:863)
	at com.carrotsearch.randomizedtesting.rules.StatementAdapter.evaluate(StatementAdapter.java:36)
	at com.carrotsearch.randomizedtesting.rules.SystemPropertiesRestoreRule$1.evaluate(SystemPropertiesRestoreRule.java:57)
	at org.apache.lucene.util.AbstractBeforeAfterRule$1.evaluate(AbstractBeforeAfterRule.java:45)
	at com.carrotsearch.randomizedtesting.rules.StatementAdapter.evaluate(StatementAdapter.java:36)
	at org.apache.lucene.util.TestRuleStoreClassName$1.evaluate(TestRuleStoreClassName.java:41)
	at com.carrotsearch.randomizedtesting.rules.NoShadowingOrOverridesOnMethodsRule$1.evaluate(NoShadowingOrOverridesOnMethodsRule.java:40)
	at com.carrotsearch.randomizedtesting.rules.NoShadowingOrOverridesOnMethodsRule$1.evaluate(NoShadowingOrOverridesOnMethodsRule.java:40)
	at com.carrotsearch.randomizedtesting.rules.StatementAdapter.evaluate(StatementAdapter.java:36)
	at com.carrotsearch.randomizedtesting.rules.StatementAdapter.evaluate(StatementAdapter.java:36)
	at com.carrotsearch.randomizedtesting.rules.StatementAdapter.evaluate(StatementAdapter.java:36)
	at org.apache.lucene.util.TestRuleAssertionsRequired$1.evaluate(TestRuleAssertionsRequired.java:53)
	at org.apache.lucene.util.TestRuleMarkFailure$1.evaluate(TestRuleMarkFailure.java:47)
	at org.apache.lucene.util.TestRuleIgnoreAfterMaxFailures$1.evaluate(TestRuleIgnoreAfterMaxFailures.java:64)
	at org.apache.lucene.util.TestRuleIgnoreTestSuites$1.evaluate(TestRuleIgnoreTestSuites.java:54)
	at com.carrotsearch.randomizedtesting.rules.StatementAdapter.evaluate(StatementAdapter.java:36)
	at com.carrotsearch.randomizedtesting.ThreadLeakControl$StatementRunner.run(ThreadLeakControl.java:368)
	at java.lang.Thread.run(Thread.java:748)
Caused by: java.lang.RuntimeException: Error from server at http://127.0.0.1:58968/solr/test_col: Async exception during distributed update: Error from server at http://127.0.0.1:48417/solr/test_col_shard1_replica_n1: Server Error



request: http://127.0.0.1:48417/solr/test_col_shard1_replica_n1/update?update.distrib=TOLEADER&distrib.from=http%3A%2F%2F127.0.0.1%3A58968%2Fsolr%2Ftest_col_shard5_replica_n18%2F&wt=javabin&version=2
Remote error message: Failed synchronous update on shard StdNode: http://127.0.0.1:32965/solr/test_col_shard1_replica_n2/ update: org.apache.solr.client.solrj.request.UpdateRequest@48a407b8
	at org.apache.solr.cloud.TestStressCloudBlindAtomicUpdates$Worker.run(TestStressCloudBlindAtomicUpdates.java:411)
	at java.util.concurrent.Executors$RunnableAdapter.call(Executors.java:511)
	at java.util.concurrent.FutureTask.run(FutureTask.java:266)
	at org.apache.solr.common.util.ExecutorUtil$MDCAwareThreadPoolExecutor.lambda$execute$0(ExecutorUtil.java:188)
	at java.util.concurrent.ThreadPoolExecutor.runWorker(ThreadPoolExecutor.java:1149)
	at java.util.concurrent.ThreadPoolExecutor$Worker.run(ThreadPoolExecutor.java:624)
	... 1 more
Caused by: org.apache.solr.client.solrj.impl.HttpSolrClient$RemoteSolrException: Error from server at http://127.0.0.1:58968/solr/test_col: Async exception during distributed update: Error from server at http://127.0.0.1:48417/solr/test_col_shard1_replica_n1: Server Error



request: http://127.0.0.1:48417/solr/test_col_shard1_replica_n1/update?update.distrib=TOLEADER&distrib.from=http%3A%2F%2F127.0.0.1%3A58968%2Fsolr%2Ftest_col_shard5_replica_n18%2F&wt=javabin&version=2
Remote error message: Failed synchronous update on shard StdNode: http://127.0.0.1:32965/solr/test_col_shard1_replica_n2/ update: org.apache.solr.client.solrj.request.UpdateRequest@48a407b8
	at org.apache.solr.client.solrj.impl.HttpSolrClient.executeMethod(HttpSolrClient.java:627)
	at org.apache.solr.client.solrj.impl.HttpSolrClient.request(HttpSolrClient.java:253)
	at org.apache.solr.client.solrj.impl.HttpSolrClient.request(HttpSolrClient.java:242)
	at org.apache.solr.client.solrj.SolrRequest.process(SolrRequest.java:178)
	at org.apache.solr.client.solrj.SolrRequest.process(SolrRequest.java:195)
	at org.apache.solr.cloud.TestStressCloudBlindAtomicUpdates$Worker.doRandomAtomicUpdate(TestStressCloudBlindAtomicUpdates.java:370)
	at org.apache.solr.cloud.TestStressCloudBlindAtomicUpdates$Worker.run(TestStressCloudBlindAtomicUpdates.java:399)
	... 6 more


FAILED:  org.apache.solr.handler.TestReplicationHandler.doTestReplicateAfterCoreReload

Error Message:
expected:<[{indexVersion=1502554180662,generation=2,filelist=[_nd.cfe, _nd.cfs, _nd.si, _nk.cfe, _nk.cfs, _nk.si, _nn.cfe, _nn.cfs, _nn.si, _no.cfe, _no.cfs, _no.si, _np.cfe, _np.cfs, _np.si, _nq.cfe, _nq.cfs, _nq.si, _nr.cfe, _nr.cfs, _nr.si, _nt.cfe, _nt.cfs, _nt.si, _nv.cfe, _nv.cfs, _nv.si, _nw.cfe, _nw.cfs, _nw.si, _nx.cfe, _nx.cfs, _nx.si, _nz.cfe, _nz.cfs, _nz.si, _o0.cfe, _o0.cfs, _o0.si, segments_2]}]> but was:<[{indexVersion=1502554180662,generation=2,filelist=[_nd.cfe, _nd.cfs, _nd.si, _nk.cfe, _nk.cfs, _nk.si, _nn.cfe, _nn.cfs, _nn.si, _no.cfe, _no.cfs, _no.si, _np.cfe, _np.cfs, _np.si, _nq.cfe, _nq.cfs, _nq.si, _nr.cfe, _nr.cfs, _nr.si, _nt.cfe, _nt.cfs, _nt.si, _nv.cfe, _nv.cfs, _nv.si, _nw.cfe, _nw.cfs, _nw.si, _nx.cfe, _nx.cfs, _nx.si, _nz.cfe, _nz.cfs, _nz.si, _o0.cfe, _o0.cfs, _o0.si, segments_2]}, {indexVersion=1502554180662,generation=3,filelist=[_nk.cfe, _nk.cfs, _nk.si, _nr.cfe, _nr.cfs, _nr.si, _nt.cfe, _nt.cfs, _nt.si, _nx.cfe, _nx.cfs, _nx.si, _o0.cfe, _o0.cfs, _o0.si, _o1.cfe, _o1.cfs, _o1.si, segments_3]}]>

Stack Trace:
java.lang.AssertionError: expected:<[{indexVersion=1502554180662,generation=2,filelist=[_nd.cfe, _nd.cfs, _nd.si, _nk.cfe, _nk.cfs, _nk.si, _nn.cfe, _nn.cfs, _nn.si, _no.cfe, _no.cfs, _no.si, _np.cfe, _np.cfs, _np.si, _nq.cfe, _nq.cfs, _nq.si, _nr.cfe, _nr.cfs, _nr.si, _nt.cfe, _nt.cfs, _nt.si, _nv.cfe, _nv.cfs, _nv.si, _nw.cfe, _nw.cfs, _nw.si, _nx.cfe, _nx.cfs, _nx.si, _nz.cfe, _nz.cfs, _nz.si, _o0.cfe, _o0.cfs, _o0.si, segments_2]}]> but was:<[{indexVersion=1502554180662,generation=2,filelist=[_nd.cfe, _nd.cfs, _nd.si, _nk.cfe, _nk.cfs, _nk.si, _nn.cfe, _nn.cfs, _nn.si, _no.cfe, _no.cfs, _no.si, _np.cfe, _np.cfs, _np.si, _nq.cfe, _nq.cfs, _nq.si, _nr.cfe, _nr.cfs, _nr.si, _nt.cfe, _nt.cfs, _nt.si, _nv.cfe, _nv.cfs, _nv.si, _nw.cfe, _nw.cfs, _nw.si, _nx.cfe, _nx.cfs, _nx.si, _nz.cfe, _nz.cfs, _nz.si, _o0.cfe, _o0.cfs, _o0.si, segments_2]}, {indexVersion=1502554180662,generation=3,filelist=[_nk.cfe, _nk.cfs, _nk.si, _nr.cfe, _nr.cfs, _nr.si, _nt.cfe, _nt.cfs, _nt.si, _nx.cfe, _nx.cfs, _nx.si, _o0.cfe, _o0.cfs, _o0.si, _o1.cfe, _o1.cfs, _o1.si, segments_3]}]>
	at __randomizedtesting.SeedInfo.seed([5E33055001FC95BA:7BE41E6071B49BB9]:0)
	at org.junit.Assert.fail(Assert.java:93)
	at org.junit.Assert.failNotEquals(Assert.java:647)
	at org.junit.Assert.assertEquals(Assert.java:128)
	at org.junit.Assert.assertEquals(Assert.java:147)
	at org.apache.solr.handler.TestReplicationHandler.doTestReplicateAfterCoreReload(TestReplicationHandler.java:1277)
	at sun.reflect.NativeMethodAccessorImpl.invoke0(Native Method)
	at sun.reflect.NativeMethodAccessorImpl.invoke(NativeMethodAccessorImpl.java:62)
	at sun.reflect.DelegatingMethodAccessorImpl.invoke(DelegatingMethodAccessorImpl.java:43)
	at java.lang.reflect.Method.invoke(Method.java:498)
	at com.carrotsearch.randomizedtesting.RandomizedRunner.invoke(RandomizedRunner.java:1713)
	at com.carrotsearch.randomizedtesting.RandomizedRunner$8.evaluate(RandomizedRunner.java:907)
	at com.carrotsearch.randomizedtesting.RandomizedRunner$9.evaluate(RandomizedRunner.java:943)
	at com.carrotsearch.randomizedtesting.RandomizedRunner$10.evaluate(RandomizedRunner.java:957)
	at com.carrotsearch.randomizedtesting.rules.SystemPropertiesRestoreRule$1.evaluate(SystemPropertiesRestoreRule.java:57)
	at org.apache.lucene.util.TestRuleSetupTeardownChained$1.evaluate(TestRuleSetupTeardownChained.java:49)
	at org.apache.lucene.util.AbstractBeforeAfterRule$1.evaluate(AbstractBeforeAfterRule.java:45)
	at org.apache.lucene.util.TestRuleThreadAndTestName$1.evaluate(TestRuleThreadAndTestName.java:48)
	at org.apache.lucene.util.TestRuleIgnoreAfterMaxFailures$1.evaluate(TestRuleIgnoreAfterMaxFailures.java:64)
	at org.apache.lucene.util.TestRuleMarkFailure$1.evaluate(TestRuleMarkFailure.java:47)
	at com.carrotsearch.randomizedtesting.rules.StatementAdapter.evaluate(StatementAdapter.java:36)
	at com.carrotsearch.randomizedtesting.ThreadLeakControl$StatementRunner.run(ThreadLeakControl.java:368)
	at com.carrotsearch.randomizedtesting.ThreadLeakControl.forkTimeoutingTask(ThreadLeakControl.java:817)
	at com.carrotsearch.randomizedtesting.ThreadLeakControl$3.evaluate(ThreadLeakControl.java:468)
	at com.carrotsearch.randomizedtesting.RandomizedRunner.runSingleTest(RandomizedRunner.java:916)
	at com.carrotsearch.randomizedtesting.RandomizedRunner$5.evaluate(RandomizedRunner.java:802)
	at com.carrotsearch.randomizedtesting.RandomizedRunner$6.evaluate(RandomizedRunner.java:852)
	at com.carrotsearch.randomizedtesting.RandomizedRunner$7.evaluate(RandomizedRunner.java:863)
	at com.carrotsearch.randomizedtesting.rules.StatementAdapter.evaluate(StatementAdapter.java:36)
	at com.carrotsearch.randomizedtesting.rules.SystemPropertiesRestoreRule$1.evaluate(SystemPropertiesRestoreRule.java:57)
	at org.apache.lucene.util.AbstractBeforeAfterRule$1.evaluate(AbstractBeforeAfterRule.java:45)
	at com.carrotsearch.randomizedtesting.rules.StatementAdapter.evaluate(StatementAdapter.java:36)
	at org.apache.lucene.util.TestRuleStoreClassName$1.evaluate(TestRuleStoreClassName.java:41)
	at com.carrotsearch.randomizedtesting.rules.NoShadowingOrOverridesOnMethodsRule$1.evaluate(NoShadowingOrOverridesOnMethodsRule.java:40)
	at com.carrotsearch.randomizedtesting.rules.NoShadowingOrOverridesOnMethodsRule$1.evaluate(NoShadowingOrOverridesOnMethodsRule.java:40)
	at com.carrotsearch.randomizedtesting.rules.StatementAdapter.evaluate(StatementAdapter.java:36)
	at com.carrotsearch.randomizedtesting.rules.StatementAdapter.evaluate(StatementAdapter.java:36)
	at com.carrotsearch.randomizedtesting.rules.StatementAdapter.evaluate(StatementAdapter.java:36)
	at org.apache.lucene.util.TestRuleAssertionsRequired$1.evaluate(TestRuleAssertionsRequired.java:53)
	at org.apache.lucene.util.TestRuleMarkFailure$1.evaluate(TestRuleMarkFailure.java:47)
	at org.apache.lucene.util.TestRuleIgnoreAfterMaxFailures$1.evaluate(TestRuleIgnoreAfterMaxFailures.java:64)
	at org.apache.lucene.util.TestRuleIgnoreTestSuites$1.evaluate(TestRuleIgnoreTestSuites.java:54)
	at com.carrotsearch.randomizedtesting.rules.StatementAdapter.evaluate(StatementAdapter.java:36)
	at com.carrotsearch.randomizedtesting.ThreadLeakControl$StatementRunner.run(ThreadLeakControl.java:368)
	at java.lang.Thread.run(Thread.java:748)


FAILED:  org.apache.solr.cloud.SharedFSAutoReplicaFailoverTest.test

Error Message:
Timeout waiting for all live and active

Stack Trace:
java.lang.AssertionError: Timeout waiting for all live and active
	at __randomizedtesting.SeedInfo.seed([5E33055001FC95BA:D6673A8AAF00F842]:0)
	at org.junit.Assert.fail(Assert.java:93)
	at org.junit.Assert.assertTrue(Assert.java:43)
	at org.apache.solr.cloud.SharedFSAutoReplicaFailoverTest.testBasics(SharedFSAutoReplicaFailoverTest.java:317)
	at org.apache.solr.cloud.SharedFSAutoReplicaFailoverTest.test(SharedFSAutoReplicaFailoverTest.java:136)
	at sun.reflect.NativeMethodAccessorImpl.invoke0(Native Method)
	at sun.reflect.NativeMethodAccessorImpl.invoke(NativeMethodAccessorImpl.java:62)
	at sun.reflect.DelegatingMethodAccessorImpl.invoke(DelegatingMethodAccessorImpl.java:43)
	at java.lang.reflect.Method.invoke(Method.java:498)
	at com.carrotsearch.randomizedtesting.RandomizedRunner.invoke(RandomizedRunner.java:1713)
	at com.carrotsearch.randomizedtesting.RandomizedRunner$8.evaluate(RandomizedRunner.java:907)
	at com.carrotsearch.randomizedtesting.RandomizedRunner$9.evaluate(RandomizedRunner.java:943)
	at com.carrotsearch.randomizedtesting.RandomizedRunner$10.evaluate(RandomizedRunner.java:957)
	at org.apache.solr.BaseDistributedSearchTestCase$ShardsRepeatRule$ShardsFixedStatement.callStatement(BaseDistributedSearchTestCase.java:993)
	at org.apache.solr.BaseDistributedSearchTestCase$ShardsRepeatRule$ShardsStatement.evaluate(BaseDistributedSearchTestCase.java:968)
	at com.carrotsearch.randomizedtesting.rules.SystemPropertiesRestoreRule$1.evaluate(SystemPropertiesRestoreRule.java:57)
	at org.apache.lucene.util.TestRuleSetupTeardownChained$1.evaluate(TestRuleSetupTeardownChained.java:49)
	at org.apache.lucene.util.AbstractBeforeAfterRule$1.evaluate(AbstractBeforeAfterRule.java:45)
	at org.apache.lucene.util.TestRuleThreadAndTestName$1.evaluate(TestRuleThreadAndTestName.java:48)
	at org.apache.lucene.util.TestRuleIgnoreAfterMaxFailures$1.evaluate(TestRuleIgnoreAfterMaxFailures.java:64)
	at org.apache.lucene.util.TestRuleMarkFailure$1.evaluate(TestRuleMarkFailure.java:47)
	at com.carrotsearch.randomizedtesting.rules.StatementAdapter.evaluate(StatementAdapter.java:36)
	at com.carrotsearch.randomizedtesting.ThreadLeakControl$StatementRunner.run(ThreadLeakControl.java:368)
	at com.carrotsearch.randomizedtesting.ThreadLeakControl.forkTimeoutingTask(ThreadLeakControl.java:817)
	at com.carrotsearch.randomizedtesting.ThreadLeakControl$3.evaluate(ThreadLeakControl.java:468)
	at com.carrotsearch.randomizedtesting.RandomizedRunner.runSingleTest(RandomizedRunner.java:916)
	at com.carrotsearch.randomizedtesting.RandomizedRunner$5.evaluate(RandomizedRunner.java:802)
	at com.carrotsearch.randomizedtesting.RandomizedRunner$6.evaluate(RandomizedRunner.java:852)
	at com.carrotsearch.randomizedtesting.RandomizedRunner$7.evaluate(RandomizedRunner.java:863)
	at com.carrotsearch.randomizedtesting.rules.StatementAdapter.evaluate(StatementAdapter.java:36)
	at com.carrotsearch.randomizedtesting.rules.SystemPropertiesRestoreRule$1.evaluate(SystemPropertiesRestoreRule.java:57)
	at org.apache.lucene.util.AbstractBeforeAfterRule$1.evaluate(AbstractBeforeAfterRule.java:45)
	at com.carrotsearch.randomizedtesting.rules.StatementAdapter.evaluate(StatementAdapter.java:36)
	at org.apache.lucene.util.TestRuleStoreClassName$1.evaluate(TestRuleStoreClassName.java:41)
	at com.carrotsearch.randomizedtesting.rules.NoShadowingOrOverridesOnMethodsRule$1.evaluate(NoShadowingOrOverridesOnMethodsRule.java:40)
	at com.carrotsearch.randomizedtesting.rules.NoShadowingOrOverridesOnMethodsRule$1.evaluate(NoShadowingOrOverridesOnMethodsRule.java:40)
	at com.carrotsearch.randomizedtesting.rules.StatementAdapter.evaluate(StatementAdapter.java:36)
	at com.carrotsearch.randomizedtesting.rules.StatementAdapter.evaluate(StatementAdapter.java:36)
	at com.carrotsearch.randomizedtesting.rules.StatementAdapter.evaluate(StatementAdapter.java:36)
	at org.apache.lucene.util.TestRuleAssertionsRequired$1.evaluate(TestRuleAssertionsRequired.java:53)
	at org.apache.lucene.util.TestRuleMarkFailure$1.evaluate(TestRuleMarkFailure.java:47)
	at org.apache.lucene.util.TestRuleIgnoreAfterMaxFailures$1.evaluate(TestRuleIgnoreAfterMaxFailures.java:64)
	at org.apache.lucene.util.TestRuleIgnoreTestSuites$1.evaluate(TestRuleIgnoreTestSuites.java:54)
	at com.carrotsearch.randomizedtesting.rules.StatementAdapter.evaluate(StatementAdapter.java:36)
	at com.carrotsearch.randomizedtesting.ThreadLeakControl$StatementRunner.run(ThreadLeakControl.java:368)
	at java.lang.Thread.run(Thread.java:748)




Build Log:
[...truncated 11696 lines...]
   [junit4] Suite: org.apache.solr.handler.TestReplicationHandler
   [junit4]   2> Creating dataDir: /x1/jenkins/jenkins-slave/workspace/Lucene-Solr-NightlyTests-master/checkout/solr/build/solr-core/test/J0/temp/solr.handler.TestReplicationHandler_5E33055001FC95BA-001/init-core-data-001
   [junit4]   2> 401831 WARN  (SUITE-TestReplicationHandler-seed#[5E33055001FC95BA]-worker) [    ] o.a.s.SolrTestCaseJ4 startTrackingSearchers: numOpens=21 numCloses=21
   [junit4]   2> 401831 INFO  (SUITE-TestReplicationHandler-seed#[5E33055001FC95BA]-worker) [    ] o.a.s.SolrTestCaseJ4 Using PointFields (NUMERIC_POINTS_SYSPROP=true) w/NUMERIC_DOCVALUES_SYSPROP=false
   [junit4]   2> 401850 INFO  (SUITE-TestReplicationHandler-seed#[5E33055001FC95BA]-worker) [    ] o.a.s.SolrTestCaseJ4 Randomized ssl (false) and clientAuth (false) via: @org.apache.solr.SolrTestCaseJ4$SuppressSSL(bugUrl=None)
   [junit4]   2> 401850 INFO  (SUITE-TestReplicationHandler-seed#[5E33055001FC95BA]-worker) [    ] o.a.s.SolrTestCaseJ4 SecureRandom sanity checks: test.solr.allowed.securerandom=null & java.security.egd=file:/dev/./urandom
   [junit4]   2> 401852 INFO  (TEST-TestReplicationHandler.doTestDetails-seed#[5E33055001FC95BA]) [    ] o.a.s.SolrTestCaseJ4 ###Starting doTestDetails
   [junit4]   2> 401853 INFO  (TEST-TestReplicationHandler.doTestDetails-seed#[5E33055001FC95BA]) [    ] o.a.s.SolrTestCaseJ4 Writing core.properties file to /x1/jenkins/jenkins-slave/workspace/Lucene-Solr-NightlyTests-master/checkout/solr/build/solr-core/test/J0/temp/solr.handler.TestReplicationHandler_5E33055001FC95BA-001/solr-instance-001/collection1
   [junit4]   2> 401855 INFO  (TEST-TestReplicationHandler.doTestDetails-seed#[5E33055001FC95BA]) [    ] o.e.j.s.Server jetty-9.3.14.v20161028
   [junit4]   2> 401856 INFO  (TEST-TestReplicationHandler.doTestDetails-seed#[5E33055001FC95BA]) [    ] o.e.j.s.h.ContextHandler Started o.e.j.s.ServletContextHandler@6ecf675{/solr,null,AVAILABLE}
   [junit4]   2> 401857 INFO  (TEST-TestReplicationHandler.doTestDetails-seed#[5E33055001FC95BA]) [    ] o.e.j.s.AbstractConnector Started ServerConnector@7f43357a{HTTP/1.1,[http/1.1]}{127.0.0.1:55235}
   [junit4]   2> 401858 INFO  (TEST-TestReplicationHandler.doTestDetails-seed#[5E33055001FC95BA]) [    ] o.e.j.s.Server Started @405137ms
   [junit4]   2> 401858 INFO  (TEST-TestReplicationHandler.doTestDetails-seed#[5E33055001FC95BA]) [    ] o.a.s.c.s.e.JettySolrRunner Jetty properties: {solr.data.dir=/x1/jenkins/jenkins-slave/workspace/Lucene-Solr-NightlyTests-master/checkout/solr/build/solr-core/test/J0/temp/solr.handler.TestReplicationHandler_5E33055001FC95BA-001/solr-instance-001/collection1/data, hostContext=/solr, hostPort=55235}
   [junit4]   2> 401858 ERROR (TEST-TestReplicationHandler.doTestDetails-seed#[5E33055001FC95BA]) [    ] o.a.s.s.StartupLoggingUtils Missing Java Option solr.log.dir. Logging may be missing or incomplete.
   [junit4]   2> 401858 INFO  (TEST-TestReplicationHandler.doTestDetails-seed#[5E33055001FC95BA]) [    ] o.a.s.s.SolrDispatchFilter  ___      _       Welcome to Apache Solr™ version 8.0.0
   [junit4]   2> 401858 INFO  (TEST-TestReplicationHandler.doTestDetails-seed#[5E33055001FC95BA]) [    ] o.a.s.s.SolrDispatchFilter / __| ___| |_ _   Starting in standalone mode on port null
   [junit4]   2> 401858 INFO  (TEST-TestReplicationHandler.doTestDetails-seed#[5E33055001FC95BA]) [    ] o.a.s.s.SolrDispatchFilter \__ \/ _ \ | '_|  Install dir: null, Default config dir: null
   [junit4]   2> 401858 INFO  (TEST-TestReplicationHandler.doTestDetails-seed#[5E33055001FC95BA]) [    ] o.a.s.s.SolrDispatchFilter |___/\___/_|_|    Start time: 2017-08-12T16:07:24.406Z
   [junit4]   2> 401858 INFO  (TEST-TestReplicationHandler.doTestDetails-seed#[5E33055001FC95BA]) [    ] o.a.s.c.SolrXmlConfig Loading container configuration from /x1/jenkins/jenkins-slave/workspace/Lucene-Solr-NightlyTests-master/checkout/solr/build/solr-core/test/J0/temp/solr.handler.TestReplicationHandler_5E33055001FC95BA-001/solr-instance-001/solr.xml
   [junit4]   2> 401869 INFO  (TEST-TestReplicationHandler.doTestDetails-seed#[5E33055001FC95BA]) [    ] o.a.s.c.SolrXmlConfig MBean server found: com.sun.jmx.mbeanserver.JmxMBeanServer@3383e024, but no JMX reporters were configured - adding default JMX reporter.
   [junit4]   2> 401900 INFO  (TEST-TestReplicationHandler.doTestDetails-seed#[5E33055001FC95BA]) [    ] o.a.s.m.r.SolrJmxReporter JMX monitoring for 'solr.node' (registry 'solr.node') enabled at server: com.sun.jmx.mbeanserver.JmxMBeanServer@3383e024
   [junit4]   2> 401903 INFO  (TEST-TestReplicationHandler.doTestDetails-seed#[5E33055001FC95BA]) [    ] o.a.s.m.r.SolrJmxReporter JMX monitoring for 'solr.jvm' (registry 'solr.jvm') enabled at server: com.sun.jmx.mbeanserver.JmxMBeanServer@3383e024
   [junit4]   2> 401903 INFO  (TEST-TestReplicationHandler.doTestDetails-seed#[5E33055001FC95BA]) [    ] o.a.s.m.r.SolrJmxReporter JMX monitoring for 'solr.jetty' (registry 'solr.jetty') enabled at server: com.sun.jmx.mbeanserver.JmxMBeanServer@3383e024
   [junit4]   2> 401905 INFO  (TEST-TestReplicationHandler.doTestDetails-seed#[5E33055001FC95BA]) [    ] o.a.s.c.CorePropertiesLocator Found 1 core definitions underneath /x1/jenkins/jenkins-slave/workspace/Lucene-Solr-NightlyTests-master/checkout/solr/build/solr-core/test/J0/temp/solr.handler.TestReplicationHandler_5E33055001FC95BA-001/solr-instance-001/.
   [junit4]   2> 401905 INFO  (TEST-TestReplicationHandler.doTestDetails-seed#[5E33055001FC95BA]) [    ] o.a.s.c.CorePropertiesLocator Cores are: [collection1]
   [junit4]   2> 401929 INFO  (coreLoadExecutor-1079-thread-1) [    x:collection1] o.a.s.c.SolrConfig Using Lucene MatchVersion: 8.0.0
   [junit4]   2> 401936 INFO  (coreLoadExecutor-1079-thread-1) [    x:collection1] o.a.s.s.IndexSchema [collection1] Schema name=test
   [junit4]   2> 401938 INFO  (coreLoadExecutor-1079-thread-1) [    x:collection1] o.a.s.s.IndexSchema Loaded schema test/1.2 with uniqueid field id
   [junit4]   2> 401938 INFO  (coreLoadExecutor-1079-thread-1) [    x:collection1] o.a.s.c.CoreContainer Creating SolrCore 'collection1' using configuration from instancedir /x1/jenkins/jenkins-slave/workspace/Lucene-Solr-NightlyTests-master/checkout/solr/build/solr-core/test/J0/temp/solr.handler.TestReplicationHandler_5E33055001FC95BA-001/solr-instance-001/./collection1, trusted=true
   [junit4]   2> 401938 INFO  (coreLoadExecutor-1079-thread-1) [    x:collection1] o.a.s.m.r.SolrJmxReporter JMX monitoring for 'solr.core.collection1' (registry 'solr.core.collection1') enabled at server: com.sun.jmx.mbeanserver.JmxMBeanServer@3383e024
   [junit4]   2> 401938 INFO  (coreLoadExecutor-1079-thread-1) [    x:collection1] o.a.s.c.SolrCore solr.RecoveryStrategy.Builder
   [junit4]   2> 401938 INFO  (coreLoadExecutor-1079-thread-1) [    x:collection1] o.a.s.c.SolrCore [[collection1] ] Opening new SolrCore at [/x1/jenkins/jenkins-slave/workspace/Lucene-Solr-NightlyTests-master/checkout/solr/build/solr-core/test/J0/temp/solr.handler.TestReplicationHandler_5E33055001FC95BA-001/solr-instance-001/collection1], dataDir=[/x1/jenkins/jenkins-slave/workspace/Lucene-Solr-NightlyTests-master/checkout/solr/build/solr-core/test/J0/temp/solr.handler.TestReplicationHandler_5E33055001FC95BA-001/solr-instance-001/./collection1/data/]
   [junit4]   2> 401940 INFO  (coreLoadExecutor-1079-thread-1) [    x:collection1] o.a.s.u.RandomMergePolicy RandomMergePolicy wrapping class org.apache.lucene.index.LogByteSizeMergePolicy: [LogByteSizeMergePolicy: minMergeSize=1677721, mergeFactor=35, maxMergeSize=2147483648, maxMergeSizeForForcedMerge=9223372036854775807, calibrateSizeByDeletes=false, maxMergeDocs=2147483647, maxCFSSegmentSizeMB=8.796093022207999E12, noCFSRatio=1.0]
   [junit4]   2> 401992 INFO  (coreLoadExecutor-1079-thread-1) [    x:collection1] o.a.s.u.CommitTracker Hard AutoCommit: disabled
   [junit4]   2> 401992 INFO  (coreLoadExecutor-1079-thread-1) [    x:collection1] o.a.s.u.CommitTracker Soft AutoCommit: disabled
   [junit4]   2> 401992 INFO  (coreLoadExecutor-1079-thread-1) [    x:collection1] o.a.s.u.RandomMergePolicy RandomMergePolicy wrapping class org.apache.lucene.index.MockRandomMergePolicy: org.apache.lucene.index.MockRandomMergePolicy@313477e7
   [junit4]   2> 401993 INFO  (coreLoadExecutor-1079-thread-1) [    x:collection1] o.a.s.s.SolrIndexSearcher Opening [Searcher@5e943030[collection1] main]
   [junit4]   2> 401993 INFO  (coreLoadExecutor-1079-thread-1) [    x:collection1] o.a.s.r.ManagedResourceStorage File-based storage initialized to use dir: /x1/jenkins/jenkins-slave/workspace/Lucene-Solr-NightlyTests-master/checkout/solr/build/solr-core/test/J0/temp/solr.handler.TestReplicationHandler_5E33055001FC95BA-001/solr-instance-001/collection1/conf
   [junit4]   2> 401994 INFO  (coreLoadExecutor-1079-thread-1) [    x:collection1] o.a.s.h.ReplicationHandler Replication enabled for following config files: schema.xml,xslt/dummy.xsl
   [junit4]   2> 401994 INFO  (coreLoadExecutor-1079-thread-1) [    x:collection1] o.a.s.h.ReplicationHandler Commits will be reserved for  10000
   [junit4]   2> 401995 INFO  (searcherExecutor-1080-thread-1-processing-x:collection1) [    x:collection1] o.a.s.c.SolrCore [collection1] Registered new searcher Searcher@5e943030[collection1] main{ExitableDirectoryReader(UninvertingDirectoryReader())}
   [junit4]   2> 402451 INFO  (TEST-TestReplicationHandler.doTestDetails-seed#[5E33055001FC95BA]) [    ] o.a.s.SolrTestCaseJ4 Writing core.properties file to /x1/jenkins/jenkins-slave/workspace/Lucene-Solr-NightlyTests-master/checkout/solr/build/solr-core/test/J0/temp/solr.handler.TestReplicationHandler_5E33055001FC95BA-001/solr-instance-002/collection1
   [junit4]   2> 402454 INFO  (TEST-TestReplicationHandler.doTestDetails-seed#[5E33055001FC95BA]) [    ] o.e.j.s.Server jetty-9.3.14.v20161028
   [junit4]   2> 402455 INFO  (TEST-TestReplicationHandler.doTestDetails-seed#[5E33055001FC95BA]) [    ] o.e.j.s.h.ContextHandler Started o.e.j.s.ServletContextHandler@2b6eb212{/solr,null,AVAILABLE}
   [junit4]   2> 402455 INFO  (TEST-TestReplicationHandler.doTestDetails-seed#[5E33055001FC95BA]) [    ] o.e.j.s.AbstractConnector Started ServerConnector@fdb761f{HTTP/1.1,[http/1.1]}{127.0.0.1:44083}
   [junit4]   2> 402455 INFO  (TEST-TestReplicationHandler.doTestDetails-seed#[5E33055001FC95BA]) [    ] o.e.j.s.Server Started @405735ms
   [junit4]   2> 402455 INFO  (TEST-TestReplicationHandler.doTestDetails-seed#[5E33055001FC95BA]) [    ] o.a.s.c.s.e.JettySolrRunner Jetty properties: {solr.data.dir=/x1/jenkins/jenkins-slave/workspace/Lucene-Solr-NightlyTests-master/checkout/solr/build/solr-core/test/J0/temp/solr.handler.TestReplicationHandler_5E33055001FC95BA-001/solr-instance-002/collection1/data, hostContext=/solr, hostPort=44083}
   [junit4]   2> 402455 ERROR (TEST-TestReplicationHandler.doTestDetails-seed#[5E33055001FC95BA]) [    ] o.a.s.s.StartupLoggingUtils Missing Java Option solr.log.dir. Logging may be missing or incomplete.
   [junit4]   2> 402455 INFO  (TEST-TestReplicationHandler.doTestDetails-seed#[5E33055001FC95BA]) [    ] o.a.s.s.SolrDispatchFilter  ___      _       Welcome to Apache Solr™ version 8.0.0
   [junit4]   2> 402455 INFO  (TEST-TestReplicationHandler.doTestDetails-seed#[5E33055001FC95BA]) [    ] o.a.s.s.SolrDispatchFilter / __| ___| |_ _   Starting in standalone mode on port null
   [junit4]   2> 402456 INFO  (TEST-TestReplicationHandler.doTestDetails-seed#[5E33055001FC95BA]) [    ] o.a.s.s.SolrDispatchFilter \__ \/ _ \ | '_|  Install dir: null, Default config dir: null
   [junit4]   2> 402456 INFO  (TEST-TestReplicationHandler.doTestDetails-seed#[5E33055001FC95BA]) [    ] o.a.s.s.SolrDispatchFilter |___/\___/_|_|    Start time: 2017-08-12T16:07:25.004Z
   [junit4]   2> 402456 INFO  (TEST-TestReplicationHandler.doTestDetails-seed#[5E33055001FC95BA]) [    ] o.a.s.c.SolrXmlConfig Loading container configuration from /x1/jenkins/jenkins-slave/workspace/Lucene-Solr-NightlyTests-master/checkout/solr/build/solr-core/test/J0/temp/solr.handler.TestReplicationHandler_5E33055001FC95BA-001/solr-instance-002/solr.xml
   [junit4]   2> 402470 INFO  (TEST-TestReplicationHandler.doTestDetails-seed#[5E33055001FC95BA]) [    ] o.a.s.c.SolrXmlConfig MBean server found: com.sun.jmx.mbeanserver.JmxMBeanServer@3383e024, but no JMX reporters were configured - adding default JMX reporter.
   [junit4]   2> 402510 INFO  (TEST-TestReplicationHandler.doTestDetails-seed#[5E33055001FC95BA]) [    ] o.a.s.m.r.SolrJmxReporter JMX monitoring for 'solr.node' (registry 'solr.node') enabled at server: com.sun.jmx.mbeanserver.JmxMBeanServer@3383e024
   [junit4]   2> 402515 INFO  (TEST-TestReplicationHandler.doTestDetails-seed#[5E33055001FC95BA]) [    ] o.a.s.m.r.SolrJmxReporter JMX monitoring for 'solr.jvm' (registry 'solr.jvm') enabled at server: com.sun.jmx.mbeanserver.JmxMBeanServer@3383e024
   [junit4]   2> 402515 INFO  (TEST-TestReplicationHandler.doTestDetails-seed#[5E33055001FC95BA]) [    ] o.a.s.m.r.SolrJmxReporter JMX monitoring for 'solr.jetty' (registry 'solr.jetty') enabled at server: com.sun.jmx.mbeanserver.JmxMBeanServer@3383e024
   [junit4]   2> 402517 INFO  (TEST-TestReplicationHandler.doTestDetails-seed#[5E33055001FC95BA]) [    ] o.a.s.c.CorePropertiesLocator Found 1 core definitions underneath /x1/jenkins/jenkins-slave/workspace/Lucene-Solr-NightlyTests-master/checkout/solr/build/solr-core/test/J0/temp/solr.handler.TestReplicationHandler_5E33055001FC95BA-001/solr-instance-002/.
   [junit4]   2> 402517 INFO  (TEST-TestReplicationHandler.doTestDetails-seed#[5E33055001FC95BA]) [    ] o.a.s.c.CorePropertiesLocator Cores are: [collection1]
   [junit4]   2> 402527 INFO  (coreLoadExecutor-1089-thread-1) [    x:collection1] o.a.s.c.SolrConfig Using Lucene MatchVersion: 8.0.0
   [junit4]   2> 402535 INFO  (coreLoadExecutor-1089-thread-1) [    x:collection1] o.a.s.s.IndexSchema [collection1] Schema name=test
   [junit4]   2> 402537 INFO  (coreLoadExecutor-1089-thread-1) [    x:collection1] o.a.s.s.IndexSchema Loaded schema test/1.2 with uniqueid field id
   [junit4]   2> 402537 INFO  (coreLoadExecutor-1089-thread-1) [    x:collection1] o.a.s.c.CoreContainer Creating SolrCore 'collection1' using configuration from instancedir /x1/jenkins/jenkins-slave/workspace/Lucene-Solr-NightlyTests-master/checkout/solr/build/solr-core/test/J0/temp/solr.handler.TestReplicationHandler_5E33055001FC95BA-001/solr-instance-002/./collection1, trusted=true
   [junit4]   2> 402537 INFO  (coreLoadExecutor-1089-thread-1) [    x:collection1] o.a.s.m.r.SolrJmxReporter JMX monitoring for 'solr.core.collection1' (registry 'solr.core.collection1') enabled at server: com.sun.jmx.mbeanserver.JmxMBeanServer@3383e024
   [junit4]   2> 402537 INFO  (coreLoadExecutor-1089-thread-1) [    x:collection1] o.a.s.c.SolrCore solr.RecoveryStrategy.Builder
   [junit4]   2> 402538 INFO  (coreLoadExecutor-1089-thread-1) [    x:collection1] o.a.s.c.SolrCore [[collection1] ] Opening new SolrCore at [/x1/jenkins/jenkins-slave/workspace/Lucene-Solr-NightlyTests-master/checkout/solr/build/solr-core/test/J0/temp/solr.handler.TestReplicationHandler_5E33055001FC95BA-001/solr-instance-002/collection1], dataDir=[/x1/jenkins/jenkins-slave/workspace/Lucene-Solr-NightlyTests-master/checkout/solr/build/solr-core/test/J0/temp/solr.handler.TestReplicationHandler_5E33055001FC95BA-001/solr-instance-002/./collection1/data/]
   [junit4]   2> 402543 INFO  (coreLoadExecutor-1089-thread-1) [    x:collection1] o.a.s.u.RandomMergePolicy RandomMergePolicy wrapping class org.apache.lucene.index.LogByteSizeMergePolicy: [LogByteSizeMergePolicy: minMergeSize=1677721, mergeFactor=35, maxMergeSize=2147483648, maxMergeSizeForForcedMerge=9223372036854775807, calibrateSizeByDeletes=false, maxMergeDocs=2147483647, maxCFSSegmentSizeMB=8.796093022207999E12, noCFSRatio=1.0]
   [junit4]   2> 402661 INFO  (coreLoadExecutor-1089-thread-1) [    x:collection1] o.a.s.u.CommitTracker Hard AutoCommit: disabled
   [junit4]   2> 402661 INFO  (coreLoadExecutor-1089-thread-1) [    x:collection1] o.a.s.u.CommitTracker Soft AutoCommit: disabled
   [junit4]   2> 402662 INFO  (coreLoadExecutor-1089-thread-1) [    x:collection1] o.a.s.u.RandomMergePolicy RandomMergePolicy wrapping class org.apache.lucene.index.MockRandomMergePolicy: org.apache.lucene.index.MockRandomMergePolicy@790536cd
   [junit4]   2> 402662 INFO  (coreLoadExecutor-1089-thread-1) [    x:collection1] o.a.s.s.SolrIndexSearcher Opening [Searcher@6d20d9ef[collection1] main]
   [junit4]   2> 402662 INFO  (coreLoadExecutor-1089-thread-1) [    x:collection1] o.a.s.r.ManagedResourceStorage File-based storage initialized to use dir: /x1/jenkins/jenkins-slave/workspace/Lucene-Solr-NightlyTests-master/checkout/solr/build/solr-core/test/J0/temp/solr.handler.TestReplicationHandler_5E33055001FC95BA-001/solr-instance-002/collection1/conf
   [junit4]   2> 402664 INFO  (coreLoadExecutor-1089-thread-1) [    x:collection1] o.a.s.h.ReplicationHandler Poll scheduled at an interval of 1000ms
   [junit4]   2> 402665 INFO  (searcherExecutor-1090-thread-1-processing-x:collection1) [    x:collection1] o.a.s.c.SolrCore [collection1] Registered new searcher Searcher@6d20d9ef[collection1] main{ExitableDirectoryReader(UninvertingDirectoryReader())}
   [junit4]   2> 403120 INFO  (TEST-TestReplicationHandler.doTestDetails-seed#[5E33055001FC95BA]) [    ] o.e.j.s.AbstractConnector Stopped ServerConnector@fdb761f{HTTP/1.1,[http/1.1]}{127.0.0.1:0}
   [junit4]   2> 403120 INFO  (TEST-TestReplicationHandler.doTestDetails-seed#[5E33055001FC95BA]) [    ] o.a.s.c.CoreContainer Shutting down CoreContainer instance=507368289
   [junit4]   2> 403120 INFO  (TEST-TestReplicationHandler.doTestDetails-seed#[5E33055001FC95BA]) [    ] o.a.s.m.SolrMetricManager Closing metric reporters for registry=solr.node, tag=null
   [junit4]   2> 403120 INFO  (TEST-TestReplicationHandler.doTestDetails-seed#[5E33055001FC95BA]) [    ] o.a.s.m.SolrMetricManager Closing metric reporters for registry=solr.jvm, tag=null
   [junit4]   2> 403121 INFO  (TEST-TestReplicationHandler.doTestDetails-seed#[5E33055001FC95BA]) [    ] o.a.s.m.SolrMetricManager Closing metric reporters for registry=solr.jetty, tag=null
   [junit4]   2> 403121 INFO  (TEST-TestReplicationHandler.doTestDetails-seed#[5E33055001FC95BA]) [    ] o.a.s.c.TransientSolrCoreCacheDefault Allocating transient cache for 4 transient cores
   [junit4]   2> 403122 INFO  (coreCloseExecutor-1095-thread-1) [    x:collection1] o.a.s.c.SolrCore [collection1]  CLOSING SolrCore org.apache.solr.core.SolrCore@5e645ed9
   [junit4]   2> 403127 INFO  (coreCloseExecutor-1095-thread-1) [    x:collection1] o.a.s.m.SolrMetricManager Closing metric reporters for registry=solr.core.collection1, tag=1583636185
   [junit4]   2> 403128 INFO  (TEST-TestReplicationHandler.doTestDetails-seed#[5E33055001FC95BA]) [    ] o.e.j.s.h.ContextHandler Stopped o.e.j.s.ServletContextHandler@2b6eb212{/solr,null,UNAVAILABLE}
   [junit4]   2> 403132 INFO  (TEST-TestReplicationHandler.doTestDetails-seed#[5E33055001FC95BA]) [    ] o.e.j.s.Server jetty-9.3.14.v20161028
   [junit4]   2> 403143 INFO  (TEST-TestReplicationHandler.doTestDetails-seed#[5E33055001FC95BA]) [    ] o.e.j.s.h.ContextHandler Started o.e.j.s.ServletContextHandler@6795c90d{/solr,null,AVAILABLE}
   [junit4]   2> 403143 INFO  (TEST-TestReplicationHandler.doTestDetails-seed#[5E33055001FC95BA]) [    ] o.e.j.s.AbstractConnector Started ServerConnector@100760a0{HTTP/1.1,[http/1.1]}{127.0.0.1:37071}
   [junit4]   2> 403143 INFO  (TEST-TestReplicationHandler.doTestDetails-seed#[5E33055001FC95BA]) [    ] o.e.j.s.Server Started @406423ms
   [junit4]   2> 403144 INFO  (TEST-TestReplicationHandler.doTestDetails-seed#[5E33055001FC95BA]) [    ] o.a.s.c.s.e.JettySolrRunner Jetty properties: {solr.data.dir=/x1/jenkins/jenkins-slave/workspace/Lucene-Solr-NightlyTests-master/checkout/solr/build/solr-core/test/J0/temp/solr.handler.TestReplicationHandler_5E33055001FC95BA-001/solr-instance-002/collection1/data, hostContext=/solr, hostPort=37071}
   [junit4]   2> 403144 ERROR (TEST-TestReplicationHandler.doTestDetails-seed#[5E33055001FC95BA]) [    ] o.a.s.s.StartupLoggingUtils Missing Java Option solr.log.dir. Logging may be missing or incomplete.
   [junit4]   2> 403144 INFO  (TEST-TestReplicationHandler.doTestDetails-seed#[5E33055001FC95BA]) [    ] o.a.s.s.SolrDispatchFilter  ___      _       Welcome to Apache Solr™ version 8.0.0
   [junit4]   2> 403144 INFO  (TEST-TestReplicationHandler.doTestDetails-seed#[5E33055001FC95BA]) [    ] o.a.s.s.SolrDispatchFilter / __| ___| |_ _   Starting in standalone mode on port null
   [junit4]   2> 403144 INFO  (TEST-TestReplicationHandler.doTestDetails-seed#[5E33055001FC95BA]) [    ] o.a.s.s.SolrDispatchFilter \__ \/ _ \ | '_|  Install dir: null, Default config dir: null
   [junit4]   2> 403144 INFO  (TEST-TestReplicationHandler.doTestDetails-seed#[5E33055001FC95BA]) [    ] o.a.s.s.SolrDispatchFilter |___/\___/_|_|    Start time: 2017-08-12T16:07:25.692Z
   [junit4]   2> 403144 INFO  (TEST-TestReplicationHandler.doTestDetails-seed#[5E33055001FC95BA]) [    ] o.a.s.c.SolrXmlConfig Loading container configuration from /x1/jenkins/jenkins-slave/workspace/Lucene-Solr-NightlyTests-master/checkout/solr/build/solr-core/test/J0/temp/solr.handler.TestReplicationHandler_5E33055001FC95BA-001/solr-instance-002/solr.xml
   [junit4]   2> 403165 INFO  (TEST-TestReplicationHandler.doTestDetails-seed#[5E33055001FC95BA]) [    ] o.a.s.c.SolrXmlConfig MBean server found: com.sun.jmx.mbeanserver.JmxMBeanServer@3383e024, but no JMX reporters were configured - adding default JMX reporter.
   [junit4]   2> 403217 INFO  (TEST-TestReplicationHandler.doTestDetails-seed#[5E33055001FC95BA]) [    ] o.a.s.m.r.SolrJmxReporter JMX monitoring for 'solr.node' (registry 'solr.node') enabled at server: com.sun.jmx.mbeanserver.JmxMBeanServer@3383e024
   [junit4]   2> 403221 INFO  (TEST-TestReplicationHandler.doTestDetails-seed#[5E33055001FC95BA]) [    ] o.a.s.m.r.SolrJmxReporter JMX monitoring for 'solr.jvm' (registry 'solr.jvm') enabled at server: com.sun.jmx.mbeanserver.JmxMBeanServer@3383e024
   [junit4]   2> 403221 INFO  (TEST-TestReplicationHandler.doTestDetails-seed#[5E33055001FC95BA]) [    ] o.a.s.m.r.SolrJmxReporter JMX monitoring for 'solr.jetty' (registry 'solr.jetty') enabled at server: com.sun.jmx.mbeanserver.JmxMBeanServer@3383e024
   [junit4]   2> 403223 INFO  (TEST-TestReplicationHandler.doTestDetails-seed#[5E33055001FC95BA]) [    ] o.a.s.c.CorePropertiesLocator Found 1 core definitions underneath /x1/jenkins/jenkins-slave/workspace/Lucene-Solr-NightlyTests-master/checkout/solr/build/solr-core/test/J0/temp/solr.handler.TestReplicationHandler_5E33055001FC95BA-001/solr-instance-002/.
   [junit4]   2> 403223 INFO  (TEST-TestReplicationHandler.doTestDetails-seed#[5E33055001FC95BA]) [    ] o.a.s.c.CorePropertiesLocator Cores are: [collection1]
   [junit4]   2> 403452 INFO  (coreLoadExecutor-1102-thread-1) [    x:collection1] o.a.s.c.SolrConfig Using Lucene MatchVersion: 8.0.0
   [junit4]   2> 403464 INFO  (coreLoadExecutor-1102-thread-1) [    x:collection1] o.a.s.s.IndexSchema [collection1] Schema name=test
   [junit4]   2> 403465 INFO  (coreLoadExecutor-1102-thread-1) [    x:collection1] o.a.s.s.IndexSchema Loaded schema test/1.2 with uniqueid field id
   [junit4]   2> 403465 INFO  (coreLoadExecutor-1102-thread-1) [    x:collection1] o.a.s.c.CoreContainer Creating SolrCore 'collection1' using configuration from instancedir /x1/jenkins/jenkins-slave/workspace/Lucene-Solr-NightlyTests-master/checkout/solr/build/solr-core/test/J0/temp/solr.handler.TestReplicationHandler_5E33055001FC95BA-001/solr-instance-002/./collection1, trusted=true
   [junit4]   2> 403466 INFO  (coreLoadExecutor-1102-thread-1) [    x:collection1] o.a.s.m.r.SolrJmxReporter JMX monitoring for 'solr.core.collection1' (registry 'solr.core.collection1') enabled at server: com.sun.jmx.mbeanserver.JmxMBeanServer@3383e024
   [junit4]   2> 403466 INFO  (coreLoadExecutor-1102-thread-1) [    x:collection1] o.a.s.c.SolrCore solr.RecoveryStrategy.Builder
   [junit4]   2> 403466 INFO  (coreLoadExecutor-1102-thread-1) [    x:collection1] o.a.s.c.SolrCore [[collection1] ] Opening new SolrCore at [/x1/jenkins/jenkins-slave/workspace/Lucene-Solr-NightlyTests-master/checkout/solr/build/solr-core/test/J0/temp/solr.handler.TestReplicationHandler_5E33055001FC95BA-001/solr-instance-002/collection1], dataDir=[/x1/jenkins/jenkins-slave/workspace/Lucene-Solr-NightlyTests-master/checkout/solr/build/solr-core/test/J0/temp/solr.handler.TestReplicationHandler_5E33055001FC95BA-001/solr-instance-002/./collection1/data/]
   [junit4]   2> 403467 INFO  (coreLoadExecutor-1102-thread-1) [    x:collection1] o.a.s.u.RandomMergePolicy RandomMergePolicy wrapping class org.apache.lucene.index.LogByteSizeMergePolicy: [LogByteSizeMergePolicy: minMergeSize=1677721, mergeFactor=35, maxMergeSize=2147483648, maxMergeSizeForForcedMerge=9223372036854775807, calibrateSizeByDeletes=false, maxMergeDocs=2147483647, maxCFSSegmentSizeMB=8.796093022207999E12, noCFSRatio=1.0]
   [junit4]   2> 403498 INFO  (coreLoadExecutor-1102-thread-1) [    x:collection1] o.a.s.u.CommitTracker Hard AutoCommit: disabled
   [junit4]   2> 403498 INFO  (coreLoadExecutor-1102-thread-1) [    x:collection1] o.a.s.u.CommitTracker Soft AutoCommit: disabled
   [junit4]   2> 403499 INFO  (coreLoadExecutor-1102-thread-1) [    x:collection1] o.a.s.u.RandomMergePolicy RandomMergePolicy wrapping class org.apache.lucene.index.MockRandomMergePolicy: org.apache.lucene.index.MockRandomMergePolicy@1ef437af
   [junit4]   2> 403499 INFO  (coreLoadExecutor-1102-thread-1) [    x:collection1] o.a.s.s.SolrIndexSearcher Opening [Searcher@6303b8c5[collection1] main]
   [junit4]   2> 403499 INFO  (coreLoadExecutor-1102-thread-1) [    x:collection1] o.a.s.r.ManagedResourceStorage File-based storage initialized to use dir: /x1/jenkins/jenkins-slave/workspace/Lucene-Solr-NightlyTests-master/checkout/solr/build/solr-core/test/J0/temp/solr.handler.TestReplicationHandler_5E33055001FC95BA-001/solr-instance-002/collection1/conf
   [junit4]   2> 403501 INFO  (coreLoadExecutor-1102-thread-1) [    x:collection1] o.a.s.h.ReplicationHandler Poll scheduled at an interval of 1000ms
   [junit4]   2> 403502 INFO  (searcherExecutor-1103-thread-1-processing-x:collection1) [    x:collection1] o.a.s.c.SolrCore [collection1] Registered new searcher Searcher@6303b8c5[collection1] main{ExitableDirectoryReader(UninvertingDirectoryReader())}
   [junit4]   2> 403800 INFO  (qtp1830900444-3685) [    x:collection1] o.a.s.c.S.Request [collection1]  webapp=/solr path=/select params={q=*:*&sort=id+desc&wt=javabin&version=2} hits=0 status=0 QTime=0
   [junit4]   2> 403804 INFO  (qtp1830900444-3686) [    x:collection1] o.a.s.c.S.Request [collection1]  webapp=/solr path=/replication params={_trace=getDetails&qt=/replication&wt=javabin&version=2&command=details} status=0 QTime=3
   [junit4]   2> 403834 INFO  (qtp1830900444-3683) [    x:collection1] o.a.s.c.S.Request [collection1]  webapp=/solr path=/replication params={slave=false&qt=/replication&wt=javabin&version=2&command=details} status=0 QTime=0
   [junit4]   2> 403834 INFO  (qtp332019563-3723) [    x:collection1] o.a.s.c.S.Request [collection1]  webapp=/solr path=/replication params={_trace=getDetails&qt=/replication&wt=javabin&version=2&command=details} status=0 QTime=4
   [junit4]   2> 403840 INFO  (qtp1830900444-3687) [    x:collection1] o.a.s.u.p.LogUpdateProcessorFactory [collection1]  webapp=/solr path=/update params={wt=javabin&version=2}{add=[0]} 0 1
   [junit4]   2> 403841 INFO  (qtp1830900444-3689) [    x:collection1] o.a.s.u.DirectUpdateHandler2 start commit{,optimize=false,openSearcher=true,waitSearcher=true,expungeDeletes=false,softCommit=false,prepareCommit=false}
   [junit4]   2> 403841 INFO  (qtp1830900444-3689) [    x:collection1] o.a.s.u.SolrIndexWriter Calling setCommitData with IW:org.apache.solr.update.SolrIndexWriter@343b024d commitCommandVersion:0
   [junit4]   2> 403843 INFO  (qtp1830900444-3689) [    x:collection1] o.a.s.s.SolrIndexSearcher Opening [Searcher@d4cd364[collection1] main]
   [junit4]   2> 403844 INFO  (qtp1830900444-3689) [    x:collection1] o.a.s.u.DirectUpdateHandler2 end_commit_flush
   [junit4]   2> 403844 INFO  (searcherExecutor-1080-thread-1-processing-x:collection1) [    x:collection1] o.a.s.c.SolrCore [collection1] Registered new searcher Searcher@d4cd364[collection1] main{ExitableDirectoryReader(UninvertingDirectoryReader(Uninverting(_0(8.0.0):c1)))}
   [junit4]   2> 403844 INFO  (qtp1830900444-3689) [    x:collection1] o.a.s.u.p.LogUpdateProcessorFactory [collection1]  webapp=/solr path=/update params={waitSearcher=true&commit=true&softCommit=false&wt=javabin&version=2}{commit=} 0 3
   [junit4]   2> 403876 WARN  (explicit-fetchindex-cmd) [    x:collection1] o.a.s.h.IndexFetcher 'masterUrl' must be specified without the /replication suffix
   [junit4]   2> 403881 INFO  (qtp1830900444-3683) [    x:collection1] o.a.s.c.S.Request [collection1]  webapp=/solr path=/replication params={qt=/replication&wt=javabin&version=2&command=indexversion} status=0 QTime=0
   [junit4]   2> 403883 INFO  (explicit-fetchindex-cmd) [    x:collection1] o.a.s.h.IndexFetcher Master's generation: 2
   [junit4]   2> 403883 INFO  (explicit-fetchindex-cmd) [    x:collection1] o.a.s.h.IndexFetcher Master's version: 1502554046389
   [junit4]   2> 403883 INFO  (explicit-fetchindex-cmd) [    x:collection1] o.a.s.h.IndexFetcher Slave's generation: 1
   [junit4]   2> 403883 INFO  (explicit-fetchindex-cmd) [    x:collection1] o.a.s.h.IndexFetcher Slave's version: 0
   [junit4]   2> 403883 INFO  (explicit-fetchindex-cmd) [    x:collection1] o.a.s.h.IndexFetcher Starting replication process
   [junit4]   2> 403885 INFO  (qtp1830900444-3683) [    x:collection1] o.a.s.c.S.Request [collection1]  webapp=/solr path=/replication params={generation=2&qt=/replication&wt=javabin&version=2&command=filelist} status=0 QTime=2
   [junit4]   2> 403886 INFO  (explicit-fetchindex-cmd) [    x:collection1] o.a.s.h.IndexFetcher Number of files in latest index in master: 4
   [junit4]   2> 403889 INFO  (explicit-fetchindex-cmd) [    x:collection1] o.a.s.u.RandomMergePolicy RandomMergePolicy wrapping class org.apache.lucene.index.LogByteSizeMergePolicy: [LogByteSizeMergePolicy: minMergeSize=1677721, mergeFactor=17, maxMergeSize=2147483648, maxMergeSizeForForcedMerge=9223372036854775807, calibrateSizeByDeletes=false, maxMergeDocs=2147483647, maxCFSSegmentSizeMB=8.796093022207999E12, noCFSRatio=1.0]
   [junit4]   2> 403890 INFO  (explicit-fetchindex-cmd) [    x:collection1] o.a.s.u.DefaultSolrCoreState New IndexWriter is ready to be used.
   [junit4]   2> 403940 INFO  (explicit-fetchindex-cmd) [    x:collection1] o.a.s.h.IndexFetcher Starting download (fullCopy=false) to MockDirectoryWrapper(RAMDirectory@23196897 lockFactory=org.apache.lucene.store.SingleInstanceLockFactory@18d60660)
   [junit4]   2> 403941 INFO  (qtp1830900444-3686) [    x:collection1] o.a.s.c.S.Request [collection1]  webapp=/solr path=/replication params={generation=2&qt=/replication&file=_0.cfe&checksum=true&wt=filestream&command=filecontent} status=0 QTime=0
   [junit4]   2> 403944 INFO  (qtp1830900444-3688) [    x:collection1] o.a.s.c.S.Request [collection1]  webapp=/solr path=/replication params={generation=2&qt=/replication&file=_0.si&checksum=true&wt=filestream&command=filecontent} status=0 QTime=0
   [junit4]   2> 403946 INFO  (qtp1830900444-3687) [    x:collection1] o.a.s.c.S.Request [collection1]  webapp=/solr path=/replication params={generation=2&qt=/replication&file=_0.cfs&checksum=true&wt=filestream&command=filecontent} status=0 QTime=0
   [junit4]   2> 403947 INFO  (qtp1830900444-3689) [    x:collection1] o.a.s.c.S.Request [collection1]  webapp=/solr path=/replication params={generation=2&qt=/replication&file=segments_2&checksum=true&wt=filestream&command=filecontent} status=0 QTime=0
   [junit4]   2> 403948 INFO  (explicit-fetchindex-cmd) [    x:collection1] o.a.s.h.IndexFetcher Total time taken for download (fullCopy=false,bytesDownloaded=1946) : 0 secs (null bytes/sec) to MockDirectoryWrapper(RAMDirectory@23196897 lockFactory=org.apache.lucene.store.SingleInstanceLockFactory@18d60660)
   [junit4]   2> 403951 INFO  (explicit-fetchindex-cmd) [    x:collection1] o.a.s.u.RandomMergePolicy RandomMergePolicy wrapping class org.apache.lucene.index.LogByteSizeMergePolicy: [LogByteSizeMergePolicy: minMergeSize=1677721, mergeFactor=35, maxMergeSize=2147483648, maxMergeSizeForForcedMerge=9223372036854775807, calibrateSizeByDeletes=false, maxMergeDocs=2147483647, maxCFSSegmentSizeMB=8.796093022207999E12, noCFSRatio=1.0]
   [junit4]   2> 403951 INFO  (explicit-fetchindex-cmd) [    x:collection1] o.a.s.u.DefaultSolrCoreState New IndexWriter is ready to be used.
   [junit4]   2> 403954 INFO  (explicit-fetchindex-cmd) [    x:collection1] o.a.s.s.SolrIndexSearcher Opening [Searcher@5b4f00ad[collection1] main]
   [junit4]   2> 403955 INFO  (searcherExecutor-1103-thread-1-processing-x:collection1) [    x:collection1] o.a.s.c.SolrCore [collection1] Registered new searcher Searcher@5b4f00ad[collection1] main{ExitableDirectoryReader(UninvertingDirectoryReader(Uninverting(_0(8.0.0):c1)))}
   [junit4]   2> 403957 INFO  (qtp332019563-3725) [    x:collection1] o.a.s.c.S.Request [collection1]  webapp=/solr path=/replication params={wait=true&masterUrl=http://127.0.0.1:55235/solr/collection1/replication&command=fetchindex} status=0 QTime=93
   [junit4]   2> 403991 INFO  (qtp1830900444-3685) [    x:collection1] o.a.s.c.S.Request [collection1]  webapp=/solr path=/replication params={slave=false&qt=/replication&wt=javabin&version=2&command=details} status=0 QTime=4
   [junit4]   2> 403992 INFO  (qtp332019563-3724) [    x:collection1] o.a.s.c.S.Request [collection1]  webapp=/solr path=/replication params={_trace=getDetails&qt=/replication&wt=javabin&version=2&command=details} status=0 QTime=22
   [junit4]   2> 403993 INFO  (qtp332019563-3726) [    x:collection1] o.a.s.c.S.Request [collection1]  webapp=/solr path=/select params={q=*:*&sort=id+desc&wt=javabin&version=2} hits=1 status=0 QTime=0
   [junit4]   2> 403993 INFO  (TEST-TestReplicationHandler.doTestDetails-seed#[5E33055001FC95BA]) [    ] o.a.s.h.TestReplicationHandler Waited for 0ms and found 1 docs
   [junit4]   2> 403999 INFO  (qtp1830900444-3682) [    x:collection1] o.a.s.u.p.LogUpdateProcessorFactory [collection1]  webapp=/solr path=/update params={wt=javabin&version=2}{add=[1]} 0 6
   [junit4]   2> 404000 INFO  (qtp1830900444-3686) [    x:collection1] o.a.s.u.DirectUpdateHandler2 start commit{,optimize=false,openSearcher=true,waitSearcher=true,expungeDeletes=false,softCommit=false,prepareCommit=false}
   [junit4]   2> 404000 INFO  (qtp1830900444-3686) [    x:collection1] o.a.s.u.SolrIndexWriter Calling setCommitData with IW:org.apache.solr.update.SolrIndexWriter@343b024d commitCommandVersion:0
   [junit4]   2> 404002 INFO  (qtp1830900444-3686) [    x:collection1] o.a.s.s.SolrIndexSearcher Opening [Searcher@5638004a[collection1] main]
   [junit4]   2> 404002 INFO  (qtp1830900444-3686) [    x:collection1] o.a.s.u.DirectUpdateHandler2 end_commit_flush
   [junit4]   2> 404003 INFO  (searcherExecutor-1080-thread-1-processing-x:collection1) [    x:collection1] o.a.s.c.SolrCore [collection1] Registered new searcher Searcher@5638004a[collection1] main{ExitableDirectoryReader(UninvertingDirectoryReader(Uninverting(_0(8.0.0):c1) Uninverting(_1(8.0.0):c1)))}
   [junit4]   2> 404003 INFO  (qtp1830900444-3686) [    x:collection1] o.a.s.u.p.LogUpdateProcessorFactory [collection1]  webapp=/solr path=/update params={waitSearcher=true&commit=true&softCommit=false&wt=javabin&version=2}{commit=} 0 3
   [junit4]   2> 404031 WARN  (explicit-fetchindex-cmd) [    x:collection1] o.a.s.h.IndexFetcher 'masterUrl' must be specified without the /replication suffix
   [junit4]   2> 404033 INFO  (qtp1830900444-3683) [    x:collection1] o.a.s.c.S.Request [collection1]  webapp=/solr path=/replication params={qt=/replication&wt=javabin&version=2&command=indexversion} status=0 QTime=0
   [junit4]   2> 404041 INFO  (explicit-fetchindex-cmd) [    x:collection1] o.a.s.h.IndexFetcher Master's generation: 3
   [junit4]   2> 404041 INFO  (explicit-fetchindex-cmd) [    x:collection1] o.a.s.h.IndexFetcher Master's version: 1502554046548
   [junit4]   2> 404041 INFO  (explicit-fetchindex-cmd) [    x:collection1] o.a.s.h.IndexFetcher Slave's generation: 2
   [junit4]   2> 404041 INFO  (explicit-fetchindex-cmd) [    x:collection1] o.a.s.h.IndexFetcher Slave's version: 1502554046389
   [junit4]   2> 404041 INFO  (explicit-fetchindex-cmd) [    x:collection1] o.a.s.h.IndexFetcher Starting replication process
   [junit4]   2> 404042 INFO  (qtp1830900444-3683) [    x:collection1] o.a.s.c.S.Request [collection1]  webapp=/solr path=/replication params={generation=3&qt=/replication&wt=javabin&version=2&command=filelist} status=0 QTime=0
   [junit4]   2> 404047 INFO  (explicit-fetchindex-cmd) [    x:collection1] o.a.s.h.IndexFetcher Number of files in latest index in master: 7
   [junit4]   2> 404064 INFO  (explicit-fetchindex-cmd) [    x:collection1] o.a.s.u.RandomMergePolicy RandomMergePolicy wrapping class org.apache.lucene.index.LogByteSizeMergePolicy: [LogByteSizeMergePolicy: minMergeSize=1677721, mergeFactor=17, maxMergeSize=2147483648, maxMergeSizeForForcedMerge=9223372036854775807, calibrateSizeByDeletes=false, maxMergeDocs=2147483647, maxCFSSegmentSizeMB=8.796093022207999E12, noCFSRatio=1.0]
   [junit4]   2> 404075 INFO  (explicit-fetchindex-cmd) [    x:collection1] o.a.s.u.DefaultSolrCoreState New IndexWriter is ready to be used.
   [junit4]   2> 404075 INFO  (explicit-fetchindex-cmd) [    x:collection1] o.a.s.h.IndexFetcher Starting download (fullCopy=false) to MockDirectoryWrapper(RAMDirectory@6b9370ae lockFactory=org.apache.lucene.store.SingleInstanceLockFactory@2fc6f51e)
   [junit4]   2> 404076 INFO  (explicit-fetchindex-cmd) [    x:collection1] o.a.s.h.IndexFetcher Skipping download for _0.cfe because it already exists
   [junit4]   2> 404076 INFO  (explicit-fetchindex-cmd) [    x:collection1] o.a.s.h.IndexFetcher Skipping download for _0.si because it already exists
   [junit4]   2> 404076 INFO  (explicit-fetchindex-cmd) [    x:collection1] o.a.s.h.IndexFetcher Skipping download for _0.cfs because it already exists
   [junit4]   2> 404076 INFO  (qtp1830900444-3689) [    x:collection1] o.a.s.c.S.Request [collection1]  webapp=/solr path=/replication params={generation=3&qt=/replication&file=_1.cfs&checksum=true&wt=filestream&command=filecontent} status=0 QTime=0
   [junit4]   2> 404092 INFO  (qtp1830900444-3685) [    x:collection1] o.a.s.c.S.Request [collection1]  webapp=/solr path=/replication params={generation=3&qt=/replication&file=_1.cfe&checksum=true&wt=filestream&command=filecontent} status=0 QTime=0
   [junit4]   2> 404096 INFO  (qtp1830900444-3682) [    x:collection1] o.a.s.c.S.Request [collection1]  webapp=/solr path=/replication params={generation=3&qt=/replication&file=_1.si&checksum=true&wt=filestream&command=filecontent} status=0 QTime=0
   [junit4]   2> 404112 INFO  (qtp1830900444-3686) [    x:collection1] o.a.s.c.S.Request [collection1]  webapp=/solr path=/replication params={generation=3&qt=/replication&file=segments_3&checksum=true&wt=filestream&command=filecontent} status=0 QTime=0
   [junit4]   2> 404112 INFO  (explicit-fetchindex-cmd) [    x:collection1] o.a.s.h.IndexFetcher Total time taken for download (fullCopy=false,bytesDownloaded=2008) : 0 secs (null bytes/sec) to MockDirectoryWrapper(RAMDirectory@6b9370ae lockFactory=org.apache.lucene.store.SingleInstanceLockFactory@2fc6f51e)
   [junit4]   2> 404148 INFO  (explicit-fetchindex-cmd) [    x:collection1] o.a.s.u.RandomMergePolicy RandomMergePolicy wrapping class org.apache.lucene.index.LogByteSizeMergePolicy: [LogByteSizeMergePolicy: minMergeSize=1677721, mergeFactor=35, maxMergeSize=2147483648, maxMergeSizeForForcedMerge=9223372036854775807, calibrateSizeByDeletes=false, maxMergeDocs=2147483647, maxCFSSegmentSizeMB=8.796093022207999E12, noCFSRatio=1.0]
   [junit4]   2> 404155 INFO  (explicit-fetchindex-cmd) [    x:collection1] o.a.s.u.DefaultSolrCoreState New IndexWriter is ready to be used.
   [junit4]   2> 404156 INFO  (explicit-fetchindex-cmd) [    x:collection1] o.a.s.s.SolrIndexSearcher Opening [Searcher@4e6db5a7[collection1] main]
   [junit4]   2> 404156 INFO  (searcherExecutor-1103-thread-1-processing-x:collection1) [    x:collection1] o.a.s.c.SolrCore [collection1] Registered new searcher Searcher@4e6db5a7[collection1] main{ExitableDirectoryReader(UninvertingDirectoryReader(Uninverting(_0(8.0.0):c1) Uninverting(_1(8.0.0):c1)))}
   [junit4]   2> 404157 INFO  (qtp332019563-3727) [    x:collection1] o.a.s.c.S.Request [collection1]  webapp=/solr path=/replication params={wait=true&masterUrl=http://127.0.0.1:55235/solr/collection1/replication&command=fetchindex} status=0 QTime=152
   [junit4]   2> 404191 INFO  (qtp1830900444-3687) [    x:collection1] o.a.s.c.S.Request [collection1]  webapp=/solr path=/replication params={slave=false&qt=/replication&wt=javabin&version=2&command=details} status=0 QTime=19
   [junit4]   2> 404191 INFO  (qtp332019563-3726) [    x:collection1] o.a.s.c.S.Request [collection1]  webapp=/solr path=/replication params={_trace=getDetails&qt=/replication&wt=javabin&version=2&command=details} status=0 QTime=30
   [junit4]   2> 404193 INFO  (qtp332019563-3721) [    x:collection1] o.a.s.c.S.Request [collection1]  webapp=/solr path=/select params={q=*:*&sort=id+desc&wt=javabin&version=2} hits=2 status=0 QTime=0
   [junit4]   2> 404193 INFO  (TEST-TestReplicationHandler.doTestDetails-seed#[5E33055001FC95BA]) [    ] o.a.s.h.TestReplicationHandler Waited for 0ms and found 2 docs
   [junit4]   2> 404194 INFO  (qtp1830900444-3688) [    x:collection1] o.a.s.u.p.LogUpdateProcessorFactory [collection1]  webapp=/solr path=/update params={wt=javabin&version=2}{add=[2]} 0 0
   [junit4]   2> 404202 INFO  (qtp1830900444-3688) [    x:collection1] o.a.s.u.DirectUpdateHandler2 start commit{,optimize=false,openSearcher=true,waitSearcher=true,expungeDeletes=false,softCommit=false,prepareCommit=false}
   [junit4]   2> 404202 INFO  (qtp1830900444-3688) [    x:collection1] o.a.s.u.SolrIndexWriter Calling setCommitData with IW:org.apache.solr.update.SolrIndexWriter@343b024d commitCommandVersion:0
   [junit4]   2> 404204 INFO  (qtp1830900444-3688) [    x:collection1] o.a.s.s.SolrIndexSearcher Opening [Searcher@3402a0f0[collection1] main]
   [junit4]   2> 404204 INFO  (qtp1830900444-3688) [    x:collection1] o.a.s.u.DirectUpdateHandler2 end_commit_flush
   [junit4]   2> 404205 INFO  (searcherExecutor-1080-thread-1-processing-x:collection1) [    x:collection1] o.a.s.c.SolrCore [collection1] Registered new searcher Searcher@3402a0f0[collection1] main{ExitableDirectoryReader(UninvertingDirectoryReader(Uninverting(_0(8.0.0):c1) Uninverting(_1(8.0.0):c1) Uninverting(_2(8.0.0):c1)))}
   [junit4]   2> 404206 INFO  (qtp1830900444-3688) [    x:collection1] o.a.s.u.p.LogUpdateProcessorFactory [collection1]  webapp=/solr path=/update params={waitSearcher=true&commit=true&softCommit=false&wt=javabin&version=2}{commit=} 0 3
   [junit4]   2> 404223 WARN  (explicit-fetchindex-cmd) [    x:collection1] o.a.s.h.IndexFetcher 'masterUrl' must be specified without the /replication suffix
   [junit4]   2> 404226 INFO  (qtp1830900444-3683) [    x:collection1] o.a.s.c.S.Request [collection1]  webapp=/solr path=/replication params={qt=/replication&wt=javabin&version=2&command=indexversion} status=0 QTime=0
   [junit4]   2> 404233 INFO  (explicit-fetchindex-cmd) [    x:collection1] o.a.s.h.IndexFetcher Master's generation: 4
   [junit4]   2> 404233 INFO  (explicit-fetchindex-cmd) [    x:collection1] o.a.s.h.IndexFetcher Master's version: 1502554046750
   [junit4]   2> 404233 INFO  (explicit-fetchindex-cmd) [    x:collection1] o.a.s.h.IndexFetcher Slave's generation: 3
   [junit4]   2> 404233 INFO  (explicit-fetchindex-cmd) [    x:collection1] o.a.s.h.IndexFetcher Slave's version: 1502554046548
   [junit4]   2> 404233 INFO  (explicit-fetchindex-cmd) [    x:collection1] o.a.s.h.IndexFetcher Starting replication process
   [junit4]   2> 404233 INFO  (qtp1830900444-3683) [    x:collection1] o.a.s.c.S.Request [collection1]  webapp=/solr path=/replication params={generation=4&qt=/replication&wt=javabin&version=2&command=filelist} status=0 QTime=0
   [junit4]   2> 404234 INFO  (explicit-fetchindex-cmd) [    x:collection1] o.a.s.h.IndexFetcher Number of files in latest index in master: 10
   [junit4]   2> 404236 INFO  (explicit-fetchindex-cmd) [    x:collection1] o.a.s.u.RandomMergePolicy RandomMergePolicy wrapping class org.apache.lucene.index.LogByteSizeMergePolicy: [LogByteSizeMergePolicy: minMergeSize=1677721, mergeFactor=17, maxMergeSize=2147483648, maxMergeSizeForForcedMerge=9223372036854775807, calibrateSizeByDeletes=false, maxMergeDocs=2147483647, maxCFSSegmentSizeMB=8.796093022207999E12, noCFSRatio=1.0]
   [junit4]   2> 404237 INFO  (explicit-fetchindex-cmd) [    x:collection1] o.a.s.u.DefaultSolrCoreState New IndexWriter is ready to be used.
   [junit4]   2> 404237 INFO  (explicit-fetchindex-cmd) [    x:collection1] o.a.s.h.IndexFetcher Starting download (fullCopy=false) to MockDirectoryWrapper(RAMDirectory@3b3a94af lockFactory=org.apache.lucene.store.SingleInstanceLockFactory@3b69b189)
   [junit4]   2> 404237 INFO  (explicit-fetchindex-cmd) [    x:collection1] o.a.s.h.IndexFetcher Skipping download for _0.cfe because it already exists
   [junit4]   2> 404237 INFO  (explicit-fetchindex-cmd) [    x:collection1] o.a.s.h.IndexFetcher Skipping download for _0.si because it already exists
   [junit4]   2> 404237 INFO  (explicit-fetchindex-cmd) [    x:collection1] o.a.s.h.IndexFetcher Skipping download for _0.cfs because it already exists
   [junit4]   2> 404237 INFO  (explicit-fetchindex-cmd) [    x:collection1] o.a.s.h.IndexFetcher Skipping download for _1.cfs because it already exists
   [junit4]   2> 404237 INFO  (explicit-fetchindex-cmd) [    x:collection1] o.a.s.h.IndexFetcher Skipping download for _1.cfe because it already exists
   [junit4]   2> 404237 INFO  (explicit-fetchindex-cmd) [    x:collection1] o.a.s.h.IndexFetcher Skipping download for _1.si because it already exists
   [junit4]   2> 404238 INFO  (qtp1830900444-3683) [    x:collection1] o.a.s.c.S.Request [collection1]  webapp=/solr path=/replication params={generation=4&qt=/replication&file=_2.si&checksum=true&wt=filestream&command=filecontent} status=0 QTime=0
   [junit4]   2> 404239 INFO  (qtp1830900444-3687) [    x:collection1] o.a.s.c.S.Request [collection1]  webapp=/solr path=/replication params={generation=4&qt=/replication&file=_2.cfe&checksum=true&wt=filestream&command=filecontent} status=0 QTime=0
   [junit4]   2> 404239 INFO  (qtp1830900444-3689) [    x:collection1] o.a.s.c.S.Request [collection1]  webapp=/solr path=/replication params={generation=4&qt=/replication&file=_2.cfs&checksum=true&wt=filestream&command=filecontent} status=0 QTime=0
   [junit4]   2> 404240 INFO  (qtp1830900444-3688) [    x:collection1] o.a.s.c.S.Request [collection1]  webapp=/solr path=/replication params={generation=4&qt=/replication&file=segments_4&checksum=true&wt=filestream&command=filecontent} status=0 QTime=0
   [junit4]   2> 404241 INFO  (explicit-fetchindex-cmd) [    x:collection1] o.a.s.h.IndexFetcher Total time taken for download (fullCopy=false,bytesDownloaded=2070) : 0 secs (null bytes/sec) to MockDirectoryWrapper(RAMDirectory@3b3a94af lockFactory=org.apache.lucene.store.SingleInstanceLockFactory@3b69b189)
   [junit4]   2> 404242 INFO  (explicit-fetchindex-cmd) [    x:collection1] o.a.s.u.RandomMergePolicy RandomMergePolicy wrapping class org.apache.lucene.index.LogByteSizeMergePolicy: [LogByteSizeMergePolicy: minMergeSize=1677721, mergeFactor=35, maxMergeSize=2147483648, maxMergeSizeForForcedMerge=9223372036854775807, calibrateSizeByDeletes=false, maxMergeDocs=2147483647, maxCFSSegmentSizeMB=8.796093022207999E12, noCFSRatio=1.0]
   [junit4]   2> 404242 INFO  (explicit-fetchindex-cmd) [    x:collection1] o.a.s.u.DefaultSolrCoreState New IndexWriter is ready to be used.
   [junit4]   2> 404243 INFO  (explicit-fetchindex-cmd) [    x:collection1] o.a.s.s.SolrIndexSearcher Opening [Searcher@7a7dd5da[collection1] main]
   [junit4]   2> 404251 INFO  (searcherExecutor-1103-thread-1-processing-x:collection1) [    x:collection1] o.a.s.c.SolrCore [collection1] Registered new searcher Searcher@7a7dd5da[collection1] main{ExitableDirectoryReader(UninvertingDirectoryReader(Uninverting(_0(8.0.0):c1) Uninverting(_1(8.0.0):c1) Uninverting(_2(8.0.0):c1)))}
   [junit4]   2> 404253 INFO  (qtp332019563-3723) [    x:collection1] o.a.s.c.S.Request [collection1]  webapp=/solr path=/replication params={wait=true&masterUrl=http://127.0.0.1:55235/solr/collection1/replication&command=fetchindex} status=0 QTime=46
   [junit4]   2> 404254 INFO  (TEST-TestReplicationHandler.doTestDetails-seed#[5E33055001FC95BA]) [    ] o.a.s.SolrTestCaseJ4 Writing core.properties file to /x1/jenkins/jenkins-slave/workspace/Lucene-Solr-NightlyTests-master/checkout/solr/build/solr-core/test/J0/temp/solr.handler.TestReplicationHandler_5E33055001FC95BA-001/solr-instance-003/collection1
   [junit4]   2> 404257 INFO  (TEST-TestReplicationHandler.doTestDetails-seed#[5E33055001FC95BA]) [    ] o.e.j.s.Server jetty-9.3.14.v20161028
   [junit4]   2> 404264 INFO  (TEST-TestReplicationHandler.doTestDetails-seed#[5E33055001FC95BA]) [    ] o.e.j.s.h.ContextHandler Started o.e.j.s.ServletContextHandler@5b3b2d8e{/solr,null,AVAILABLE}
   [junit4]   2> 404264 INFO  (TEST-TestReplicationHandler.doTestDetails-seed#[5E33055001FC95BA]) [    ] o.e.j.s.AbstractConnector Started ServerConnector@7a97349e{HTTP/1.1,[http/1.1]}{127.0.0.1:35205}
   [junit4]   2> 404264 INFO  (TEST-TestReplicationHandler.doTestDetails-seed#[5E33055001FC95BA]) [    ] o.e.j.s.Server Started @407543ms
   [junit4]   2> 404264 INFO  (TEST-TestReplicationHandler.doTestDetails-seed#[5E33055001FC95BA]) [    ] o.a.s.c.s.e.JettySolrRunner Jetty properties: {solr.data.dir=/x1/jenkins/jenkins-slave/workspace/Lucene-Solr-NightlyTests-master/checkout/solr/build/solr-core/test/J0/temp/solr.handler.TestReplicationHandler_5E33055001FC95BA-001/solr-instance-003/collection1/data, hostContext=/solr, hostPort=35205}
   [junit4]   2> 404264 ERROR (TEST-TestReplicationHandler.doTestDetails-seed#[5E33055001FC95BA]) [    ] o.a.s.s.StartupLoggingUtils Missing Java Option solr.log.dir. Logging may be missing or incomplete.
   [junit4]   2> 404264 INFO  (TEST-TestReplicationHandler.doTestDetails-seed#[5E33055001FC95BA]) [    ] o.a.s.s.SolrDispatchFilter  ___      _       Welcome to Apache Solr™ version 8.0.0
   [junit4]   2> 404264 INFO  (TEST-TestReplicationHandler.doTestDetails-seed#[5E33055001FC95BA]) [    ] o.a.s.s.SolrDispatchFilter / __| ___| |_ _   Starting in standalone mode on port null
   [junit4]   2> 404264 INFO  (TEST-TestReplicationHandler.doTestDetails-seed#[5E33055001FC95BA]) [    ] o.a.s.s.SolrDispatchFilter \__ \/ _ \ | '_|  Install dir: null, Default config dir: null
   [junit4]   2> 404264 INFO  (TEST-TestReplicationHandler.doTestDetails-seed#[5E33055001FC95BA]) [    ] o.a.s.s.SolrDispatchFilter |___/\___/_|_|    Start time: 2017-08-12T16:07:26.812Z
   [junit4]   2> 404265 INFO  (TEST-TestReplicationHandler.doTestDetails-seed#[5E33055001FC95BA]) [    ] o.a.s.c.SolrXmlConfig Loading container configuration from /x1/jenkins/jenkins-slave/workspace/Lucene-Solr-NightlyTests-master/checkout/solr/build/solr-core/test/J0/temp/solr.handler.TestReplicationHandler_5E33055001FC95BA-001/solr-instance-003/solr.xml
   [junit4]   2> 404491 INFO  (TEST-TestReplicationHandler.doTestDetails-seed#[5E33055001FC95BA]) [    ] o.a.s.c.SolrXmlConfig MBean server found: com.sun.jmx.mbeanserver.JmxMBeanServer@3383e024, but no JMX reporters were configured - adding default JMX reporter.
   [junit4]   2> 404522 INFO  (TEST-TestReplicationHandler.doTestDetails-seed#[5E33055001FC95BA]) [    ] o.a.s.m.r.SolrJmxReporter JMX monitoring for 'solr.node' (registry 'solr.node') enabled at server: com.sun.jmx.mbeanserver.JmxMBeanServer@3383e024
   [junit4]   2> 404526 INFO  (TEST-TestReplicationHandler.doTestDetails-seed#[5E33055001FC95BA]) [    ] o.a.s.m.r.SolrJmxReporter JMX monitoring for 'solr.jvm' (registry 'solr.jvm') enabled at server: com.sun.jmx.mbeanserver.JmxMBeanServer@3383e024
   [junit4]   2> 404526 INFO  (TEST-TestReplicationHandler.doTestDetails-seed#[5E33055001FC95BA]) [    ] o.a.s.m.r.SolrJmxReporter JMX monitoring for 'solr.jetty' (registry 'solr.jetty') enabled at server: com.sun.jmx.mbeanserver.JmxMBeanServer@3383e024
   [junit4]   2> 404529 INFO  (TEST-TestReplicationHandler.doTestDetails-seed#[5E33055001FC95BA]) [    ] o.a.s.c.CorePropertiesLocator Found 1 core definitions underneath /x1/jenkins/jenkins-slave/workspace/Lucene-Solr-NightlyTests-master/checkout/solr/build/solr-core/test/J0/temp/solr.handler.TestReplicationHandler_5E33055001FC95BA-001/solr-instance-003/.
   [junit4]   2> 404529 INFO  (TEST-TestReplicationHandler.doTestDetails-seed#[5E33055001FC95BA]) [    ] o.a.s.c.CorePropertiesLocator Cores are: [collection1]
   [junit4]   2> 404580 INFO  (coreLoadExecutor-1116-thread-1) [    x:collection1] o.a.s.c.SolrConfig Using Lucene MatchVersion: 8.0.0
   [junit4]   2> 404589 INFO  (coreLoadExecutor-1116-thread-1) [    x:collection1] o.a.s.s.IndexSchema [collection1] Schema name=test
   [junit4]   2> 404590 INFO  (coreLoadExecutor-1116-thread-1) [    x:collection1] o.a.s.s.IndexSchema Loaded schema test/1.2 with uniqueid field id
   [junit4]   2> 404590 INFO  (coreLoadExecutor-1116-thread-1) [    x:collection1] o.a.s.c.CoreContainer Creating SolrCore 'collection1' using configuration from instancedir /x1/jenkins/jenkins-slave/workspace/Lucene-Solr-NightlyTests-master/checkout/solr/build/solr-core/test/J0/temp/solr.handler.TestReplicationHandler_5E33055001FC95BA-001/solr-instance-003/./collection1, trusted=true
   [junit4]   2> 404591 INFO  (coreLoadExecutor-1116-thread-1) [    x:collection1] o.a.s.m.r.SolrJmxReporter JMX monitoring for 'solr.core.collection1' (registry 'solr.core.collection1') enabled at server: com.sun.jmx.mbeanserver.JmxMBeanServer@3383e024
   [junit4]   2> 404591 INFO  (coreLoadExecutor-1116-thread-1) [    x:collection1] o.a.s.c.SolrCore solr.RecoveryStrategy.Builder
   [junit4]   2> 404591 INFO  (coreLoadExecutor-1116-thread-1) [    x:collection1] o.a.s.c.SolrCore [[collection1] ] Opening new SolrCore at [/x1/jenkins/jenkins-slave/workspace/Lucene-Solr-NightlyTests-master/checkout/solr/build/solr-core/test/J0/temp/solr.handler.TestReplicationHandler_5E33055001FC95BA-001/solr-instance-003/collection1], dataDir=[/x1/jenkins/jenkins-slave/workspace/Lucene-Solr-NightlyTests-master/checkout/solr/build/solr-core/test/J0/temp/solr.handler.TestReplicationHandler_5E33055001FC95BA-001/solr-instance-003/./collection1/data/]
   [junit4]   2> 404592 INFO  (coreLoadExecutor-1116-thread-1) [    x:collection1] o.a.s.u.RandomMergePolicy RandomMergePolicy wrapping class org.apache.lucene.index.LogByteSizeMergePolicy: [LogByteSizeMergePolicy: minMergeSize=1677721, mergeFactor=35, maxMergeSize=2147483648, maxMergeSizeForForcedMerge=9223372036854775807, calibrateSizeByDeletes=false, maxMergeDocs=2147483647, maxCFSSegmentSizeMB=8.796093022207999E12, noCFSRatio=1.0]
   [junit4]   2> 404682 INFO  (coreLoadExecutor-1116-thread-1) [    x:collection1] o.a.s.u.CommitTracker Hard AutoCommit: disabled
   [junit4]   2> 404682 INFO  (coreLoadExecutor-1116-thread-1) [    x:collection1] o.a.s.u.CommitTracker Soft AutoCommit: disabled
   [junit4]   2> 404695 INFO  (coreLoadExecutor-1116-thread-1) [    x:collection1] o.a.s.u.RandomMergePolicy RandomMergePolicy wrapping class org.apache.lucene.index.MockRandomMergePolicy: org.apache.lucene.index.MockRandomMergePolicy@54dc79c0
   [junit4]   2> 404696 INFO  (coreLoadExecutor-1116-thread-1) [    x:collection1] o.a.s.s.SolrIndexSearcher Opening [Searcher@34ef895b[collection1] main]
   [junit4]   2> 404696 INFO  (coreLoadExecutor-1116-thread-1) [    x:collection1] o.a.s.r.ManagedResourceStorage File-based storage initialized to use dir: /x1/jenkins/jenkins-slave/workspace/Lucene-Solr-NightlyTests-master/checkout/solr/build/solr-core/test/J0/temp/solr.handler.TestReplicationHandler_5E33055001FC95BA-001/solr-instance-003/collection1/conf
   [junit4]   2> 404697 WARN  (coreLoadExecutor-1116-thread-1) [    x:collection1] o.a.s.h.IndexFetcher 'masterUrl' must be specified without the /replication suffix
   [junit4]   2> 404698 INFO  (coreLoadExecutor-1116-thread-1) [    x:collection1] o.a.s.h.ReplicationHandler  No value set for 'pollInterval'. Timer Task not started.
   [junit4]   2> 404698 INFO  (coreLoadExecutor-1116-thread-1) [    x:collection1] o.a.s.h.ReplicationHandler Replication enabled for following config files: schema.xml
   [junit4]   2> 404698 INFO  (coreLoadExecutor-1116-thread-1) [    x:collection1] o.a.s.h.ReplicationHandler Commits will be reserved for  10000
   [junit4]   2> 404698 INFO  (searcherExecutor-1117-thread-1-processing-x:collection1) [    x:collection1] o.a.s.c.SolrCore [collection1] Registered new searcher Searcher@34ef895b[collection1] main{ExitableDirectoryReader(UninvertingDirectoryReader())}
   [junit4]   2> 405044 INFO  (qtp1830900444-3682) [    x:collection1] o.a.s.c.S.Request [collection1]  webapp=/solr path=/replication params={qt=/replication&wt=javabin&version=2&command=indexversion} status=0 QTime=0
   [junit4]   2> 405044 INFO  (indexFetcher-1107-thread-1) [    x:collection1] o.a.s.h.IndexFetcher Master's generation: 4
   [junit4]   2> 405044 INFO  (indexFetcher-1107-thread-1) [    x:collection1] o.a.s.h.IndexFetcher Master's version: 1502554046750
   [junit4]   2> 405044 INFO  (indexFetcher-1107-thread-1) [    x:collection1] o.a.s.h.IndexFetcher Slave's generation: 4
   [junit4]   2> 405044 INFO  (indexFetcher-1107-thread-1) [    x:collection1] o.a.s.h.IndexFetcher Slave's version: 1502554046750
   [junit4]   2> 405044 INFO  (indexFetcher-1107-thread-1) [    x:collection1] o.a.s.h.IndexFetcher Slave in sync with master.
   [junit4]   2> 405137 INFO  (qtp1830900444-3686) [    ] o.a.s.c.TransientSolrCoreCacheDefault Allocating transient cache for 4 transient cores
   [junit4]   2> 405139 WARN  (qtp1994246037-3751) [    x:collection1] o.a.s.h.ReplicationHandler Exception while invoking 'details' method for replication on master 
   [junit4]   2> org.apache.solr.client.solrj.impl.HttpSolrClient$RemoteSolrException: Error from server at http://127.0.0.1:55235/solr: Expected mime type application/octet-stream but got text/html. <html>
   [junit4]   2> <head>
   [junit4]   2> <meta http-equiv="Content-Type" content="text/html;charset=ISO-8859-1"/>
   [junit4]   2> <title>Error 404 </title>
   [junit4]   2> </head>
   [junit4]   2> <body>
   [junit4]   2> <h2>HTTP ERROR: 404</h2>
   [junit4]   2> <p>Problem accessing /solr/replication. Reason:
   [junit4]   2> <pre>    Can not find: /solr/replication</pre></p>
   [junit4]   2> <hr /><a href="http://eclipse.org/jetty">Powered by Jetty:// 9.3.14.v20161028</a><hr/>
   [junit4]   2> </body>
   [junit4]   2> </html>
   [junit4]   2> 
   [junit4]   2> 	at org.apache.solr.client.solrj.impl.HttpSolrClient.executeMethod(HttpSolrClient.java:591)
   [junit4]   2> 	at org.apache.solr.client.solrj.impl.HttpSolrClient.request(HttpSolrClient.java:253)
   [junit4]   2> 	at org.apache.solr.client.solrj.impl.HttpSolrClient.request(HttpSolrClient.java:242)
   [junit4]   2> 	at org.apache.solr.client.solrj.SolrClient.request(SolrClient.java:1219)
   [junit4]   2> 	at org.apache.solr.handler.IndexFetcher.getDetails(IndexFetcher.java:1813)
   [junit4]   2> 	at org.apache.solr.handler.ReplicationHandler.getReplicationDetails(ReplicationHandler.java:952)
   [junit4]   2> 	at org.apache.solr.handler.ReplicationHandler.handleRequestBody(ReplicationHandler.java:330)
   [junit4]   2> 	at org.apache.solr.handler.RequestHandlerBase.handleRequest(RequestHandlerBase.java:177)
   [junit4]   2> 	at org.apache.solr.core.SolrCore.execute(SolrCore.java:2482)
   [junit4]   2> 	at org.apache.solr.servlet.HttpSolrCall.execute(HttpSolrCall.java:720)
   [junit4]   2> 	at org.apache.solr.servlet.HttpSolrCall.call(HttpSolrCall.java:526)
   [junit4]   2> 	at org.apache.solr.servlet.SolrDispatchFilter.doFilter(SolrDispatchFilter.java:378)
   [junit4]   2> 	at org.apache.solr.servlet.SolrDispatchFilter.doFilter(SolrDispatchFilter.java:322)
   [junit4]   2> 	at org.eclipse.jetty.servlet.ServletHandler$CachedChain.doFilter(ServletHandler.java:1699)
   [junit4]   2> 	at org.apache.solr.client.solrj.embedded.JettySolrRunner$DebugFilter.doFilter(JettySolrRunner.java:139)
   [junit4]   2> 	at org.eclipse.jetty.servlet.ServletHandler$CachedChain.doFilter(ServletHandler.java:1699)
   [junit4]   2> 	at org.eclipse.jetty.servlet.ServletHandler.doHandle(ServletHandler.java:582)
   [junit4]   2> 	at org.eclipse.jetty.server.session.SessionHandler.doHandle(SessionHandler.java:224)
   [junit4]   2> 	at org.eclipse.jetty.server.handler.ContextHandler.doHandle(ContextHandler.java:1180)
   [junit4]   2> 	at org.eclipse.jetty.servlet.ServletHandler.doScope(ServletHandler.java:512)
   [junit4]   2> 	at org.eclipse.jetty.server.session.SessionHandler.doScope(SessionHandler.java:185)
   [junit4]   2> 	at org.eclipse.jetty.server.handler.ContextHandler.doScope(ContextHandler.java:1112)
   [junit4]   2> 	at org.eclipse.jetty.server.handler.ScopedHandler.handle(ScopedHandler.java:141)
   [junit4]   2> 	at org.eclipse.jetty.server.handler.gzip.GzipHandler.handle(GzipHandler.java:462)
   [junit4]   2> 	at org.eclipse.jetty.server.handler.HandlerWrapper.handle(HandlerWrapper.java:134)
   [junit4]   2> 	at org.eclipse.jetty.server.Server.handle(Server.java:534)
   [junit4]   2> 	at org.eclipse.jetty.server.HttpChannel.handle(HttpChannel.java:320)
   [junit4]   2> 	at org.eclipse.jetty.server.HttpConnection.onFillable(HttpConnection.java:251)
   [junit4]   2> 	at org.eclipse.jetty.io.AbstractConnection$ReadCallback.succeeded(AbstractConnection.java:273)
   [junit4]   2> 	at org.eclipse.jetty.io.FillInterest.fillable(FillInterest.java:95)
   [junit4]   2> 	at org.eclipse.jetty.io.SelectChannelEndPoint$2.run(SelectChannelEndPoint.java:93)
   [junit4]   2> 	at org.eclipse.jetty.util.thread.strategy.ExecuteProduceConsume.executeProduceConsume(ExecuteProduceConsume.java:303)
   [junit4]   2> 	at org.eclipse.jetty.util.thread.strategy.ExecuteProduceConsume.produceConsume(ExecuteProduceConsume.java:148)
   [junit4]   2> 	at org.eclipse.jetty.util.thread.strategy.ExecuteProduceConsume.run(ExecuteProduceConsume.java:136)
   [junit4]   2> 	at org.eclipse.jetty.util.thread.QueuedThreadPool.runJob(QueuedThreadPool.java:671)
   [junit4]   2> 	at org.eclipse.jetty.util.thread.QueuedThreadPool$2.run(QueuedThreadPool.java:589)
   [junit4]   2> 	at java.lang.Thread.run(Thread.java:748)
   [junit4]   2> 405140 INFO  (qtp1994246037-3751) [    x:collection1] o.a.s.c.S.Request [collection1]  webapp=/solr path=/replication params={_trace=getDetails&qt=/replication&wt=javabin&version=2&command=details} status=0 QTime=4
   [junit4]   2> 405143 INFO  (TEST-TestReplicationHandler.doTestDetails-seed#[5E33055001FC95BA]) [    ] o.e.j.s.AbstractConnector Stopped ServerConnector@7a97349e{HTTP/1.1,[http/1.1]}{127.0.0.1:0}
   [junit4]   2> 405143 INFO  (TEST-TestReplicationHandler.doTestDetails-seed#[5E33055001FC95BA]) [    ] o.a.s.c.CoreContainer Shutting down CoreContainer instance=409066100
   [junit4]   2> 405143 INFO  (TEST-TestReplicationHandler.doTestDetails-seed#[5E33055001FC95BA]) [    ] o.a.s.m.SolrMetricManager Closing metric reporters for registry=solr.node, tag=null
   [junit4]   2> 405143 INFO  (TEST-TestReplicationHandler.doTestDetails-seed#[5E33055001FC95BA]) [    ] o.a.s.m.SolrMetricManager Closing metric reporters for registry=solr.jvm, tag=null
   [junit4]   2> 405143 INFO  (TEST-TestReplicationHandler.doTestDetails-seed#[5E33055001FC95BA]) [    ] o.a.s.m.SolrMetricManager Closing metric reporters for registry=solr.jetty, tag=null
   [junit4]   2> 405143 INFO  (TEST-TestReplicationHandler.doTestDetails-seed#[5E33055001FC95BA]) [    ] o.a.s.c.TransientSolrCoreCacheDefault Allocating transient cache for 4 transient cores
   [junit4]   2> 405151 INFO  (coreCloseExecutor-1121-thread-1) [    x:collection1] o.a.s.c.SolrCore [collection1]  CLOSING SolrCore org.apache.solr.core.SolrCore@10b733b7
   [junit4]   2> 405157 INFO  (coreCloseExecutor-1121-thread-1) [    x:collection1] o.a.s.m.SolrMetricManager Closing metric reporters for registry=solr.core.collection1, tag=280441783
   [junit4]   2> 405157 INFO  (TEST-TestReplicationHandler.doTestDetails-seed#[5E33055001FC95BA]) [    ] o.e.j.s.h.ContextHandler Stopped o.e.j.s.ServletContextHandler@5b3b2d8e{/solr,null,UNAVAILABLE}
   [junit4]   2> 405159 INFO  (TEST-TestReplicationHandler.doTestDetails-seed#[5E33055001FC95BA]) [    ] o.a.s.SolrTestCaseJ4 ###Ending doTestDetails
   [junit4]   2> 405166 INFO  (TEST-TestReplicationHandler.doTestDetails-seed#[5E33055001FC95BA]) [    ] o.e.j.s.AbstractConnector Stopped ServerConnector@7f43357a{HTTP/1.1,[http/1.1]}{127.0.0.1:0}
   [junit4]   2> 405166 INFO  (TEST-TestReplicationHandler.doTestDetails-seed#[5E33055001FC95BA]) [    ] o.a.s.c.CoreContainer Shutting down CoreContainer instance=190592016
   [junit4]   2> 405166 INFO  (TEST-TestReplicationHandler.doTestDetails-seed#[5E33055001FC95BA]) [    ] o.a.s.m.SolrMetricManager Closing metric reporters for registry=solr.node, tag=null
   [junit4]   2> 405168 INFO  (TEST-TestReplicationHandler.doTestDetails-seed#[5E33055001FC95BA]) [    ] o.a.s.m.SolrMetricManager Closing metric reporters 

[...truncated too long message...]

5001FC95BA]) [    ] o.a.s.c.ZkTestServer connecting to 127.0.0.1:32830 32830
   [junit4]   2> 2764225 INFO  (Thread-10081) [    ] o.a.s.c.ZkTestServer connecting to 127.0.0.1:32830 32830
   [junit4]   2> 2764227 WARN  (Thread-10081) [    ] o.a.s.c.ZkTestServer Watch limit violations: 
   [junit4]   2> Maximum concurrent create/delete watches above limit:
   [junit4]   2> 
   [junit4]   2> 	6	/solr/aliases.json
   [junit4]   2> 	4	/solr/security.json
   [junit4]   2> 	4	/solr/configs/conf1
   [junit4]   2> 
   [junit4]   2> Maximum concurrent data watches above limit:
   [junit4]   2> 
   [junit4]   2> 	6	/solr/clusterprops.json
   [junit4]   2> 	6	/solr/clusterstate.json
   [junit4]   2> 	3	/solr/collections/forceleader_test_collection/state.json
   [junit4]   2> 	3	/solr/collections/collection1/state.json
   [junit4]   2> 
   [junit4]   2> Maximum concurrent children watches above limit:
   [junit4]   2> 
   [junit4]   2> 	6	/solr/live_nodes
   [junit4]   2> 	6	/solr/collections
   [junit4]   2> 	2	/solr/overseer/queue
   [junit4]   2> 	2	/solr/overseer/collection-queue-work
   [junit4]   2> 
   [junit4]   2> 2764227 WARN  (TEST-ForceLeaderTest.testReplicasInLIRNoLeader-seed#[5E33055001FC95BA]) [    ] o.a.s.c.SocketProxy Closing 0 connections to: http://127.0.0.1:42980/, target: http://127.0.0.1:58710/
   [junit4]   2> 2764227 WARN  (TEST-ForceLeaderTest.testReplicasInLIRNoLeader-seed#[5E33055001FC95BA]) [    ] o.a.s.c.SocketProxy Closing 3 connections to: http://127.0.0.1:39343/, target: http://127.0.0.1:48682/
   [junit4]   2> 2764227 WARN  (TEST-ForceLeaderTest.testReplicasInLIRNoLeader-seed#[5E33055001FC95BA]) [    ] o.a.s.c.SocketProxy Closing 6 connections to: http://127.0.0.1:37975/, target: http://127.0.0.1:47032/
   [junit4]   2> 2764227 WARN  (TEST-ForceLeaderTest.testReplicasInLIRNoLeader-seed#[5E33055001FC95BA]) [    ] o.a.s.c.SocketProxy Closing 14 connections to: http://127.0.0.1:44808/, target: http://127.0.0.1:40998/
   [junit4]   2> NOTE: download the large Jenkins line-docs file by running 'ant get-jenkins-line-docs' in the lucene directory.
   [junit4]   2> NOTE: reproduce with: ant test  -Dtestcase=ForceLeaderTest -Dtests.method=testReplicasInLIRNoLeader -Dtests.seed=5E33055001FC95BA -Dtests.multiplier=2 -Dtests.nightly=true -Dtests.slow=true -Dtests.linedocsfile=/home/jenkins/jenkins-slave/workspace/Lucene-Solr-NightlyTests-master/test-data/enwiki.random.lines.txt -Dtests.locale=ar-SA -Dtests.timezone=America/Yakutat -Dtests.asserts=true -Dtests.file.encoding=UTF-8
   [junit4] FAILURE 59.5s J2 | ForceLeaderTest.testReplicasInLIRNoLeader <<<
   [junit4]    > Throwable #1: java.lang.AssertionError: Doc with id=1 not found in http://127.0.0.1:44808/forceleader_test_collection due to: Path not found: /id; rsp={doc=null}
   [junit4]    > 	at __randomizedtesting.SeedInfo.seed([5E33055001FC95BA:B8A43190387E6CDB]:0)
   [junit4]    > 	at org.apache.solr.cloud.HttpPartitionTest.assertDocExists(HttpPartitionTest.java:603)
   [junit4]    > 	at org.apache.solr.cloud.HttpPartitionTest.assertDocsExistInAllReplicas(HttpPartitionTest.java:556)
   [junit4]    > 	at org.apache.solr.cloud.ForceLeaderTest.testReplicasInLIRNoLeader(ForceLeaderTest.java:142)
   [junit4]    > 	at org.apache.solr.BaseDistributedSearchTestCase$ShardsRepeatRule$ShardsFixedStatement.callStatement(BaseDistributedSearchTestCase.java:993)
   [junit4]    > 	at org.apache.solr.BaseDistributedSearchTestCase$ShardsRepeatRule$ShardsStatement.evaluate(BaseDistributedSearchTestCase.java:968)
   [junit4]    > 	at java.lang.Thread.run(Thread.java:748)
   [junit4]   2> NOTE: leaving temporary files on disk at: /x1/jenkins/jenkins-slave/workspace/Lucene-Solr-NightlyTests-master/checkout/solr/build/solr-core/test/J2/temp/solr.cloud.ForceLeaderTest_5E33055001FC95BA-001
   [junit4]   2> Aug 12, 2017 4:46:46 PM com.carrotsearch.randomizedtesting.ThreadLeakControl checkThreadLeaks
   [junit4]   2> WARNING: Will linger awaiting termination of 1 leaked thread(s).
   [junit4]   2> NOTE: test params are: codec=Asserting(Lucene70), sim=RandomSimilarity(queryNorm=false): {}, locale=ar-SA, timezone=America/Yakutat
   [junit4]   2> NOTE: Linux 3.13.0-88-generic amd64/Oracle Corporation 1.8.0_144 (64-bit)/cpus=4,threads=1,free=209623032,total=526385152
   [junit4]   2> NOTE: All tests run in this JVM: [TestConfigSetProperties, TestExactStatsCache, BlockJoinFacetRandomTest, TestSolrConfigHandler, MultiTermTest, TestLegacyFieldReuse, TestSolrDeletionPolicy2, TestNumericTokenStream, SolrCoreCheckLockOnStartupTest, TestManagedSynonymFilterFactory, HardAutoCommitTest, TestJettySolrRunner, TestScoreJoinQPScore, TestAddFieldRealTimeGet, ReplicationFactorTest, CoreMergeIndexesAdminHandlerTest, BigEndianAscendingWordDeserializerTest, PreAnalyzedFieldTest, TestStressLiveNodes, TestSchemaResource, SolrInfoBeanTest, RequiredFieldsTest, ShowFileRequestHandlerTest, V2StandaloneTest, TestMissingGroups, ImplicitSnitchTest, DistributedExpandComponentTest, HdfsChaosMonkeySafeLeaderTest, UUIDUpdateProcessorFallbackTest, TestReversedWildcardFilterFactory, TestFoldingMultitermQuery, TestFieldCacheWithThreads, TestReRankQParserPlugin, CustomCollectionTest, TestExceedMaxTermLength, TestRawTransformer, TestBlendedInfixSuggestions, TestSortByMinMaxFunction, TestStressReorder, SuggesterTest, ConfigSetsAPITest, TestPKIAuthenticationPlugin, OverseerStatusTest, TestStandardQParsers, ParsingFieldUpdateProcessorsTest, PeerSyncWithIndexFingerprintCachingTest, DocValuesNotIndexedTest, TestMultiValuedNumericRangeQuery, TestXmlQParser, TestObjectReleaseTracker, SharedFSAutoReplicaFailoverTest, HdfsRecoverLeaseTest, RegexBoostProcessorTest, TestPrepRecovery, TestRecovery, ClusterStateTest, NumericFieldsTest, MinimalSchemaTest, TestFieldTypeCollectionResource, TestCollectionAPI, TestComplexPhraseQParserPlugin, CollectionsAPIAsyncDistributedZkTest, TestManagedResource, TestSolr4Spatial2, FastVectorHighlighterTest, ManagedSchemaRoundRobinCloudTest, SimplePostToolTest, BufferStoreTest, ReturnFieldsTest, SSLMigrationTest, URLClassifyProcessorTest, TestDeleteCollectionOnDownNodes, CollectionReloadTest, StatsReloadRaceTest, TestExclusionRuleCollectionAccess, SmileWriterTest, TestRandomFlRTGCloud, HdfsBasicDistributedZk2Test, TestJmxIntegration, TestQueryUtils, SignatureUpdateProcessorFactoryTest, UnloadDistributedZkTest, VMParamsZkACLAndCredentialsProvidersTest, PolyFieldTest, TestCloudSchemaless, TestSSLRandomization, NodeMutatorTest, AsyncCallRequestStatusResponseTest, SolrMetricReporterTest, TestHighFrequencyDictionaryFactory, TestCloudNestedDocsSort, TestPointFields, AddSchemaFieldsUpdateProcessorFactoryTest, PingRequestHandlerTest, CdcrVersionReplicationTest, DocumentBuilderTest, TestUnifiedSolrHighlighter, TestDynamicFieldResource, TestPseudoReturnFields, TestUtils, TestReload, TestCloudRecovery, SearchHandlerTest, CdcrReplicationDistributedZkTest, TestReplicaProperties, TestSort, BadIndexSchemaTest, TestSuggestSpellingConverter, ConfigureRecoveryStrategyTest, ConjunctionSolrSpellCheckerTest, TestTrie, SuggesterFSTTest, TestInPlaceUpdatesStandalone, TestLFUCache, DistributedFacetPivotWhiteBoxTest, TestTestInjection, TestQuerySenderListener, TestManagedSchema, TermVectorComponentDistributedTest, DistributedTermsComponentTest, SimpleFacetsTest, StatsComponentTest, TestGroupingSearch, TestFunctionQuery, BasicFunctionalityTest, DirectUpdateHandlerTest, TestBadConfig, TestIndexSearcher, HighlighterTest, AnalysisAfterCoreReloadTest, TestExtendedDismaxParser, SpellCheckCollatorTest, CoreAdminHandlerTest, DocValuesTest, SuggesterTSTTest, TestStressLucene, FieldMutatingUpdateProcessorTest, TestAtomicUpdateErrorCases, TestWordDelimiterFilterFactory, QueryEqualityTest, DirectUpdateHandlerOptimizeTest, DefaultValueUpdateProcessorTest, SortByFunctionTest, DocValuesMultiTest, TestSolrDeletionPolicy1, XsltUpdateRequestHandlerTest, TestSurroundQueryParser, LukeRequestHandlerTest, DisMaxRequestHandlerTest, TestWriterPerf, DocumentAnalysisRequestHandlerTest, TestQueryTypes, PrimitiveFieldTypeTest, FileBasedSpellCheckerTest, TermsComponentTest, XmlUpdateRequestHandlerTest, RequestHandlersTest, PathHierarchyTokenizerFactoryTest, TermVectorComponentTest, TestIndexingPerformance, MoreLikeThisHandlerTest, IndexSchemaRuntimeFieldTest, LoggingHandlerTest, SolrPluginUtilsTest, UpdateRequestProcessorFactoryTest, MBeansHandlerTest, TestAnalyzedSuggestions, UniqFieldsUpdateProcessorFactoryTest, JsonLoaderTest, BinaryUpdateRequestHandlerTest, TestPHPSerializedResponseWriter, TestComponentsName, UpdateParamsTest, TestSolrIndexConfig, TestQuerySenderNoQuery, CopyFieldTest, ResponseLogComponentTest, SolrIndexConfigTest, BadComponentTest, TestStressRecovery, TestMergePolicyConfig, SampleTest, TestDocSet, TestSearchPerf, TestConfig, OutputWriterTest, TestFuzzyAnalyzedSuggestions, TestSolrCoreProperties, TestPostingsSolrHighlighter, DirectSolrConnectionTest, NotRequiredUniqueKeyTest, TestLuceneMatchVersion, SpellPossibilityIteratorTest, TestCodecSupport, TestXIncludeConfig, TestSweetSpotSimilarityFactory, TestDFRSimilarityFactory, TestPerFieldSimilarity, TestLMJelinekMercerSimilarityFactory, TestBM25SimilarityFactory, TestFastWriter, TimeZoneUtilsTest, ResourceLoaderTest, TestFastOutputStream, DateMathParserTest, TestSystemIdResolver, PrimUtilsTest, DateFieldTest, SpellingQueryConverterTest, TestSolrJ, TestLRUCache, ZkNodePropsTest, SliceStateTest, SystemInfoHandlerTest, UUIDFieldTest, CircularListTest, DistributedMLTComponentTest, SolrTestCaseJ4Test, TestDistributedMissingSort, TestSimpleTrackingShardHandler, TestTolerantSearch, TestEmbeddedSolrServerConstructors, ActionThrottleTest, AliasIntegrationTest, AssignBackwardCompatibilityTest, CdcrBootstrapTest, ChaosMonkeyNothingIsSafeWithPullReplicasTest, DeleteLastCustomShardedReplicaTest, DeleteReplicaTest, DistribJoinFromCollectionTest, ForceLeaderTest]
   [junit4] Completed [514/729 (4!)] on J2 in 132.07s, 3 tests, 1 failure, 1 skipped <<< FAILURES!

[...truncated 43941 lines...]

Mime
View raw message