lucene-dev mailing list archives

Site index · List index
Message view « Date » · « Thread »
Top « Date » · « Thread »
From Policeman Jenkins Server <jenk...@thetaphi.de>
Subject [JENKINS-EA] Lucene-Solr-master-Windows (32bit/jdk-9-ea+181) - Build # 6848 - Still Unstable!
Date Sat, 26 Aug 2017 13:39:04 GMT
Build: https://jenkins.thetaphi.de/job/Lucene-Solr-master-Windows/6848/
Java: 32bit/jdk-9-ea+181 -server -XX:+UseSerialGC --illegal-access=deny

3 tests failed.
FAILED:  org.apache.solr.cloud.ForceLeaderTest.testReplicasInLIRNoLeader

Error Message:
Doc with id=1 not found in http://127.0.0.1:53130/forceleader_test_collection due to: Path not found: /id; rsp={doc=null}

Stack Trace:
java.lang.AssertionError: Doc with id=1 not found in http://127.0.0.1:53130/forceleader_test_collection due to: Path not found: /id; rsp={doc=null}
	at __randomizedtesting.SeedInfo.seed([6D769DA18FE00175:8BE1A961B662F814]:0)
	at org.junit.Assert.fail(Assert.java:93)
	at org.junit.Assert.assertTrue(Assert.java:43)
	at org.apache.solr.cloud.HttpPartitionTest.assertDocExists(HttpPartitionTest.java:603)
	at org.apache.solr.cloud.HttpPartitionTest.assertDocsExistInAllReplicas(HttpPartitionTest.java:556)
	at org.apache.solr.cloud.ForceLeaderTest.testReplicasInLIRNoLeader(ForceLeaderTest.java:142)
	at java.base/jdk.internal.reflect.NativeMethodAccessorImpl.invoke0(Native Method)
	at java.base/jdk.internal.reflect.NativeMethodAccessorImpl.invoke(NativeMethodAccessorImpl.java:62)
	at java.base/jdk.internal.reflect.DelegatingMethodAccessorImpl.invoke(DelegatingMethodAccessorImpl.java:43)
	at java.base/java.lang.reflect.Method.invoke(Method.java:564)
	at com.carrotsearch.randomizedtesting.RandomizedRunner.invoke(RandomizedRunner.java:1713)
	at com.carrotsearch.randomizedtesting.RandomizedRunner$8.evaluate(RandomizedRunner.java:907)
	at com.carrotsearch.randomizedtesting.RandomizedRunner$9.evaluate(RandomizedRunner.java:943)
	at com.carrotsearch.randomizedtesting.RandomizedRunner$10.evaluate(RandomizedRunner.java:957)
	at org.apache.solr.BaseDistributedSearchTestCase$ShardsRepeatRule$ShardsFixedStatement.callStatement(BaseDistributedSearchTestCase.java:993)
	at org.apache.solr.BaseDistributedSearchTestCase$ShardsRepeatRule$ShardsStatement.evaluate(BaseDistributedSearchTestCase.java:968)
	at com.carrotsearch.randomizedtesting.rules.SystemPropertiesRestoreRule$1.evaluate(SystemPropertiesRestoreRule.java:57)
	at org.apache.lucene.util.TestRuleSetupTeardownChained$1.evaluate(TestRuleSetupTeardownChained.java:49)
	at org.apache.lucene.util.AbstractBeforeAfterRule$1.evaluate(AbstractBeforeAfterRule.java:45)
	at org.apache.lucene.util.TestRuleThreadAndTestName$1.evaluate(TestRuleThreadAndTestName.java:48)
	at org.apache.lucene.util.TestRuleIgnoreAfterMaxFailures$1.evaluate(TestRuleIgnoreAfterMaxFailures.java:64)
	at org.apache.lucene.util.TestRuleMarkFailure$1.evaluate(TestRuleMarkFailure.java:47)
	at com.carrotsearch.randomizedtesting.rules.StatementAdapter.evaluate(StatementAdapter.java:36)
	at com.carrotsearch.randomizedtesting.ThreadLeakControl$StatementRunner.run(ThreadLeakControl.java:368)
	at com.carrotsearch.randomizedtesting.ThreadLeakControl.forkTimeoutingTask(ThreadLeakControl.java:817)
	at com.carrotsearch.randomizedtesting.ThreadLeakControl$3.evaluate(ThreadLeakControl.java:468)
	at com.carrotsearch.randomizedtesting.RandomizedRunner.runSingleTest(RandomizedRunner.java:916)
	at com.carrotsearch.randomizedtesting.RandomizedRunner$5.evaluate(RandomizedRunner.java:802)
	at com.carrotsearch.randomizedtesting.RandomizedRunner$6.evaluate(RandomizedRunner.java:852)
	at com.carrotsearch.randomizedtesting.RandomizedRunner$7.evaluate(RandomizedRunner.java:863)
	at com.carrotsearch.randomizedtesting.rules.StatementAdapter.evaluate(StatementAdapter.java:36)
	at com.carrotsearch.randomizedtesting.rules.SystemPropertiesRestoreRule$1.evaluate(SystemPropertiesRestoreRule.java:57)
	at org.apache.lucene.util.AbstractBeforeAfterRule$1.evaluate(AbstractBeforeAfterRule.java:45)
	at com.carrotsearch.randomizedtesting.rules.StatementAdapter.evaluate(StatementAdapter.java:36)
	at org.apache.lucene.util.TestRuleStoreClassName$1.evaluate(TestRuleStoreClassName.java:41)
	at com.carrotsearch.randomizedtesting.rules.NoShadowingOrOverridesOnMethodsRule$1.evaluate(NoShadowingOrOverridesOnMethodsRule.java:40)
	at com.carrotsearch.randomizedtesting.rules.NoShadowingOrOverridesOnMethodsRule$1.evaluate(NoShadowingOrOverridesOnMethodsRule.java:40)
	at com.carrotsearch.randomizedtesting.rules.StatementAdapter.evaluate(StatementAdapter.java:36)
	at com.carrotsearch.randomizedtesting.rules.StatementAdapter.evaluate(StatementAdapter.java:36)
	at org.apache.lucene.util.TestRuleAssertionsRequired$1.evaluate(TestRuleAssertionsRequired.java:53)
	at org.apache.lucene.util.TestRuleMarkFailure$1.evaluate(TestRuleMarkFailure.java:47)
	at org.apache.lucene.util.TestRuleIgnoreAfterMaxFailures$1.evaluate(TestRuleIgnoreAfterMaxFailures.java:64)
	at org.apache.lucene.util.TestRuleIgnoreTestSuites$1.evaluate(TestRuleIgnoreTestSuites.java:54)
	at com.carrotsearch.randomizedtesting.rules.StatementAdapter.evaluate(StatementAdapter.java:36)
	at com.carrotsearch.randomizedtesting.ThreadLeakControl$StatementRunner.run(ThreadLeakControl.java:368)
	at java.base/java.lang.Thread.run(Thread.java:844)


FAILED:  org.apache.solr.metrics.reporters.SolrSlf4jReporterTest.testReporter

Error Message:
count1=6, count2=6 - no 'solr.node' logs in: {numFound=0,start=0,docs=[]}

Stack Trace:
java.lang.AssertionError: count1=6, count2=6 - no 'solr.node' logs in: {numFound=0,start=0,docs=[]}
	at __randomizedtesting.SeedInfo.seed([6D769DA18FE00175:3292B096E4EC9230]:0)
	at org.junit.Assert.fail(Assert.java:93)
	at org.apache.solr.metrics.reporters.SolrSlf4jReporterTest.testReporter(SolrSlf4jReporterTest.java:90)
	at java.base/jdk.internal.reflect.NativeMethodAccessorImpl.invoke0(Native Method)
	at java.base/jdk.internal.reflect.NativeMethodAccessorImpl.invoke(NativeMethodAccessorImpl.java:62)
	at java.base/jdk.internal.reflect.DelegatingMethodAccessorImpl.invoke(DelegatingMethodAccessorImpl.java:43)
	at java.base/java.lang.reflect.Method.invoke(Method.java:564)
	at com.carrotsearch.randomizedtesting.RandomizedRunner.invoke(RandomizedRunner.java:1713)
	at com.carrotsearch.randomizedtesting.RandomizedRunner$8.evaluate(RandomizedRunner.java:907)
	at com.carrotsearch.randomizedtesting.RandomizedRunner$9.evaluate(RandomizedRunner.java:943)
	at com.carrotsearch.randomizedtesting.RandomizedRunner$10.evaluate(RandomizedRunner.java:957)
	at com.carrotsearch.randomizedtesting.rules.SystemPropertiesRestoreRule$1.evaluate(SystemPropertiesRestoreRule.java:57)
	at org.apache.lucene.util.TestRuleSetupTeardownChained$1.evaluate(TestRuleSetupTeardownChained.java:49)
	at org.apache.lucene.util.AbstractBeforeAfterRule$1.evaluate(AbstractBeforeAfterRule.java:45)
	at org.apache.lucene.util.TestRuleThreadAndTestName$1.evaluate(TestRuleThreadAndTestName.java:48)
	at org.apache.lucene.util.TestRuleIgnoreAfterMaxFailures$1.evaluate(TestRuleIgnoreAfterMaxFailures.java:64)
	at org.apache.lucene.util.TestRuleMarkFailure$1.evaluate(TestRuleMarkFailure.java:47)
	at com.carrotsearch.randomizedtesting.rules.StatementAdapter.evaluate(StatementAdapter.java:36)
	at com.carrotsearch.randomizedtesting.ThreadLeakControl$StatementRunner.run(ThreadLeakControl.java:368)
	at com.carrotsearch.randomizedtesting.ThreadLeakControl.forkTimeoutingTask(ThreadLeakControl.java:817)
	at com.carrotsearch.randomizedtesting.ThreadLeakControl$3.evaluate(ThreadLeakControl.java:468)
	at com.carrotsearch.randomizedtesting.RandomizedRunner.runSingleTest(RandomizedRunner.java:916)
	at com.carrotsearch.randomizedtesting.RandomizedRunner$5.evaluate(RandomizedRunner.java:802)
	at com.carrotsearch.randomizedtesting.RandomizedRunner$6.evaluate(RandomizedRunner.java:852)
	at com.carrotsearch.randomizedtesting.RandomizedRunner$7.evaluate(RandomizedRunner.java:863)
	at com.carrotsearch.randomizedtesting.rules.StatementAdapter.evaluate(StatementAdapter.java:36)
	at com.carrotsearch.randomizedtesting.rules.SystemPropertiesRestoreRule$1.evaluate(SystemPropertiesRestoreRule.java:57)
	at org.apache.lucene.util.AbstractBeforeAfterRule$1.evaluate(AbstractBeforeAfterRule.java:45)
	at com.carrotsearch.randomizedtesting.rules.StatementAdapter.evaluate(StatementAdapter.java:36)
	at org.apache.lucene.util.TestRuleStoreClassName$1.evaluate(TestRuleStoreClassName.java:41)
	at com.carrotsearch.randomizedtesting.rules.NoShadowingOrOverridesOnMethodsRule$1.evaluate(NoShadowingOrOverridesOnMethodsRule.java:40)
	at com.carrotsearch.randomizedtesting.rules.NoShadowingOrOverridesOnMethodsRule$1.evaluate(NoShadowingOrOverridesOnMethodsRule.java:40)
	at com.carrotsearch.randomizedtesting.rules.StatementAdapter.evaluate(StatementAdapter.java:36)
	at com.carrotsearch.randomizedtesting.rules.StatementAdapter.evaluate(StatementAdapter.java:36)
	at org.apache.lucene.util.TestRuleAssertionsRequired$1.evaluate(TestRuleAssertionsRequired.java:53)
	at org.apache.lucene.util.TestRuleMarkFailure$1.evaluate(TestRuleMarkFailure.java:47)
	at org.apache.lucene.util.TestRuleIgnoreAfterMaxFailures$1.evaluate(TestRuleIgnoreAfterMaxFailures.java:64)
	at org.apache.lucene.util.TestRuleIgnoreTestSuites$1.evaluate(TestRuleIgnoreTestSuites.java:54)
	at com.carrotsearch.randomizedtesting.rules.StatementAdapter.evaluate(StatementAdapter.java:36)
	at com.carrotsearch.randomizedtesting.ThreadLeakControl$StatementRunner.run(ThreadLeakControl.java:368)
	at java.base/java.lang.Thread.run(Thread.java:844)


FAILED:  junit.framework.TestSuite.org.apache.solr.util.TestSolrCLIRunExample

Error Message:
Could not remove the following files (in the order of attempts):    C:\Users\jenkins\workspace\Lucene-Solr-master-Windows\solr\build\solr-core\test\J0\temp\solr.util.TestSolrCLIRunExample_6D769DA18FE00175-001\tempDir-007\schemaless\solr\gettingstarted: java.nio.file.DirectoryNotEmptyException: C:\Users\jenkins\workspace\Lucene-Solr-master-Windows\solr\build\solr-core\test\J0\temp\solr.util.TestSolrCLIRunExample_6D769DA18FE00175-001\tempDir-007\schemaless\solr\gettingstarted    C:\Users\jenkins\workspace\Lucene-Solr-master-Windows\solr\build\solr-core\test\J0\temp\solr.util.TestSolrCLIRunExample_6D769DA18FE00175-001\tempDir-007\schemaless\solr: java.nio.file.DirectoryNotEmptyException: C:\Users\jenkins\workspace\Lucene-Solr-master-Windows\solr\build\solr-core\test\J0\temp\solr.util.TestSolrCLIRunExample_6D769DA18FE00175-001\tempDir-007\schemaless\solr    C:\Users\jenkins\workspace\Lucene-Solr-master-Windows\solr\build\solr-core\test\J0\temp\solr.util.TestSolrCLIRunExample_6D769DA18FE00175-001\tempDir-007\schemaless: java.nio.file.DirectoryNotEmptyException: C:\Users\jenkins\workspace\Lucene-Solr-master-Windows\solr\build\solr-core\test\J0\temp\solr.util.TestSolrCLIRunExample_6D769DA18FE00175-001\tempDir-007\schemaless    C:\Users\jenkins\workspace\Lucene-Solr-master-Windows\solr\build\solr-core\test\J0\temp\solr.util.TestSolrCLIRunExample_6D769DA18FE00175-001\tempDir-007: java.nio.file.DirectoryNotEmptyException: C:\Users\jenkins\workspace\Lucene-Solr-master-Windows\solr\build\solr-core\test\J0\temp\solr.util.TestSolrCLIRunExample_6D769DA18FE00175-001\tempDir-007 

Stack Trace:
java.io.IOException: Could not remove the following files (in the order of attempts):
   C:\Users\jenkins\workspace\Lucene-Solr-master-Windows\solr\build\solr-core\test\J0\temp\solr.util.TestSolrCLIRunExample_6D769DA18FE00175-001\tempDir-007\schemaless\solr\gettingstarted: java.nio.file.DirectoryNotEmptyException: C:\Users\jenkins\workspace\Lucene-Solr-master-Windows\solr\build\solr-core\test\J0\temp\solr.util.TestSolrCLIRunExample_6D769DA18FE00175-001\tempDir-007\schemaless\solr\gettingstarted
   C:\Users\jenkins\workspace\Lucene-Solr-master-Windows\solr\build\solr-core\test\J0\temp\solr.util.TestSolrCLIRunExample_6D769DA18FE00175-001\tempDir-007\schemaless\solr: java.nio.file.DirectoryNotEmptyException: C:\Users\jenkins\workspace\Lucene-Solr-master-Windows\solr\build\solr-core\test\J0\temp\solr.util.TestSolrCLIRunExample_6D769DA18FE00175-001\tempDir-007\schemaless\solr
   C:\Users\jenkins\workspace\Lucene-Solr-master-Windows\solr\build\solr-core\test\J0\temp\solr.util.TestSolrCLIRunExample_6D769DA18FE00175-001\tempDir-007\schemaless: java.nio.file.DirectoryNotEmptyException: C:\Users\jenkins\workspace\Lucene-Solr-master-Windows\solr\build\solr-core\test\J0\temp\solr.util.TestSolrCLIRunExample_6D769DA18FE00175-001\tempDir-007\schemaless
   C:\Users\jenkins\workspace\Lucene-Solr-master-Windows\solr\build\solr-core\test\J0\temp\solr.util.TestSolrCLIRunExample_6D769DA18FE00175-001\tempDir-007: java.nio.file.DirectoryNotEmptyException: C:\Users\jenkins\workspace\Lucene-Solr-master-Windows\solr\build\solr-core\test\J0\temp\solr.util.TestSolrCLIRunExample_6D769DA18FE00175-001\tempDir-007

	at __randomizedtesting.SeedInfo.seed([6D769DA18FE00175]:0)
	at org.apache.lucene.util.IOUtils.rm(IOUtils.java:329)
	at org.apache.lucene.util.TestRuleTemporaryFilesCleanup.afterAlways(TestRuleTemporaryFilesCleanup.java:216)
	at com.carrotsearch.randomizedtesting.rules.TestRuleAdapter$1.afterAlways(TestRuleAdapter.java:31)
	at com.carrotsearch.randomizedtesting.rules.StatementAdapter.evaluate(StatementAdapter.java:43)
	at com.carrotsearch.randomizedtesting.rules.StatementAdapter.evaluate(StatementAdapter.java:36)
	at org.apache.lucene.util.TestRuleAssertionsRequired$1.evaluate(TestRuleAssertionsRequired.java:53)
	at org.apache.lucene.util.TestRuleMarkFailure$1.evaluate(TestRuleMarkFailure.java:47)
	at org.apache.lucene.util.TestRuleIgnoreAfterMaxFailures$1.evaluate(TestRuleIgnoreAfterMaxFailures.java:64)
	at org.apache.lucene.util.TestRuleIgnoreTestSuites$1.evaluate(TestRuleIgnoreTestSuites.java:54)
	at com.carrotsearch.randomizedtesting.rules.StatementAdapter.evaluate(StatementAdapter.java:36)
	at com.carrotsearch.randomizedtesting.ThreadLeakControl$StatementRunner.run(ThreadLeakControl.java:368)
	at java.base/java.lang.Thread.run(Thread.java:844)




Build Log:
[...truncated 11379 lines...]
   [junit4] Suite: org.apache.solr.cloud.ForceLeaderTest
   [junit4]   2> 791817 INFO  (SUITE-ForceLeaderTest-seed#[6D769DA18FE00175]-worker) [    ] o.a.s.SolrTestCaseJ4 SecureRandom sanity checks: test.solr.allowed.securerandom=null & java.security.egd=file:/dev/./urandom
   [junit4]   2> Creating dataDir: C:\Users\jenkins\workspace\Lucene-Solr-master-Windows\solr\build\solr-core\test\J0\temp\solr.cloud.ForceLeaderTest_6D769DA18FE00175-001\init-core-data-001
   [junit4]   2> 791817 WARN  (SUITE-ForceLeaderTest-seed#[6D769DA18FE00175]-worker) [    ] o.a.s.SolrTestCaseJ4 startTrackingSearchers: numOpens=52 numCloses=52
   [junit4]   2> 791818 INFO  (SUITE-ForceLeaderTest-seed#[6D769DA18FE00175]-worker) [    ] o.a.s.SolrTestCaseJ4 Using PointFields (NUMERIC_POINTS_SYSPROP=true) w/NUMERIC_DOCVALUES_SYSPROP=true
   [junit4]   2> 791819 INFO  (SUITE-ForceLeaderTest-seed#[6D769DA18FE00175]-worker) [    ] o.a.s.SolrTestCaseJ4 Randomized ssl (false) and clientAuth (false) via: @org.apache.solr.SolrTestCaseJ4$SuppressSSL(bugUrl="https://issues.apache.org/jira/browse/SOLR-5776")
   [junit4]   2> 791819 INFO  (SUITE-ForceLeaderTest-seed#[6D769DA18FE00175]-worker) [    ] o.a.s.BaseDistributedSearchTestCase Setting hostContext system property: /
   [junit4]   2> 791820 INFO  (TEST-ForceLeaderTest.testReplicasInLIRNoLeader-seed#[6D769DA18FE00175]) [    ] o.a.s.c.ZkTestServer STARTING ZK TEST SERVER
   [junit4]   2> 791821 INFO  (Thread-1353) [    ] o.a.s.c.ZkTestServer client port:0.0.0.0/0.0.0.0:0
   [junit4]   2> 791821 INFO  (Thread-1353) [    ] o.a.s.c.ZkTestServer Starting server
   [junit4]   2> 791826 ERROR (Thread-1353) [    ] o.a.z.s.ZooKeeperServer ZKShutdownHandler is not registered, so ZooKeeper server won't take any action on ERROR or SHUTDOWN server state changes
   [junit4]   2> 791921 INFO  (TEST-ForceLeaderTest.testReplicasInLIRNoLeader-seed#[6D769DA18FE00175]) [    ] o.a.s.c.ZkTestServer start zk server on port:53092
   [junit4]   2> 791938 INFO  (TEST-ForceLeaderTest.testReplicasInLIRNoLeader-seed#[6D769DA18FE00175]) [    ] o.a.s.c.AbstractZkTestCase put C:\Users\jenkins\workspace\Lucene-Solr-master-Windows\solr\core\src\test-files\solr\collection1\conf\solrconfig-tlog.xml to /configs/conf1/solrconfig.xml
   [junit4]   2> 791941 INFO  (TEST-ForceLeaderTest.testReplicasInLIRNoLeader-seed#[6D769DA18FE00175]) [    ] o.a.s.c.AbstractZkTestCase put C:\Users\jenkins\workspace\Lucene-Solr-master-Windows\solr\core\src\test-files\solr\collection1\conf\schema.xml to /configs/conf1/schema.xml
   [junit4]   2> 791944 INFO  (TEST-ForceLeaderTest.testReplicasInLIRNoLeader-seed#[6D769DA18FE00175]) [    ] o.a.s.c.AbstractZkTestCase put C:\Users\jenkins\workspace\Lucene-Solr-master-Windows\solr\core\src\test-files\solr\collection1\conf\solrconfig.snippet.randomindexconfig.xml to /configs/conf1/solrconfig.snippet.randomindexconfig.xml
   [junit4]   2> 791946 INFO  (TEST-ForceLeaderTest.testReplicasInLIRNoLeader-seed#[6D769DA18FE00175]) [    ] o.a.s.c.AbstractZkTestCase put C:\Users\jenkins\workspace\Lucene-Solr-master-Windows\solr\core\src\test-files\solr\collection1\conf\stopwords.txt to /configs/conf1/stopwords.txt
   [junit4]   2> 791948 INFO  (TEST-ForceLeaderTest.testReplicasInLIRNoLeader-seed#[6D769DA18FE00175]) [    ] o.a.s.c.AbstractZkTestCase put C:\Users\jenkins\workspace\Lucene-Solr-master-Windows\solr\core\src\test-files\solr\collection1\conf\protwords.txt to /configs/conf1/protwords.txt
   [junit4]   2> 791950 INFO  (TEST-ForceLeaderTest.testReplicasInLIRNoLeader-seed#[6D769DA18FE00175]) [    ] o.a.s.c.AbstractZkTestCase put C:\Users\jenkins\workspace\Lucene-Solr-master-Windows\solr\core\src\test-files\solr\collection1\conf\currency.xml to /configs/conf1/currency.xml
   [junit4]   2> 791952 INFO  (TEST-ForceLeaderTest.testReplicasInLIRNoLeader-seed#[6D769DA18FE00175]) [    ] o.a.s.c.AbstractZkTestCase put C:\Users\jenkins\workspace\Lucene-Solr-master-Windows\solr\core\src\test-files\solr\collection1\conf\enumsConfig.xml to /configs/conf1/enumsConfig.xml
   [junit4]   2> 791954 INFO  (TEST-ForceLeaderTest.testReplicasInLIRNoLeader-seed#[6D769DA18FE00175]) [    ] o.a.s.c.AbstractZkTestCase put C:\Users\jenkins\workspace\Lucene-Solr-master-Windows\solr\core\src\test-files\solr\collection1\conf\open-exchange-rates.json to /configs/conf1/open-exchange-rates.json
   [junit4]   2> 791956 INFO  (TEST-ForceLeaderTest.testReplicasInLIRNoLeader-seed#[6D769DA18FE00175]) [    ] o.a.s.c.AbstractZkTestCase put C:\Users\jenkins\workspace\Lucene-Solr-master-Windows\solr\core\src\test-files\solr\collection1\conf\mapping-ISOLatin1Accent.txt to /configs/conf1/mapping-ISOLatin1Accent.txt
   [junit4]   2> 791958 INFO  (TEST-ForceLeaderTest.testReplicasInLIRNoLeader-seed#[6D769DA18FE00175]) [    ] o.a.s.c.AbstractZkTestCase put C:\Users\jenkins\workspace\Lucene-Solr-master-Windows\solr\core\src\test-files\solr\collection1\conf\old_synonyms.txt to /configs/conf1/old_synonyms.txt
   [junit4]   2> 791959 INFO  (TEST-ForceLeaderTest.testReplicasInLIRNoLeader-seed#[6D769DA18FE00175]) [    ] o.a.s.c.AbstractZkTestCase put C:\Users\jenkins\workspace\Lucene-Solr-master-Windows\solr\core\src\test-files\solr\collection1\conf\synonyms.txt to /configs/conf1/synonyms.txt
   [junit4]   2> 791962 INFO  (TEST-ForceLeaderTest.testReplicasInLIRNoLeader-seed#[6D769DA18FE00175]) [    ] o.a.s.c.AbstractFullDistribZkTestBase Will use TLOG replicas unless explicitly asked otherwise
   [junit4]   2> 792321 INFO  (TEST-ForceLeaderTest.testReplicasInLIRNoLeader-seed#[6D769DA18FE00175]) [    ] o.e.j.s.Server jetty-9.3.20.v20170531
   [junit4]   2> 792322 INFO  (TEST-ForceLeaderTest.testReplicasInLIRNoLeader-seed#[6D769DA18FE00175]) [    ] o.e.j.s.h.ContextHandler Started o.e.j.s.ServletContextHandler@56ee3d{/,null,AVAILABLE}
   [junit4]   2> 792325 INFO  (TEST-ForceLeaderTest.testReplicasInLIRNoLeader-seed#[6D769DA18FE00175]) [    ] o.e.j.s.AbstractConnector Started ServerConnector@29e605{HTTP/1.1,[http/1.1]}{127.0.0.1:53100}
   [junit4]   2> 792325 INFO  (TEST-ForceLeaderTest.testReplicasInLIRNoLeader-seed#[6D769DA18FE00175]) [    ] o.e.j.s.Server Started @801287ms
   [junit4]   2> 792325 INFO  (TEST-ForceLeaderTest.testReplicasInLIRNoLeader-seed#[6D769DA18FE00175]) [    ] o.a.s.c.s.e.JettySolrRunner Jetty properties: {hostContext=/, solr.data.dir=C:\Users\jenkins\workspace\Lucene-Solr-master-Windows\solr\build\solr-core\test\J0\temp\solr.cloud.ForceLeaderTest_6D769DA18FE00175-001\tempDir-001/control/data, hostPort=53099, coreRootDirectory=C:\Users\jenkins\workspace\Lucene-Solr-master-Windows\solr\build\solr-core\test\J0\temp\solr.cloud.ForceLeaderTest_6D769DA18FE00175-001\control-001\cores}
   [junit4]   2> 792325 ERROR (TEST-ForceLeaderTest.testReplicasInLIRNoLeader-seed#[6D769DA18FE00175]) [    ] o.a.s.u.StartupLoggingUtils Missing Java Option solr.log.dir. Logging may be missing or incomplete.
   [junit4]   2> 792326 INFO  (TEST-ForceLeaderTest.testReplicasInLIRNoLeader-seed#[6D769DA18FE00175]) [    ] o.a.s.s.SolrDispatchFilter  ___      _       Welcome to Apache Solr? version 8.0.0
   [junit4]   2> 792326 INFO  (TEST-ForceLeaderTest.testReplicasInLIRNoLeader-seed#[6D769DA18FE00175]) [    ] o.a.s.s.SolrDispatchFilter / __| ___| |_ _   Starting in cloud mode on port null
   [junit4]   2> 792326 INFO  (TEST-ForceLeaderTest.testReplicasInLIRNoLeader-seed#[6D769DA18FE00175]) [    ] o.a.s.s.SolrDispatchFilter \__ \/ _ \ | '_|  Install dir: null, Default config dir: null
   [junit4]   2> 792326 INFO  (TEST-ForceLeaderTest.testReplicasInLIRNoLeader-seed#[6D769DA18FE00175]) [    ] o.a.s.s.SolrDispatchFilter |___/\___/_|_|    Start time: 2017-08-26T12:39:00.616412100Z
   [junit4]   2> 792330 INFO  (TEST-ForceLeaderTest.testReplicasInLIRNoLeader-seed#[6D769DA18FE00175]) [    ] o.a.s.s.SolrDispatchFilter Loading solr.xml from SolrHome (not found in ZooKeeper)
   [junit4]   2> 792330 INFO  (TEST-ForceLeaderTest.testReplicasInLIRNoLeader-seed#[6D769DA18FE00175]) [    ] o.a.s.c.SolrXmlConfig Loading container configuration from C:\Users\jenkins\workspace\Lucene-Solr-master-Windows\solr\build\solr-core\test\J0\temp\solr.cloud.ForceLeaderTest_6D769DA18FE00175-001\control-001\solr.xml
   [junit4]   2> 792334 INFO  (TEST-ForceLeaderTest.testReplicasInLIRNoLeader-seed#[6D769DA18FE00175]) [    ] o.a.s.c.SolrXmlConfig MBean server found: com.sun.jmx.mbeanserver.JmxMBeanServer@14a0586, but no JMX reporters were configured - adding default JMX reporter.
   [junit4]   2> 792337 INFO  (TEST-ForceLeaderTest.testReplicasInLIRNoLeader-seed#[6D769DA18FE00175]) [    ] o.a.s.c.ZkContainer Zookeeper client=127.0.0.1:53092/solr
   [junit4]   2> 792474 INFO  (TEST-ForceLeaderTest.testReplicasInLIRNoLeader-seed#[6D769DA18FE00175]) [    ] o.a.s.c.Overseer Overseer (id=null) closing
   [junit4]   2> 792475 INFO  (TEST-ForceLeaderTest.testReplicasInLIRNoLeader-seed#[6D769DA18FE00175]) [    ] o.a.s.c.OverseerElectionContext I am going to be the leader 127.0.0.1:53099_
   [junit4]   2> 792476 INFO  (TEST-ForceLeaderTest.testReplicasInLIRNoLeader-seed#[6D769DA18FE00175]) [    ] o.a.s.c.Overseer Overseer (id=98549834718576644-127.0.0.1:53099_-n_0000000000) starting
   [junit4]   2> 792485 INFO  (TEST-ForceLeaderTest.testReplicasInLIRNoLeader-seed#[6D769DA18FE00175]) [    ] o.a.s.c.ZkController Register node as live in ZooKeeper:/live_nodes/127.0.0.1:53099_
   [junit4]   2> 792488 INFO  (zkCallback-1042-thread-1) [    ] o.a.s.c.c.ZkStateReader Updated live nodes from ZooKeeper... (0) -> (1)
   [junit4]   2> 792799 INFO  (TEST-ForceLeaderTest.testReplicasInLIRNoLeader-seed#[6D769DA18FE00175]) [    ] o.a.s.m.r.SolrJmxReporter JMX monitoring for 'solr.node' (registry 'solr.node') enabled at server: com.sun.jmx.mbeanserver.JmxMBeanServer@14a0586
   [junit4]   2> 792807 INFO  (TEST-ForceLeaderTest.testReplicasInLIRNoLeader-seed#[6D769DA18FE00175]) [    ] o.a.s.m.r.SolrJmxReporter JMX monitoring for 'solr.jvm' (registry 'solr.jvm') enabled at server: com.sun.jmx.mbeanserver.JmxMBeanServer@14a0586
   [junit4]   2> 792807 INFO  (TEST-ForceLeaderTest.testReplicasInLIRNoLeader-seed#[6D769DA18FE00175]) [    ] o.a.s.m.r.SolrJmxReporter JMX monitoring for 'solr.jetty' (registry 'solr.jetty') enabled at server: com.sun.jmx.mbeanserver.JmxMBeanServer@14a0586
   [junit4]   2> 792809 INFO  (TEST-ForceLeaderTest.testReplicasInLIRNoLeader-seed#[6D769DA18FE00175]) [    ] o.a.s.c.CorePropertiesLocator Found 0 core definitions underneath C:\Users\jenkins\workspace\Lucene-Solr-master-Windows\solr\build\solr-core\test\J0\temp\solr.cloud.ForceLeaderTest_6D769DA18FE00175-001\control-001\cores
   [junit4]   2> 792836 INFO  (TEST-ForceLeaderTest.testReplicasInLIRNoLeader-seed#[6D769DA18FE00175]) [    ] o.a.s.c.c.ZkStateReader Updated live nodes from ZooKeeper... (0) -> (1)
   [junit4]   2> 792838 INFO  (TEST-ForceLeaderTest.testReplicasInLIRNoLeader-seed#[6D769DA18FE00175]) [    ] o.a.s.c.s.i.ZkClientClusterStateProvider Cluster at 127.0.0.1:53092/solr ready
   [junit4]   2> 792839 INFO  (SocketProxy-Acceptor-53099) [    ] o.a.s.c.SocketProxy accepted Socket[addr=/127.0.0.1,port=53115,localport=53099], receiveBufferSize:65536
   [junit4]   2> 792841 INFO  (SocketProxy-Acceptor-53099) [    ] o.a.s.c.SocketProxy proxy connection Socket[addr=/127.0.0.1,port=53100,localport=53116], receiveBufferSize=65536
   [junit4]   2> 792844 INFO  (qtp27562229-6264) [    ] o.a.s.h.a.CollectionsHandler Invoked Collection Action :create with params replicationFactor=1&collection.configName=conf1&name=control_collection&nrtReplicas=1&action=CREATE&numShards=1&createNodeSet=127.0.0.1:53099_&wt=javabin&version=2 and sendToOCPQueue=true
   [junit4]   2> 792847 INFO  (OverseerThreadFactory-2683-thread-1) [    ] o.a.s.c.CreateCollectionCmd Create collection control_collection
   [junit4]   2> 792956 INFO  (SocketProxy-Acceptor-53099) [    ] o.a.s.c.SocketProxy accepted Socket[addr=/127.0.0.1,port=53117,localport=53099], receiveBufferSize:65536
   [junit4]   2> 792957 INFO  (SocketProxy-Acceptor-53099) [    ] o.a.s.c.SocketProxy proxy connection Socket[addr=/127.0.0.1,port=53100,localport=53118], receiveBufferSize=65536
   [junit4]   2> 792958 INFO  (qtp27562229-6268) [    ] o.a.s.h.a.CoreAdminOperation core create command qt=/admin/cores&collection.configName=conf1&newCollection=true&name=control_collection_shard1_replica_n1&action=CREATE&numShards=1&collection=control_collection&shard=shard1&wt=javabin&version=2&replicaType=NRT
   [junit4]   2> 792959 INFO  (qtp27562229-6268) [    ] o.a.s.c.TransientSolrCoreCacheDefault Allocating transient cache for 4 transient cores
   [junit4]   2> 793066 INFO  (zkCallback-1042-thread-1) [    ] o.a.s.c.c.ZkStateReader A cluster state change: [WatchedEvent state:SyncConnected type:NodeDataChanged path:/collections/control_collection/state.json] for collection [control_collection] has occurred - updating... (live nodes size: [1])
   [junit4]   2> 793974 INFO  (qtp27562229-6268) [    ] o.a.s.c.SolrConfig Using Lucene MatchVersion: 8.0.0
   [junit4]   2> 793988 INFO  (qtp27562229-6268) [    ] o.a.s.s.IndexSchema [control_collection_shard1_replica_n1] Schema name=test
   [junit4]   2> 794079 INFO  (qtp27562229-6268) [    ] o.a.s.s.IndexSchema Loaded schema test/1.0 with uniqueid field id
   [junit4]   2> 794102 INFO  (qtp27562229-6268) [    ] o.a.s.c.CoreContainer Creating SolrCore 'control_collection_shard1_replica_n1' using configuration from collection control_collection, trusted=true
   [junit4]   2> 794103 INFO  (qtp27562229-6268) [    ] o.a.s.m.r.SolrJmxReporter JMX monitoring for 'solr.core.control_collection.shard1.replica_n1' (registry 'solr.core.control_collection.shard1.replica_n1') enabled at server: com.sun.jmx.mbeanserver.JmxMBeanServer@14a0586
   [junit4]   2> 794103 INFO  (qtp27562229-6268) [    ] o.a.s.c.SolrCore solr.RecoveryStrategy.Builder
   [junit4]   2> 794103 INFO  (qtp27562229-6268) [    ] o.a.s.c.SolrCore [[control_collection_shard1_replica_n1] ] Opening new SolrCore at [C:\Users\jenkins\workspace\Lucene-Solr-master-Windows\solr\build\solr-core\test\J0\temp\solr.cloud.ForceLeaderTest_6D769DA18FE00175-001\control-001\cores\control_collection_shard1_replica_n1], dataDir=[C:\Users\jenkins\workspace\Lucene-Solr-master-Windows\solr\build\solr-core\test\J0\temp\solr.cloud.ForceLeaderTest_6D769DA18FE00175-001\control-001\cores\control_collection_shard1_replica_n1\data\]
   [junit4]   2> 794106 INFO  (qtp27562229-6268) [    ] o.a.s.u.RandomMergePolicy RandomMergePolicy wrapping class org.apache.lucene.index.TieredMergePolicy: [TieredMergePolicy: maxMergeAtOnce=33, maxMergeAtOnceExplicit=33, maxMergedSegmentMB=16.2978515625, floorSegmentMB=0.271484375, forceMergeDeletesPctAllowed=13.93876620708393, segmentsPerTier=19.0, maxCFSSegmentSizeMB=8.796093022207999E12, noCFSRatio=0.0
   [junit4]   2> 794108 WARN  (qtp27562229-6268) [    ] o.a.s.c.RequestHandlers INVALID paramSet a in requestHandler {type = requestHandler,name = /dump,class = DumpRequestHandler,attributes = {initParams=a, name=/dump, class=DumpRequestHandler},args = {defaults={a=A,b=B}}}
   [junit4]   2> 794184 INFO  (qtp27562229-6268) [    ] o.a.s.u.UpdateHandler Using UpdateLog implementation: org.apache.solr.update.UpdateLog
   [junit4]   2> 794184 INFO  (qtp27562229-6268) [    ] o.a.s.u.UpdateLog Initializing UpdateLog: dataDir= defaultSyncLevel=FLUSH numRecordsToKeep=100 maxNumLogsToKeep=10 numVersionBuckets=65536
   [junit4]   2> 794186 INFO  (qtp27562229-6268) [    ] o.a.s.u.CommitTracker Hard AutoCommit: disabled
   [junit4]   2> 794186 INFO  (qtp27562229-6268) [    ] o.a.s.u.CommitTracker Soft AutoCommit: disabled
   [junit4]   2> 794188 INFO  (qtp27562229-6268) [    ] o.a.s.u.RandomMergePolicy RandomMergePolicy wrapping class org.apache.lucene.index.LogByteSizeMergePolicy: [LogByteSizeMergePolicy: minMergeSize=1677721, mergeFactor=23, maxMergeSize=2147483648, maxMergeSizeForForcedMerge=9223372036854775807, calibrateSizeByDeletes=true, maxMergeDocs=2147483647, maxCFSSegmentSizeMB=8.796093022207999E12, noCFSRatio=0.0]
   [junit4]   2> 794188 INFO  (qtp27562229-6268) [    ] o.a.s.s.SolrIndexSearcher Opening [Searcher@11f19b4[control_collection_shard1_replica_n1] main]
   [junit4]   2> 794190 INFO  (qtp27562229-6268) [    ] o.a.s.r.ManagedResourceStorage Configured ZooKeeperStorageIO with znodeBase: /configs/conf1
   [junit4]   2> 794191 INFO  (qtp27562229-6268) [    ] o.a.s.r.ManagedResourceStorage Loaded null at path _rest_managed.json using ZooKeeperStorageIO:path=/configs/conf1
   [junit4]   2> 794191 INFO  (qtp27562229-6268) [    ] o.a.s.h.ReplicationHandler Commits will be reserved for  10000
   [junit4]   2> 794192 INFO  (qtp27562229-6268) [    ] o.a.s.u.UpdateLog Could not find max version in index or recent updates, using new clock 1576797357979205632
   [junit4]   2> 794193 INFO  (searcherExecutor-2686-thread-1) [    ] o.a.s.c.SolrCore [control_collection_shard1_replica_n1] Registered new searcher Searcher@11f19b4[control_collection_shard1_replica_n1] main{ExitableDirectoryReader(UninvertingDirectoryReader())}
   [junit4]   2> 794198 INFO  (qtp27562229-6268) [    ] o.a.s.c.ShardLeaderElectionContext Enough replicas found to continue.
   [junit4]   2> 794198 INFO  (qtp27562229-6268) [    ] o.a.s.c.ShardLeaderElectionContext I may be the new leader - try and sync
   [junit4]   2> 794198 INFO  (qtp27562229-6268) [    ] o.a.s.c.SyncStrategy Sync replicas to http://127.0.0.1:53099/control_collection_shard1_replica_n1/
   [junit4]   2> 794199 INFO  (qtp27562229-6268) [    ] o.a.s.c.SyncStrategy Sync Success - now sync replicas to me
   [junit4]   2> 794199 INFO  (qtp27562229-6268) [    ] o.a.s.c.SyncStrategy http://127.0.0.1:53099/control_collection_shard1_replica_n1/ has no replicas
   [junit4]   2> 794199 INFO  (qtp27562229-6268) [    ] o.a.s.c.ShardLeaderElectionContext Found all replicas participating in election, clear LIR
   [junit4]   2> 794202 INFO  (qtp27562229-6268) [    ] o.a.s.c.ShardLeaderElectionContext I am the new leader: http://127.0.0.1:53099/control_collection_shard1_replica_n1/ shard1
   [junit4]   2> 794307 INFO  (zkCallback-1042-thread-1) [    ] o.a.s.c.c.ZkStateReader A cluster state change: [WatchedEvent state:SyncConnected type:NodeDataChanged path:/collections/control_collection/state.json] for collection [control_collection] has occurred - updating... (live nodes size: [1])
   [junit4]   2> 794354 INFO  (qtp27562229-6268) [    ] o.a.s.c.ZkController I am the leader, no recovery necessary
   [junit4]   2> 794355 INFO  (qtp27562229-6268) [    ] o.a.s.s.HttpSolrCall [admin] webapp=null path=/admin/cores params={qt=/admin/cores&collection.configName=conf1&newCollection=true&name=control_collection_shard1_replica_n1&action=CREATE&numShards=1&collection=control_collection&shard=shard1&wt=javabin&version=2&replicaType=NRT} status=0 QTime=1397
   [junit4]   2> 794358 INFO  (qtp27562229-6264) [    ] o.a.s.h.a.CollectionsHandler Wait for new collection to be active for at most 30 seconds. Check all shard replicas
   [junit4]   2> 794460 INFO  (zkCallback-1042-thread-1) [    ] o.a.s.c.c.ZkStateReader A cluster state change: [WatchedEvent state:SyncConnected type:NodeDataChanged path:/collections/control_collection/state.json] for collection [control_collection] has occurred - updating... (live nodes size: [1])
   [junit4]   2> 794850 INFO  (OverseerCollectionConfigSetProcessor-98549834718576644-127.0.0.1:53099_-n_0000000000) [    ] o.a.s.c.OverseerTaskQueue Response ZK path: /overseer/collection-queue-work/qnr-0000000000 doesn't exist.  Requestor may have disconnected from ZooKeeper
   [junit4]   2> 795359 INFO  (qtp27562229-6264) [    ] o.a.s.s.HttpSolrCall [admin] webapp=null path=/admin/collections params={replicationFactor=1&collection.configName=conf1&name=control_collection&nrtReplicas=1&action=CREATE&numShards=1&createNodeSet=127.0.0.1:53099_&wt=javabin&version=2} status=0 QTime=2515
   [junit4]   2> 795368 INFO  (TEST-ForceLeaderTest.testReplicasInLIRNoLeader-seed#[6D769DA18FE00175]) [    ] o.a.s.c.c.ZkStateReader Updated live nodes from ZooKeeper... (0) -> (1)
   [junit4]   2> 795369 INFO  (TEST-ForceLeaderTest.testReplicasInLIRNoLeader-seed#[6D769DA18FE00175]) [    ] o.a.s.c.s.i.ZkClientClusterStateProvider Cluster at 127.0.0.1:53092/solr ready
   [junit4]   2> 795369 INFO  (TEST-ForceLeaderTest.testReplicasInLIRNoLeader-seed#[6D769DA18FE00175]) [    ] o.a.s.c.ChaosMonkey monkey: init - expire sessions:false cause connection loss:false
   [junit4]   2> 795370 INFO  (SocketProxy-Acceptor-53099) [    ] o.a.s.c.SocketProxy accepted Socket[addr=/127.0.0.1,port=53128,localport=53099], receiveBufferSize:65536
   [junit4]   2> 795370 INFO  (SocketProxy-Acceptor-53099) [    ] o.a.s.c.SocketProxy proxy connection Socket[addr=/127.0.0.1,port=53100,localport=53129], receiveBufferSize=65536
   [junit4]   2> 795372 INFO  (qtp27562229-6265) [    ] o.a.s.h.a.CollectionsHandler Invoked Collection Action :create with params replicationFactor=1&collection.configName=conf1&name=collection1&nrtReplicas=1&action=CREATE&numShards=2&createNodeSet=&stateFormat=2&wt=javabin&version=2 and sendToOCPQueue=true
   [junit4]   2> 795374 INFO  (OverseerThreadFactory-2683-thread-2) [    ] o.a.s.c.CreateCollectionCmd Create collection collection1
   [junit4]   2> 795375 WARN  (OverseerThreadFactory-2683-thread-2) [    ] o.a.s.c.CreateCollectionCmd It is unusual to create a collection (collection1) without cores.
   [junit4]   2> 795581 INFO  (qtp27562229-6265) [    ] o.a.s.h.a.CollectionsHandler Wait for new collection to be active for at most 30 seconds. Check all shard replicas
   [junit4]   2> 795581 INFO  (qtp27562229-6265) [    ] o.a.s.s.HttpSolrCall [admin] webapp=null path=/admin/collections params={replicationFactor=1&collection.configName=conf1&name=collection1&nrtReplicas=1&action=CREATE&numShards=2&createNodeSet=&stateFormat=2&wt=javabin&version=2} status=0 QTime=209
   [junit4]   2> 795942 INFO  (TEST-ForceLeaderTest.testReplicasInLIRNoLeader-seed#[6D769DA18FE00175]) [    ] o.a.s.c.AbstractFullDistribZkTestBase create jetty 1 in directory C:\Users\jenkins\workspace\Lucene-Solr-master-Windows\solr\build\solr-core\test\J0\temp\solr.cloud.ForceLeaderTest_6D769DA18FE00175-001\shard-1-001 of type TLOG
   [junit4]   2> 795942 INFO  (TEST-ForceLeaderTest.testReplicasInLIRNoLeader-seed#[6D769DA18FE00175]) [    ] o.e.j.s.Server jetty-9.3.20.v20170531
   [junit4]   2> 795943 INFO  (TEST-ForceLeaderTest.testReplicasInLIRNoLeader-seed#[6D769DA18FE00175]) [    ] o.e.j.s.h.ContextHandler Started o.e.j.s.ServletContextHandler@78799a{/,null,AVAILABLE}
   [junit4]   2> 795943 INFO  (TEST-ForceLeaderTest.testReplicasInLIRNoLeader-seed#[6D769DA18FE00175]) [    ] o.e.j.s.AbstractConnector Started ServerConnector@12a8889{HTTP/1.1,[http/1.1]}{127.0.0.1:53131}
   [junit4]   2> 795944 INFO  (TEST-ForceLeaderTest.testReplicasInLIRNoLeader-seed#[6D769DA18FE00175]) [    ] o.e.j.s.Server Started @804906ms
   [junit4]   2> 795944 INFO  (TEST-ForceLeaderTest.testReplicasInLIRNoLeader-seed#[6D769DA18FE00175]) [    ] o.a.s.c.s.e.JettySolrRunner Jetty properties: {hostContext=/, solrconfig=solrconfig.xml, solr.data.dir=C:\Users\jenkins\workspace\Lucene-Solr-master-Windows\solr\build\solr-core\test\J0\temp\solr.cloud.ForceLeaderTest_6D769DA18FE00175-001\tempDir-001/jetty1, hostPort=53130, coreRootDirectory=C:\Users\jenkins\workspace\Lucene-Solr-master-Windows\solr\build\solr-core\test\J0\temp\solr.cloud.ForceLeaderTest_6D769DA18FE00175-001\shard-1-001\cores, replicaType=TLOG}
   [junit4]   2> 795944 ERROR (TEST-ForceLeaderTest.testReplicasInLIRNoLeader-seed#[6D769DA18FE00175]) [    ] o.a.s.u.StartupLoggingUtils Missing Java Option solr.log.dir. Logging may be missing or incomplete.
   [junit4]   2> 795944 INFO  (TEST-ForceLeaderTest.testReplicasInLIRNoLeader-seed#[6D769DA18FE00175]) [    ] o.a.s.s.SolrDispatchFilter  ___      _       Welcome to Apache Solr? version 8.0.0
   [junit4]   2> 795944 INFO  (TEST-ForceLeaderTest.testReplicasInLIRNoLeader-seed#[6D769DA18FE00175]) [    ] o.a.s.s.SolrDispatchFilter / __| ___| |_ _   Starting in cloud mode on port null
   [junit4]   2> 795945 INFO  (TEST-ForceLeaderTest.testReplicasInLIRNoLeader-seed#[6D769DA18FE00175]) [    ] o.a.s.s.SolrDispatchFilter \__ \/ _ \ | '_|  Install dir: null, Default config dir: null
   [junit4]   2> 795945 INFO  (TEST-ForceLeaderTest.testReplicasInLIRNoLeader-seed#[6D769DA18FE00175]) [    ] o.a.s.s.SolrDispatchFilter |___/\___/_|_|    Start time: 2017-08-26T12:39:04.235520400Z
   [junit4]   2> 795949 INFO  (TEST-ForceLeaderTest.testReplicasInLIRNoLeader-seed#[6D769DA18FE00175]) [    ] o.a.s.s.SolrDispatchFilter Loading solr.xml from SolrHome (not found in ZooKeeper)
   [junit4]   2> 795949 INFO  (TEST-ForceLeaderTest.testReplicasInLIRNoLeader-seed#[6D769DA18FE00175]) [    ] o.a.s.c.SolrXmlConfig Loading container configuration from C:\Users\jenkins\workspace\Lucene-Solr-master-Windows\solr\build\solr-core\test\J0\temp\solr.cloud.ForceLeaderTest_6D769DA18FE00175-001\shard-1-001\solr.xml
   [junit4]   2> 795953 INFO  (TEST-ForceLeaderTest.testReplicasInLIRNoLeader-seed#[6D769DA18FE00175]) [    ] o.a.s.c.SolrXmlConfig MBean server found: com.sun.jmx.mbeanserver.JmxMBeanServer@14a0586, but no JMX reporters were configured - adding default JMX reporter.
   [junit4]   2> 795956 INFO  (TEST-ForceLeaderTest.testReplicasInLIRNoLeader-seed#[6D769DA18FE00175]) [    ] o.a.s.c.ZkContainer Zookeeper client=127.0.0.1:53092/solr
   [junit4]   2> 795972 INFO  (TEST-ForceLeaderTest.testReplicasInLIRNoLeader-seed#[6D769DA18FE00175]) [    ] o.a.s.c.c.ZkStateReader Updated live nodes from ZooKeeper... (0) -> (1)
   [junit4]   2> 795975 INFO  (TEST-ForceLeaderTest.testReplicasInLIRNoLeader-seed#[6D769DA18FE00175]) [    ] o.a.s.c.Overseer Overseer (id=null) closing
   [junit4]   2> 795977 INFO  (TEST-ForceLeaderTest.testReplicasInLIRNoLeader-seed#[6D769DA18FE00175]) [    ] o.a.s.c.ZkController Register node as live in ZooKeeper:/live_nodes/127.0.0.1:53130_
   [junit4]   2> 795979 INFO  (zkCallback-1049-thread-1) [    ] o.a.s.c.c.ZkStateReader Updated live nodes from ZooKeeper... (1) -> (2)
   [junit4]   2> 795979 INFO  (zkCallback-1054-thread-1) [    ] o.a.s.c.c.ZkStateReader Updated live nodes from ZooKeeper... (1) -> (2)
   [junit4]   2> 795980 INFO  (zkCallback-1042-thread-1) [    ] o.a.s.c.c.ZkStateReader Updated live nodes from ZooKeeper... (1) -> (2)
   [junit4]   2> 796162 INFO  (TEST-ForceLeaderTest.testReplicasInLIRNoLeader-seed#[6D769DA18FE00175]) [    ] o.a.s.m.r.SolrJmxReporter JMX monitoring for 'solr.node' (registry 'solr.node') enabled at server: com.sun.jmx.mbeanserver.JmxMBeanServer@14a0586
   [junit4]   2> 796174 INFO  (TEST-ForceLeaderTest.testReplicasInLIRNoLeader-seed#[6D769DA18FE00175]) [    ] o.a.s.m.r.SolrJmxReporter JMX monitoring for 'solr.jvm' (registry 'solr.jvm') enabled at server: com.sun.jmx.mbeanserver.JmxMBeanServer@14a0586
   [junit4]   2> 796175 INFO  (TEST-ForceLeaderTest.testReplicasInLIRNoLeader-seed#[6D769DA18FE00175]) [    ] o.a.s.m.r.SolrJmxReporter JMX monitoring for 'solr.jetty' (registry 'solr.jetty') enabled at server: com.sun.jmx.mbeanserver.JmxMBeanServer@14a0586
   [junit4]   2> 796177 INFO  (TEST-ForceLeaderTest.testReplicasInLIRNoLeader-seed#[6D769DA18FE00175]) [    ] o.a.s.c.CorePropertiesLocator Found 0 core definitions underneath C:\Users\jenkins\workspace\Lucene-Solr-master-Windows\solr\build\solr-core\test\J0\temp\solr.cloud.ForceLeaderTest_6D769DA18FE00175-001\shard-1-001\cores
   [junit4]   2> 796206 INFO  (qtp27562229-6267) [    ] o.a.s.h.a.CollectionsHandler Invoked Collection Action :addreplica with params node=127.0.0.1:53130_&action=ADDREPLICA&collection=collection1&shard=shard2&type=TLOG&wt=javabin&version=2 and sendToOCPQueue=true
   [junit4]   2> 796209 INFO  (OverseerCollectionConfigSetProcessor-98549834718576644-127.0.0.1:53099_-n_0000000000) [    ] o.a.s.c.OverseerTaskQueue Response ZK path: /overseer/collection-queue-work/qnr-0000000002 doesn't exist.  Requestor may have disconnected from ZooKeeper
   [junit4]   2> 796210 INFO  (OverseerThreadFactory-2683-thread-3) [    ] o.a.s.c.AddReplicaCmd Node Identified 127.0.0.1:53130_ for creating new replica
   [junit4]   2> 796213 INFO  (SocketProxy-Acceptor-53130) [    ] o.a.s.c.SocketProxy accepted Socket[addr=/127.0.0.1,port=53143,localport=53130], receiveBufferSize:65536
   [junit4]   2> 796213 INFO  (SocketProxy-Acceptor-53130) [    ] o.a.s.c.SocketProxy proxy connection Socket[addr=/127.0.0.1,port=53131,localport=53144], receiveBufferSize=65536
   [junit4]   2> 796215 INFO  (qtp27323691-6314) [    ] o.a.s.h.a.CoreAdminOperation core create command qt=/admin/cores&collection.configName=conf1&name=collection1_shard2_replica_t41&action=CREATE&collection=collection1&shard=shard2&wt=javabin&version=2&replicaType=TLOG
   [junit4]   2> 796216 INFO  (qtp27323691-6314) [    ] o.a.s.c.TransientSolrCoreCacheDefault Allocating transient cache for 4 transient cores
   [junit4]   2> 796323 INFO  (zkCallback-1054-thread-1) [    ] o.a.s.c.c.ZkStateReader A cluster state change: [WatchedEvent state:SyncConnected type:NodeDataChanged path:/collections/collection1/state.json] for collection [collection1] has occurred - updating... (live nodes size: [2])
   [junit4]   2> 797245 INFO  (qtp27323691-6314) [    ] o.a.s.c.SolrConfig Using Lucene MatchVersion: 8.0.0
   [junit4]   2> 797257 INFO  (qtp27323691-6314) [    ] o.a.s.s.IndexSchema [collection1_shard2_replica_t41] Schema name=test
   [junit4]   2> 797339 INFO  (qtp27323691-6314) [    ] o.a.s.s.IndexSchema Loaded schema test/1.0 with uniqueid field id
   [junit4]   2> 797358 INFO  (qtp27323691-6314) [    ] o.a.s.c.CoreContainer Creating SolrCore 'collection1_shard2_replica_t41' using configuration from collection collection1, trusted=true
   [junit4]   2> 797359 INFO  (qtp27323691-6314) [    ] o.a.s.m.r.SolrJmxReporter JMX monitoring for 'solr.core.collection1.shard2.replica_t41' (registry 'solr.core.collection1.shard2.replica_t41') enabled at server: com.sun.jmx.mbeanserver.JmxMBeanServer@14a0586
   [junit4]   2> 797359 INFO  (qtp27323691-6314) [    ] o.a.s.c.SolrCore solr.RecoveryStrategy.Builder
   [junit4]   2> 797359 INFO  (qtp27323691-6314) [    ] o.a.s.c.SolrCore [[collection1_shard2_replica_t41] ] Opening new SolrCore at [C:\Users\jenkins\workspace\Lucene-Solr-master-Windows\solr\build\solr-core\test\J0\temp\solr.cloud.ForceLeaderTest_6D769DA18FE00175-001\shard-1-001\cores\collection1_shard2_replica_t41], dataDir=[C:\Users\jenkins\workspace\Lucene-Solr-master-Windows\solr\build\solr-core\test\J0\temp\solr.cloud.ForceLeaderTest_6D769DA18FE00175-001\shard-1-001\cores\collection1_shard2_replica_t41\data\]
   [junit4]   2> 797362 INFO  (qtp27323691-6314) [    ] o.a.s.u.RandomMergePolicy RandomMergePolicy wrapping class org.apache.lucene.index.TieredMergePolicy: [TieredMergePolicy: maxMergeAtOnce=33, maxMergeAtOnceExplicit=33, maxMergedSegmentMB=16.2978515625, floorSegmentMB=0.271484375, forceMergeDeletesPctAllowed=13.93876620708393, segmentsPerTier=19.0, maxCFSSegmentSizeMB=8.796093022207999E12, noCFSRatio=0.0
   [junit4]   2> 797364 WARN  (qtp27323691-6314) [    ] o.a.s.c.RequestHandlers INVALID paramSet a in requestHandler {type = requestHandler,name = /dump,class = DumpRequestHandler,attributes = {initParams=a, name=/dump, class=DumpRequestHandler},args = {defaults={a=A,b=B}}}
   [junit4]   2> 797434 INFO  (qtp27323691-6314) [    ] o.a.s.u.UpdateHandler Using UpdateLog implementation: org.apache.solr.update.UpdateLog
   [junit4]   2> 797434 INFO  (qtp27323691-6314) [    ] o.a.s.u.UpdateLog Initializing UpdateLog: dataDir= defaultSyncLevel=FLUSH numRecordsToKeep=100 maxNumLogsToKeep=10 numVersionBuckets=65536
   [junit4]   2> 797436 INFO  (qtp27323691-6314) [    ] o.a.s.u.CommitTracker Hard AutoCommit: disabled
   [junit4]   2> 797436 INFO  (qtp27323691-6314) [    ] o.a.s.u.CommitTracker Soft AutoCommit: disabled
   [junit4]   2> 797437 INFO  (qtp27323691-6314) [    ] o.a.s.u.RandomMergePolicy RandomMergePolicy wrapping class org.apache.lucene.index.LogByteSizeMergePolicy: [LogByteSizeMergePolicy: minMergeSize=1677721, mergeFactor=23, maxMergeSize=2147483648, maxMergeSizeForForcedMerge=9223372036854775807, calibrateSizeByDeletes=true, maxMergeDocs=2147483647, maxCFSSegmentSizeMB=8.796093022207999E12, noCFSRatio=0.0]
   [junit4]   2> 797438 INFO  (qtp27323691-6314) [    ] o.a.s.s.SolrIndexSearcher Opening [Searcher@1d5c588[collection1_shard2_replica_t41] main]
   [junit4]   2> 797439 INFO  (qtp27323691-6314) [    ] o.a.s.r.ManagedResourceStorage Configured ZooKeeperStorageIO with znodeBase: /configs/conf1
   [junit4]   2> 797440 INFO  (qtp27323691-6314) [    ] o.a.s.r.ManagedResourceStorage Loaded null at path _rest_managed.json using ZooKeeperStorageIO:path=/configs/conf1
   [junit4]   2> 797441 INFO  (qtp27323691-6314) [    ] o.a.s.h.ReplicationHandler Commits will be reserved for  10000
   [junit4]   2> 797441 INFO  (qtp27323691-6314) [    ] o.a.s.u.UpdateLog Could not find max version in index or recent updates, using new clock 1576797361386029056
   [junit4]   2> 797442 INFO  (searcherExecutor-2697-thread-1) [    ] o.a.s.c.SolrCore [collection1_shard2_replica_t41] Registered new searcher Searcher@1d5c588[collection1_shard2_replica_t41] main{ExitableDirectoryReader(UninvertingDirectoryReader())}
   [junit4]   2> 797447 INFO  (qtp27323691-6314) [    ] o.a.s.c.ShardLeaderElectionContext Enough replicas found to continue.
   [junit4]   2> 797447 INFO  (qtp27323691-6314) [    ] o.a.s.c.ShardLeaderElectionContext I may be the new leader - try and sync
   [junit4]   2> 797447 INFO  (qtp27323691-6314) [    ] o.a.s.c.SyncStrategy Sync replicas to http://127.0.0.1:53130/collection1_shard2_replica_t41/
   [junit4]   2> 797447 INFO  (qtp27323691-6314) [    ] o.a.s.c.SyncStrategy Sync Success - now sync replicas to me
   [junit4]   2> 797447 INFO  (qtp27323691-6314) [    ] o.a.s.c.SyncStrategy http://127.0.0.1:53130/collection1_shard2_replica_t41/ has no replicas
   [junit4]   2> 797447 INFO  (qtp27323691-6314) [    ] o.a.s.c.ShardLeaderElectionContext Found all replicas participating in election, clear LIR
   [junit4]   2> 797448 INFO  (qtp27323691-6314) [    ] o.a.s.c.ZkController collection1_shard2_replica_t41 stopping background replication from leader
   [junit4]   2> 797451 INFO  (qtp27323691-6314) [    ] o.a.s.c.ShardLeaderElectionContext I am the new leader: http://127.0.0.1:53130/collection1_shard2_replica_t41/ shard2
   [junit4]   2> 797556 INFO  (zkCallback-1054-thread-1) [    ] o.a.s.c.c.ZkStateReader A cluster state change: [WatchedEvent state:SyncConnected type:NodeDataChanged path:/collections/collection1/state.json] for collection [collection1] has occurred - updating... (live nodes size: [2])
   [junit4]   2> 797603 INFO  (qtp27323691-6314) [    ] o.a.s.c.ZkController I am the leader, no recovery necessary
   [junit4]   2> 797606 INFO  (qtp27323691-6314) [    ] o.a.s.s.HttpSolrCall [admin] webapp=null path=/admin/cores params={qt=/admin/cores&collection.configName=conf1&name=collection1_shard2_replica_t41&action=CREATE&collection=collection1&shard=shard2&wt=javabin&version=2&replicaType=TLOG} status=0 QTime=1389
   [junit4]   2> 797609 INFO  (qtp27562229-6267) [    ] o.a.s.s.HttpSolrCall [admin] webapp=null path=/admin/collections params={node=127.0.0.1:53130_&action=ADDREPLICA&collection=collection1&shard=shard2&type=TLOG&wt=javabin&version=2} status=0 QTime=1403
   [junit4]   2> 797709 INFO  (zkCallback-1054-thread-1) [    ] o.a.s.c.c.ZkStateReader A cluster state change: [WatchedEvent state:SyncConnected type:NodeDataChanged path:/collections/collection1/state.json] for collection [collection1] has occurred - updating... (live nodes size: [2])
   [junit4]   2> 798029 INFO  (TEST-ForceLeaderTest.testReplicasInLIRNoLeader-seed#[6D769DA18FE00175]) [    ] o.a.s.c.AbstractFullDistribZkTestBase create jetty 2 in directory C:\Users\jenkins\workspace\Lucene-Solr-master-Windows\solr\build\solr-core\test\J0\temp\solr.cloud.ForceLeaderTest_6D769DA18FE00175-001\shard-2-001 of type TLOG
   [junit4]   2> 798030 INFO  (TEST-ForceLeaderTest.testReplicasInLIRNoLeader-seed#[6D769DA18FE00175]) [    ] o.e.j.s.Server jetty-9.3.20.v20170531
   [junit4]   2> 798047 INFO  (TEST-ForceLeaderTest.testReplicasInLIRNoLeader-seed#[6D769DA18FE00175]) [    ] o.e.j.s.h.ContextHandler Started o.e.j.s.ServletContextHandler@1efcb5{/,null,AVAILABLE}
   [junit4]   2> 798048 INFO  (TEST-ForceLeaderTest.testReplicasInLIRNoLeader-seed#[6D769DA18FE00175]) [    ] o.e.j.s.AbstractConnector Started ServerConnector@13e28d5{HTTP/1.1,[http/1.1]}{127.0.0.1:53149}
   [junit4]   2> 798048 INFO  (TEST-ForceLeaderTest.testReplicasInLIRNoLeader-seed#[6D769DA18FE00175]) [    ] o.e.j.s.Server Started @807010ms
   [junit4]   2> 798048 INFO  (TEST-ForceLeaderTest.testReplicasInLIRNoLeader-seed#[6D769DA18FE00175]) [    ] o.a.s.c.s.e.JettySolrRunner Jetty properties: {hostContext=/, solrconfig=solrconfig.xml, solr.data.dir=C:\Users\jenkins\workspace\Lucene-Solr-master-Windows\solr\build\solr-core\test\J0\temp\solr.cloud.ForceLeaderTest_6D769DA18FE00175-001\tempDir-001/jetty2, hostPort=53148, coreRootDirectory=C:\Users\jenkins\workspace\Lucene-Solr-master-Windows\solr\build\solr-core\test\J0\temp\solr.cloud.ForceLeaderTest_6D769DA18FE00175-001\shard-2-001\cores, replicaType=TLOG}
   [junit4]   2> 798049 ERROR (TEST-ForceLeaderTest.testReplicasInLIRNoLeader-seed#[6D769DA18FE00175]) [    ] o.a.s.u.StartupLoggingUtils Missing Java Option solr.log.dir. Logging may be missing or incomplete.
   [junit4]   2> 798049 INFO  (TEST-ForceLeaderTest.testReplicasInLIRNoLeader-seed#[6D769DA18FE00175]) [    ] o.a.s.s.SolrDispatchFilter  ___      _       Welcome to Apache Solr? version 8.0.0
   [junit4]   2> 798049 INFO  (TEST-ForceLeaderTest.testReplicasInLIRNoLeader-seed#[6D769DA18FE00175]) [    ] o.a.s.s.SolrDispatchFilter / __| ___| |_ _   Starting in cloud mode on port null
   [junit4]   2> 798049 INFO  (TEST-ForceLeaderTest.testReplicasInLIRNoLeader-seed#[6D769DA18FE00175]) [    ] o.a.s.s.SolrDispatchFilter \__ \/ _ \ | '_|  Install dir: null, Default config dir: null
   [junit4]   2> 798049 INFO  (TEST-ForceLeaderTest.testReplicasInLIRNoLeader-seed#[6D769DA18FE00175]) [    ] o.a.s.s.SolrDispatchFilter |___/\___/_|_|    Start time: 2017-08-26T12:39:06.339141900Z
   [junit4]   2> 798053 WARN  (NIOServerCxn.Factory:0.0.0.0/0.0.0.0:0) [    ] o.a.z.s.NIOServerCnxn caught end of stream exception
   [junit4]   2> EndOfStreamException: Unable to read additional data from client sessionid 0x15e1e8d7313000a, likely client has closed socket
   [junit4]   2> 	at org.apache.zookeeper.server.NIOServerCnxn.doIO(NIOServerCnxn.java:239)
   [junit4]   2> 	at org.apache.zookeeper.server.NIOServerCnxnFactory.run(NIOServerCnxnFactory.java:203)
   [junit4]   2> 	at java.base/java.lang.Thread.run(Thread.java:844)
   [junit4]   2> 798054 INFO  (TEST-ForceLeaderTest.testReplicasInLIRNoLeader-seed#[6D769DA18FE00175]) [    ] o.a.s.s.SolrDispatchFilter Loading solr.xml from SolrHome (not found in ZooKeeper)
   [junit4]   2> 798054 INFO  (TEST-ForceLeaderTest.testReplicasInLIRNoLeader-seed#[6D769DA18FE00175]) [    ] o.a.s.c.SolrXmlConfig Loading container configuration from C:\Users\jenkins\workspace\Lucene-Solr-master-Windows\solr\build\solr-core\test\J0\temp\solr.cloud.ForceLeaderTest_6D769DA18FE00175-001\shard-2-001\solr.xml
   [junit4]   2> 798060 INFO  (TEST-ForceLeaderTest.testReplicasInLIRNoLeader-seed#[6D769DA18FE00175]) [    ] o.a.s.c.SolrXmlConfig MBean server found: com.sun.jmx.mbeanserver.JmxMBeanServer@14a0586, but no JMX reporters were configured - adding default JMX reporter.
   [junit4]   2> 798065 INFO  (TEST-ForceLeaderTest.testReplicasInLIRNoLeader-seed#[6D769DA18FE00175]) [    ] o.a.s.c.ZkContainer Zookeeper client=127.0.0.1:53092/solr
   [junit4]   2> 798069 WARN  (NIOServerCxn.Factory:0.0.0.0/0.0.0.0:0) [    ] o.a.z.s.NIOServerCnxn caught end of stream exception
   [junit4]   2> EndOfStreamException: Unable to read additional data from client sessionid 0x15e1e8d7313000b, likely client has closed socket
   [junit4]   2> 	at org.apache.zookeeper.server.NIOServerCnxn.doIO(NIOServerCnxn.java:239)
   [junit4]   2> 	at org.apache.zookeeper.server.NIOServerCnxnFactory.run(NIOServerCnxnFactory.java:203)
   [junit4]   2> 	at java.base/java.lang.Thread.run(Thread.java:844)
   [junit4]   2> 798080 INFO  (TEST-ForceLeaderTest.testReplicasInLIRNoLeader-seed#[6D769DA18FE00175]) [    ] o.a.s.c.c.ZkStateReader Updated live nodes from ZooKeeper... (0) -> (2)
   [junit4]   2> 798083 INFO  (TEST-ForceLeaderTest.testReplicasInLIRNoLeader-seed#[6D769DA18FE00175]) [    ] o.a.s.c.Overseer Overseer (id=null) closing
   [junit4]   2> 798085 INFO  (TEST-ForceLeaderTest.testReplicasInLIRNoLeader-seed#[6D769DA18FE00175]) [    ] o.a.s.c.ZkController Register node as live in ZooKeeper:/live_nodes/127.0.0.1:53148_
   [junit4]   2> 798087 INFO  (zkCallback-1049-thread-1) [    ] o.a.s.c.c.ZkStateReader Updated live nodes from ZooKeeper... (2) -> (3)
   [junit4]   2> 798088 INFO  (zkCallback-1042-thread-1) [    ] o.a.s.c.c.ZkStateReader Updated live nodes from ZooKeeper... (2) -> (3)
   [junit4]   2> 798088 INFO  (zkCallback-1054-thread-1) [    ] o.a.s.c.c.ZkStateReader Updated live nodes from ZooKeeper... (2) -> (3)
   [junit4]   2> 798088 INFO  (zkCallback-1060-thread-1) [    ] o.a.s.c.c.ZkStateReader Updated live nodes from ZooKeeper... (2) -> (3)
   [junit4]   2> 798211 INFO  (OverseerCollectionConfigSetProcessor-98549834718576644-127.0.0.1:53099_-n_0000000000) [    ] o.a.s.c.OverseerTaskQueue Response ZK path: /overseer/collection-queue-work/qnr-0000000004 doesn't exist.  Requestor may have disconnected from ZooKeeper
   [junit4]   2> 798239 INFO  (TEST-ForceLeaderTest.testReplicasInLIRNoLeader-seed#[6D769DA18FE00175]) [    ] o.a.s.m.r.SolrJmxReporter JMX monitoring for 'solr.node' (registry 'solr.node') enabled at server: com.sun.jmx.mbeanserver.JmxMBeanServer@14a0586
   [junit4]   2> 798248 INFO  (TEST-ForceLeaderTest.testReplicasInLIRNoLeader-seed#[6D769DA18FE00175]) [    ] o.a.s.m.r.SolrJmxReporter JMX monitoring for 'solr.jvm' (registry 'solr.jvm') enabled at server: com.sun.jmx.mbeanserver.JmxMBeanServer@14a0586
   [junit4]   2> 798248 INFO  (TEST-ForceLeaderTest.testReplicasInLIRNoLeader-seed#[6D769DA18FE00175]) [    ] o.a.s.m.r.SolrJmxReporter JMX monitoring for 'solr.jetty' (registry 'solr.jetty') enabled at server: com.sun.jmx.mbeanserver.JmxMBeanServer@14a0586
   [junit4]   2> 798251 INFO  (TEST-ForceLeaderTest.testReplicasInLIRNoLeader-seed#[6D769DA18FE00175]) [    ] o.a.s.c.CorePropertiesLocator Found 0 core definitions underneath C:\Users\jenkins\workspace\Lucene-Solr-master-Windows\solr\build\solr-core\test\J0\temp\solr.cloud.ForceLeaderTest_6D769DA18FE00175-001\shard-2-001\cores
   [junit4]   2> 798288 INFO  (qtp27562229-6266) [    ] o.a.s.h.a.CollectionsHandler Invoked Collection Action :addreplica with params node=127.0.0.1:53148_&action=ADDREPLICA&collection=collection1&shard=shard1&type=TLOG&wt=javabin&version=2 and sendToOCPQueue=true
   [junit4]   2> 798292 INFO  (OverseerThreadFactory-2683-thread-4) [    ] o.a.s.c.AddReplicaCmd Node Identified 127.0.0.1:53148_ for creating new replica
   [junit4]   2> 798295 INFO  (SocketProxy-Acceptor-53148) [    ] o.a.s.c.SocketProxy accepted Socket[addr=/127.0.0.1,port=53167,localport=53148], receiveBufferSize:65536
   [junit4]   2> 798295 INFO  (SocketProxy-Acceptor-53148) [    ] o.a.s.c.SocketProxy proxy connection Socket[addr=/127.0.0.1,port=53149,localport=53168], receiveBufferSize=65536
   [junit4]   2> 798297 INFO  (qtp8210717-6350) [    ] o.a.s.h.a.CoreAdminOperation core create command qt=/admin/cores&collection.configName=conf1&name=collection1_shard1_replica_t43&action=CREATE&collection=collection1&shard=shard1&wt=javabin&version=2&replicaType=TLOG
   [junit4]   2> 798298 INFO  (qtp8210717-6350) [    ] o.a.s.c.TransientSolrCoreCacheDefault Allocating transient cache for 4 transient cores
   [junit4]   2> 798406 INFO  (zkCallback-1054-thread-1) [    ] o.a.s.c.c.ZkStateReader A cluster state change: [WatchedEvent state:SyncConnected type:NodeDataChanged path:/collections/collection1/state.json] for collection [collection1] has occurred - updating... (live nodes size: [3])
   [junit4]   2> 798406 INFO  (zkCallback-1060-thread-1) [    ] o.a.s.c.c.ZkStateReader A cluster state change: [WatchedEvent state:SyncConnected type:NodeDataChanged path:/collections/collection1/state.json] for collection [collection1] has occurred - updating... (live nodes size: [3])
   [junit4]   2> 799316 INFO  (qtp8210717-6350) [    ] o.a.s.c.SolrConfig Using Lucene MatchVersion: 8.0.0
   [junit4]   2> 799332 INFO  (qtp8210717-6350) [    ] o.a.s.s.IndexSchema [collection1_shard1_replica_t43] Schema name=test
   [junit4]   2> 799440 INFO  (qtp8210717-6350) [    ] o.a.s.s.IndexSchema Loaded schema test/1.0 with uniqueid field id
   [junit4]   2> 799462 INFO  (qtp8210717-6350) [    ] o.a.s.c.CoreContainer Creating SolrCore 'collection1_shard1_replica_t43' using configuration from collection collection1, trusted=true
   [junit4]   2> 799463 INFO  (qtp8210717-6350) [    ] o.a.s.m.r.SolrJmxReporter JMX monitoring for 'solr.core.collection1.shard1.replica_t43' (registry 'solr.core.collection1.shard1.replica_t43') enabled at server: com.sun.jmx.mbeanserver.JmxMBeanServer@14a0586
   [junit4]   2> 799463 INFO  (qtp8210717-6350) [    ] o.a.s.c.SolrCore solr.RecoveryStrategy.Builder
   [junit4]   2> 799463 INFO  (qtp8210717-6350) [    ] o.a.s.c.SolrCore [[collection1_shard1_replica_t43] ] Opening new SolrCore at [C:\Users\jenkins\workspace\Lucene-Solr-master-Windows\solr\build\solr-core\test\J0\temp\solr.cloud.ForceLeaderTest_6D769DA18FE00175-001\shard-2-001\cores\collection1_shard1_replica_t43], dataDir=[C:\Users\jenkins\workspace\Lucene-Solr-master-Windows\solr\build\solr-core\test\J0\temp\solr.cloud.ForceLeaderTest_6D769DA18FE00175-001\shard-2-001\cores\collection1_shard1_replica_t43\data\]
   [junit4]   2> 799467 INFO  (qtp8210717-6350) [    ] o.a.s.u.RandomMergePolicy RandomMergePolicy wrapping class org.apache.lucene.index.TieredMergePolicy: [TieredMergePolicy: maxMergeAtOnce=33, maxMergeAtOnceExplicit=33, maxMergedSegmentMB=16.2978515625, floorSegmentMB=0.271484375, forceMergeDeletesPctAllowed=13.93876620708393, segmentsPerTier=19.0, maxCFSSegmentSizeMB=8.796093022207999E12, noCFSRatio=0.0
   [junit4]   2> 799469 WARN  (qtp8210717-6350) [    ] o.a.s.c.RequestHandlers INVALID paramSet a in requestHandler {type = requestHandler,name = /dump,class = DumpRequestHandler,attributes = {initParams=a, name=/dump, class=DumpRequestHandler},args = {defaults={a=A,b=B}}}
   [junit4]   2> 799546 INFO  (qtp8210717-6350) [    ] o.a.s.u.UpdateHandler Using UpdateLog implementation: org.apache.solr.update.UpdateLog
   [junit4]   2> 799546 INFO  (qtp8210717-6350) [    ] o.a.s.u.UpdateLog Initializing UpdateLog: dataDir= defaultSyncLevel=FLUSH numRecordsToKeep=100 maxNumLogsToKeep=10 numVersionBuckets=65536
   [junit4]   2> 799548 INFO  (qtp8210717-6350) [    ] o.a.s.u.CommitTracker Hard AutoCommit: disabled
   [junit4]   2> 799548 INFO  (qtp8210717-6350) [    ] o.a.s.u.CommitTracker Soft AutoCommit: disabled
   [junit4]   2> 799550 INFO  (qtp8210717-6350) [    ] o.a.s.u.RandomMergePolicy RandomMergePolicy wrapping class org.apache.lucene.index.LogByteSizeMergePolicy: [LogByteSizeMergePolicy: minMergeSize=1677721, mergeFactor=23, maxMergeSize=2147483648, maxMergeSizeForForcedMerge=9223372036854775807, calibrateSizeByDeletes=true, maxMergeDocs=2147483647, maxCFSSegmentSizeMB=8.796093022207999E12, noCFSRatio=0.0]
   [junit4]   2> 799550 INFO  (qtp8210717-6350) [    ] o.a.s.s.SolrIndexSearcher Opening [Searcher@173ad1a[collection1_shard1_replica_t43] main]
   [junit4]   2> 799552 INFO  (qtp8210717-6350) [    ] o.a.s.r.ManagedResourceStorage Configured ZooKeeperStorageIO with znodeBase: /configs/conf1
   [junit4]   2> 799553 INFO  (qtp8210717-6350) [    ] o.a.s.r.ManagedResourceStorage Loaded null at path _rest_managed.json using ZooKeeperStorageIO:path=/configs/conf1
   [junit4]   2> 799553 INFO  (qtp8210717-6350) [    ] o.a.s.h.ReplicationHandler Commits will be reserved for  10000
   [junit4]   2> 799554 INFO  (searcherExecutor-2708-thread-1) [    ] o.a.s.c.SolrCore [collection1_shard1_replica_t43] Registered new searcher Searcher@173ad1a[collection1_shard1_replica_t43] main{ExitableDirectoryReader(UninvertingDirectoryReader())}
   [junit4]   2> 799555 INFO  (qtp8210717-6350) [    ] o.a.s.u.UpdateLog Could not find max version in index or recent updates, using new clock 1576797363602718720
   [junit4]   2> 799562 INFO  (qtp8210717-6350) [    ] o.a.s.c.ShardLeaderElectionContext Enough replicas found to continue.
   [junit4]   2> 799562 INFO  (qtp8210717-6350) [    ] o.a.s.c.ShardLeaderElectionContext I may be the new leader - try and sync
   [junit4]   2> 799562 INFO  (qtp8210717-6350) [    ] o.a.s.c.SyncStrategy Sync replicas to http://127.0.0.1:53148/collection1_shard1_replica_t43/
   [junit4]   2> 799562 INFO  (qtp8210717-6350) [    ] o.a.s.c.SyncStrategy Sync Success - now sync replicas to me
   [junit4]   2> 799562 INFO  (qtp8210717-6350) [    ] o.a.s.c.SyncStrategy http://127.0.0.1:53148/collection1_shard1_replica_t43/ has no replicas
   [junit4]   2> 799562 INFO  (qtp8210717-6350) [    ] o.a.s.c.ShardLeaderElectionContext Found all replicas participating in election, clear LIR
   [junit4]   2> 799562 INFO  (qtp8210717-6350) [    ] o.a.s.c.ZkController collection1_shard1_replica_t43 stopping background replication from leader
   [junit4]   2> 799566 INFO  (qtp8210717-6350) [    ] o.a.s.c.ShardLeaderElectionContext I am the new leader: http://127.0.0.1:53148/collection1_shard1_replica_t43/ shard1
   [junit4]   2> 799670 INFO  (zkCallback-1054-thread-1) [    ] o.a.s.c.c.ZkStateReader A cluster state change: [WatchedEvent state:SyncConnected type:NodeDataChanged path:/collections/collection1/state.json] for collection [collection1] has occurred - updating... (live nodes size: [3])
   [junit4]   2> 799670 INFO  (zkCallback-1060-thread-1) [    ] o.a.s.c.c.ZkStateReader A cluster state change: [WatchedEvent state:SyncConnected type:NodeDataChanged path:/collections/collection1/state.json] for collection [collection1] has occurred - updating... (live nodes size: [3])
   [junit4]   2> 799719 INFO  (qtp8210717-6350) [    ] o.a.s.c.ZkController I am the leader, no recovery necessary
   [junit4]   2> 799721 INFO  (qtp8210717-6350) [    ] o.a.s.s.HttpSolrCall [admin] webapp=null path=/admin/cores params={qt=/admin/cores&collection.configName=conf1&name=collection1_shard1_replica_t43&action=CREATE&collection=collection1&shard=shard1&wt=javabin&version=2&replicaType=TLOG} status=0 QTime=1423
   [junit4]   2> 799724 INFO  (qtp27562229-6266) [    ] o.a.s.s.HttpSolrCall [admin] webapp=null path=/admin/collections params={node=127.0.0.1:53148_&action=ADDREPLICA&collection=collection1&shard=shard1&type=TLOG&wt=javabin&version=2} status=0 QTime=1435
   [junit4]   2> 799824 INFO  (zkCallback-1054-thread-1) [    ] o.a.s.c.c.ZkStateReader A cluster state change: [WatchedEvent state:SyncConnected type:NodeDataChanged path:/collections/collection1/state.json] for collection [collection1] has occurred - updating... (live nodes size: [3])
   [junit4]   2> 799825 INFO  (zkCallback-1060-thread-1) [    ] o.a.s.c.c.ZkStateReader A cluster state change: [WatchedEvent state:SyncConnected type:NodeDataChanged path:/collections/collection1/state.json] for collection [collection1] has occurred - updating... (live nodes size: [3])
   [junit4]   2> 800113 INFO  (TEST-ForceLeaderTest.testReplicasInLIRNoLeader-seed#[6D769DA18FE00175]) [    ] o.a.s.c.AbstractFullDistribZkTestBase create jetty 3 in directory C:\Users\jenkins\workspace\Lucene-Solr-master-Windows\solr\build\solr-core\test\J0\temp\solr.cloud.ForceLeaderTest_6D769DA18FE00175-001\shard-3-001 of type TLOG
   [junit4]   2> 800115 INFO  (TEST-ForceLeaderTest.testReplicasInLIRNoLeader-seed#[6D769DA18FE00175]) [    ] o.e.j.s.Server jetty-9.3.20.v20170531
   [junit4]   2> 800115 INFO  (TEST-ForceLeaderTest.testReplicasInLIRNoLeader-seed#[6D769DA18FE00175]) [    ] o.e.j.s.h.ContextHandler Started o.e.j.s.ServletContextHandler@b2a305{/,null,AVAILABLE}
   [junit4]   2> 800116 INFO  (TEST-ForceLeaderTest.testReplicasInLIRNoLeader-seed#[6D769DA18FE00175]) [    ] o.e.j.s.AbstractConnector Started ServerConnector@4c38cc{HTTP/1.1,[http/1.1]}{127.0.0.1:53187}
   [junit4]   2> 800116 INFO  (TEST-ForceLeaderTest.testReplicasInLIRNoLeader-seed#[6D769DA18FE00175]) [    ] o.e.j.s.Server Started @809078ms
   [junit4]   2> 800117 INFO  (TEST-ForceLeaderTest.testReplicasInLIRNoLeader-seed#[6D769DA18FE00175]) [    ] o.a.s.c.s.e.JettySolrRunner Jetty properties: {hostContext=/, solrconfig=solrconfig.xml, solr.data.dir=C:\Users\jenkins\workspace\Lucene-Solr-master-Windows\solr\build\solr-core\test\J0\temp\solr.cloud.ForceLeaderTest_6D769DA18FE00175-001\tempDir-001/jetty3, hostPort=53186, coreRootDirectory=C:\Users\jenkins\workspace\Lucene-Solr-master-Windows\solr\build\solr-core\test\J0\temp\solr.cloud.ForceLeaderTest_6D769DA18FE00175-001\shard-3-001\cores, replicaType=TLOG}
   [junit4]   2> 800117 ERROR (TEST-ForceLeaderTest.testReplicasInLIRNoLeader-seed#[6D769DA18FE00175]) [    ] o.a.s.u.StartupLoggingUtils Missing Java Option solr.log.dir. Logging may be missing or incomplete.
   [junit4]   2> 800117 INFO  (TEST-ForceLeaderTest.testReplicasInLIRNoLeader-seed#[6D769DA18FE00175]) [    ] o.a.s.s.SolrDispatchFilter  ___      _       Welcome to Apache Solr? version 8.0.0
   [junit4]   2> 800118 INFO  (TEST-ForceLeaderTest.testReplicasInLIRNoLeader-seed#[6D769DA18FE00175]) [    ] o.a.s.s.SolrDispatchFilter / __| ___| |_ _   Starting in cloud mode on port null
   [junit4]   2> 800118 INFO  (TEST-ForceLeaderTest.testReplicasInLIRNoLeader-seed#[6D769DA18FE00175]) [    ] o.a.s.s.SolrDispatchFilter \__ \/ _ \ | '_|  Install dir: null, Default config dir: null
   [junit4]   2> 800118 INFO  (TEST-ForceLeaderTest.testReplicasInLIRNoLeader-seed#[6D769DA18FE00175]) [    ] o.a.s.s.SolrDispatchFilter |___/\___/_|_|    Start time: 2017-08-26T12:39:08.408502300Z
   [junit4]   2> 800126 INFO  (TEST-ForceLeaderTest.testReplicasInLIRNoLeader-seed#[6D769DA18FE00175]) [    ] o.a.s.s.SolrDispatchFilter Loading solr.xml from SolrHome (not found in ZooKeeper)
   [junit4]   2> 800126 INFO  (TEST-ForceLeaderTest.testReplicasInLIRNoLeader-seed#[6D769DA18FE00175]) [    ] o.a.s.c.SolrXmlConfig Loading container configuration from C:\Users\jenkins\workspace\Lucene-Solr-master-Windows\solr\build\solr-core\test\J0\temp\solr.cloud.ForceLeaderTest_6D769DA18FE00175-001\shard-3-001\solr.xml
   [junit4]   2> 800132 INFO  (TEST-ForceLeaderTest.testReplicasInLIRNoLeader-seed#[6D769DA18FE00175]) [    ] o.a.s.c.SolrXmlConfig MBean server found: com.sun.jmx.mbeanserver.JmxMBeanServer@14a0586, but no JMX reporters were configured - adding default JMX reporter.
   [junit4]   2> 800135 INFO  (TEST-ForceLeaderTest.testReplicasInLIRNoLeader-seed#[6D769DA18FE00175]) [    ] o.a.s.c.ZkContainer Zookeeper client=127.0.0.1:53092/solr
   [junit4]   2> 800138 WARN  (NIOServerCxn.Factory:0.0.0.0/0.0.0.0:0) [    ] o.a.z.s.NIOServerCnxn caught end of stream exception
   [junit4]   2> EndOfStreamException: Unable to read additional data from client sessionid 0x15e1e8d7313000e, likely client has closed socket
   [junit4]   2> 	at org.apache.zookeeper.server.NIOServerCnxn.doIO(NIOServerCnxn.java:239)
   [junit4]   2> 	at org.apache.zookeeper.server.NIOServerCnxnFactory.run(NIOServerCnxnFactory.java:203)
   [junit4]   2> 	at java.base/java.lang.Thread.run(Thread.java:844)
   [junit4]   2> 800148 INFO  (TEST-ForceLeaderTest.testReplicasInLIRNoLeader-seed#[6D769DA18FE00175]) [    ] o.a.s.c.c.ZkStateReader Updated live nodes from ZooKeeper... (0) -> (3)
   [junit4]   2> 800150 INFO  (TEST-ForceLeaderTest.testReplicasInLIRNoLeader-seed#[6D769DA18FE00175]) [    ] o.a.s.c.Overseer Overseer (id=null) closing
   [junit4]   2> 800153 INFO  (TEST-ForceLeaderTest.testReplicasInLIRNoLeader-seed#[6D769DA18FE00175]) [    ] o.a.s.c.ZkController Register node as live in ZooKeeper:/live_nodes/127.0.0.1:53186_
   [junit4]   2> 800155 INFO  (zkCallback-1049-thread-1) [    ] o.a.s.c.c.ZkStateReader Updated live nodes from ZooKeeper... (3) -> (4)
   [junit4]   2> 800155 INFO  (zkCallback-1054-thread-1) [    ] o.a.s.c.c.ZkStateReader Updated live nodes from ZooKeeper... (3) -> (4)
   [junit4]   2> 800155 INFO  (zkCallback-1066-thread-1) [    ] o.a.s.c.c.ZkStateReader Updated live nodes from ZooKeeper... (3) -> (4)
   [junit4]   2> 800155 INFO  (zkCallback-1042-thread-2) [    ] o.a.s.c.c.ZkStateReader Updated live nodes from ZooKeeper... (3) -> (4)
   [junit4]   2> 800155 INFO  (zkCallback-1060-thread-1) [    ] o.a.s.c.c.ZkStateReader Updated live nodes from ZooKeeper... (3) -> (4)
   [junit4]   2> 800294 INFO  (OverseerCollectionConfigSetProcessor-98549834718576644-127.0.0.1:53099_-n_0000000000) [    ] o.a.s.c.OverseerTaskQueue Response ZK path: /overseer/collection-queue-work/qnr-0000000006 doesn't exist.  Requestor may have disconnected from ZooKeeper
   [junit4]   2> 800350 INFO  (TEST-ForceLeaderTest.testReplicasInLIRNoLeader-seed#[6D769DA18FE00175]) [    ] o.a.s.m.r.SolrJmxReporter JMX monitoring for 'solr.node' (registry 'solr.node') enabled at server: com.sun.jmx.mbeanserver.JmxMBeanServer@14a0586
   [junit4]   2> 800360 INFO  (TEST-ForceLeaderTest.testReplicasInLIRNoLeader-seed#[6D769DA18FE00175]) [    ] o.a.s.m.r.SolrJmxReporter JMX monitoring for 'solr.jvm' (registry 'solr.jvm') enabled at server: com.sun.jmx.mbeanserver.JmxMBeanServer@14a0586
   [junit4]   2> 800360 INFO  (TEST-ForceLeaderTest.testReplicasInLIRNoLeader-seed#[6D769DA18FE00175]) [    ] o.a.s.m.r.SolrJmxReporter JMX monitoring for 'solr.jetty' (registry 'solr.jetty') enabled at server: com.sun.jmx.mbeanserver.JmxMBeanServer@14a0586
   [junit4]   2> 800362 INFO  (TEST-ForceLeaderTest.testReplicasInLIRNoLeader-seed#[6D769DA18FE00175]) [    ] o.a.s.c.CorePropertiesLocator Found 0 core definitions underneath C:\Users\jenkins\workspace\Lucene-Solr-master-Windows\solr\build\solr-core\test\J0\temp\solr.cloud.ForceLeaderTest_6D769DA18FE00175-001\shard-3-001\cores
   [junit4]   2> 800422 INFO  (SocketProxy-Acceptor-53186) [    ] o.a.s.c.SocketProxy accepted Socket[addr=/127.0.0.1,port=53199,localport=53186], receiveBufferSize:65536
   [junit4]   2> 800422 INFO  (SocketProxy-Acceptor-53186) [    ] o.a.s.c.SocketProxy proxy connection Socket[addr=/127.0.0.1,port=53187,localport=53200], receiveBufferSize=65536
   [junit4]   2> 800425 INFO  (qtp20638262-6384) [    ] o.a.s.h.a.CollectionsHandler Invoked Collection Action :addreplica with params node=127.0.0.1:53186_&action=ADDREPLICA&collection=collection1&shard=shard2&type=TLOG&wt=javabin&version=2 and sendToOCPQueue=true
   [junit4]   2> 800433 INFO  (OverseerThreadFactory-2683-thread-5) [    ] o.a.s.c.AddReplicaCmd Node Identified 127.0.0.1:53186_ for creating new replica
   [junit4]   2> 800436 INFO  (SocketProxy-Acceptor-53186) [    ] o.a.s.c.SocketProxy accepted Socket[addr=/127.0.0.1,port=53201,localport=53186], receiveBufferSize:65536
   [junit4]   2> 800436 INFO  (SocketProxy-Acceptor-53186) [    ] o.a.s.c.SocketProxy proxy connection Socket[addr=/127.0.0.1,port=53187,localport=53202], receiveBufferSize=65536
   [junit4]   2> 800438 INFO  (qtp20638262-6382) [    ] o.a.s.h.a.CoreAdminOperation core create command qt=/admin/cores&collection.configName=conf1&name=collection1_shard2_replica_t45&action=CREATE&collection=collection1&shard=shard2&wt=javabin&version=2&replicaType=TLOG
   [junit4]   2> 800438 INFO  (qtp20638262-6382) [    ] o.a.s.c.TransientSolrCoreCacheDefault Allocating transient cache for 4 transient cores
   [junit4]   2> 800546 INFO  (zkCallback-1054-thread-1) [    ] o.a.s.c.c.ZkStateReader A cluster state change: [WatchedEvent state:SyncConnected type:NodeDataChanged path:/collections/collection1/state.json] for collection [collection1] has occurred - updating... (live nodes size: [4])
   [junit4]   2> 800546 INFO  (zkCallback-1066-thread-1) [    ] o.a.s.c.c.ZkStateReader A cluster state change: [WatchedEvent state:SyncConnected type:NodeDataChanged path:/collections/collection1/state.json] for collection [collection1] has occurred - updating... (live nodes size: [4])
   [junit4]   2> 800546 INFO  (zkCallback-1060-thread-1) [    ] o.a.s.c.c.ZkStateReader A cluster state change: [WatchedEvent state:SyncConnected type:NodeDataChanged path:/collections/collection1/state.json] for collection [collection1] has occurred - updating... (live nodes size: [4])
   [junit4]   2> 801454 INFO  (qtp20638262-6382) [    ] o.a.s.c.SolrConfig Using Lucene MatchVersion: 8.0.0
   [junit4]   2> 801468 INFO  (qtp20638262-6382) [    ] o.a.s.s.IndexSchema [collection1_shard2_replica_t45] Schema name=test
   [junit4]   2> 801554 INFO  (qtp20638262-6382) [    ] o.a.s.s.IndexSchema Loaded schema test/1.0 with uniqueid field id
   [junit4]   2> 801576 INFO  (qtp20638262-6382) [    ] o.a.s.c.CoreContainer Creating SolrCore 'collection1_shard2_replica_t45' using configuration from collection collection1, trusted=true
   [junit4]   2> 801577 INFO  (qtp20638262-6382) [    ] o.a.s.m.r.SolrJmxReporter JMX monitoring for 'solr.core.collection1.shard2.replica_t45' (registry 'solr.core.collection1.shard2.replica_t45') enabled at server: com.sun.jmx.mbeanserver.JmxMBeanServer@14a0586
   [junit4]   2> 801577 INFO  (qtp20638262-6382) [    ] o.a.s.c.SolrCore solr.RecoveryStrategy.Builder
   [junit4]   2> 801577 INFO  (qtp20638262-6382) [    ] o.a.s.c.SolrCore [[collection1_shard2_replica_t45] ] Opening new SolrCore at [C:\Users\jenkins\workspace\Lucene-Solr-master-Windows\solr\build\solr-core\test\J0\temp\solr.cloud.ForceLeaderTest_6D769DA18FE00175-001\shard-3-001\cores\collection1_shard2_replica_t45], dataDir=[C:\Users\jenkins\workspace\Lucene-Solr-master-Windows\solr\build\solr-core\test\J0\temp\solr.cloud.ForceLeaderTest_6D769DA18FE00175-001\shard-3-001\cores\collection1_shard2_replica_t45\data\]
   [junit4]   2> 801580 INFO  (qtp20638262-6382) [    ] o.a.s.u.RandomMergePolicy RandomMergePolicy wrapping class org.apache.lucene.index.TieredMergePolicy: [TieredMergePolicy: maxMergeAtOnce=33, maxMergeAtOnceExplicit=33, maxMergedSegmentMB=16.2978515625, floorSegmentMB=0.271484375, forceMergeDeletesPctAllowed=13.93876620708393, segmentsPerTier=19.0, maxCFSSegmentSizeMB=8.796093022207999E12, noCFSRatio=0.0
   [junit4]   2> 801582 WARN  (qtp20638262-6382) [    ] o.a.s.c.RequestHandlers INVALID paramSet a in requestHandler {type = requestHandler,name = /dump,class = DumpRequestHandler,attributes = {initParams=a, name=/dump, class=DumpRequestHandler},args = {defaults={a=A,b=B}}}
   [junit4]   2> 801673 INFO  (qtp20638262-6382) [    ] o.a.s.u.UpdateHandler Using UpdateLog implementation: org.apache.solr.update.UpdateLog
   [junit4]   2> 801673 INFO  (qtp20638262-6382) [    ] o.a.s.u.UpdateLog Initializing UpdateLog: dataDir= defaultSyncLevel=FLUSH numRecordsToKeep=100 maxNumLogsToKeep=10 numVersionBuckets=65536
   [junit4]   2> 801692 INFO  (qtp20638262-6382) [    ] o.a.s.u.CommitTracker Hard AutoCommit: disabled
   [junit4]   2> 801692 INFO  (qtp20638262-6382) [    ] o.a.s.u.CommitTracker Soft AutoCommit: disabled
   [junit4]   2> 801694 INFO  (qtp20638262-6382) [    ] o.a.s.u.RandomMergePolicy RandomMergePolicy wrapping class org.apache.lucene.index.LogByteSizeMergePolicy: [LogByteSizeMergePolicy: minMergeSize=1677721, mergeFactor=23, maxMergeSize=2147483648, maxMergeSizeForForcedMerge=9223372036854775807, calibrateSizeByDeletes=true, maxMergeDocs=2147483647, maxCFSSegmentSizeMB=8.796093022207999E12, noCFSRatio=0.0]
   [junit4]   2> 801694 INFO  (qtp20638262-6382) [    ] o.a.s.s.SolrIndexSearcher Opening [Searcher@87dfd4[collection1_shard2_replica_t45] main]
   [junit4]   2> 801696 INFO  (qtp20638262-6382) [    ] o.a.s.r.ManagedResourceStorage Configured ZooKeeperStorageIO with znodeBase: /configs/conf1
   [junit4]   2> 801697 INFO  (qtp20638262-6382) [    ] o.a.s.r.ManagedResourceStorage Loaded null at path _rest_managed.json using ZooKeeperStorageIO:path=/configs/conf1
   [junit4]   2> 801698 INFO  (qtp20638262-6382) [    ] o.a.s.h.ReplicationHandler Commits will be reserved for  10000
   [junit4]   2> 801698 INFO  (qtp20638262-6382) [    ] o.a.s.u.UpdateLog Could not find max version in index or recent updates, using new clock 1576797365849817088
   [junit4]   2> 801703 INFO  (searcherExecutor-2719-thread-1) [    ] o.a.s.c.SolrCore [collection1_shard2_replica_t45] Registered new searcher Searcher@87dfd4[collection1_shard2_replica_t45] main{ExitableDirectoryReader(UninvertingDirectoryReader())}
   [junit4]   2> 801704 INFO  (qtp20638262-6382) [    ] o.a.s.c.ZkController Core needs to recover:collection1_shard2_replica_t45
   [junit4]   2> 801705 INFO  (qtp20638262-6382) [    ] o.a.s.s.HttpSolrCall [admin] webapp=null path=/admin/cores params={qt=/admin/cores&collection.configName=conf1&name=collection1_shard2_replica_t45&action=CREATE&collection=collection1&shard=shard2&wt=javabin&version=2&replicaType=TLOG} status=0 QTime=1267
   [junit4]   2> 801705 INFO  (updateExecutor-1063-thread-1) [    ] o.a.s.u.DefaultSolrCoreState Running recovery
   [junit4]   2> 801706 INFO  (recoveryExecutor-1064-thread-1) [    ] o.a.s.c.RecoveryStrategy Starting recovery process. recoveringAfterStartup=true
   [junit4]   2> 801706 INFO  (recoveryExecutor-1064-thread-1) [    ] o.a.s.c.RecoveryStrategy ###### startupVersions=[[]]
   [junit4]   2> 801706 INFO  (recoveryExecutor-1064-thread-1) [    ] o.a.s.c.ZkController collection1_shard2_replica_t45 stopping background replication from leader
   [junit4]   2> 801706 INFO  (recoveryExecutor-1064-thread-1) [    ] o.a.s.c.RecoveryStrategy Begin buffering updates. core=[collection1_shard2_replica_t45]
   [junit4]   2> 801706 INFO  (recoveryExecutor-1064-thread-1) [    ] o.a.s.u.UpdateLog Starting to buffer updates. FSUpdateLog{state=ACTIVE, tlog=null}
   [junit4]   2> 801706 INFO  (recoveryExecutor-1064-thread-1) [    ] o.a.s.c.RecoveryStrategy Publishing state of core [collection1_shard2_replica_t45] as recovering, leader is [http://127.0.0.1:53130/collection1_shard2_replica_t41/] and I am [http://127.0.0.1:53186/collection1_shard2_replica_t45/]
   [junit4]   2> 801710 INFO  (recoveryExecutor-1064-thread-1) [    ] o.a.s.c.RecoveryStrategy Sending prep recovery command to [http://127.0.0.1:53130]; [WaitForState: action=PREPRECOVERY&core=collection1_shard2_replica_t41&nodeName=127.0.0.1:53186_&coreNodeName=core_node46&state=recovering&checkLive=true&onlyIfLeader=true&onlyIfLeaderActive=true]
   [junit4]   2> 801710 INFO  (qtp20638262-6384) [    ] o.a.s.s.HttpSolrCall [admin] webapp=null path=/admin/collections params={node=127.0.0.1:53186_&action=ADDREPLICA&collection=collection1&shard=shard2&type=TLOG&wt=javabin&version=2} status=0 QTime=1284
   [junit4]   2> 801715 INFO  (TEST-ForceLeaderTest.testReplicasInLIRNoLeader-seed#[6D769DA18FE00175]) [    ] o.a.s.SolrTestCaseJ4 ###Starting testReplicasInLIRNoLeader
   [junit4]   2> 801715 INFO  (SocketProxy-Acceptor-53130) [    ] o.a.s.c.SocketProxy accepted Socket[addr=/127.0.0.1,port=53207,localport=53130], receiveBufferSize:65536
   [junit4]   2> 801715 INFO  (SocketProxy-Acceptor-53130) [    ] o.a.s.c.SocketProxy proxy connection Socket[addr=/127.0.0.1,port=53131,localport=53208], receiveBufferSize=65536
   [junit4]   2> 801718 INFO  (qtp27323691-6315) [    ] o.a.s.h.a.PrepRecoveryOp Going to wait for coreNodeName: core_node46, state: recovering, checkLive: true, onlyIfLeader: true, onlyIfLeaderActive: true, maxTime: 183 s
   [junit4]   2> 801719 INFO  (SocketProxy-Acceptor-53130) [    ] o.a.s.c.SocketProxy accepted Socket[addr=/127.0.0.1,port=53209,localport=53130], receiveBufferSize:65536
   [junit4]   2> 801719 INFO  (qtp27323691-6315) [    ] o.a.s.h.a.PrepRecoveryOp In WaitForState(recovering): collection=collection1, shard=shard2, thisCore=collection1_shard2_replica_t41, leaderDoesNotNeedRecovery=false, isLeader? true, live=true, checkLive=true, currentState=down, localState=active, nodeName=127.0.0.1:53186_, coreNodeName=core_node46, onlyIfActiveCheckResult=false, nodeProps: core_node46:{"core":"collection1_shard2_replica_t45","base_url":"http://127.0.0.1:53186","node_name":"127.0.0.1:53186_","state":"down","type":"TLOG"}
   [junit4]   2> 801720 INFO  (SocketProxy-Acceptor-53130) [    ] o.a.s.c.SocketProxy proxy connection Socket[addr=/127.0.0.1,port=53131,localport=53210], receiveBufferSize=65536
   [junit4]   2> 801722 INFO  (qtp27323691-6319) [    ] o.a.s.h.a.CollectionsHandler Invoked Collection Action :create with params pullReplicas=0&maxShardsPerNode=1&collection.configName=conf1&nrtReplicas=0&name=forceleader_test_collection&action=CREATE&numShards=1&tlogReplicas=3&wt=javabin&version=2 and sendToOCPQueue=true
   [junit4]   2> 801724 INFO  (OverseerThreadFactory-2683-thread-5) [    ] o.a.s.c.CreateCollectionCmd Create collection forceleader_test_collection
   [junit4]   2> 801724 INFO  (OverseerCollectionConfigSetProcessor-98549834718576644-127.0.0.1:53099_-n_0000000000) [    ] o.a.s.c.OverseerTaskQueue Response ZK path: /overseer/collection-queue-work/qnr-0000000008 doesn't exist.  Requestor may have disconnected from ZooKeeper
   [junit4]   2> 801833 INFO  (zkCallback-1054-thread-1) [    ] o.a.s.c.c.ZkStateReader A cluster state change: [WatchedEvent state:SyncConnected type:NodeDataChanged path:/collections/collection1/state.json] for collection [collection1] has occurred - updating... (live nodes size: [4])
   [junit4]   2> 801835 INFO  (zkCallback-1060-thread-1) [    ] o.a.s.c.c.ZkStateReader A cluster state change: [WatchedEvent state:SyncConnected type:NodeDataChanged path:/collections/collection1/state.json] for collection [collection1] has occurred - updating... (live nodes size: [4])
   [junit4]   2> 801833 INFO  (zkCallback-1066-thread-1) [    ] o.a.s.c.c.ZkStateReader A cluster state change: [WatchedEvent state:SyncConnected type:NodeDataChanged path:/collections/collection1/state.json] for collection [collection1] has occurred - updating... (live nodes size: [4])
   [junit4]   2> 801934 INFO  (qtp27323691-6318) [    ] o.a.s.h.a.CoreAdminOperation core create command qt=/admin/cores&collection.configName=conf1&newCollection=true&name=forceleader_test_collection_shard1_replica_t1&action=CREATE&numShards=1&collection=forceleader_test_collection&shard=shard1&wt=javabin&version=2&replicaType=TLOG
   [junit4]   2> 801939 INFO  (qtp20638262-6381) [    ] o.a.s.h.a.CoreAdminOperation core create command qt=/admin/cores&collection.configName=conf1&newCollection=true&name=forceleader_test_collection_shard1_replica_t2&action=CREATE&numShards=1&collection=forceleader_test_collection&shard=shard1&wt=javabin&version=2&replicaType=TLOG
   [junit4]   2> 801940 INFO  (qtp8210717-6349) [    ] o.a.s.h.a.CoreAdminOperation core create command qt=/admin/cores&collection.configName=conf1&newCollection=true&name=forceleader_test_collection_shard1_replica_t3&action=CREATE&numShards=1&collection=forceleader_test_collection&shard=shard1&wt=javabin&version=2&replicaType=TLOG
   [junit4]   2> 802050 INFO  (zkCallback-1054-thread-1) [    ] o.a.s.c.c.ZkStateReader A cluster state change: [WatchedEvent state:SyncConnected type:NodeDataChanged path:/collections/forceleader_test_collection/state.json] for collection [forceleader_test_collection] has occurred - updating... (live nodes size: [4])
   [junit4]   2> 802050 INFO  (zkCallback-1066-thread-1) [    ] o.a.s.c.c.ZkStateReader A cluster state change: [WatchedEvent state:SyncConnected type:NodeDataChanged path:/collections/forceleader_test_collection/state.json] for collection [forceleader_test_collection] has occurred - updating... (live nodes size: [4])
   [junit4]   2> 802050 INFO  (zkCallback-1060-thread-1) [    ] o.a.s.c.c.ZkStateReader A cluster state change: [WatchedEvent state:SyncConnected type:NodeDataChanged path:/collections/forceleader_test_collection/state.json] for collection [forceleader_test_collection] has occurred - updating... (live nodes size: [4])
   [junit4]   2> 802719 INFO  (qtp27323691-6315) [    ] o.a.s.h.a.PrepRecoveryOp In WaitForState(recovering): collection=collection1, shard=shard2, thisCore=collection1_shard2_replica_t41, leaderDoesNotNeedRecovery=false, isLeader? true, live=true, checkLive=true, currentState=recovering, localState=active, nodeName=127.0.0.1:53186_, coreNodeName=core_node46, onlyIfActiveCheckResult=false, nodeProps: core_node46:{"core":"collection1_shard2_replica_t45","base_url":"http://127.0.0.1:53186","node_name":"127.0.0.1:53186_","state":"recovering","type":"TLOG"}
   [junit4]   2> 802719 INFO  (qtp27323691-6315) [    ] o.a.s.h.a.PrepRecoveryOp Waited coreNodeName: core_node46, state: recovering, checkLive: true, onlyIfLeader: true for: 1 seconds.
   [junit4]   2> 802719 INFO  (qtp27323691-6315) [    ] o.a.s.s.HttpSolrCall [admin] webapp=null path=/admin/cores params={nodeName=127.0.0.1:53186_&onlyIfLeaderActive=true&core=collection1_shard2_replica_t41&coreNodeName=core_node46&action=PREPRECOVERY&checkLive=true&state=recovering&onlyIfLeader=true&wt=javabin&version=2} status=0 QTime=1000
   [junit4]   2> 802956 INFO  (qtp27323691-6318) [    ] o.a.s.c.SolrConfig Using Lucene MatchVersion: 8.0.0
   [junit4]   2> 802959 INFO  (qtp20638262-6381) [    ] o.a.s.c.SolrConfig Using Lucene MatchVersion: 8.0.0
   [junit4]   2> 802965 INFO  (qtp8210717-6349) [    ] o.a.s.c.SolrConfig Using Lucene MatchVersion: 8.0.0
   [junit4]   2> 802979 INFO  (qtp20638262-6381) [    ] o.a.s.s.IndexSchema [forceleader_test_collection_shard1_replica_t2] Schema name=test
   [junit4]   2> 802979 INFO  (qtp27323691-6318) [    ] o.a.s.s.IndexSchema [forceleader_test_collection_shard1_replica_t1] Schema name=test
   [junit4]   2> 802982 INFO  (qtp8210717-6349) [    ] o.a.s.s.IndexSchema [forceleader_test_collection_shard1_replica_t3] Schema name=test
   [junit4]   2> 803132 INFO  (qtp20638262-6381) [    ] o.a.s.s.IndexSchema Loaded schema test/1.0 with uniqueid field id
   [junit4]   2> 803152 INFO  (qtp27323691-6318) [    ] o.a.s.s.IndexSchema Loaded schema test/1.0 with uniqueid field id
   [junit4]   2> 803154 INFO  (qtp8210717-6349) [    ] o.a.s.s.IndexSchema Loaded schema test/1.0 with uniqueid field id
   [junit4]   2> 803178 INFO  (qtp20638262-6381) [    ] o.a.s.c.CoreContainer Creating SolrCore 'forceleader_test_collection_shard1_replica_t2' using configuration from collection forceleader_test_collection, trusted=true
   [junit4]   2> 803179 INFO  (qtp20638262-6381) [    ] o.a.s.m.r.SolrJmxReporter JMX monitoring for 'solr.core.forceleader_test_collection.shard1.replica_t2' (registry 'solr.core.forceleader_test_collection.shard1.replica_t2') enabled at server: com.sun.jmx.mbeanserver.JmxMBeanServer@14a0586
   [junit4]   2> 803179 INFO  (qtp20638262-6381) [    ] o.a.s.c.SolrCore solr.RecoveryStrategy.Builder
   [junit4]   2> 803179 INFO  (qtp20638262-6381) [    ] o.a.s.c.SolrCore [[forceleader_test_collection_shard1_replica_t2] ] Opening new SolrCore at [C:\Users\jenkins\workspace\Lucene-Solr-master-Windows\solr\build\solr-core\test\J0\temp\solr.cloud.ForceLeaderTest_6D769DA18FE00175-001\shard-3-001\cores\forceleader_test_collection_shard1_replica_t2], dataDir=[C:\Users\jenkins\workspace\Lucene-Solr-master-Windows\solr\build\solr-core\test\J0\temp\solr.cloud.ForceLeaderTest_6D769DA18FE00175-001\shard-3-001\cores\forceleader_test_collection_shard1_replica_t2\data\]
   [junit4]   2> 803185 INFO  (qtp20638262-6381) [    ] o.a.s.u.RandomMergePolicy RandomMergePolicy wrapping class org.apache.lucene.index.TieredMergePolicy: [TieredMergePolicy: maxMergeAtOnce=33, maxMergeAtOnceExplicit=33, maxMergedSegmentMB=16.2978515625, floorSegmentMB=0.271484375, force

[...truncated too long message...]

s.SolrSlf4jReporterTest_6D769DA18FE00175-001\init-core-data-001
   [junit4]   2> 2844622 INFO  (SUITE-SolrSlf4jReporterTest-seed#[6D769DA18FE00175]-worker) [    ] o.a.s.SolrTestCaseJ4 Using PointFields (NUMERIC_POINTS_SYSPROP=true) w/NUMERIC_DOCVALUES_SYSPROP=false
   [junit4]   2> 2844624 INFO  (SUITE-SolrSlf4jReporterTest-seed#[6D769DA18FE00175]-worker) [    ] o.a.s.SolrTestCaseJ4 Randomized ssl (false) and clientAuth (false) via: @org.apache.solr.util.RandomizeSSL(reason="", value=0.0/0.0, ssl=0.0/0.0, clientAuth=0.0/0.0)
   [junit4]   2> 2844626 INFO  (TEST-SolrSlf4jReporterTest.testReporter-seed#[6D769DA18FE00175]) [    ] o.a.s.SolrTestCaseJ4 ###Starting testReporter
   [junit4]   2> 2850987 INFO  (TEST-SolrSlf4jReporterTest.testReporter-seed#[6D769DA18FE00175]) [    ] o.a.s.SolrTestCaseJ4 ###Ending testReporter
   [junit4]   2> NOTE: reproduce with: ant test  -Dtestcase=SolrSlf4jReporterTest -Dtests.method=testReporter -Dtests.seed=6D769DA18FE00175 -Dtests.slow=true -Dtests.locale=se -Dtests.timezone=Portugal -Dtests.asserts=true -Dtests.file.encoding=ISO-8859-1
   [junit4] FAILURE 6.37s J0 | SolrSlf4jReporterTest.testReporter <<<
   [junit4]    > Throwable #1: java.lang.AssertionError: count1=6, count2=6 - no 'solr.node' logs in: {numFound=0,start=0,docs=[]}
   [junit4]    > 	at __randomizedtesting.SeedInfo.seed([6D769DA18FE00175:3292B096E4EC9230]:0)
   [junit4]    > 	at org.apache.solr.metrics.reporters.SolrSlf4jReporterTest.testReporter(SolrSlf4jReporterTest.java:90)
   [junit4]    > 	at java.base/jdk.internal.reflect.NativeMethodAccessorImpl.invoke0(Native Method)
   [junit4]    > 	at java.base/jdk.internal.reflect.NativeMethodAccessorImpl.invoke(NativeMethodAccessorImpl.java:62)
   [junit4]    > 	at java.base/jdk.internal.reflect.DelegatingMethodAccessorImpl.invoke(DelegatingMethodAccessorImpl.java:43)
   [junit4]    > 	at java.base/java.lang.reflect.Method.invoke(Method.java:564)
   [junit4]    > 	at java.base/java.lang.Thread.run(Thread.java:844)
   [junit4]   2> 2850989 INFO  (SUITE-SolrSlf4jReporterTest-seed#[6D769DA18FE00175]-worker) [    ] o.a.s.SolrTestCaseJ4 ###deleteCore
   [junit4]   2> NOTE: leaving temporary files on disk at: C:\Users\jenkins\workspace\Lucene-Solr-master-Windows\solr\build\solr-core\test\J0\temp\solr.metrics.reporters.SolrSlf4jReporterTest_6D769DA18FE00175-001
   [junit4]   2> NOTE: test params are: codec=Asserting(Lucene70): {}, docValues:{}, maxPointsInLeafNode=627, maxMBSortInHeap=5.166944047916304, sim=RandomSimilarity(queryNorm=false): {}, locale=se, timezone=Portugal
   [junit4]   2> NOTE: Windows 10 10.0 x86/Oracle Corporation 9 (32-bit)/cpus=3,threads=1,free=222968104,total=429355008
   [junit4]   2> NOTE: All tests run in this JVM: [RollingRestartTest, SaslZkACLProviderTest, DateRangeFieldTest, TestJsonRequest, TestCloudNestedDocsSort, CursorMarkTest, ExitableDirectoryReaderTest, SuggestComponentContextFilterQueryTest, TestSolr4Spatial2, TestJmxIntegration, UpdateLogTest, TestNumericRangeQuery64, RequestLoggingTest, TestRequestForwarding, TestCloudManagedSchema, SolrJmxReporterTest, TestMultiWordSynonyms, SimpleFacetsTest, TestDistribDocBasedVersion, TestLegacyNumericUtils, TestRestManager, OverseerStatusTest, HighlighterConfigTest, TestFieldSortValues, TestReversedWildcardFilterFactory, DirectUpdateHandlerOptimizeTest, OverseerTest, TestGroupingSearch, TestUseDocValuesAsStored, TestWriterPerf, DistributedFacetPivotSmallTest, TestRuleBasedAuthorizationPlugin, TestUniqueKeyFieldResource, TestEmbeddedSolrServerConstructors, InfoHandlerTest, TestChildDocTransformer, TolerantUpdateProcessorTest, RegexBoostProcessorTest, TestSolrFieldCacheBean, SolrMetricsIntegrationTest, TestMacroExpander, TestCursorMarkWithoutUniqueKey, TestSystemCollAutoCreate, OverseerModifyCollectionTest, ResponseLogComponentTest, TestUpdate, TestRebalanceLeaders, TestCloudRecovery, TestSchemaVersionResource, BasicDistributedZkTest, TestStressInPlaceUpdates, IndexSchemaTest, TestSolrCloudSnapshots, TimeZoneUtilsTest, DistribCursorPagingTest, TestFuzzyAnalyzedSuggestions, DeleteShardTest, ResourceLoaderTest, SharedFSAutoReplicaFailoverTest, TestSolrCloudWithDelegationTokens, TestCollapseQParserPlugin, DocValuesTest, DistribJoinFromCollectionTest, TestClusterProperties, SimplePostToolTest, AnalysisAfterCoreReloadTest, SuggesterTest, DistanceFunctionTest, TestLRUStatsCache, FullHLLTest, DistributedSuggestComponentTest, TestPHPSerializedResponseWriter, TestDynamicFieldResource, ChaosMonkeyNothingIsSafeTest, CollectionsAPISolrJTest, ForceLeaderTest, TestCryptoKeys, TestPerFieldSimilarityWithDefaultOverride, PathHierarchyTokenizerFactoryTest, TestExactSharedStatsCache, PropertiesRequestHandlerTest, SolrIndexSplitterTest, SolrCloudExampleTest, TestReRankQParserPlugin, TestSweetSpotSimilarityFactory, TestCSVResponseWriter, TestLazyCores, BlockJoinFacetDistribTest, SolrGraphiteReporterTest, BinaryUpdateRequestHandlerTest, TestHighFrequencyDictionaryFactory, AddSchemaFieldsUpdateProcessorFactoryTest, TestConfigSetProperties, AnalysisErrorHandlingTest, NodeMutatorTest, TestStressVersions, TestManagedResource, RemoteQueryErrorTest, TestShortCircuitedRequests, ReplicationFactorTest, TestPhraseSuggestions, TestLMDirichletSimilarityFactory, MergeStrategyTest, TestMultiValuedNumericRangeQuery, CdcrReplicationHandlerTest, TestGraphMLResponseWriter, TestConfigOverlay, TestIntervalFaceting, HdfsTlogReplayBufferedWhileIndexingTest, FieldAnalysisRequestHandlerTest, TestInfoStreamLogging, TestPullReplica, NotRequiredUniqueKeyTest, SoftAutoCommitTest, ChaosMonkeySafeLeaderWithPullReplicasTest, TestSortByMinMaxFunction, TestCoreContainer, SolrIndexMetricsTest, V2StandaloneTest, TestStressRecovery, TestOnReconnectListenerSupport, SortByFunctionTest, TestInitQParser, RequestHandlersTest, PeerSyncTest, TestGraphTermsQParserPlugin, WordBreakSolrSpellCheckerTest, AsyncCallRequestStatusResponseTest, ScriptEngineTest, TestUtils, LeaderFailoverAfterPartitionTest, SolrCoreTest, TestHdfsBackupRestoreCore, OverriddenZkACLAndCredentialsProvidersTest, TestFieldCacheSortRandom, BlockJoinFacetSimpleTest, OutputWriterTest, TestSolrCloudWithSecureImpersonation, HdfsRecoveryZkTest, PrimitiveFieldTypeTest, TestConfigSetsAPIExclusivity, CreateCollectionCleanupTest, TestHighlightDedupGrouping, TestFoldingMultitermQuery, SliceStateTest, SegmentsInfoRequestHandlerTest, TestRandomDVFaceting, TestRawTransformer, ReturnFieldsTest, TestDistributedSearch, TestSubQueryTransformerCrossCore, DistributedSpellCheckComponentTest, TestSolrCLIRunExample, LeaderElectionTest, TestNumericTerms32, TemplateUpdateProcessorTest, TestAtomicUpdateErrorCases, TestDistributedStatsComponentCardinality, TestDelegationWithHadoopAuth, BasicAuthStandaloneTest, TestAuthenticationFramework, TestSolrDeletionPolicy2, SpatialRPTFieldTypeTest, RAMDirectoryFactoryTest, TestSolrConfigHandlerCloud, FastVectorHighlighterTest, TestXmlQParser, TestTolerantUpdateProcessorRandomCloud, HttpSolrCallGetCoreTest, QueryElevationComponentTest, TestExclusionRuleCollectionAccess, HdfsWriteToMultipleCollectionsTest, PreAnalyzedFieldManagedSchemaCloudTest, HdfsDirectoryTest, SuggesterWFSTTest, TestSlowCompositeReaderWrapper, TestSurroundQueryParser, ChangedSchemaMergeTest, AssignBackwardCompatibilityTest, ClusterStateUpdateTest, ZkSolrClientTest, TestFaceting, TestHashPartitioner, TestRealTimeGet, TestReload, ConvertedLegacyTest, TestSort, TestFiltering, DirectUpdateHandlerTest, ShowFileRequestHandlerTest, TestExtendedDismaxParser, CoreAdminHandlerTest, TestStressLucene, TestTrie, PolyFieldTest, SchemaVersionSpecificBehaviorTest, DefaultValueUpdateProcessorTest, TestRemoteStreaming, XsltUpdateRequestHandlerTest, CacheHeaderTest, DisMaxRequestHandlerTest, DocumentAnalysisRequestHandlerTest, TestQueryTypes, TestIndexingPerformance, MoreLikeThisHandlerTest, LoggingHandlerTest, SolrPluginUtilsTest, QueryParsingTest, JsonLoaderTest, CSVRequestHandlerTest, TestLFUCache, TestCodecSupport, TestPerFieldSimilarity, TestBM25SimilarityFactory, URLClassifyProcessorTest, DateMathParserTest, DOMUtilTest, FileUtilsTest, TestRTGBase, DistributedIntervalFacetingTest, CdcrBootstrapTest, CollectionStateFormat2Test, CollectionsAPIAsyncDistributedZkTest, DeleteInactiveReplicaTest, DeleteLastCustomShardedReplicaTest, DeleteNodeTest, DistributedVersionInfoTest, LeaderFailureAfterFreshStartTest, LeaderInitiatedRecoveryOnCommitTest, LeaderInitiatedRecoveryOnShardRestartTest, MigrateRouteKeyTest, OverseerTaskQueueTest, RecoveryAfterSoftCommitTest, ShardSplitTest, TestDeleteCollectionOnDownNodes, TestLeaderInitiatedRecoveryThread, TestPrepRecovery, TestRandomFlRTGCloud, TestSSLRandomization, TestSegmentSorting, TestTlogReplica, HdfsBasicDistributedZk2Test, HdfsBasicDistributedZkTest, HdfsChaosMonkeyNothingIsSafeTest, HdfsChaosMonkeySafeLeaderTest, HdfsCollectionsAPIDistributedZkTest, HdfsNNFailoverTest, HdfsRecoverLeaseTest, HdfsRestartWhileUpdatingTest, HdfsSyncSliceTest, HdfsThreadLeakTest, HdfsUnloadDistributedZkTest, TestClusterStateMutator, ZkStateReaderTest, RuleEngineTest, CachingDirectoryFactoryTest, ConfigureRecoveryStrategyTest, CoreSorterTest, DirectoryFactoryTest, HdfsDirectoryFactoryTest, QueryResultKeyTest, TestBackupRepositoryFactory, TestCorePropertiesReload, TestDynamicLoading, TestReplicationHandlerBackup, TestSQLHandler, DistributedExpandComponentTest, DistributedFacetPivotLargeTest, DistributedFacetPivotSmallAdvancedTest, DistributedQueryComponentCustomSortTest, FacetPivotSmallTest, InfixSuggestersTest, SuggestComponentTest, TestExpandComponent, TestHttpShardHandlerFactory, TestPivotHelperCode, TestTrackingShardHandlerFactory, HighlighterMaxOffsetTest, TestUnifiedSolrHighlighter, UninvertDocValuesMergePolicyTest, WrapperMergePolicyFactoryTest, TestLegacyField, JvmMetricsTest, MetricsConfigTest, SolrCoreMetricManagerTest, SolrMetricManagerTest, SolrSlf4jReporterTest]
   [junit4] Completed [618/732 (3!)] on J0 in 6.44s, 1 test, 1 failure <<< FAILURES!

[...truncated 36939 lines...]

Mime
View raw message