lucene-dev mailing list archives

Site index · List index
Message view « Date » · « Thread »
Top « Date » · « Thread »
From Policeman Jenkins Server <jenk...@thetaphi.de>
Subject [JENKINS] Lucene-Solr-master-Linux (64bit/jdk1.8.0_144) - Build # 20297 - Still Unstable!
Date Fri, 11 Aug 2017 09:40:30 GMT
Build: https://jenkins.thetaphi.de/job/Lucene-Solr-master-Linux/20297/
Java: 64bit/jdk1.8.0_144 -XX:-UseCompressedOops -XX:+UseParallelGC

1 tests failed.
FAILED:  org.apache.solr.update.HardAutoCommitTest.testCommitWithin

Error Message:
Exception during query

Stack Trace:
java.lang.RuntimeException: Exception during query
	at __randomizedtesting.SeedInfo.seed([3778A826EFABF4EE:8DAAC75E6C851AFB]:0)
	at org.apache.solr.SolrTestCaseJ4.assertQ(SolrTestCaseJ4.java:886)
	at org.apache.solr.update.HardAutoCommitTest.testCommitWithin(HardAutoCommitTest.java:100)
	at sun.reflect.NativeMethodAccessorImpl.invoke0(Native Method)
	at sun.reflect.NativeMethodAccessorImpl.invoke(NativeMethodAccessorImpl.java:62)
	at sun.reflect.DelegatingMethodAccessorImpl.invoke(DelegatingMethodAccessorImpl.java:43)
	at java.lang.reflect.Method.invoke(Method.java:498)
	at com.carrotsearch.randomizedtesting.RandomizedRunner.invoke(RandomizedRunner.java:1713)
	at com.carrotsearch.randomizedtesting.RandomizedRunner$8.evaluate(RandomizedRunner.java:907)
	at com.carrotsearch.randomizedtesting.RandomizedRunner$9.evaluate(RandomizedRunner.java:943)
	at com.carrotsearch.randomizedtesting.RandomizedRunner$10.evaluate(RandomizedRunner.java:957)
	at com.carrotsearch.randomizedtesting.rules.SystemPropertiesRestoreRule$1.evaluate(SystemPropertiesRestoreRule.java:57)
	at org.apache.lucene.util.TestRuleSetupTeardownChained$1.evaluate(TestRuleSetupTeardownChained.java:49)
	at org.apache.lucene.util.AbstractBeforeAfterRule$1.evaluate(AbstractBeforeAfterRule.java:45)
	at org.apache.lucene.util.TestRuleThreadAndTestName$1.evaluate(TestRuleThreadAndTestName.java:48)
	at org.apache.lucene.util.TestRuleIgnoreAfterMaxFailures$1.evaluate(TestRuleIgnoreAfterMaxFailures.java:64)
	at org.apache.lucene.util.TestRuleMarkFailure$1.evaluate(TestRuleMarkFailure.java:47)
	at com.carrotsearch.randomizedtesting.rules.StatementAdapter.evaluate(StatementAdapter.java:36)
	at com.carrotsearch.randomizedtesting.ThreadLeakControl$StatementRunner.run(ThreadLeakControl.java:368)
	at com.carrotsearch.randomizedtesting.ThreadLeakControl.forkTimeoutingTask(ThreadLeakControl.java:817)
	at com.carrotsearch.randomizedtesting.ThreadLeakControl$3.evaluate(ThreadLeakControl.java:468)
	at com.carrotsearch.randomizedtesting.RandomizedRunner.runSingleTest(RandomizedRunner.java:916)
	at com.carrotsearch.randomizedtesting.RandomizedRunner$5.evaluate(RandomizedRunner.java:802)
	at com.carrotsearch.randomizedtesting.RandomizedRunner$6.evaluate(RandomizedRunner.java:852)
	at com.carrotsearch.randomizedtesting.RandomizedRunner$7.evaluate(RandomizedRunner.java:863)
	at com.carrotsearch.randomizedtesting.rules.StatementAdapter.evaluate(StatementAdapter.java:36)
	at com.carrotsearch.randomizedtesting.rules.SystemPropertiesRestoreRule$1.evaluate(SystemPropertiesRestoreRule.java:57)
	at org.apache.lucene.util.AbstractBeforeAfterRule$1.evaluate(AbstractBeforeAfterRule.java:45)
	at com.carrotsearch.randomizedtesting.rules.StatementAdapter.evaluate(StatementAdapter.java:36)
	at org.apache.lucene.util.TestRuleStoreClassName$1.evaluate(TestRuleStoreClassName.java:41)
	at com.carrotsearch.randomizedtesting.rules.NoShadowingOrOverridesOnMethodsRule$1.evaluate(NoShadowingOrOverridesOnMethodsRule.java:40)
	at com.carrotsearch.randomizedtesting.rules.NoShadowingOrOverridesOnMethodsRule$1.evaluate(NoShadowingOrOverridesOnMethodsRule.java:40)
	at com.carrotsearch.randomizedtesting.rules.StatementAdapter.evaluate(StatementAdapter.java:36)
	at com.carrotsearch.randomizedtesting.rules.StatementAdapter.evaluate(StatementAdapter.java:36)
	at com.carrotsearch.randomizedtesting.rules.StatementAdapter.evaluate(StatementAdapter.java:36)
	at org.apache.lucene.util.TestRuleAssertionsRequired$1.evaluate(TestRuleAssertionsRequired.java:53)
	at org.apache.lucene.util.TestRuleMarkFailure$1.evaluate(TestRuleMarkFailure.java:47)
	at org.apache.lucene.util.TestRuleIgnoreAfterMaxFailures$1.evaluate(TestRuleIgnoreAfterMaxFailures.java:64)
	at org.apache.lucene.util.TestRuleIgnoreTestSuites$1.evaluate(TestRuleIgnoreTestSuites.java:54)
	at com.carrotsearch.randomizedtesting.rules.StatementAdapter.evaluate(StatementAdapter.java:36)
	at com.carrotsearch.randomizedtesting.ThreadLeakControl$StatementRunner.run(ThreadLeakControl.java:368)
	at java.lang.Thread.run(Thread.java:748)
Caused by: java.lang.RuntimeException: REQUEST FAILED: xpath=//result[@numFound=1]
	xml response was: <?xml version="1.0" encoding="UTF-8"?>
<response>
<lst name="responseHeader"><int name="status">0</int><int name="QTime">0</int></lst><result
name="response" numFound="0" start="0"></result>
</response>

	request was:q=id:529&qt=&start=0&rows=20&version=2.2
	at org.apache.solr.SolrTestCaseJ4.assertQ(SolrTestCaseJ4.java:879)
	... 40 more




Build Log:
[...truncated 11982 lines...]
   [junit4] Suite: org.apache.solr.update.HardAutoCommitTest
   [junit4]   2> Creating dataDir: /home/jenkins/workspace/Lucene-Solr-master-Linux/solr/build/solr-core/test/J0/temp/solr.update.HardAutoCommitTest_3778A826EFABF4EE-001/init-core-data-001
   [junit4]   2> 1384125 INFO  (SUITE-HardAutoCommitTest-seed#[3778A826EFABF4EE]-worker)
[    ] o.a.s.SolrTestCaseJ4 Using PointFields (NUMERIC_POINTS_SYSPROP=true) w/NUMERIC_DOCVALUES_SYSPROP=false
   [junit4]   2> 1384126 INFO  (SUITE-HardAutoCommitTest-seed#[3778A826EFABF4EE]-worker)
[    ] o.a.s.SolrTestCaseJ4 Randomized ssl (false) and clientAuth (false) via: @org.apache.solr.util.RandomizeSSL(reason=,
ssl=NaN, value=NaN, clientAuth=NaN)
   [junit4]   2> 1384126 INFO  (SUITE-HardAutoCommitTest-seed#[3778A826EFABF4EE]-worker)
[    ] o.a.s.SolrTestCaseJ4 SecureRandom sanity checks: test.solr.allowed.securerandom=null
& java.security.egd=file:/dev/./urandom
   [junit4]   2> 1384126 INFO  (SUITE-HardAutoCommitTest-seed#[3778A826EFABF4EE]-worker)
[    ] o.a.s.SolrTestCaseJ4 ####initCore
   [junit4]   2> 1384127 INFO  (SUITE-HardAutoCommitTest-seed#[3778A826EFABF4EE]-worker)
[    ] o.a.s.c.SolrResourceLoader [null] Added 2 libs to classloader, from paths: [/home/jenkins/workspace/Lucene-Solr-master-Linux/solr/core/src/test-files/solr/collection1/lib,
/home/jenkins/workspace/Lucene-Solr-master-Linux/solr/core/src/test-files/solr/collection1/lib/classes]
   [junit4]   2> 1384152 INFO  (SUITE-HardAutoCommitTest-seed#[3778A826EFABF4EE]-worker)
[    ] o.a.s.c.SolrConfig Using Lucene MatchVersion: 8.0.0
   [junit4]   2> 1384184 INFO  (SUITE-HardAutoCommitTest-seed#[3778A826EFABF4EE]-worker)
[    ] o.a.s.s.IndexSchema [null] Schema name=test
   [junit4]   2> 1384250 INFO  (SUITE-HardAutoCommitTest-seed#[3778A826EFABF4EE]-worker)
[    ] o.a.s.s.IndexSchema Loaded schema test/1.0 with uniqueid field id
   [junit4]   2> 1384283 INFO  (SUITE-HardAutoCommitTest-seed#[3778A826EFABF4EE]-worker)
[    ] o.a.s.m.r.SolrJmxReporter JMX monitoring for 'solr.node' (registry 'solr.node') enabled
at server: com.sun.jmx.mbeanserver.JmxMBeanServer@3fb73da2
   [junit4]   2> 1384286 INFO  (SUITE-HardAutoCommitTest-seed#[3778A826EFABF4EE]-worker)
[    ] o.a.s.m.r.SolrJmxReporter JMX monitoring for 'solr.jvm' (registry 'solr.jvm') enabled
at server: com.sun.jmx.mbeanserver.JmxMBeanServer@3fb73da2
   [junit4]   2> 1384286 INFO  (SUITE-HardAutoCommitTest-seed#[3778A826EFABF4EE]-worker)
[    ] o.a.s.m.r.SolrJmxReporter JMX monitoring for 'solr.jetty' (registry 'solr.jetty') enabled
at server: com.sun.jmx.mbeanserver.JmxMBeanServer@3fb73da2
   [junit4]   2> 1384288 INFO  (coreLoadExecutor-3885-thread-1) [    x:collection1] o.a.s.c.SolrResourceLoader
[null] Added 2 libs to classloader, from paths: [/home/jenkins/workspace/Lucene-Solr-master-Linux/solr/core/src/test-files/solr/collection1/lib,
/home/jenkins/workspace/Lucene-Solr-master-Linux/solr/core/src/test-files/solr/collection1/lib/classes]
   [junit4]   2> 1384318 INFO  (coreLoadExecutor-3885-thread-1) [    x:collection1] o.a.s.c.SolrConfig
Using Lucene MatchVersion: 8.0.0
   [junit4]   2> 1384337 INFO  (coreLoadExecutor-3885-thread-1) [    x:collection1] o.a.s.s.IndexSchema
[collection1] Schema name=test
   [junit4]   2> 1384533 INFO  (coreLoadExecutor-3885-thread-1) [    x:collection1] o.a.s.s.IndexSchema
Loaded schema test/1.0 with uniqueid field id
   [junit4]   2> 1384564 INFO  (coreLoadExecutor-3885-thread-1) [    x:collection1] o.a.s.c.CoreContainer
Creating SolrCore 'collection1' using configuration from instancedir /home/jenkins/workspace/Lucene-Solr-master-Linux/solr/core/src/test-files/solr/collection1,
trusted=true
   [junit4]   2> 1384565 INFO  (coreLoadExecutor-3885-thread-1) [    x:collection1] o.a.s.m.r.SolrJmxReporter
JMX monitoring for 'solr.core.collection1' (registry 'solr.core.collection1') enabled at server:
com.sun.jmx.mbeanserver.JmxMBeanServer@3fb73da2
   [junit4]   2> 1384565 INFO  (coreLoadExecutor-3885-thread-1) [    x:collection1] o.a.s.c.SolrCore
solr.RecoveryStrategy.Builder
   [junit4]   2> 1384565 INFO  (coreLoadExecutor-3885-thread-1) [    x:collection1] o.a.s.c.SolrCore
[[collection1] ] Opening new SolrCore at [/home/jenkins/workspace/Lucene-Solr-master-Linux/solr/core/src/test-files/solr/collection1],
dataDir=[/home/jenkins/workspace/Lucene-Solr-master-Linux/solr/build/solr-core/test/J0/temp/solr.update.HardAutoCommitTest_3778A826EFABF4EE-001/init-core-data-001/]
   [junit4]   2> 1384567 INFO  (coreLoadExecutor-3885-thread-1) [    x:collection1] o.a.s.u.RandomMergePolicy
RandomMergePolicy wrapping class org.apache.lucene.index.LogDocMergePolicy: [LogDocMergePolicy:
minMergeSize=1000, mergeFactor=10, maxMergeSize=9223372036854775807, maxMergeSizeForForcedMerge=9223372036854775807,
calibrateSizeByDeletes=false, maxMergeDocs=2147483647, maxCFSSegmentSizeMB=1.0380859375, noCFSRatio=1.0]
   [junit4]   2> 1384615 INFO  (coreLoadExecutor-3885-thread-1) [    x:collection1] o.a.s.u.UpdateHandler
Using UpdateLog implementation: org.apache.solr.update.UpdateLog
   [junit4]   2> 1384615 INFO  (coreLoadExecutor-3885-thread-1) [    x:collection1] o.a.s.u.UpdateLog
Initializing UpdateLog: dataDir= defaultSyncLevel=FLUSH numRecordsToKeep=100 maxNumLogsToKeep=10
numVersionBuckets=65536
   [junit4]   2> 1384616 INFO  (coreLoadExecutor-3885-thread-1) [    x:collection1] o.a.s.u.CommitTracker
Hard AutoCommit: disabled
   [junit4]   2> 1384616 INFO  (coreLoadExecutor-3885-thread-1) [    x:collection1] o.a.s.u.CommitTracker
Soft AutoCommit: disabled
   [junit4]   2> 1384616 INFO  (coreLoadExecutor-3885-thread-1) [    x:collection1] o.a.s.u.RandomMergePolicy
RandomMergePolicy wrapping class org.apache.lucene.index.MockRandomMergePolicy: org.apache.lucene.index.MockRandomMergePolicy@3c1b70e
   [junit4]   2> 1384616 INFO  (coreLoadExecutor-3885-thread-1) [    x:collection1] o.a.s.s.SolrIndexSearcher
Opening [Searcher@6d1da5de[collection1] main]
   [junit4]   2> 1384617 INFO  (coreLoadExecutor-3885-thread-1) [    x:collection1] o.a.s.h.c.SpellCheckComponent
Initializing spell checkers
   [junit4]   2> 1384637 INFO  (coreLoadExecutor-3885-thread-1) [    x:collection1] o.a.s.s.DirectSolrSpellChecker
init: {name=direct,classname=DirectSolrSpellChecker,field=lowerfilt,minQueryLength=3}
   [junit4]   2> 1384712 INFO  (coreLoadExecutor-3885-thread-1) [    x:collection1] o.a.s.h.ReplicationHandler
Commits will be reserved for  10000
   [junit4]   2> 1384713 INFO  (searcherExecutor-3886-thread-1-processing-x:collection1)
[    x:collection1] o.a.s.h.c.SpellCheckComponent Loading spell index for spellchecker: default
   [junit4]   2> 1384713 INFO  (coreLoadExecutor-3885-thread-1) [    x:collection1] o.a.s.u.UpdateLog
Could not find max version in index or recent updates, using new clock 1575425286735921152
   [junit4]   2> 1384713 INFO  (searcherExecutor-3886-thread-1-processing-x:collection1)
[    x:collection1] o.a.s.h.c.SpellCheckComponent Loading spell index for spellchecker: direct
   [junit4]   2> 1384713 INFO  (searcherExecutor-3886-thread-1-processing-x:collection1)
[    x:collection1] o.a.s.h.c.SpellCheckComponent Loading spell index for spellchecker: wordbreak
   [junit4]   2> 1384713 INFO  (searcherExecutor-3886-thread-1-processing-x:collection1)
[    x:collection1] o.a.s.h.c.SpellCheckComponent Loading spell index for spellchecker: multipleFields
   [junit4]   2> 1384713 INFO  (searcherExecutor-3886-thread-1-processing-x:collection1)
[    x:collection1] o.a.s.h.c.SpellCheckComponent Loading spell index for spellchecker: jarowinkler
   [junit4]   2> 1384713 INFO  (searcherExecutor-3886-thread-1-processing-x:collection1)
[    x:collection1] o.a.s.h.c.SpellCheckComponent Loading spell index for spellchecker: external
   [junit4]   2> 1384713 INFO  (searcherExecutor-3886-thread-1-processing-x:collection1)
[    x:collection1] o.a.s.h.c.SpellCheckComponent Loading spell index for spellchecker: freq
   [junit4]   2> 1384713 INFO  (searcherExecutor-3886-thread-1-processing-x:collection1)
[    x:collection1] o.a.s.h.c.SpellCheckComponent Loading spell index for spellchecker: fqcn
   [junit4]   2> 1384713 INFO  (searcherExecutor-3886-thread-1-processing-x:collection1)
[    x:collection1] o.a.s.h.c.SpellCheckComponent Loading spell index for spellchecker: perDict
   [junit4]   2> 1384715 INFO  (searcherExecutor-3886-thread-1-processing-x:collection1)
[    x:collection1] o.a.s.c.SolrCore [collection1] Registered new searcher Searcher@6d1da5de[collection1]
main{ExitableDirectoryReader(UninvertingDirectoryReader())}
   [junit4]   2> 1384716 INFO  (SUITE-HardAutoCommitTest-seed#[3778A826EFABF4EE]-worker)
[    ] o.a.s.SolrTestCaseJ4 ####initCore end
   [junit4]   2> 1384719 INFO  (TEST-HardAutoCommitTest.testCommitWithin-seed#[3778A826EFABF4EE])
[    ] o.a.s.SolrTestCaseJ4 ###Starting testCommitWithin
   [junit4]   2> 1384719 INFO  (TEST-HardAutoCommitTest.testCommitWithin-seed#[3778A826EFABF4EE])
[    ] o.a.s.u.DirectUpdateHandler2 [collection1] REMOVING ALL DOCUMENTS FROM INDEX
   [junit4]   2> 1384725 INFO  (TEST-HardAutoCommitTest.testCommitWithin-seed#[3778A826EFABF4EE])
[    ] o.a.s.s.SolrIndexSearcher Opening [Searcher@58bb60e9[collection1] realtime]
   [junit4]   2> 1384726 INFO  (TEST-HardAutoCommitTest.testCommitWithin-seed#[3778A826EFABF4EE])
[    ] o.a.s.u.p.LogUpdateProcessorFactory [collection1]  webapp=null path=null params={_version_=-9223372036854775807&update.distrib=FROMLEADER&versions=true&wt=json&indent=true}{deleteByQuery=*:*
(-9223372036854775807)} 0 6
   [junit4]   2> 1384726 ERROR (TEST-HardAutoCommitTest.testCommitWithin-seed#[3778A826EFABF4EE])
[    ] o.a.s.c.CorePropertiesLocator Couldn't load core descriptor from /home/jenkins/workspace/Lucene-Solr-master-Linux/solr/core/src/test-files/solr/collection1/core.properties:java.nio.file.NoSuchFileException:
/home/jenkins/workspace/Lucene-Solr-master-Linux/solr/core/src/test-files/solr/collection1/core.properties
   [junit4]   2> 1384726 INFO  (TEST-HardAutoCommitTest.testCommitWithin-seed#[3778A826EFABF4EE])
[    ] o.a.s.c.SolrResourceLoader [null] Added 2 libs to classloader, from paths: [/home/jenkins/workspace/Lucene-Solr-master-Linux/solr/core/src/test-files/solr/collection1/lib,
/home/jenkins/workspace/Lucene-Solr-master-Linux/solr/core/src/test-files/solr/collection1/lib/classes]
   [junit4]   2> 1384753 INFO  (TEST-HardAutoCommitTest.testCommitWithin-seed#[3778A826EFABF4EE])
[    ] o.a.s.c.SolrConfig Using Lucene MatchVersion: 8.0.0
   [junit4]   2> 1384779 INFO  (TEST-HardAutoCommitTest.testCommitWithin-seed#[3778A826EFABF4EE])
[    ] o.a.s.s.IndexSchema [collection1] Schema name=test
   [junit4]   2> 1384963 INFO  (TEST-HardAutoCommitTest.testCommitWithin-seed#[3778A826EFABF4EE])
[    ] o.a.s.s.IndexSchema Loaded schema test/1.0 with uniqueid field id
   [junit4]   2> 1384971 INFO  (TEST-HardAutoCommitTest.testCommitWithin-seed#[3778A826EFABF4EE])
[    ] o.a.s.c.CoreContainer Reloading SolrCore 'collection1' using configuration from instancedir
/home/jenkins/workspace/Lucene-Solr-master-Linux/solr/core/src/test-files/solr/collection1
   [junit4]   2> 1384989 INFO  (TEST-HardAutoCommitTest.testCommitWithin-seed#[3778A826EFABF4EE])
[    x:collection1] o.a.s.m.r.SolrJmxReporter JMX monitoring for 'solr.core.collection1' (registry
'solr.core.collection1') enabled at server: com.sun.jmx.mbeanserver.JmxMBeanServer@3fb73da2
   [junit4]   2> 1384989 INFO  (TEST-HardAutoCommitTest.testCommitWithin-seed#[3778A826EFABF4EE])
[    x:collection1] o.a.s.c.SolrCore [[collection1] ] Opening new SolrCore at [/home/jenkins/workspace/Lucene-Solr-master-Linux/solr/core/src/test-files/solr/collection1],
dataDir=[/home/jenkins/workspace/Lucene-Solr-master-Linux/solr/build/solr-core/test/J0/temp/solr.update.HardAutoCommitTest_3778A826EFABF4EE-001/init-core-data-001/]
   [junit4]   2> 1385048 INFO  (TEST-HardAutoCommitTest.testCommitWithin-seed#[3778A826EFABF4EE])
[    x:collection1] o.a.s.u.CommitTracker Hard AutoCommit: disabled
   [junit4]   2> 1385048 INFO  (TEST-HardAutoCommitTest.testCommitWithin-seed#[3778A826EFABF4EE])
[    x:collection1] o.a.s.u.CommitTracker Soft AutoCommit: disabled
   [junit4]   2> 1385049 INFO  (TEST-HardAutoCommitTest.testCommitWithin-seed#[3778A826EFABF4EE])
[    x:collection1] o.a.s.s.SolrIndexSearcher Opening [Searcher@7fe2e0e2[collection1] main]
   [junit4]   2> 1385050 INFO  (TEST-HardAutoCommitTest.testCommitWithin-seed#[3778A826EFABF4EE])
[    x:collection1] o.a.s.h.c.SpellCheckComponent Initializing spell checkers
   [junit4]   2> 1385050 INFO  (TEST-HardAutoCommitTest.testCommitWithin-seed#[3778A826EFABF4EE])
[    x:collection1] o.a.s.s.DirectSolrSpellChecker init: {name=direct,classname=DirectSolrSpellChecker,field=lowerfilt,minQueryLength=3}
   [junit4]   2> 1385053 INFO  (TEST-HardAutoCommitTest.testCommitWithin-seed#[3778A826EFABF4EE])
[    x:collection1] o.a.s.h.ReplicationHandler Commits will be reserved for  10000
   [junit4]   2> 1385053 INFO  (TEST-HardAutoCommitTest.testCommitWithin-seed#[3778A826EFABF4EE])
[    x:collection1] o.a.s.u.UpdateLog Could not find max version in index or recent updates,
using new clock 1575425287092436992
   [junit4]   2> 1385064 INFO  (TEST-HardAutoCommitTest.testCommitWithin-seed#[3778A826EFABF4EE])
[    x:collection1] o.a.s.u.RandomMergePolicy RandomMergePolicy wrapping class org.apache.lucene.index.LogDocMergePolicy:
[LogDocMergePolicy: minMergeSize=1000, mergeFactor=45, maxMergeSize=9223372036854775807, maxMergeSizeForForcedMerge=9223372036854775807,
calibrateSizeByDeletes=false, maxMergeDocs=2147483647, maxCFSSegmentSizeMB=8.796093022207999E12,
noCFSRatio=0.36207947396391926]
   [junit4]   2> 1385064 INFO  (TEST-HardAutoCommitTest.testCommitWithin-seed#[3778A826EFABF4EE])
[    x:collection1] o.a.s.u.DefaultSolrCoreState New IndexWriter is ready to be used.
   [junit4]   2> 1385064 INFO  (searcherExecutor-3891-thread-1-processing-x:collection1)
[    x:collection1] o.a.s.h.c.SpellCheckComponent Loading spell index for spellchecker: default
   [junit4]   2> 1385065 INFO  (searcherExecutor-3891-thread-1-processing-x:collection1)
[    x:collection1] o.a.s.h.c.SpellCheckComponent Loading spell index for spellchecker: direct
   [junit4]   2> 1385065 INFO  (searcherExecutor-3891-thread-1-processing-x:collection1)
[    x:collection1] o.a.s.h.c.SpellCheckComponent Loading spell index for spellchecker: wordbreak
   [junit4]   2> 1385065 INFO  (searcherExecutor-3891-thread-1-processing-x:collection1)
[    x:collection1] o.a.s.h.c.SpellCheckComponent Loading spell index for spellchecker: multipleFields
   [junit4]   2> 1385065 INFO  (searcherExecutor-3891-thread-1-processing-x:collection1)
[    x:collection1] o.a.s.h.c.SpellCheckComponent Loading spell index for spellchecker: jarowinkler
   [junit4]   2> 1385065 INFO  (searcherExecutor-3891-thread-1-processing-x:collection1)
[    x:collection1] o.a.s.h.c.SpellCheckComponent Loading spell index for spellchecker: external
   [junit4]   2> 1385065 INFO  (searcherExecutor-3891-thread-1-processing-x:collection1)
[    x:collection1] o.a.s.h.c.SpellCheckComponent Loading spell index for spellchecker: freq
   [junit4]   2> 1385065 INFO  (searcherExecutor-3891-thread-1-processing-x:collection1)
[    x:collection1] o.a.s.h.c.SpellCheckComponent Loading spell index for spellchecker: fqcn
   [junit4]   2> 1385065 INFO  (searcherExecutor-3891-thread-1-processing-x:collection1)
[    x:collection1] o.a.s.h.c.SpellCheckComponent Loading spell index for spellchecker: perDict
   [junit4]   2> 1385067 INFO  (searcherExecutor-3891-thread-1-processing-x:collection1)
[    x:collection1] o.a.s.c.SolrCore [collection1] Registered new searcher Searcher@7fe2e0e2[collection1]
main{ExitableDirectoryReader(UninvertingDirectoryReader())}
   [junit4]   2> 1385068 INFO  (TEST-HardAutoCommitTest.testCommitWithin-seed#[3778A826EFABF4EE])
[    x:collection1] o.a.s.s.SolrIndexSearcher Opening [Searcher@6cec39ea[collection1] main]
   [junit4]   2> 1385068 INFO  (TEST-HardAutoCommitTest.testCommitWithin-seed#[3778A826EFABF4EE])
[    x:collection1] o.a.s.c.SolrCore [collection1]  CLOSING SolrCore org.apache.solr.core.SolrCore@300a8d89
   [junit4]   2> 1385068 INFO  (TEST-HardAutoCommitTest.testCommitWithin-seed#[3778A826EFABF4EE])
[    x:collection1] o.a.s.m.SolrMetricManager Closing metric reporters for registry=solr.core.collection1,
tag=805997961
   [junit4]   2> 1385076 INFO  (searcherExecutor-3891-thread-1-processing-x:collection1)
[    x:collection1] o.a.s.c.SolrCore [collection1] Registered new searcher Searcher@6cec39ea[collection1]
main{ExitableDirectoryReader(UninvertingDirectoryReader())}
   [junit4]   2> 1385077 INFO  (TEST-HardAutoCommitTest.testCommitWithin-seed#[3778A826EFABF4EE])
[    x:collection1] o.a.s.u.p.LogUpdateProcessorFactory [collection1] {add=[529 (1575425287114457088)]}
0 2
   [junit4]   2> 1385077 INFO  (TEST-HardAutoCommitTest.testCommitWithin-seed#[3778A826EFABF4EE])
[    x:collection1] o.a.s.c.S.Request [collection1]  webapp=null path=null params={q=id:529&qt=&start=0&rows=20&version=2.2}
hits=0 status=0 QTime=0
   [junit4]   2> 1385079 INFO  (TEST-HardAutoCommitTest.testCommitWithin-seed#[3778A826EFABF4EE])
[    x:collection1] o.a.s.u.p.LogUpdateProcessorFactory [collection1] {add=[530 (1575425287119699968)]}
0 5
   [junit4]   2> 1385080 INFO  (TEST-HardAutoCommitTest.testCommitWithin-seed#[3778A826EFABF4EE])
[    x:collection1] o.a.s.c.S.Request [collection1]  webapp=null path=null params={q=id:530&qt=&start=0&rows=20&version=2.2}
hits=0 status=0 QTime=0
   [junit4]   2> 1385085 INFO  (TEST-HardAutoCommitTest.testCommitWithin-seed#[3778A826EFABF4EE])
[    x:collection1] o.a.s.u.p.LogUpdateProcessorFactory [collection1] {delete=[529 (-1575425287125991424)]}
0 11
   [junit4]   2> 1385085 INFO  (TEST-HardAutoCommitTest.testCommitWithin-seed#[3778A826EFABF4EE])
[    x:collection1] o.a.s.c.S.Request [collection1]  webapp=null path=null params={q=id:529&qt=&start=0&rows=20&version=2.2}
hits=0 status=0 QTime=0
   [junit4]   2> 1385086 ERROR (TEST-HardAutoCommitTest.testCommitWithin-seed#[3778A826EFABF4EE])
[    x:collection1] o.a.s.SolrTestCaseJ4 REQUEST FAILED: xpath=//result[@numFound=1]
   [junit4]   2> 	xml response was: <?xml version="1.0" encoding="UTF-8"?>
   [junit4]   2> <response>
   [junit4]   2> <lst name="responseHeader"><int name="status">0</int><int
name="QTime">0</int></lst><result name="response" numFound="0" start="0"></result>
   [junit4]   2> </response>
   [junit4]   2> 
   [junit4]   2> 	request was:q=id:529&qt=&start=0&rows=20&version=2.2
   [junit4]   2> 1385086 ERROR (TEST-HardAutoCommitTest.testCommitWithin-seed#[3778A826EFABF4EE])
[    x:collection1] o.a.s.SolrTestCaseJ4 REQUEST FAILED: q=id:529&qt=&start=0&rows=20&version=2.2:java.lang.RuntimeException:
REQUEST FAILED: xpath=//result[@numFound=1]
   [junit4]   2> 	xml response was: <?xml version="1.0" encoding="UTF-8"?>
   [junit4]   2> <response>
   [junit4]   2> <lst name="responseHeader"><int name="status">0</int><int
name="QTime">0</int></lst><result name="response" numFound="0" start="0"></result>
   [junit4]   2> </response>
   [junit4]   2> 
   [junit4]   2> 	request was:q=id:529&qt=&start=0&rows=20&version=2.2
   [junit4]   2> 	at org.apache.solr.SolrTestCaseJ4.assertQ(SolrTestCaseJ4.java:879)
   [junit4]   2> 	at org.apache.solr.update.HardAutoCommitTest.testCommitWithin(HardAutoCommitTest.java:100)
   [junit4]   2> 	at sun.reflect.NativeMethodAccessorImpl.invoke0(Native Method)
   [junit4]   2> 	at sun.reflect.NativeMethodAccessorImpl.invoke(NativeMethodAccessorImpl.java:62)
   [junit4]   2> 	at sun.reflect.DelegatingMethodAccessorImpl.invoke(DelegatingMethodAccessorImpl.java:43)
   [junit4]   2> 	at java.lang.reflect.Method.invoke(Method.java:498)
   [junit4]   2> 	at com.carrotsearch.randomizedtesting.RandomizedRunner.invoke(RandomizedRunner.java:1713)
   [junit4]   2> 	at com.carrotsearch.randomizedtesting.RandomizedRunner$8.evaluate(RandomizedRunner.java:907)
   [junit4]   2> 	at com.carrotsearch.randomizedtesting.RandomizedRunner$9.evaluate(RandomizedRunner.java:943)
   [junit4]   2> 	at com.carrotsearch.randomizedtesting.RandomizedRunner$10.evaluate(RandomizedRunner.java:957)
   [junit4]   2> 	at com.carrotsearch.randomizedtesting.rules.SystemPropertiesRestoreRule$1.evaluate(SystemPropertiesRestoreRule.java:57)
   [junit4]   2> 	at org.apache.lucene.util.TestRuleSetupTeardownChained$1.evaluate(TestRuleSetupTeardownChained.java:49)
   [junit4]   2> 	at org.apache.lucene.util.AbstractBeforeAfterRule$1.evaluate(AbstractBeforeAfterRule.java:45)
   [junit4]   2> 	at org.apache.lucene.util.TestRuleThreadAndTestName$1.evaluate(TestRuleThreadAndTestName.java:48)
   [junit4]   2> 	at org.apache.lucene.util.TestRuleIgnoreAfterMaxFailures$1.evaluate(TestRuleIgnoreAfterMaxFailures.java:64)
   [junit4]   2> 	at org.apache.lucene.util.TestRuleMarkFailure$1.evaluate(TestRuleMarkFailure.java:47)
   [junit4]   2> 	at com.carrotsearch.randomizedtesting.rules.StatementAdapter.evaluate(StatementAdapter.java:36)
   [junit4]   2> 	at com.carrotsearch.randomizedtesting.ThreadLeakControl$StatementRunner.run(ThreadLeakControl.java:368)
   [junit4]   2> 	at com.carrotsearch.randomizedtesting.ThreadLeakControl.forkTimeoutingTask(ThreadLeakControl.java:817)
   [junit4]   2> 	at com.carrotsearch.randomizedtesting.ThreadLeakControl$3.evaluate(ThreadLeakControl.java:468)
   [junit4]   2> 	at com.carrotsearch.randomizedtesting.RandomizedRunner.runSingleTest(RandomizedRunner.java:916)
   [junit4]   2> 	at com.carrotsearch.randomizedtesting.RandomizedRunner$5.evaluate(RandomizedRunner.java:802)
   [junit4]   2> 	at com.carrotsearch.randomizedtesting.RandomizedRunner$6.evaluate(RandomizedRunner.java:852)
   [junit4]   2> 	at com.carrotsearch.randomizedtesting.RandomizedRunner$7.evaluate(RandomizedRunner.java:863)
   [junit4]   2> 	at com.carrotsearch.randomizedtesting.rules.StatementAdapter.evaluate(StatementAdapter.java:36)
   [junit4]   2> 	at com.carrotsearch.randomizedtesting.rules.SystemPropertiesRestoreRule$1.evaluate(SystemPropertiesRestoreRule.java:57)
   [junit4]   2> 	at org.apache.lucene.util.AbstractBeforeAfterRule$1.evaluate(AbstractBeforeAfterRule.java:45)
   [junit4]   2> 	at com.carrotsearch.randomizedtesting.rules.StatementAdapter.evaluate(StatementAdapter.java:36)
   [junit4]   2> 	at org.apache.lucene.util.TestRuleStoreClassName$1.evaluate(TestRuleStoreClassName.java:41)
   [junit4]   2> 	at com.carrotsearch.randomizedtesting.rules.NoShadowingOrOverridesOnMethodsRule$1.evaluate(NoShadowingOrOverridesOnMethodsRule.java:40)
   [junit4]   2> 	at com.carrotsearch.randomizedtesting.rules.NoShadowingOrOverridesOnMethodsRule$1.evaluate(NoShadowingOrOverridesOnMethodsRule.java:40)
   [junit4]   2> 	at com.carrotsearch.randomizedtesting.rules.StatementAdapter.evaluate(StatementAdapter.java:36)
   [junit4]   2> 	at com.carrotsearch.randomizedtesting.rules.StatementAdapter.evaluate(StatementAdapter.java:36)
   [junit4]   2> 	at com.carrotsearch.randomizedtesting.rules.StatementAdapter.evaluate(StatementAdapter.java:36)
   [junit4]   2> 	at org.apache.lucene.util.TestRuleAssertionsRequired$1.evaluate(TestRuleAssertionsRequired.java:53)
   [junit4]   2> 	at org.apache.lucene.util.TestRuleMarkFailure$1.evaluate(TestRuleMarkFailure.java:47)
   [junit4]   2> 	at org.apache.lucene.util.TestRuleIgnoreAfterMaxFailures$1.evaluate(TestRuleIgnoreAfterMaxFailures.java:64)
   [junit4]   2> 	at org.apache.lucene.util.TestRuleIgnoreTestSuites$1.evaluate(TestRuleIgnoreTestSuites.java:54)
   [junit4]   2> 	at com.carrotsearch.randomizedtesting.rules.StatementAdapter.evaluate(StatementAdapter.java:36)
   [junit4]   2> 	at com.carrotsearch.randomizedtesting.ThreadLeakControl$StatementRunner.run(ThreadLeakControl.java:368)
   [junit4]   2> 	at java.lang.Thread.run(Thread.java:748)
   [junit4]   2> 
   [junit4]   2> 1385087 INFO  (TEST-HardAutoCommitTest.testCommitWithin-seed#[3778A826EFABF4EE])
[    x:collection1] o.a.s.SolrTestCaseJ4 ###Ending testCommitWithin
   [junit4]   2> NOTE: reproduce with: ant test  -Dtestcase=HardAutoCommitTest -Dtests.method=testCommitWithin
-Dtests.seed=3778A826EFABF4EE -Dtests.multiplier=3 -Dtests.slow=true -Dtests.locale=ar-KW
-Dtests.timezone=America/St_Thomas -Dtests.asserts=true -Dtests.file.encoding=UTF-8
   [junit4] ERROR   0.38s J0 | HardAutoCommitTest.testCommitWithin <<<
   [junit4]    > Throwable #1: java.lang.RuntimeException: Exception during query
   [junit4]    > 	at __randomizedtesting.SeedInfo.seed([3778A826EFABF4EE:8DAAC75E6C851AFB]:0)
   [junit4]    > 	at org.apache.solr.SolrTestCaseJ4.assertQ(SolrTestCaseJ4.java:886)
   [junit4]    > 	at org.apache.solr.update.HardAutoCommitTest.testCommitWithin(HardAutoCommitTest.java:100)
   [junit4]    > 	at java.lang.Thread.run(Thread.java:748)
   [junit4]    > Caused by: java.lang.RuntimeException: REQUEST FAILED: xpath=//result[@numFound=1]
   [junit4]    > 	xml response was: <?xml version="1.0" encoding="UTF-8"?>
   [junit4]    > <response>
   [junit4]    > <lst name="responseHeader"><int name="status">0</int><int
name="QTime">0</int></lst><result name="response" numFound="0" start="0"></result>
   [junit4]    > </response>
   [junit4]    > 	request was:q=id:529&qt=&start=0&rows=20&version=2.2
   [junit4]    > 	at org.apache.solr.SolrTestCaseJ4.assertQ(SolrTestCaseJ4.java:879)
   [junit4]    > 	... 40 more
   [junit4]   2> 1385092 INFO  (SUITE-HardAutoCommitTest-seed#[3778A826EFABF4EE]-worker)
[    x:collection1] o.a.s.SolrTestCaseJ4 ###deleteCore
   [junit4]   2> 1385092 INFO  (SUITE-HardAutoCommitTest-seed#[3778A826EFABF4EE]-worker)
[    x:collection1] o.a.s.c.CoreContainer Shutting down CoreContainer instance=2053301270
   [junit4]   2> 1385092 INFO  (SUITE-HardAutoCommitTest-seed#[3778A826EFABF4EE]-worker)
[    x:collection1] o.a.s.m.SolrMetricManager Closing metric reporters for registry=solr.node,
tag=null
   [junit4]   2> 1385094 INFO  (SUITE-HardAutoCommitTest-seed#[3778A826EFABF4EE]-worker)
[    x:collection1] o.a.s.m.SolrMetricManager Closing metric reporters for registry=solr.jvm,
tag=null
   [junit4]   2> 1385095 INFO  (SUITE-HardAutoCommitTest-seed#[3778A826EFABF4EE]-worker)
[    x:collection1] o.a.s.m.SolrMetricManager Closing metric reporters for registry=solr.jetty,
tag=null
   [junit4]   2> 1385095 INFO  (SUITE-HardAutoCommitTest-seed#[3778A826EFABF4EE]-worker)
[    x:collection1] o.a.s.c.TransientSolrCoreCacheDefault Allocating transient cache for 2147483647
transient cores
   [junit4]   2> 1385103 INFO  (coreCloseExecutor-3895-thread-1-processing-x:collection1)
[    x:collection1] o.a.s.c.SolrCore [collection1]  CLOSING SolrCore org.apache.solr.core.SolrCore@1c1d3f9a
   [junit4]   2> 1385103 INFO  (coreCloseExecutor-3895-thread-1-processing-x:collection1)
[    x:collection1] o.a.s.u.DirectUpdateHandler2 Committing on IndexWriter close.
   [junit4]   2> 1385103 INFO  (coreCloseExecutor-3895-thread-1-processing-x:collection1)
[    x:collection1] o.a.s.u.SolrIndexWriter Calling setCommitData with IW:org.apache.solr.update.SolrIndexWriter@749f1682
commitCommandVersion:0
   [junit4]   2> 1385120 INFO  (coreCloseExecutor-3895-thread-1-processing-x:collection1)
[    x:collection1] o.a.s.m.SolrMetricManager Closing metric reporters for registry=solr.core.collection1,
tag=471678874
   [junit4]   2> NOTE: leaving temporary files on disk at: /home/jenkins/workspace/Lucene-Solr-master-Linux/solr/build/solr-core/test/J0/temp/solr.update.HardAutoCommitTest_3778A826EFABF4EE-001
   [junit4]   2> NOTE: test params are: codec=Asserting(Lucene70), sim=RandomSimilarity(queryNorm=true):
{}, locale=ar-KW, timezone=America/St_Thomas
   [junit4]   2> NOTE: Linux 4.10.0-27-generic amd64/Oracle Corporation 1.8.0_144 (64-bit)/cpus=8,threads=1,free=172580392,total=529530880
   [junit4]   2> NOTE: All tests run in this JVM: [TestCollectionsAPIViaSolrCloudCluster,
TestRangeQuery, HighlighterConfigTest, TestCopyFieldCollectionResource, TestSystemCollAutoCreate,
BlockCacheTest, TestRandomRequestDistribution, TestMinMaxOnMultiValuedField, TestRemoteStreaming,
TestInitParams, TestTlogReplica, OverseerModifyCollectionTest, IndexBasedSpellCheckerTest,
SolrPluginUtilsTest, TestNestedDocsSort, CoreAdminCreateDiscoverTest, SaslZkACLProviderTest,
SolrIndexSplitterTest, TestConfigSetsAPIZkFailure, TestLuceneMatchVersion, DistributedQueryElevationComponentTest,
SolrIndexConfigTest, TestXmlQParserPlugin, TestManagedResourceStorage, SolrCoreTest, BasicDistributedZkTest,
TestBadConfig, TestConfigOverlay, TestCoreAdminApis, AtomicUpdateProcessorFactoryTest, ChaosMonkeyNothingIsSafeTest,
PeerSyncTest, TestImpersonationWithHadoopAuth, TestSubQueryTransformerCrossCore, ForceLeaderTest,
TestLegacyNumericRangeQueryBuilder, UUIDFieldTest, TestManagedSchemaAPI, DeleteInactiveReplicaTest,
TestGraphTermsQParserPlugin, BasicZkTest, TestNumericRangeQuery32, ZkStateReaderTest, BigEndianAscendingWordSerializerTest,
CursorPagingTest, TestSegmentSorting, CdcrReplicationHandlerTest, TestOmitPositions, RestartWhileUpdatingTest,
TestPerFieldSimilarityWithDefaultOverride, DistributedQueueTest, OutOfBoxZkACLAndCredentialsProvidersTest,
TestSolrDeletionPolicy1, TestRTimerTree, TestFileDictionaryLookup, TestExtendedDismaxParser,
TestSolr4Spatial, TestStressCloudBlindAtomicUpdates, TestLegacyNumericUtils, TestFieldCache,
TestIBSimilarityFactory, DefaultValueUpdateProcessorTest, TestCollapseQParserPlugin, ChaosMonkeyNothingIsSafeWithPullReplicasTest,
SecurityConfHandlerTest, TestWordDelimiterFilterFactory, TestRandomCollapseQParserPlugin,
OpenExchangeRatesOrgProviderTest, TestRandomDVFaceting, DistribCursorPagingTest, TestBinaryField,
DocExpirationUpdateProcessorFactoryTest, TestSolrQueryParser, ExternalFileFieldSortTest, CdcrUpdateLogTest,
TestSchemaManager, TestReqParamsAPI, RequestLoggingTest, TestSolrCloudWithDelegationTokens,
InfoHandlerTest, RAMDirectoryFactoryTest, TestLeaderInitiatedRecoveryThread, TestFunctionQuery,
SuggestComponentTest, MissingSegmentRecoveryTest, SpellCheckCollatorTest, EchoParamsTest,
TestCSVResponseWriter, TestMacros, SolrIndexMetricsTest, DistanceUnitsTest, PreAnalyzedUpdateProcessorTest,
DocumentAnalysisRequestHandlerTest, TestPayloadCheckQParserPlugin, DistributedFacetPivotSmallAdvancedTest,
HdfsRecoveryZkTest, TestCrossCoreJoin, HdfsBasicDistributedZkTest, HdfsWriteToMultipleCollectionsTest,
DeleteReplicaTest, SyncSliceTest, TestClassicSimilarityFactory, SolrCoreMetricManagerTest,
TestApiFramework, SpellingQueryConverterTest, WordBreakSolrSpellCheckerTest, PreAnalyzedFieldManagedSchemaCloudTest,
TestConfigSets, TestFaceting, DistributedQueryComponentCustomSortTest, TlogReplayBufferedWhileIndexingTest,
TestComponentsName, TestHighlightDedupGrouping, HdfsCollectionsAPIDistributedZkTest, OverseerTaskQueueTest,
TestLRUStatsCache, TestIntervalFaceting, TestMergePolicyConfig, AutoCommitTest, ZkControllerTest,
HardAutoCommitTest]
   [junit4] Completed [375/729 (1!)] on J0 in 1.01s, 1 test, 1 error <<< FAILURES!

[...truncated 44412 lines...]

Mime
View raw message