lucene-dev mailing list archives

Site index · List index
Message view « Date » · « Thread »
Top « Date » · « Thread »
From Policeman Jenkins Server <jenk...@thetaphi.de>
Subject [JENKINS] Lucene-Solr-master-Linux (32bit/jdk1.8.0_144) - Build # 20358 - Still Unstable!
Date Tue, 22 Aug 2017 12:53:03 GMT
Build: https://jenkins.thetaphi.de/job/Lucene-Solr-master-Linux/20358/
Java: 32bit/jdk1.8.0_144 -client -XX:+UseSerialGC

2 tests failed.
FAILED:  org.apache.solr.cloud.HttpPartitionTest.test

Error Message:
Doc with id=1 not found in http://127.0.0.1:35321/xh/p/collMinRf_1x3 due to: Path not found: /id; rsp={doc=null}

Stack Trace:
java.lang.AssertionError: Doc with id=1 not found in http://127.0.0.1:35321/xh/p/collMinRf_1x3 due to: Path not found: /id; rsp={doc=null}
	at __randomizedtesting.SeedInfo.seed([81332594CF3169AA:9671A4E61CD0452]:0)
	at org.junit.Assert.fail(Assert.java:93)
	at org.junit.Assert.assertTrue(Assert.java:43)
	at org.apache.solr.cloud.HttpPartitionTest.assertDocExists(HttpPartitionTest.java:603)
	at org.apache.solr.cloud.HttpPartitionTest.assertDocsExistInAllReplicas(HttpPartitionTest.java:558)
	at org.apache.solr.cloud.HttpPartitionTest.testMinRf(HttpPartitionTest.java:249)
	at org.apache.solr.cloud.HttpPartitionTest.test(HttpPartitionTest.java:127)
	at sun.reflect.NativeMethodAccessorImpl.invoke0(Native Method)
	at sun.reflect.NativeMethodAccessorImpl.invoke(NativeMethodAccessorImpl.java:62)
	at sun.reflect.DelegatingMethodAccessorImpl.invoke(DelegatingMethodAccessorImpl.java:43)
	at java.lang.reflect.Method.invoke(Method.java:498)
	at com.carrotsearch.randomizedtesting.RandomizedRunner.invoke(RandomizedRunner.java:1713)
	at com.carrotsearch.randomizedtesting.RandomizedRunner$8.evaluate(RandomizedRunner.java:907)
	at com.carrotsearch.randomizedtesting.RandomizedRunner$9.evaluate(RandomizedRunner.java:943)
	at com.carrotsearch.randomizedtesting.RandomizedRunner$10.evaluate(RandomizedRunner.java:957)
	at org.apache.solr.BaseDistributedSearchTestCase$ShardsRepeatRule$ShardsFixedStatement.callStatement(BaseDistributedSearchTestCase.java:993)
	at org.apache.solr.BaseDistributedSearchTestCase$ShardsRepeatRule$ShardsStatement.evaluate(BaseDistributedSearchTestCase.java:968)
	at com.carrotsearch.randomizedtesting.rules.SystemPropertiesRestoreRule$1.evaluate(SystemPropertiesRestoreRule.java:57)
	at org.apache.lucene.util.TestRuleSetupTeardownChained$1.evaluate(TestRuleSetupTeardownChained.java:49)
	at org.apache.lucene.util.AbstractBeforeAfterRule$1.evaluate(AbstractBeforeAfterRule.java:45)
	at org.apache.lucene.util.TestRuleThreadAndTestName$1.evaluate(TestRuleThreadAndTestName.java:48)
	at org.apache.lucene.util.TestRuleIgnoreAfterMaxFailures$1.evaluate(TestRuleIgnoreAfterMaxFailures.java:64)
	at org.apache.lucene.util.TestRuleMarkFailure$1.evaluate(TestRuleMarkFailure.java:47)
	at com.carrotsearch.randomizedtesting.rules.StatementAdapter.evaluate(StatementAdapter.java:36)
	at com.carrotsearch.randomizedtesting.ThreadLeakControl$StatementRunner.run(ThreadLeakControl.java:368)
	at com.carrotsearch.randomizedtesting.ThreadLeakControl.forkTimeoutingTask(ThreadLeakControl.java:817)
	at com.carrotsearch.randomizedtesting.ThreadLeakControl$3.evaluate(ThreadLeakControl.java:468)
	at com.carrotsearch.randomizedtesting.RandomizedRunner.runSingleTest(RandomizedRunner.java:916)
	at com.carrotsearch.randomizedtesting.RandomizedRunner$5.evaluate(RandomizedRunner.java:802)
	at com.carrotsearch.randomizedtesting.RandomizedRunner$6.evaluate(RandomizedRunner.java:852)
	at com.carrotsearch.randomizedtesting.RandomizedRunner$7.evaluate(RandomizedRunner.java:863)
	at com.carrotsearch.randomizedtesting.rules.StatementAdapter.evaluate(StatementAdapter.java:36)
	at com.carrotsearch.randomizedtesting.rules.SystemPropertiesRestoreRule$1.evaluate(SystemPropertiesRestoreRule.java:57)
	at org.apache.lucene.util.AbstractBeforeAfterRule$1.evaluate(AbstractBeforeAfterRule.java:45)
	at com.carrotsearch.randomizedtesting.rules.StatementAdapter.evaluate(StatementAdapter.java:36)
	at org.apache.lucene.util.TestRuleStoreClassName$1.evaluate(TestRuleStoreClassName.java:41)
	at com.carrotsearch.randomizedtesting.rules.NoShadowingOrOverridesOnMethodsRule$1.evaluate(NoShadowingOrOverridesOnMethodsRule.java:40)
	at com.carrotsearch.randomizedtesting.rules.NoShadowingOrOverridesOnMethodsRule$1.evaluate(NoShadowingOrOverridesOnMethodsRule.java:40)
	at com.carrotsearch.randomizedtesting.rules.StatementAdapter.evaluate(StatementAdapter.java:36)
	at com.carrotsearch.randomizedtesting.rules.StatementAdapter.evaluate(StatementAdapter.java:36)
	at com.carrotsearch.randomizedtesting.rules.StatementAdapter.evaluate(StatementAdapter.java:36)
	at org.apache.lucene.util.TestRuleAssertionsRequired$1.evaluate(TestRuleAssertionsRequired.java:53)
	at org.apache.lucene.util.TestRuleMarkFailure$1.evaluate(TestRuleMarkFailure.java:47)
	at org.apache.lucene.util.TestRuleIgnoreAfterMaxFailures$1.evaluate(TestRuleIgnoreAfterMaxFailures.java:64)
	at org.apache.lucene.util.TestRuleIgnoreTestSuites$1.evaluate(TestRuleIgnoreTestSuites.java:54)
	at com.carrotsearch.randomizedtesting.rules.StatementAdapter.evaluate(StatementAdapter.java:36)
	at com.carrotsearch.randomizedtesting.ThreadLeakControl$StatementRunner.run(ThreadLeakControl.java:368)
	at java.lang.Thread.run(Thread.java:748)


FAILED:  org.apache.solr.metrics.reporters.SolrSlf4jReporterTest.testReporter

Error Message:


Stack Trace:
java.lang.AssertionError
	at __randomizedtesting.SeedInfo.seed([81332594CF3169AA:DED708A3A43DFAEF]:0)
	at org.junit.Assert.fail(Assert.java:92)
	at org.junit.Assert.assertTrue(Assert.java:43)
	at org.junit.Assert.assertTrue(Assert.java:54)
	at org.apache.solr.metrics.reporters.SolrSlf4jReporterTest.testReporter(SolrSlf4jReporterTest.java:74)
	at sun.reflect.NativeMethodAccessorImpl.invoke0(Native Method)
	at sun.reflect.NativeMethodAccessorImpl.invoke(NativeMethodAccessorImpl.java:62)
	at sun.reflect.DelegatingMethodAccessorImpl.invoke(DelegatingMethodAccessorImpl.java:43)
	at java.lang.reflect.Method.invoke(Method.java:498)
	at com.carrotsearch.randomizedtesting.RandomizedRunner.invoke(RandomizedRunner.java:1713)
	at com.carrotsearch.randomizedtesting.RandomizedRunner$8.evaluate(RandomizedRunner.java:907)
	at com.carrotsearch.randomizedtesting.RandomizedRunner$9.evaluate(RandomizedRunner.java:943)
	at com.carrotsearch.randomizedtesting.RandomizedRunner$10.evaluate(RandomizedRunner.java:957)
	at com.carrotsearch.randomizedtesting.rules.SystemPropertiesRestoreRule$1.evaluate(SystemPropertiesRestoreRule.java:57)
	at org.apache.lucene.util.TestRuleSetupTeardownChained$1.evaluate(TestRuleSetupTeardownChained.java:49)
	at org.apache.lucene.util.AbstractBeforeAfterRule$1.evaluate(AbstractBeforeAfterRule.java:45)
	at org.apache.lucene.util.TestRuleThreadAndTestName$1.evaluate(TestRuleThreadAndTestName.java:48)
	at org.apache.lucene.util.TestRuleIgnoreAfterMaxFailures$1.evaluate(TestRuleIgnoreAfterMaxFailures.java:64)
	at org.apache.lucene.util.TestRuleMarkFailure$1.evaluate(TestRuleMarkFailure.java:47)
	at com.carrotsearch.randomizedtesting.rules.StatementAdapter.evaluate(StatementAdapter.java:36)
	at com.carrotsearch.randomizedtesting.ThreadLeakControl$StatementRunner.run(ThreadLeakControl.java:368)
	at com.carrotsearch.randomizedtesting.ThreadLeakControl.forkTimeoutingTask(ThreadLeakControl.java:817)
	at com.carrotsearch.randomizedtesting.ThreadLeakControl$3.evaluate(ThreadLeakControl.java:468)
	at com.carrotsearch.randomizedtesting.RandomizedRunner.runSingleTest(RandomizedRunner.java:916)
	at com.carrotsearch.randomizedtesting.RandomizedRunner$5.evaluate(RandomizedRunner.java:802)
	at com.carrotsearch.randomizedtesting.RandomizedRunner$6.evaluate(RandomizedRunner.java:852)
	at com.carrotsearch.randomizedtesting.RandomizedRunner$7.evaluate(RandomizedRunner.java:863)
	at com.carrotsearch.randomizedtesting.rules.StatementAdapter.evaluate(StatementAdapter.java:36)
	at com.carrotsearch.randomizedtesting.rules.SystemPropertiesRestoreRule$1.evaluate(SystemPropertiesRestoreRule.java:57)
	at org.apache.lucene.util.AbstractBeforeAfterRule$1.evaluate(AbstractBeforeAfterRule.java:45)
	at com.carrotsearch.randomizedtesting.rules.StatementAdapter.evaluate(StatementAdapter.java:36)
	at org.apache.lucene.util.TestRuleStoreClassName$1.evaluate(TestRuleStoreClassName.java:41)
	at com.carrotsearch.randomizedtesting.rules.NoShadowingOrOverridesOnMethodsRule$1.evaluate(NoShadowingOrOverridesOnMethodsRule.java:40)
	at com.carrotsearch.randomizedtesting.rules.NoShadowingOrOverridesOnMethodsRule$1.evaluate(NoShadowingOrOverridesOnMethodsRule.java:40)
	at com.carrotsearch.randomizedtesting.rules.StatementAdapter.evaluate(StatementAdapter.java:36)
	at com.carrotsearch.randomizedtesting.rules.StatementAdapter.evaluate(StatementAdapter.java:36)
	at com.carrotsearch.randomizedtesting.rules.StatementAdapter.evaluate(StatementAdapter.java:36)
	at org.apache.lucene.util.TestRuleAssertionsRequired$1.evaluate(TestRuleAssertionsRequired.java:53)
	at org.apache.lucene.util.TestRuleMarkFailure$1.evaluate(TestRuleMarkFailure.java:47)
	at org.apache.lucene.util.TestRuleIgnoreAfterMaxFailures$1.evaluate(TestRuleIgnoreAfterMaxFailures.java:64)
	at org.apache.lucene.util.TestRuleIgnoreTestSuites$1.evaluate(TestRuleIgnoreTestSuites.java:54)
	at com.carrotsearch.randomizedtesting.rules.StatementAdapter.evaluate(StatementAdapter.java:36)
	at com.carrotsearch.randomizedtesting.ThreadLeakControl$StatementRunner.run(ThreadLeakControl.java:368)
	at java.lang.Thread.run(Thread.java:748)




Build Log:
[...truncated 11053 lines...]
   [junit4] Suite: org.apache.solr.cloud.HttpPartitionTest
   [junit4]   2> 433685 INFO  (SUITE-HttpPartitionTest-seed#[81332594CF3169AA]-worker) [    ] o.a.s.SolrTestCaseJ4 SecureRandom sanity checks: test.solr.allowed.securerandom=null & java.security.egd=file:/dev/./urandom
   [junit4]   2> Creating dataDir: /home/jenkins/workspace/Lucene-Solr-master-Linux/solr/build/solr-core/test/J2/temp/solr.cloud.HttpPartitionTest_81332594CF3169AA-001/init-core-data-001
   [junit4]   2> 433685 WARN  (SUITE-HttpPartitionTest-seed#[81332594CF3169AA]-worker) [    ] o.a.s.SolrTestCaseJ4 startTrackingSearchers: numOpens=7 numCloses=7
   [junit4]   2> 433686 INFO  (SUITE-HttpPartitionTest-seed#[81332594CF3169AA]-worker) [    ] o.a.s.SolrTestCaseJ4 Using PointFields (NUMERIC_POINTS_SYSPROP=true) w/NUMERIC_DOCVALUES_SYSPROP=false
   [junit4]   2> 433687 INFO  (SUITE-HttpPartitionTest-seed#[81332594CF3169AA]-worker) [    ] o.a.s.SolrTestCaseJ4 Randomized ssl (false) and clientAuth (false) via: @org.apache.solr.SolrTestCaseJ4$SuppressSSL(bugUrl=https://issues.apache.org/jira/browse/SOLR-5776)
   [junit4]   2> 433687 INFO  (SUITE-HttpPartitionTest-seed#[81332594CF3169AA]-worker) [    ] o.a.s.BaseDistributedSearchTestCase Setting hostContext system property: /xh/p
   [junit4]   2> 433688 INFO  (TEST-HttpPartitionTest.test-seed#[81332594CF3169AA]) [    ] o.a.s.c.ZkTestServer STARTING ZK TEST SERVER
   [junit4]   2> 433688 INFO  (Thread-527) [    ] o.a.s.c.ZkTestServer client port:0.0.0.0/0.0.0.0:0
   [junit4]   2> 433688 INFO  (Thread-527) [    ] o.a.s.c.ZkTestServer Starting server
   [junit4]   2> 433690 ERROR (Thread-527) [    ] o.a.z.s.ZooKeeperServer ZKShutdownHandler is not registered, so ZooKeeper server won't take any action on ERROR or SHUTDOWN server state changes
   [junit4]   2> 433788 INFO  (TEST-HttpPartitionTest.test-seed#[81332594CF3169AA]) [    ] o.a.s.c.ZkTestServer start zk server on port:37945
   [junit4]   2> 433804 INFO  (TEST-HttpPartitionTest.test-seed#[81332594CF3169AA]) [    ] o.a.s.c.AbstractZkTestCase put /home/jenkins/workspace/Lucene-Solr-master-Linux/solr/core/src/test-files/solr/collection1/conf/solrconfig-tlog.xml to /configs/conf1/solrconfig.xml
   [junit4]   2> 433806 INFO  (TEST-HttpPartitionTest.test-seed#[81332594CF3169AA]) [    ] o.a.s.c.AbstractZkTestCase put /home/jenkins/workspace/Lucene-Solr-master-Linux/solr/core/src/test-files/solr/collection1/conf/schema.xml to /configs/conf1/schema.xml
   [junit4]   2> 433808 INFO  (TEST-HttpPartitionTest.test-seed#[81332594CF3169AA]) [    ] o.a.s.c.AbstractZkTestCase put /home/jenkins/workspace/Lucene-Solr-master-Linux/solr/core/src/test-files/solr/collection1/conf/solrconfig.snippet.randomindexconfig.xml to /configs/conf1/solrconfig.snippet.randomindexconfig.xml
   [junit4]   2> 433809 INFO  (TEST-HttpPartitionTest.test-seed#[81332594CF3169AA]) [    ] o.a.s.c.AbstractZkTestCase put /home/jenkins/workspace/Lucene-Solr-master-Linux/solr/core/src/test-files/solr/collection1/conf/stopwords.txt to /configs/conf1/stopwords.txt
   [junit4]   2> 433811 INFO  (TEST-HttpPartitionTest.test-seed#[81332594CF3169AA]) [    ] o.a.s.c.AbstractZkTestCase put /home/jenkins/workspace/Lucene-Solr-master-Linux/solr/core/src/test-files/solr/collection1/conf/protwords.txt to /configs/conf1/protwords.txt
   [junit4]   2> 433812 INFO  (TEST-HttpPartitionTest.test-seed#[81332594CF3169AA]) [    ] o.a.s.c.AbstractZkTestCase put /home/jenkins/workspace/Lucene-Solr-master-Linux/solr/core/src/test-files/solr/collection1/conf/currency.xml to /configs/conf1/currency.xml
   [junit4]   2> 433813 INFO  (TEST-HttpPartitionTest.test-seed#[81332594CF3169AA]) [    ] o.a.s.c.AbstractZkTestCase put /home/jenkins/workspace/Lucene-Solr-master-Linux/solr/core/src/test-files/solr/collection1/conf/enumsConfig.xml to /configs/conf1/enumsConfig.xml
   [junit4]   2> 433814 INFO  (TEST-HttpPartitionTest.test-seed#[81332594CF3169AA]) [    ] o.a.s.c.AbstractZkTestCase put /home/jenkins/workspace/Lucene-Solr-master-Linux/solr/core/src/test-files/solr/collection1/conf/open-exchange-rates.json to /configs/conf1/open-exchange-rates.json
   [junit4]   2> 433816 INFO  (TEST-HttpPartitionTest.test-seed#[81332594CF3169AA]) [    ] o.a.s.c.AbstractZkTestCase put /home/jenkins/workspace/Lucene-Solr-master-Linux/solr/core/src/test-files/solr/collection1/conf/mapping-ISOLatin1Accent.txt to /configs/conf1/mapping-ISOLatin1Accent.txt
   [junit4]   2> 433817 INFO  (TEST-HttpPartitionTest.test-seed#[81332594CF3169AA]) [    ] o.a.s.c.AbstractZkTestCase put /home/jenkins/workspace/Lucene-Solr-master-Linux/solr/core/src/test-files/solr/collection1/conf/old_synonyms.txt to /configs/conf1/old_synonyms.txt
   [junit4]   2> 433818 INFO  (TEST-HttpPartitionTest.test-seed#[81332594CF3169AA]) [    ] o.a.s.c.AbstractZkTestCase put /home/jenkins/workspace/Lucene-Solr-master-Linux/solr/core/src/test-files/solr/collection1/conf/synonyms.txt to /configs/conf1/synonyms.txt
   [junit4]   2> 433821 INFO  (TEST-HttpPartitionTest.test-seed#[81332594CF3169AA]) [    ] o.a.s.c.AbstractFullDistribZkTestBase Will use TLOG replicas unless explicitly asked otherwise
   [junit4]   2> 433913 INFO  (TEST-HttpPartitionTest.test-seed#[81332594CF3169AA]) [    ] o.e.j.s.Server jetty-9.3.20.v20170531
   [junit4]   2> 433914 INFO  (TEST-HttpPartitionTest.test-seed#[81332594CF3169AA]) [    ] o.e.j.s.h.ContextHandler Started o.e.j.s.ServletContextHandler@1160399{/xh/p,null,AVAILABLE}
   [junit4]   2> 433914 INFO  (TEST-HttpPartitionTest.test-seed#[81332594CF3169AA]) [    ] o.e.j.s.AbstractConnector Started ServerConnector@daff9e{HTTP/1.1,[http/1.1]}{127.0.0.1:37691}
   [junit4]   2> 433915 INFO  (TEST-HttpPartitionTest.test-seed#[81332594CF3169AA]) [    ] o.e.j.s.Server Started @434851ms
   [junit4]   2> 433915 INFO  (TEST-HttpPartitionTest.test-seed#[81332594CF3169AA]) [    ] o.a.s.c.s.e.JettySolrRunner Jetty properties: {solr.data.dir=/home/jenkins/workspace/Lucene-Solr-master-Linux/solr/build/solr-core/test/J2/temp/solr.cloud.HttpPartitionTest_81332594CF3169AA-001/tempDir-001/control/data, replicaType=NRT, hostContext=/xh/p, hostPort=37257, coreRootDirectory=/home/jenkins/workspace/Lucene-Solr-master-Linux/solr/build/solr-core/test/J2/temp/solr.cloud.HttpPartitionTest_81332594CF3169AA-001/control-001/cores}
   [junit4]   2> 433915 ERROR (TEST-HttpPartitionTest.test-seed#[81332594CF3169AA]) [    ] o.a.s.u.StartupLoggingUtils Missing Java Option solr.log.dir. Logging may be missing or incomplete.
   [junit4]   2> 433915 INFO  (TEST-HttpPartitionTest.test-seed#[81332594CF3169AA]) [    ] o.a.s.s.SolrDispatchFilter  ___      _       Welcome to Apache Solr? version 8.0.0
   [junit4]   2> 433915 INFO  (TEST-HttpPartitionTest.test-seed#[81332594CF3169AA]) [    ] o.a.s.s.SolrDispatchFilter / __| ___| |_ _   Starting in cloud mode on port null
   [junit4]   2> 433915 INFO  (TEST-HttpPartitionTest.test-seed#[81332594CF3169AA]) [    ] o.a.s.s.SolrDispatchFilter \__ \/ _ \ | '_|  Install dir: null, Default config dir: null
   [junit4]   2> 433915 INFO  (TEST-HttpPartitionTest.test-seed#[81332594CF3169AA]) [    ] o.a.s.s.SolrDispatchFilter |___/\___/_|_|    Start time: 2017-08-22T11:59:30.481Z
   [junit4]   2> 433917 INFO  (TEST-HttpPartitionTest.test-seed#[81332594CF3169AA]) [    ] o.a.s.s.SolrDispatchFilter Loading solr.xml from SolrHome (not found in ZooKeeper)
   [junit4]   2> 433917 INFO  (TEST-HttpPartitionTest.test-seed#[81332594CF3169AA]) [    ] o.a.s.c.SolrXmlConfig Loading container configuration from /home/jenkins/workspace/Lucene-Solr-master-Linux/solr/build/solr-core/test/J2/temp/solr.cloud.HttpPartitionTest_81332594CF3169AA-001/control-001/solr.xml
   [junit4]   2> 433923 INFO  (TEST-HttpPartitionTest.test-seed#[81332594CF3169AA]) [    ] o.a.s.c.SolrXmlConfig MBean server found: com.sun.jmx.mbeanserver.JmxMBeanServer@e269fa, but no JMX reporters were configured - adding default JMX reporter.
   [junit4]   2> 433925 INFO  (TEST-HttpPartitionTest.test-seed#[81332594CF3169AA]) [    ] o.a.s.c.ZkContainer Zookeeper client=127.0.0.1:37945/solr
   [junit4]   2> 433957 INFO  (TEST-HttpPartitionTest.test-seed#[81332594CF3169AA]) [n:127.0.0.1:37257_xh%2Fp    ] o.a.s.c.Overseer Overseer (id=null) closing
   [junit4]   2> 433957 INFO  (TEST-HttpPartitionTest.test-seed#[81332594CF3169AA]) [n:127.0.0.1:37257_xh%2Fp    ] o.a.s.c.OverseerElectionContext I am going to be the leader 127.0.0.1:37257_xh%2Fp
   [junit4]   2> 433958 INFO  (TEST-HttpPartitionTest.test-seed#[81332594CF3169AA]) [n:127.0.0.1:37257_xh%2Fp    ] o.a.s.c.Overseer Overseer (id=98527030165831684-127.0.0.1:37257_xh%2Fp-n_0000000000) starting
   [junit4]   2> 433960 INFO  (TEST-HttpPartitionTest.test-seed#[81332594CF3169AA]) [n:127.0.0.1:37257_xh%2Fp    ] o.a.s.c.ZkController Register node as live in ZooKeeper:/live_nodes/127.0.0.1:37257_xh%2Fp
   [junit4]   2> 433962 INFO  (zkCallback-380-thread-1-processing-n:127.0.0.1:37257_xh%2Fp) [n:127.0.0.1:37257_xh%2Fp    ] o.a.s.c.c.ZkStateReader Updated live nodes from ZooKeeper... (0) -> (1)
   [junit4]   2> 434230 INFO  (TEST-HttpPartitionTest.test-seed#[81332594CF3169AA]) [n:127.0.0.1:37257_xh%2Fp    ] o.a.s.m.r.SolrJmxReporter JMX monitoring for 'solr.node' (registry 'solr.node') enabled at server: com.sun.jmx.mbeanserver.JmxMBeanServer@e269fa
   [junit4]   2> 434240 INFO  (TEST-HttpPartitionTest.test-seed#[81332594CF3169AA]) [n:127.0.0.1:37257_xh%2Fp    ] o.a.s.m.r.SolrJmxReporter JMX monitoring for 'solr.jvm' (registry 'solr.jvm') enabled at server: com.sun.jmx.mbeanserver.JmxMBeanServer@e269fa
   [junit4]   2> 434240 INFO  (TEST-HttpPartitionTest.test-seed#[81332594CF3169AA]) [n:127.0.0.1:37257_xh%2Fp    ] o.a.s.m.r.SolrJmxReporter JMX monitoring for 'solr.jetty' (registry 'solr.jetty') enabled at server: com.sun.jmx.mbeanserver.JmxMBeanServer@e269fa
   [junit4]   2> 434241 INFO  (TEST-HttpPartitionTest.test-seed#[81332594CF3169AA]) [n:127.0.0.1:37257_xh%2Fp    ] o.a.s.c.CorePropertiesLocator Found 0 core definitions underneath /home/jenkins/workspace/Lucene-Solr-master-Linux/solr/build/solr-core/test/J2/temp/solr.cloud.HttpPartitionTest_81332594CF3169AA-001/control-001/cores
   [junit4]   2> 434271 INFO  (TEST-HttpPartitionTest.test-seed#[81332594CF3169AA]) [    ] o.a.s.c.c.ZkStateReader Updated live nodes from ZooKeeper... (0) -> (1)
   [junit4]   2> 434272 INFO  (TEST-HttpPartitionTest.test-seed#[81332594CF3169AA]) [    ] o.a.s.c.s.i.ZkClientClusterStateProvider Cluster at 127.0.0.1:37945/solr ready
   [junit4]   2> 434272 INFO  (SocketProxy-Acceptor-37257) [    ] o.a.s.c.SocketProxy accepted Socket[addr=/127.0.0.1,port=60612,localport=37257], receiveBufferSize:531000
   [junit4]   2> 434272 INFO  (SocketProxy-Acceptor-37257) [    ] o.a.s.c.SocketProxy proxy connection Socket[addr=/127.0.0.1,port=37691,localport=56808], receiveBufferSize=530904
   [junit4]   2> 434273 INFO  (qtp21575158-2590) [n:127.0.0.1:37257_xh%2Fp    ] o.a.s.h.a.CollectionsHandler Invoked Collection Action :create with params replicationFactor=1&collection.configName=conf1&name=control_collection&nrtReplicas=1&action=CREATE&numShards=1&createNodeSet=127.0.0.1:37257_xh%252Fp&wt=javabin&version=2 and sendToOCPQueue=true
   [junit4]   2> 434275 INFO  (OverseerThreadFactory-970-thread-1-processing-n:127.0.0.1:37257_xh%2Fp) [n:127.0.0.1:37257_xh%2Fp    ] o.a.s.c.CreateCollectionCmd Create collection control_collection
   [junit4]   2> 434382 INFO  (SocketProxy-Acceptor-37257) [    ] o.a.s.c.SocketProxy accepted Socket[addr=/127.0.0.1,port=60616,localport=37257], receiveBufferSize:531000
   [junit4]   2> 434382 INFO  (SocketProxy-Acceptor-37257) [    ] o.a.s.c.SocketProxy proxy connection Socket[addr=/127.0.0.1,port=37691,localport=56812], receiveBufferSize=530904
   [junit4]   2> 434382 INFO  (qtp21575158-2586) [n:127.0.0.1:37257_xh%2Fp    ] o.a.s.h.a.CoreAdminOperation core create command qt=/admin/cores&collection.configName=conf1&newCollection=true&name=control_collection_shard1_replica_n1&action=CREATE&numShards=1&collection=control_collection&shard=shard1&wt=javabin&version=2&replicaType=NRT
   [junit4]   2> 434383 INFO  (qtp21575158-2586) [n:127.0.0.1:37257_xh%2Fp    ] o.a.s.c.TransientSolrCoreCacheDefault Allocating transient cache for 4 transient cores
   [junit4]   2> 434486 INFO  (zkCallback-380-thread-1-processing-n:127.0.0.1:37257_xh%2Fp) [n:127.0.0.1:37257_xh%2Fp    ] o.a.s.c.c.ZkStateReader A cluster state change: [WatchedEvent state:SyncConnected type:NodeDataChanged path:/collections/control_collection/state.json] for collection [control_collection] has occurred - updating... (live nodes size: [1])
   [junit4]   2> 435398 INFO  (qtp21575158-2586) [n:127.0.0.1:37257_xh%2Fp c:control_collection s:shard1  x:control_collection_shard1_replica_n1] o.a.s.c.SolrConfig Using Lucene MatchVersion: 8.0.0
   [junit4]   2> 435433 INFO  (qtp21575158-2586) [n:127.0.0.1:37257_xh%2Fp c:control_collection s:shard1  x:control_collection_shard1_replica_n1] o.a.s.s.IndexSchema [control_collection_shard1_replica_n1] Schema name=test
   [junit4]   2> 435528 INFO  (qtp21575158-2586) [n:127.0.0.1:37257_xh%2Fp c:control_collection s:shard1  x:control_collection_shard1_replica_n1] o.a.s.s.IndexSchema Loaded schema test/1.0 with uniqueid field id
   [junit4]   2> 435549 INFO  (qtp21575158-2586) [n:127.0.0.1:37257_xh%2Fp c:control_collection s:shard1  x:control_collection_shard1_replica_n1] o.a.s.c.CoreContainer Creating SolrCore 'control_collection_shard1_replica_n1' using configuration from collection control_collection, trusted=true
   [junit4]   2> 435550 INFO  (qtp21575158-2586) [n:127.0.0.1:37257_xh%2Fp c:control_collection s:shard1  x:control_collection_shard1_replica_n1] o.a.s.m.r.SolrJmxReporter JMX monitoring for 'solr.core.control_collection.shard1.replica_n1' (registry 'solr.core.control_collection.shard1.replica_n1') enabled at server: com.sun.jmx.mbeanserver.JmxMBeanServer@e269fa
   [junit4]   2> 435550 INFO  (qtp21575158-2586) [n:127.0.0.1:37257_xh%2Fp c:control_collection s:shard1  x:control_collection_shard1_replica_n1] o.a.s.c.SolrCore solr.RecoveryStrategy.Builder
   [junit4]   2> 435550 INFO  (qtp21575158-2586) [n:127.0.0.1:37257_xh%2Fp c:control_collection s:shard1  x:control_collection_shard1_replica_n1] o.a.s.c.SolrCore [[control_collection_shard1_replica_n1] ] Opening new SolrCore at [/home/jenkins/workspace/Lucene-Solr-master-Linux/solr/build/solr-core/test/J2/temp/solr.cloud.HttpPartitionTest_81332594CF3169AA-001/control-001/cores/control_collection_shard1_replica_n1], dataDir=[/home/jenkins/workspace/Lucene-Solr-master-Linux/solr/build/solr-core/test/J2/temp/solr.cloud.HttpPartitionTest_81332594CF3169AA-001/control-001/cores/control_collection_shard1_replica_n1/data/]
   [junit4]   2> 435553 INFO  (qtp21575158-2586) [n:127.0.0.1:37257_xh%2Fp c:control_collection s:shard1  x:control_collection_shard1_replica_n1] o.a.s.u.RandomMergePolicy RandomMergePolicy wrapping class org.apache.lucene.index.LogDocMergePolicy: [LogDocMergePolicy: minMergeSize=1000, mergeFactor=48, maxMergeSize=9223372036854775807, maxMergeSizeForForcedMerge=9223372036854775807, calibrateSizeByDeletes=true, maxMergeDocs=2147483647, maxCFSSegmentSizeMB=8.796093022207999E12, noCFSRatio=1.0]
   [junit4]   2> 435555 WARN  (qtp21575158-2586) [n:127.0.0.1:37257_xh%2Fp c:control_collection s:shard1  x:control_collection_shard1_replica_n1] o.a.s.c.RequestHandlers INVALID paramSet a in requestHandler {type = requestHandler,name = /dump,class = DumpRequestHandler,attributes = {initParams=a, name=/dump, class=DumpRequestHandler},args = {defaults={a=A,b=B}}}
   [junit4]   2> 435594 INFO  (qtp21575158-2586) [n:127.0.0.1:37257_xh%2Fp c:control_collection s:shard1  x:control_collection_shard1_replica_n1] o.a.s.u.UpdateHandler Using UpdateLog implementation: org.apache.solr.update.UpdateLog
   [junit4]   2> 435594 INFO  (qtp21575158-2586) [n:127.0.0.1:37257_xh%2Fp c:control_collection s:shard1  x:control_collection_shard1_replica_n1] o.a.s.u.UpdateLog Initializing UpdateLog: dataDir= defaultSyncLevel=FLUSH numRecordsToKeep=100 maxNumLogsToKeep=10 numVersionBuckets=65536
   [junit4]   2> 435595 INFO  (qtp21575158-2586) [n:127.0.0.1:37257_xh%2Fp c:control_collection s:shard1  x:control_collection_shard1_replica_n1] o.a.s.u.CommitTracker Hard AutoCommit: disabled
   [junit4]   2> 435595 INFO  (qtp21575158-2586) [n:127.0.0.1:37257_xh%2Fp c:control_collection s:shard1  x:control_collection_shard1_replica_n1] o.a.s.u.CommitTracker Soft AutoCommit: disabled
   [junit4]   2> 435605 INFO  (qtp21575158-2586) [n:127.0.0.1:37257_xh%2Fp c:control_collection s:shard1  x:control_collection_shard1_replica_n1] o.a.s.u.RandomMergePolicy RandomMergePolicy wrapping class org.apache.lucene.index.TieredMergePolicy: [TieredMergePolicy: maxMergeAtOnce=34, maxMergeAtOnceExplicit=33, maxMergedSegmentMB=1.6982421875, floorSegmentMB=1.0224609375, forceMergeDeletesPctAllowed=24.595564567763446, segmentsPerTier=36.0, maxCFSSegmentSizeMB=0.6201171875, noCFSRatio=0.20630070084716712
   [junit4]   2> 435605 INFO  (qtp21575158-2586) [n:127.0.0.1:37257_xh%2Fp c:control_collection s:shard1  x:control_collection_shard1_replica_n1] o.a.s.s.SolrIndexSearcher Opening [Searcher@17509ae[control_collection_shard1_replica_n1] main]
   [junit4]   2> 435606 INFO  (qtp21575158-2586) [n:127.0.0.1:37257_xh%2Fp c:control_collection s:shard1  x:control_collection_shard1_replica_n1] o.a.s.r.ManagedResourceStorage Configured ZooKeeperStorageIO with znodeBase: /configs/conf1
   [junit4]   2> 435606 INFO  (qtp21575158-2586) [n:127.0.0.1:37257_xh%2Fp c:control_collection s:shard1  x:control_collection_shard1_replica_n1] o.a.s.r.ManagedResourceStorage Loaded null at path _rest_managed.json using ZooKeeperStorageIO:path=/configs/conf1
   [junit4]   2> 435607 INFO  (qtp21575158-2586) [n:127.0.0.1:37257_xh%2Fp c:control_collection s:shard1  x:control_collection_shard1_replica_n1] o.a.s.h.ReplicationHandler Commits will be reserved for  10000
   [junit4]   2> 435607 INFO  (qtp21575158-2586) [n:127.0.0.1:37257_xh%2Fp c:control_collection s:shard1  x:control_collection_shard1_replica_n1] o.a.s.u.UpdateLog Could not find max version in index or recent updates, using new clock 1576432484664475648
   [junit4]   2> 435610 INFO  (searcherExecutor-973-thread-1-processing-n:127.0.0.1:37257_xh%2Fp x:control_collection_shard1_replica_n1 s:shard1 c:control_collection) [n:127.0.0.1:37257_xh%2Fp c:control_collection s:shard1  x:control_collection_shard1_replica_n1] o.a.s.c.SolrCore [control_collection_shard1_replica_n1] Registered new searcher Searcher@17509ae[control_collection_shard1_replica_n1] main{ExitableDirectoryReader(UninvertingDirectoryReader())}
   [junit4]   2> 435620 INFO  (qtp21575158-2586) [n:127.0.0.1:37257_xh%2Fp c:control_collection s:shard1  x:control_collection_shard1_replica_n1] o.a.s.c.ShardLeaderElectionContext Enough replicas found to continue.
   [junit4]   2> 435620 INFO  (qtp21575158-2586) [n:127.0.0.1:37257_xh%2Fp c:control_collection s:shard1  x:control_collection_shard1_replica_n1] o.a.s.c.ShardLeaderElectionContext I may be the new leader - try and sync
   [junit4]   2> 435620 INFO  (qtp21575158-2586) [n:127.0.0.1:37257_xh%2Fp c:control_collection s:shard1  x:control_collection_shard1_replica_n1] o.a.s.c.SyncStrategy Sync replicas to http://127.0.0.1:37257/xh/p/control_collection_shard1_replica_n1/
   [junit4]   2> 435620 INFO  (qtp21575158-2586) [n:127.0.0.1:37257_xh%2Fp c:control_collection s:shard1  x:control_collection_shard1_replica_n1] o.a.s.c.SyncStrategy Sync Success - now sync replicas to me
   [junit4]   2> 435620 INFO  (qtp21575158-2586) [n:127.0.0.1:37257_xh%2Fp c:control_collection s:shard1  x:control_collection_shard1_replica_n1] o.a.s.c.SyncStrategy http://127.0.0.1:37257/xh/p/control_collection_shard1_replica_n1/ has no replicas
   [junit4]   2> 435620 INFO  (qtp21575158-2586) [n:127.0.0.1:37257_xh%2Fp c:control_collection s:shard1  x:control_collection_shard1_replica_n1] o.a.s.c.ShardLeaderElectionContext Found all replicas participating in election, clear LIR
   [junit4]   2> 435621 INFO  (qtp21575158-2586) [n:127.0.0.1:37257_xh%2Fp c:control_collection s:shard1  x:control_collection_shard1_replica_n1] o.a.s.c.ShardLeaderElectionContext I am the new leader: http://127.0.0.1:37257/xh/p/control_collection_shard1_replica_n1/ shard1
   [junit4]   2> 435723 INFO  (zkCallback-380-thread-1-processing-n:127.0.0.1:37257_xh%2Fp) [n:127.0.0.1:37257_xh%2Fp    ] o.a.s.c.c.ZkStateReader A cluster state change: [WatchedEvent state:SyncConnected type:NodeDataChanged path:/collections/control_collection/state.json] for collection [control_collection] has occurred - updating... (live nodes size: [1])
   [junit4]   2> 435772 INFO  (qtp21575158-2586) [n:127.0.0.1:37257_xh%2Fp c:control_collection s:shard1  x:control_collection_shard1_replica_n1] o.a.s.c.ZkController I am the leader, no recovery necessary
   [junit4]   2> 435773 INFO  (qtp21575158-2586) [n:127.0.0.1:37257_xh%2Fp c:control_collection s:shard1  x:control_collection_shard1_replica_n1] o.a.s.s.HttpSolrCall [admin] webapp=null path=/admin/cores params={qt=/admin/cores&collection.configName=conf1&newCollection=true&name=control_collection_shard1_replica_n1&action=CREATE&numShards=1&collection=control_collection&shard=shard1&wt=javabin&version=2&replicaType=NRT} status=0 QTime=1391
   [junit4]   2> 435776 INFO  (qtp21575158-2590) [n:127.0.0.1:37257_xh%2Fp    ] o.a.s.h.a.CollectionsHandler Wait for new collection to be active for at most 30 seconds. Check all shard replicas
   [junit4]   2> 435876 INFO  (zkCallback-380-thread-1-processing-n:127.0.0.1:37257_xh%2Fp) [n:127.0.0.1:37257_xh%2Fp    ] o.a.s.c.c.ZkStateReader A cluster state change: [WatchedEvent state:SyncConnected type:NodeDataChanged path:/collections/control_collection/state.json] for collection [control_collection] has occurred - updating... (live nodes size: [1])
   [junit4]   2> 436277 INFO  (OverseerCollectionConfigSetProcessor-98527030165831684-127.0.0.1:37257_xh%2Fp-n_0000000000) [n:127.0.0.1:37257_xh%2Fp    ] o.a.s.c.OverseerTaskQueue Response ZK path: /overseer/collection-queue-work/qnr-0000000000 doesn't exist.  Requestor may have disconnected from ZooKeeper
   [junit4]   2> 436776 INFO  (qtp21575158-2590) [n:127.0.0.1:37257_xh%2Fp    ] o.a.s.s.HttpSolrCall [admin] webapp=null path=/admin/collections params={replicationFactor=1&collection.configName=conf1&name=control_collection&nrtReplicas=1&action=CREATE&numShards=1&createNodeSet=127.0.0.1:37257_xh%252Fp&wt=javabin&version=2} status=0 QTime=2503
   [junit4]   2> 436781 INFO  (TEST-HttpPartitionTest.test-seed#[81332594CF3169AA]) [    ] o.a.s.c.c.ZkStateReader Updated live nodes from ZooKeeper... (0) -> (1)
   [junit4]   2> 436782 INFO  (TEST-HttpPartitionTest.test-seed#[81332594CF3169AA]) [    ] o.a.s.c.s.i.ZkClientClusterStateProvider Cluster at 127.0.0.1:37945/solr ready
   [junit4]   2> 436782 INFO  (TEST-HttpPartitionTest.test-seed#[81332594CF3169AA]) [    ] o.a.s.c.ChaosMonkey monkey: init - expire sessions:false cause connection loss:false
   [junit4]   2> 436782 INFO  (SocketProxy-Acceptor-37257) [    ] o.a.s.c.SocketProxy accepted Socket[addr=/127.0.0.1,port=60640,localport=37257], receiveBufferSize:531000
   [junit4]   2> 436783 INFO  (SocketProxy-Acceptor-37257) [    ] o.a.s.c.SocketProxy proxy connection Socket[addr=/127.0.0.1,port=37691,localport=56836], receiveBufferSize=530904
   [junit4]   2> 436783 INFO  (qtp21575158-2587) [n:127.0.0.1:37257_xh%2Fp    ] o.a.s.h.a.CollectionsHandler Invoked Collection Action :create with params replicationFactor=1&collection.configName=conf1&name=collection1&nrtReplicas=1&action=CREATE&numShards=2&createNodeSet=&stateFormat=2&wt=javabin&version=2 and sendToOCPQueue=true
   [junit4]   2> 436785 INFO  (OverseerThreadFactory-970-thread-2-processing-n:127.0.0.1:37257_xh%2Fp) [n:127.0.0.1:37257_xh%2Fp    ] o.a.s.c.CreateCollectionCmd Create collection collection1
   [junit4]   2> 436785 WARN  (OverseerThreadFactory-970-thread-2-processing-n:127.0.0.1:37257_xh%2Fp) [n:127.0.0.1:37257_xh%2Fp    ] o.a.s.c.CreateCollectionCmd It is unusual to create a collection (collection1) without cores.
   [junit4]   2> 436988 INFO  (qtp21575158-2587) [n:127.0.0.1:37257_xh%2Fp    ] o.a.s.h.a.CollectionsHandler Wait for new collection to be active for at most 30 seconds. Check all shard replicas
   [junit4]   2> 436988 INFO  (qtp21575158-2587) [n:127.0.0.1:37257_xh%2Fp    ] o.a.s.s.HttpSolrCall [admin] webapp=null path=/admin/collections params={replicationFactor=1&collection.configName=conf1&name=collection1&nrtReplicas=1&action=CREATE&numShards=2&createNodeSet=&stateFormat=2&wt=javabin&version=2} status=0 QTime=205
   [junit4]   2> 437060 INFO  (TEST-HttpPartitionTest.test-seed#[81332594CF3169AA]) [    ] o.a.s.c.AbstractFullDistribZkTestBase create jetty 1 in directory /home/jenkins/workspace/Lucene-Solr-master-Linux/solr/build/solr-core/test/J2/temp/solr.cloud.HttpPartitionTest_81332594CF3169AA-001/shard-1-001 of type TLOG
   [junit4]   2> 437060 INFO  (TEST-HttpPartitionTest.test-seed#[81332594CF3169AA]) [    ] o.e.j.s.Server jetty-9.3.20.v20170531
   [junit4]   2> 437061 INFO  (TEST-HttpPartitionTest.test-seed#[81332594CF3169AA]) [    ] o.e.j.s.h.ContextHandler Started o.e.j.s.ServletContextHandler@1996c63{/xh/p,null,AVAILABLE}
   [junit4]   2> 437061 INFO  (TEST-HttpPartitionTest.test-seed#[81332594CF3169AA]) [    ] o.e.j.s.AbstractConnector Started ServerConnector@151807a{HTTP/1.1,[http/1.1]}{127.0.0.1:35763}
   [junit4]   2> 437061 INFO  (TEST-HttpPartitionTest.test-seed#[81332594CF3169AA]) [    ] o.e.j.s.Server Started @437998ms
   [junit4]   2> 437061 INFO  (TEST-HttpPartitionTest.test-seed#[81332594CF3169AA]) [    ] o.a.s.c.s.e.JettySolrRunner Jetty properties: {solr.data.dir=/home/jenkins/workspace/Lucene-Solr-master-Linux/solr/build/solr-core/test/J2/temp/solr.cloud.HttpPartitionTest_81332594CF3169AA-001/tempDir-001/jetty1, replicaType=TLOG, solrconfig=solrconfig.xml, hostContext=/xh/p, hostPort=44687, coreRootDirectory=/home/jenkins/workspace/Lucene-Solr-master-Linux/solr/build/solr-core/test/J2/temp/solr.cloud.HttpPartitionTest_81332594CF3169AA-001/shard-1-001/cores}
   [junit4]   2> 437062 ERROR (TEST-HttpPartitionTest.test-seed#[81332594CF3169AA]) [    ] o.a.s.u.StartupLoggingUtils Missing Java Option solr.log.dir. Logging may be missing or incomplete.
   [junit4]   2> 437062 INFO  (TEST-HttpPartitionTest.test-seed#[81332594CF3169AA]) [    ] o.a.s.s.SolrDispatchFilter  ___      _       Welcome to Apache Solr? version 8.0.0
   [junit4]   2> 437062 INFO  (TEST-HttpPartitionTest.test-seed#[81332594CF3169AA]) [    ] o.a.s.s.SolrDispatchFilter / __| ___| |_ _   Starting in cloud mode on port null
   [junit4]   2> 437062 INFO  (TEST-HttpPartitionTest.test-seed#[81332594CF3169AA]) [    ] o.a.s.s.SolrDispatchFilter \__ \/ _ \ | '_|  Install dir: null, Default config dir: null
   [junit4]   2> 437062 INFO  (TEST-HttpPartitionTest.test-seed#[81332594CF3169AA]) [    ] o.a.s.s.SolrDispatchFilter |___/\___/_|_|    Start time: 2017-08-22T11:59:33.628Z
   [junit4]   2> 437064 INFO  (TEST-HttpPartitionTest.test-seed#[81332594CF3169AA]) [    ] o.a.s.s.SolrDispatchFilter Loading solr.xml from SolrHome (not found in ZooKeeper)
   [junit4]   2> 437064 INFO  (TEST-HttpPartitionTest.test-seed#[81332594CF3169AA]) [    ] o.a.s.c.SolrXmlConfig Loading container configuration from /home/jenkins/workspace/Lucene-Solr-master-Linux/solr/build/solr-core/test/J2/temp/solr.cloud.HttpPartitionTest_81332594CF3169AA-001/shard-1-001/solr.xml
   [junit4]   2> 437070 INFO  (TEST-HttpPartitionTest.test-seed#[81332594CF3169AA]) [    ] o.a.s.c.SolrXmlConfig MBean server found: com.sun.jmx.mbeanserver.JmxMBeanServer@e269fa, but no JMX reporters were configured - adding default JMX reporter.
   [junit4]   2> 437073 INFO  (TEST-HttpPartitionTest.test-seed#[81332594CF3169AA]) [    ] o.a.s.c.ZkContainer Zookeeper client=127.0.0.1:37945/solr
   [junit4]   2> 437079 INFO  (TEST-HttpPartitionTest.test-seed#[81332594CF3169AA]) [n:127.0.0.1:44687_xh%2Fp    ] o.a.s.c.c.ZkStateReader Updated live nodes from ZooKeeper... (0) -> (1)
   [junit4]   2> 437079 INFO  (TEST-HttpPartitionTest.test-seed#[81332594CF3169AA]) [n:127.0.0.1:44687_xh%2Fp    ] o.a.s.c.Overseer Overseer (id=null) closing
   [junit4]   2> 437080 INFO  (TEST-HttpPartitionTest.test-seed#[81332594CF3169AA]) [n:127.0.0.1:44687_xh%2Fp    ] o.a.s.c.ZkController Register node as live in ZooKeeper:/live_nodes/127.0.0.1:44687_xh%2Fp
   [junit4]   2> 437081 INFO  (zkCallback-387-thread-1) [    ] o.a.s.c.c.ZkStateReader Updated live nodes from ZooKeeper... (1) -> (2)
   [junit4]   2> 437081 INFO  (zkCallback-380-thread-1-processing-n:127.0.0.1:37257_xh%2Fp) [n:127.0.0.1:37257_xh%2Fp    ] o.a.s.c.c.ZkStateReader Updated live nodes from ZooKeeper... (1) -> (2)
   [junit4]   2> 437082 INFO  (zkCallback-392-thread-1-processing-n:127.0.0.1:44687_xh%2Fp) [n:127.0.0.1:44687_xh%2Fp    ] o.a.s.c.c.ZkStateReader Updated live nodes from ZooKeeper... (1) -> (2)
   [junit4]   2> 437309 INFO  (TEST-HttpPartitionTest.test-seed#[81332594CF3169AA]) [n:127.0.0.1:44687_xh%2Fp    ] o.a.s.m.r.SolrJmxReporter JMX monitoring for 'solr.node' (registry 'solr.node') enabled at server: com.sun.jmx.mbeanserver.JmxMBeanServer@e269fa
   [junit4]   2> 437321 INFO  (TEST-HttpPartitionTest.test-seed#[81332594CF3169AA]) [n:127.0.0.1:44687_xh%2Fp    ] o.a.s.m.r.SolrJmxReporter JMX monitoring for 'solr.jvm' (registry 'solr.jvm') enabled at server: com.sun.jmx.mbeanserver.JmxMBeanServer@e269fa
   [junit4]   2> 437321 INFO  (TEST-HttpPartitionTest.test-seed#[81332594CF3169AA]) [n:127.0.0.1:44687_xh%2Fp    ] o.a.s.m.r.SolrJmxReporter JMX monitoring for 'solr.jetty' (registry 'solr.jetty') enabled at server: com.sun.jmx.mbeanserver.JmxMBeanServer@e269fa
   [junit4]   2> 437322 INFO  (TEST-HttpPartitionTest.test-seed#[81332594CF3169AA]) [n:127.0.0.1:44687_xh%2Fp    ] o.a.s.c.CorePropertiesLocator Found 0 core definitions underneath /home/jenkins/workspace/Lucene-Solr-master-Linux/solr/build/solr-core/test/J2/temp/solr.cloud.HttpPartitionTest_81332594CF3169AA-001/shard-1-001/cores
   [junit4]   2> 437356 INFO  (qtp21575158-2590) [n:127.0.0.1:37257_xh%2Fp    ] o.a.s.h.a.CollectionsHandler Invoked Collection Action :addreplica with params node=127.0.0.1:44687_xh%252Fp&action=ADDREPLICA&collection=collection1&shard=shard2&type=TLOG&wt=javabin&version=2 and sendToOCPQueue=true
   [junit4]   2> 437358 INFO  (OverseerCollectionConfigSetProcessor-98527030165831684-127.0.0.1:37257_xh%2Fp-n_0000000000) [n:127.0.0.1:37257_xh%2Fp    ] o.a.s.c.OverseerTaskQueue Response ZK path: /overseer/collection-queue-work/qnr-0000000002 doesn't exist.  Requestor may have disconnected from ZooKeeper
   [junit4]   2> 437358 INFO  (OverseerThreadFactory-970-thread-3-processing-n:127.0.0.1:37257_xh%2Fp) [n:127.0.0.1:37257_xh%2Fp    ] o.a.s.c.AddReplicaCmd Node Identified 127.0.0.1:44687_xh%2Fp for creating new replica
   [junit4]   2> 437359 INFO  (SocketProxy-Acceptor-44687) [    ] o.a.s.c.SocketProxy accepted Socket[addr=/127.0.0.1,port=53026,localport=44687], receiveBufferSize:531000
   [junit4]   2> 437360 INFO  (SocketProxy-Acceptor-44687) [    ] o.a.s.c.SocketProxy proxy connection Socket[addr=/127.0.0.1,port=35763,localport=40380], receiveBufferSize=530904
   [junit4]   2> 437360 INFO  (qtp13401326-2638) [n:127.0.0.1:44687_xh%2Fp    ] o.a.s.h.a.CoreAdminOperation core create command qt=/admin/cores&collection.configName=conf1&name=collection1_shard2_replica_t41&action=CREATE&collection=collection1&shard=shard2&wt=javabin&version=2&replicaType=TLOG
   [junit4]   2> 437361 INFO  (qtp13401326-2638) [n:127.0.0.1:44687_xh%2Fp    ] o.a.s.c.TransientSolrCoreCacheDefault Allocating transient cache for 4 transient cores
   [junit4]   2> 437464 INFO  (zkCallback-392-thread-1-processing-n:127.0.0.1:44687_xh%2Fp) [n:127.0.0.1:44687_xh%2Fp    ] o.a.s.c.c.ZkStateReader A cluster state change: [WatchedEvent state:SyncConnected type:NodeDataChanged path:/collections/collection1/state.json] for collection [collection1] has occurred - updating... (live nodes size: [2])
   [junit4]   2> 438384 INFO  (qtp13401326-2638) [n:127.0.0.1:44687_xh%2Fp c:collection1 s:shard2  x:collection1_shard2_replica_t41] o.a.s.c.SolrConfig Using Lucene MatchVersion: 8.0.0
   [junit4]   2> 438401 INFO  (qtp13401326-2638) [n:127.0.0.1:44687_xh%2Fp c:collection1 s:shard2  x:collection1_shard2_replica_t41] o.a.s.s.IndexSchema [collection1_shard2_replica_t41] Schema name=test
   [junit4]   2> 438486 INFO  (qtp13401326-2638) [n:127.0.0.1:44687_xh%2Fp c:collection1 s:shard2  x:collection1_shard2_replica_t41] o.a.s.s.IndexSchema Loaded schema test/1.0 with uniqueid field id
   [junit4]   2> 438501 INFO  (qtp13401326-2638) [n:127.0.0.1:44687_xh%2Fp c:collection1 s:shard2  x:collection1_shard2_replica_t41] o.a.s.c.CoreContainer Creating SolrCore 'collection1_shard2_replica_t41' using configuration from collection collection1, trusted=true
   [junit4]   2> 438501 INFO  (qtp13401326-2638) [n:127.0.0.1:44687_xh%2Fp c:collection1 s:shard2  x:collection1_shard2_replica_t41] o.a.s.m.r.SolrJmxReporter JMX monitoring for 'solr.core.collection1.shard2.replica_t41' (registry 'solr.core.collection1.shard2.replica_t41') enabled at server: com.sun.jmx.mbeanserver.JmxMBeanServer@e269fa
   [junit4]   2> 438501 INFO  (qtp13401326-2638) [n:127.0.0.1:44687_xh%2Fp c:collection1 s:shard2  x:collection1_shard2_replica_t41] o.a.s.c.SolrCore solr.RecoveryStrategy.Builder
   [junit4]   2> 438502 INFO  (qtp13401326-2638) [n:127.0.0.1:44687_xh%2Fp c:collection1 s:shard2  x:collection1_shard2_replica_t41] o.a.s.c.SolrCore [[collection1_shard2_replica_t41] ] Opening new SolrCore at [/home/jenkins/workspace/Lucene-Solr-master-Linux/solr/build/solr-core/test/J2/temp/solr.cloud.HttpPartitionTest_81332594CF3169AA-001/shard-1-001/cores/collection1_shard2_replica_t41], dataDir=[/home/jenkins/workspace/Lucene-Solr-master-Linux/solr/build/solr-core/test/J2/temp/solr.cloud.HttpPartitionTest_81332594CF3169AA-001/shard-1-001/cores/collection1_shard2_replica_t41/data/]
   [junit4]   2> 438504 INFO  (qtp13401326-2638) [n:127.0.0.1:44687_xh%2Fp c:collection1 s:shard2  x:collection1_shard2_replica_t41] o.a.s.u.RandomMergePolicy RandomMergePolicy wrapping class org.apache.lucene.index.LogDocMergePolicy: [LogDocMergePolicy: minMergeSize=1000, mergeFactor=48, maxMergeSize=9223372036854775807, maxMergeSizeForForcedMerge=9223372036854775807, calibrateSizeByDeletes=true, maxMergeDocs=2147483647, maxCFSSegmentSizeMB=8.796093022207999E12, noCFSRatio=1.0]
   [junit4]   2> 438506 WARN  (qtp13401326-2638) [n:127.0.0.1:44687_xh%2Fp c:collection1 s:shard2  x:collection1_shard2_replica_t41] o.a.s.c.RequestHandlers INVALID paramSet a in requestHandler {type = requestHandler,name = /dump,class = DumpRequestHandler,attributes = {initParams=a, name=/dump, class=DumpRequestHandler},args = {defaults={a=A,b=B}}}
   [junit4]   2> 438539 INFO  (qtp13401326-2638) [n:127.0.0.1:44687_xh%2Fp c:collection1 s:shard2  x:collection1_shard2_replica_t41] o.a.s.u.UpdateHandler Using UpdateLog implementation: org.apache.solr.update.UpdateLog
   [junit4]   2> 438539 INFO  (qtp13401326-2638) [n:127.0.0.1:44687_xh%2Fp c:collection1 s:shard2  x:collection1_shard2_replica_t41] o.a.s.u.UpdateLog Initializing UpdateLog: dataDir= defaultSyncLevel=FLUSH numRecordsToKeep=100 maxNumLogsToKeep=10 numVersionBuckets=65536
   [junit4]   2> 438540 INFO  (qtp13401326-2638) [n:127.0.0.1:44687_xh%2Fp c:collection1 s:shard2  x:collection1_shard2_replica_t41] o.a.s.u.CommitTracker Hard AutoCommit: disabled
   [junit4]   2> 438540 INFO  (qtp13401326-2638) [n:127.0.0.1:44687_xh%2Fp c:collection1 s:shard2  x:collection1_shard2_replica_t41] o.a.s.u.CommitTracker Soft AutoCommit: disabled
   [junit4]   2> 438541 INFO  (qtp13401326-2638) [n:127.0.0.1:44687_xh%2Fp c:collection1 s:shard2  x:collection1_shard2_replica_t41] o.a.s.u.RandomMergePolicy RandomMergePolicy wrapping class org.apache.lucene.index.TieredMergePolicy: [TieredMergePolicy: maxMergeAtOnce=34, maxMergeAtOnceExplicit=33, maxMergedSegmentMB=1.6982421875, floorSegmentMB=1.0224609375, forceMergeDeletesPctAllowed=24.595564567763446, segmentsPerTier=36.0, maxCFSSegmentSizeMB=0.6201171875, noCFSRatio=0.20630070084716712
   [junit4]   2> 438541 INFO  (qtp13401326-2638) [n:127.0.0.1:44687_xh%2Fp c:collection1 s:shard2  x:collection1_shard2_replica_t41] o.a.s.s.SolrIndexSearcher Opening [Searcher@1d4905a[collection1_shard2_replica_t41] main]
   [junit4]   2> 438542 INFO  (qtp13401326-2638) [n:127.0.0.1:44687_xh%2Fp c:collection1 s:shard2  x:collection1_shard2_replica_t41] o.a.s.r.ManagedResourceStorage Configured ZooKeeperStorageIO with znodeBase: /configs/conf1
   [junit4]   2> 438543 INFO  (qtp13401326-2638) [n:127.0.0.1:44687_xh%2Fp c:collection1 s:shard2  x:collection1_shard2_replica_t41] o.a.s.r.ManagedResourceStorage Loaded null at path _rest_managed.json using ZooKeeperStorageIO:path=/configs/conf1
   [junit4]   2> 438543 INFO  (qtp13401326-2638) [n:127.0.0.1:44687_xh%2Fp c:collection1 s:shard2  x:collection1_shard2_replica_t41] o.a.s.h.ReplicationHandler Commits will be reserved for  10000
   [junit4]   2> 438543 INFO  (qtp13401326-2638) [n:127.0.0.1:44687_xh%2Fp c:collection1 s:shard2  x:collection1_shard2_replica_t41] o.a.s.u.UpdateLog Could not find max version in index or recent updates, using new clock 1576432487743094784
   [junit4]   2> 438553 INFO  (searcherExecutor-984-thread-1-processing-n:127.0.0.1:44687_xh%2Fp x:collection1_shard2_replica_t41 s:shard2 c:collection1) [n:127.0.0.1:44687_xh%2Fp c:collection1 s:shard2  x:collection1_shard2_replica_t41] o.a.s.c.SolrCore [collection1_shard2_replica_t41] Registered new searcher Searcher@1d4905a[collection1_shard2_replica_t41] main{ExitableDirectoryReader(UninvertingDirectoryReader())}
   [junit4]   2> 438555 INFO  (qtp13401326-2638) [n:127.0.0.1:44687_xh%2Fp c:collection1 s:shard2  x:collection1_shard2_replica_t41] o.a.s.c.ShardLeaderElectionContext Enough replicas found to continue.
   [junit4]   2> 438555 INFO  (qtp13401326-2638) [n:127.0.0.1:44687_xh%2Fp c:collection1 s:shard2  x:collection1_shard2_replica_t41] o.a.s.c.ShardLeaderElectionContext I may be the new leader - try and sync
   [junit4]   2> 438555 INFO  (qtp13401326-2638) [n:127.0.0.1:44687_xh%2Fp c:collection1 s:shard2  x:collection1_shard2_replica_t41] o.a.s.c.SyncStrategy Sync replicas to http://127.0.0.1:44687/xh/p/collection1_shard2_replica_t41/
   [junit4]   2> 438555 INFO  (qtp13401326-2638) [n:127.0.0.1:44687_xh%2Fp c:collection1 s:shard2  x:collection1_shard2_replica_t41] o.a.s.c.SyncStrategy Sync Success - now sync replicas to me
   [junit4]   2> 438555 INFO  (qtp13401326-2638) [n:127.0.0.1:44687_xh%2Fp c:collection1 s:shard2  x:collection1_shard2_replica_t41] o.a.s.c.SyncStrategy http://127.0.0.1:44687/xh/p/collection1_shard2_replica_t41/ has no replicas
   [junit4]   2> 438555 INFO  (qtp13401326-2638) [n:127.0.0.1:44687_xh%2Fp c:collection1 s:shard2  x:collection1_shard2_replica_t41] o.a.s.c.ShardLeaderElectionContext Found all replicas participating in election, clear LIR
   [junit4]   2> 438556 INFO  (qtp13401326-2638) [n:127.0.0.1:44687_xh%2Fp c:collection1 s:shard2  x:collection1_shard2_replica_t41] o.a.s.c.ZkController collection1_shard2_replica_t41 stopping background replication from leader
   [junit4]   2> 438557 INFO  (qtp13401326-2638) [n:127.0.0.1:44687_xh%2Fp c:collection1 s:shard2  x:collection1_shard2_replica_t41] o.a.s.c.ShardLeaderElectionContext I am the new leader: http://127.0.0.1:44687/xh/p/collection1_shard2_replica_t41/ shard2
   [junit4]   2> 438659 INFO  (zkCallback-392-thread-1-processing-n:127.0.0.1:44687_xh%2Fp) [n:127.0.0.1:44687_xh%2Fp    ] o.a.s.c.c.ZkStateReader A cluster state change: [WatchedEvent state:SyncConnected type:NodeDataChanged path:/collections/collection1/state.json] for collection [collection1] has occurred - updating... (live nodes size: [2])
   [junit4]   2> 438708 INFO  (qtp13401326-2638) [n:127.0.0.1:44687_xh%2Fp c:collection1 s:shard2  x:collection1_shard2_replica_t41] o.a.s.c.ZkController I am the leader, no recovery necessary
   [junit4]   2> 438709 INFO  (qtp13401326-2638) [n:127.0.0.1:44687_xh%2Fp c:collection1 s:shard2  x:collection1_shard2_replica_t41] o.a.s.s.HttpSolrCall [admin] webapp=null path=/admin/cores params={qt=/admin/cores&collection.configName=conf1&name=collection1_shard2_replica_t41&action=CREATE&collection=collection1&shard=shard2&wt=javabin&version=2&replicaType=TLOG} status=0 QTime=1349
   [junit4]   2> 438711 INFO  (qtp21575158-2590) [n:127.0.0.1:37257_xh%2Fp    ] o.a.s.s.HttpSolrCall [admin] webapp=null path=/admin/collections params={node=127.0.0.1:44687_xh%252Fp&action=ADDREPLICA&collection=collection1&shard=shard2&type=TLOG&wt=javabin&version=2} status=0 QTime=1354
   [junit4]   2> 438776 INFO  (TEST-HttpPartitionTest.test-seed#[81332594CF3169AA]) [    ] o.a.s.c.AbstractFullDistribZkTestBase create jetty 2 in directory /home/jenkins/workspace/Lucene-Solr-master-Linux/solr/build/solr-core/test/J2/temp/solr.cloud.HttpPartitionTest_81332594CF3169AA-001/shard-2-001 of type TLOG
   [junit4]   2> 438776 INFO  (TEST-HttpPartitionTest.test-seed#[81332594CF3169AA]) [    ] o.e.j.s.Server jetty-9.3.20.v20170531
   [junit4]   2> 438777 INFO  (TEST-HttpPartitionTest.test-seed#[81332594CF3169AA]) [    ] o.e.j.s.h.ContextHandler Started o.e.j.s.ServletContextHandler@eb9218{/xh/p,null,AVAILABLE}
   [junit4]   2> 438777 INFO  (TEST-HttpPartitionTest.test-seed#[81332594CF3169AA]) [    ] o.e.j.s.AbstractConnector Started ServerConnector@18f8ada{HTTP/1.1,[http/1.1]}{127.0.0.1:37767}
   [junit4]   2> 438777 INFO  (TEST-HttpPartitionTest.test-seed#[81332594CF3169AA]) [    ] o.e.j.s.Server Started @439714ms
   [junit4]   2> 438777 INFO  (TEST-HttpPartitionTest.test-seed#[81332594CF3169AA]) [    ] o.a.s.c.s.e.JettySolrRunner Jetty properties: {solr.data.dir=/home/jenkins/workspace/Lucene-Solr-master-Linux/solr/build/solr-core/test/J2/temp/solr.cloud.HttpPartitionTest_81332594CF3169AA-001/tempDir-001/jetty2, replicaType=TLOG, solrconfig=solrconfig.xml, hostContext=/xh/p, hostPort=45341, coreRootDirectory=/home/jenkins/workspace/Lucene-Solr-master-Linux/solr/build/solr-core/test/J2/temp/solr.cloud.HttpPartitionTest_81332594CF3169AA-001/shard-2-001/cores}
   [junit4]   2> 438778 ERROR (TEST-HttpPartitionTest.test-seed#[81332594CF3169AA]) [    ] o.a.s.u.StartupLoggingUtils Missing Java Option solr.log.dir. Logging may be missing or incomplete.
   [junit4]   2> 438778 INFO  (TEST-HttpPartitionTest.test-seed#[81332594CF3169AA]) [    ] o.a.s.s.SolrDispatchFilter  ___      _       Welcome to Apache Solr? version 8.0.0
   [junit4]   2> 438778 INFO  (TEST-HttpPartitionTest.test-seed#[81332594CF3169AA]) [    ] o.a.s.s.SolrDispatchFilter / __| ___| |_ _   Starting in cloud mode on port null
   [junit4]   2> 438778 INFO  (TEST-HttpPartitionTest.test-seed#[81332594CF3169AA]) [    ] o.a.s.s.SolrDispatchFilter \__ \/ _ \ | '_|  Install dir: null, Default config dir: null
   [junit4]   2> 438778 INFO  (TEST-HttpPartitionTest.test-seed#[81332594CF3169AA]) [    ] o.a.s.s.SolrDispatchFilter |___/\___/_|_|    Start time: 2017-08-22T11:59:35.344Z
   [junit4]   2> 438780 INFO  (TEST-HttpPartitionTest.test-seed#[81332594CF3169AA]) [    ] o.a.s.s.SolrDispatchFilter Loading solr.xml from SolrHome (not found in ZooKeeper)
   [junit4]   2> 438780 INFO  (TEST-HttpPartitionTest.test-seed#[81332594CF3169AA]) [    ] o.a.s.c.SolrXmlConfig Loading container configuration from /home/jenkins/workspace/Lucene-Solr-master-Linux/solr/build/solr-core/test/J2/temp/solr.cloud.HttpPartitionTest_81332594CF3169AA-001/shard-2-001/solr.xml
   [junit4]   2> 438785 INFO  (TEST-HttpPartitionTest.test-seed#[81332594CF3169AA]) [    ] o.a.s.c.SolrXmlConfig MBean server found: com.sun.jmx.mbeanserver.JmxMBeanServer@e269fa, but no JMX reporters were configured - adding default JMX reporter.
   [junit4]   2> 438787 INFO  (TEST-HttpPartitionTest.test-seed#[81332594CF3169AA]) [    ] o.a.s.c.ZkContainer Zookeeper client=127.0.0.1:37945/solr
   [junit4]   2> 438793 INFO  (TEST-HttpPartitionTest.test-seed#[81332594CF3169AA]) [n:127.0.0.1:45341_xh%2Fp    ] o.a.s.c.c.ZkStateReader Updated live nodes from ZooKeeper... (0) -> (2)
   [junit4]   2> 438795 INFO  (TEST-HttpPartitionTest.test-seed#[81332594CF3169AA]) [n:127.0.0.1:45341_xh%2Fp    ] o.a.s.c.Overseer Overseer (id=null) closing
   [junit4]   2> 438796 INFO  (TEST-HttpPartitionTest.test-seed#[81332594CF3169AA]) [n:127.0.0.1:45341_xh%2Fp    ] o.a.s.c.ZkController Register node as live in ZooKeeper:/live_nodes/127.0.0.1:45341_xh%2Fp
   [junit4]   2> 438797 INFO  (zkCallback-387-thread-1) [    ] o.a.s.c.c.ZkStateReader Updated live nodes from ZooKeeper... (2) -> (3)
   [junit4]   2> 438797 INFO  (zkCallback-392-thread-1-processing-n:127.0.0.1:44687_xh%2Fp) [n:127.0.0.1:44687_xh%2Fp    ] o.a.s.c.c.ZkStateReader Updated live nodes from ZooKeeper... (2) -> (3)
   [junit4]   2> 438797 INFO  (zkCallback-380-thread-1-processing-n:127.0.0.1:37257_xh%2Fp) [n:127.0.0.1:37257_xh%2Fp    ] o.a.s.c.c.ZkStateReader Updated live nodes from ZooKeeper... (2) -> (3)
   [junit4]   2> 438798 INFO  (zkCallback-398-thread-1-processing-n:127.0.0.1:45341_xh%2Fp) [n:127.0.0.1:45341_xh%2Fp    ] o.a.s.c.c.ZkStateReader Updated live nodes from ZooKeeper... (2) -> (3)
   [junit4]   2> 438898 INFO  (zkCallback-392-thread-1-processing-n:127.0.0.1:44687_xh%2Fp) [n:127.0.0.1:44687_xh%2Fp    ] o.a.s.c.c.ZkStateReader A cluster state change: [WatchedEvent state:SyncConnected type:NodeDataChanged path:/collections/collection1/state.json] for collection [collection1] has occurred - updating... (live nodes size: [3])
   [junit4]   2> 438911 INFO  (TEST-HttpPartitionTest.test-seed#[81332594CF3169AA]) [n:127.0.0.1:45341_xh%2Fp    ] o.a.s.m.r.SolrJmxReporter JMX monitoring for 'solr.node' (registry 'solr.node') enabled at server: com.sun.jmx.mbeanserver.JmxMBeanServer@e269fa
   [junit4]   2> 438922 INFO  (TEST-HttpPartitionTest.test-seed#[81332594CF3169AA]) [n:127.0.0.1:45341_xh%2Fp    ] o.a.s.m.r.SolrJmxReporter JMX monitoring for 'solr.jvm' (registry 'solr.jvm') enabled at server: com.sun.jmx.mbeanserver.JmxMBeanServer@e269fa
   [junit4]   2> 438922 INFO  (TEST-HttpPartitionTest.test-seed#[81332594CF3169AA]) [n:127.0.0.1:45341_xh%2Fp    ] o.a.s.m.r.SolrJmxReporter JMX monitoring for 'solr.jetty' (registry 'solr.jetty') enabled at server: com.sun.jmx.mbeanserver.JmxMBeanServer@e269fa
   [junit4]   2> 438923 INFO  (TEST-HttpPartitionTest.test-seed#[81332594CF3169AA]) [n:127.0.0.1:45341_xh%2Fp    ] o.a.s.c.CorePropertiesLocator Found 0 core definitions underneath /home/jenkins/workspace/Lucene-Solr-master-Linux/solr/build/solr-core/test/J2/temp/solr.cloud.HttpPartitionTest_81332594CF3169AA-001/shard-2-001/cores
   [junit4]   2> 438967 INFO  (SocketProxy-Acceptor-45341) [    ] o.a.s.c.SocketProxy accepted Socket[addr=/127.0.0.1,port=36766,localport=45341], receiveBufferSize:531000
   [junit4]   2> 438967 INFO  (SocketProxy-Acceptor-45341) [    ] o.a.s.c.SocketProxy proxy connection Socket[addr=/127.0.0.1,port=37767,localport=56812], receiveBufferSize=530904
   [junit4]   2> 438968 INFO  (qtp20678736-2670) [n:127.0.0.1:45341_xh%2Fp    ] o.a.s.h.a.CollectionsHandler Invoked Collection Action :addreplica with params node=127.0.0.1:45341_xh%252Fp&action=ADDREPLICA&collection=collection1&shard=shard1&type=TLOG&wt=javabin&version=2 and sendToOCPQueue=true
   [junit4]   2> 438971 INFO  (OverseerCollectionConfigSetProcessor-98527030165831684-127.0.0.1:37257_xh%2Fp-n_0000000000) [n:127.0.0.1:37257_xh%2Fp    ] o.a.s.c.OverseerTaskQueue Response ZK path: /overseer/collection-queue-work/qnr-0000000004 doesn't exist.  Requestor may have disconnected from ZooKeeper
   [junit4]   2> 438971 INFO  (OverseerThreadFactory-970-thread-4-processing-n:127.0.0.1:37257_xh%2Fp) [n:127.0.0.1:37257_xh%2Fp    ] o.a.s.c.AddReplicaCmd Node Identified 127.0.0.1:45341_xh%2Fp for creating new replica
   [junit4]   2> 438972 INFO  (SocketProxy-Acceptor-45341) [    ] o.a.s.c.SocketProxy accepted Socket[addr=/127.0.0.1,port=36770,localport=45341], receiveBufferSize:531000
   [junit4]   2> 438973 INFO  (SocketProxy-Acceptor-45341) [    ] o.a.s.c.SocketProxy proxy connection Socket[addr=/127.0.0.1,port=37767,localport=56816], receiveBufferSize=530904
   [junit4]   2> 438973 INFO  (qtp20678736-2672) [n:127.0.0.1:45341_xh%2Fp    ] o.a.s.h.a.CoreAdminOperation core create command qt=/admin/cores&collection.configName=conf1&name=collection1_shard1_replica_t43&action=CREATE&collection=collection1&shard=shard1&wt=javabin&version=2&replicaType=TLOG
   [junit4]   2> 438973 INFO  (qtp20678736-2672) [n:127.0.0.1:45341_xh%2Fp    ] o.a.s.c.TransientSolrCoreCacheDefault Allocating transient cache for 4 transient cores
   [junit4]   2> 439076 INFO  (zkCallback-392-thread-1-processing-n:127.0.0.1:44687_xh%2Fp) [n:127.0.0.1:44687_xh%2Fp    ] o.a.s.c.c.ZkStateReader A cluster state change: [WatchedEvent state:SyncConnected type:NodeDataChanged path:/collections/collection1/state.json] for collection [collection1] has occurred - updating... (live nodes size: [3])
   [junit4]   2> 439076 INFO  (zkCallback-398-thread-1-processing-n:127.0.0.1:45341_xh%2Fp) [n:127.0.0.1:45341_xh%2Fp    ] o.a.s.c.c.ZkStateReader A cluster state change: [WatchedEvent state:SyncConnected type:NodeDataChanged path:/collections/collection1/state.json] for collection [collection1] has occurred - updating... (live nodes size: [3])
   [junit4]   2> 439995 INFO  (qtp20678736-2672) [n:127.0.0.1:45341_xh%2Fp c:collection1 s:shard1  x:collection1_shard1_replica_t43] o.a.s.c.SolrConfig Using Lucene MatchVersion: 8.0.0
   [junit4]   2> 440018 INFO  (qtp20678736-2672) [n:127.0.0.1:45341_xh%2Fp c:collection1 s:shard1  x:collection1_shard1_replica_t43] o.a.s.s.IndexSchema [collection1_shard1_replica_t43] Schema name=test
   [junit4]   2> 440103 INFO  (qtp20678736-2672) [n:127.0.0.1:45341_xh%2Fp c:collection1 s:shard1  x:collection1_shard1_replica_t43] o.a.s.s.IndexSchema Loaded schema test/1.0 with uniqueid field id
   [junit4]   2> 440115 INFO  (qtp20678736-2672) [n:127.0.0.1:45341_xh%2Fp c:collection1 s:shard1  x:collection1_shard1_replica_t43] o.a.s.c.CoreContainer Creating SolrCore 'collection1_shard1_replica_t43' using configuration from collection collection1, trusted=true
   [junit4]   2> 440115 INFO  (qtp20678736-2672) [n:127.0.0.1:45341_xh%2Fp c:collection1 s:shard1  x:collection1_shard1_replica_t43] o.a.s.m.r.SolrJmxReporter JMX monitoring for 'solr.core.collection1.shard1.replica_t43' (registry 'solr.core.collection1.shard1.replica_t43') enabled at server: com.sun.jmx.mbeanserver.JmxMBeanServer@e269fa
   [junit4]   2> 440115 INFO  (qtp20678736-2672) [n:127.0.0.1:45341_xh%2Fp c:collection1 s:shard1  x:collection1_shard1_replica_t43] o.a.s.c.SolrCore solr.RecoveryStrategy.Builder
   [junit4]   2> 440116 INFO  (qtp20678736-2672) [n:127.0.0.1:45341_xh%2Fp c:collection1 s:shard1  x:collection1_shard1_replica_t43] o.a.s.c.SolrCore [[collection1_shard1_replica_t43] ] Opening new SolrCore at [/home/jenkins/workspace/Lucene-Solr-master-Linux/solr/build/solr-core/test/J2/temp/solr.cloud.HttpPartitionTest_81332594CF3169AA-001/shard-2-001/cores/collection1_shard1_replica_t43], dataDir=[/home/jenkins/workspace/Lucene-Solr-master-Linux/solr/build/solr-core/test/J2/temp/solr.cloud.HttpPartitionTest_81332594CF3169AA-001/shard-2-001/cores/collection1_shard1_replica_t43/data/]
   [junit4]   2> 440118 INFO  (qtp20678736-2672) [n:127.0.0.1:45341_xh%2Fp c:collection1 s:shard1  x:collection1_shard1_replica_t43] o.a.s.u.RandomMergePolicy RandomMergePolicy wrapping class org.apache.lucene.index.LogDocMergePolicy: [LogDocMergePolicy: minMergeSize=1000, mergeFactor=48, maxMergeSize=9223372036854775807, maxMergeSizeForForcedMerge=9223372036854775807, calibrateSizeByDeletes=true, maxMergeDocs=2147483647, maxCFSSegmentSizeMB=8.796093022207999E12, noCFSRatio=1.0]
   [junit4]   2> 440120 WARN  (qtp20678736-2672) [n:127.0.0.1:45341_xh%2Fp c:collection1 s:shard1  x:collection1_shard1_replica_t43] o.a.s.c.RequestHandlers INVALID paramSet a in requestHandler {type = requestHandler,name = /dump,class = DumpRequestHandler,attributes = {initParams=a, name=/dump, class=DumpRequestHandler},args = {defaults={a=A,b=B}}}
   [junit4]   2> 440160 INFO  (qtp20678736-2672) [n:127.0.0.1:45341_xh%2Fp c:collection1 s:shard1  x:collection1_shard1_replica_t43] o.a.s.u.UpdateHandler Using UpdateLog implementation: org.apache.solr.update.UpdateLog
   [junit4]   2> 440161 INFO  (qtp20678736-2672) [n:127.0.0.1:45341_xh%2Fp c:collection1 s:shard1  x:collection1_shard1_replica_t43] o.a.s.u.UpdateLog Initializing UpdateLog: dataDir= defaultSyncLevel=FLUSH numRecordsToKeep=100 maxNumLogsToKeep=10 numVersionBuckets=65536
   [junit4]   2> 440161 INFO  (qtp20678736-2672) [n:127.0.0.1:45341_xh%2Fp c:collection1 s:shard1  x:collection1_shard1_replica_t43] o.a.s.u.CommitTracker Hard AutoCommit: disabled
   [junit4]   2> 440161 INFO  (qtp20678736-2672) [n:127.0.0.1:45341_xh%2Fp c:collection1 s:shard1  x:collection1_shard1_replica_t43] o.a.s.u.CommitTracker Soft AutoCommit: disabled
   [junit4]   2> 440162 INFO  (qtp20678736-2672) [n:127.0.0.1:45341_xh%2Fp c:collection1 s:shard1  x:collection1_shard1_replica_t43] o.a.s.u.RandomMergePolicy RandomMergePolicy wrapping class org.apache.lucene.index.TieredMergePolicy: [TieredMergePolicy: maxMergeAtOnce=34, maxMergeAtOnceExplicit=33, maxMergedSegmentMB=1.6982421875, floorSegmentMB=1.0224609375, forceMergeDeletesPctAllowed=24.595564567763446, segmentsPerTier=36.0, maxCFSSegmentSizeMB=0.6201171875, noCFSRatio=0.20630070084716712
   [junit4]   2> 440163 INFO  (qtp20678736-2672) [n:127.0.0.1:45341_xh%2Fp c:collection1 s:shard1  x:collection1_shard1_replica_t43] o.a.s.s.SolrIndexSearcher Opening [Searcher@162564c[collection1_shard1_replica_t43] main]
   [junit4]   2> 440164 INFO  (qtp20678736-2672) [n:127.0.0.1:45341_xh%2Fp c:collection1 s:shard1  x:collection1_shard1_replica_t43] o.a.s.r.ManagedResourceStorage Configured ZooKeeperStorageIO with znodeBase: /configs/conf1
   [junit4]   2> 440164 INFO  (qtp20678736-2672) [n:127.0.0.1:45341_xh%2Fp c:collection1 s:shard1  x:collection1_shard1_replica_t43] o.a.s.r.ManagedResourceStorage Loaded null at path _rest_managed.json using ZooKeeperStorageIO:path=/configs/conf1
   [junit4]   2> 440164 INFO  (qtp20678736-2672) [n:127.0.0.1:45341_xh%2Fp c:collection1 s:shard1  x:collection1_shard1_replica_t43] o.a.s.h.ReplicationHandler Commits will be reserved for  10000
   [junit4]   2> 440165 INFO  (qtp20678736-2672) [n:127.0.0.1:45341_xh%2Fp c:collection1 s:shard1  x:collection1_shard1_replica_t43] o.a.s.u.UpdateLog Could not find max version in index or recent updates, using new clock 1576432489443885056
   [junit4]   2> 440166 INFO  (searcherExecutor-995-thread-1-processing-n:127.0.0.1:45341_xh%2Fp x:collection1_shard1_replica_t43 s:shard1 c:collection1) [n:127.0.0.1:45341_xh%2Fp c:collection1 s:shard1  x:collection1_shard1_replica_t43] o.a.s.c.SolrCore [collection1_shard1_replica_t43] Registered new searcher Searcher@162564c[collection1_shard1_replica_t43] main{ExitableDirectoryReader(UninvertingDirectoryReader())}
   [junit4]   2> 440169 INFO  (qtp20678736-2672) [n:127.0.0.1:45341_xh%2Fp c:collection1 s:shard1  x:collection1_shard1_replica_t43] o.a.s.c.ShardLeaderElectionContext Enough replicas found to continue.
   [junit4]   2> 440170 INFO  (qtp20678736-2672) [n:127.0.0.1:45341_xh%2Fp c:collection1 s:shard1  x:collection1_shard1_replica_t43] o.a.s.c.ShardLeaderElectionContext I may be the new leader - try and sync
   [junit4]   2> 440170 INFO  (qtp20678736-2672) [n:127.0.0.1:45341_xh%2Fp c:collection1 s:shard1  x:collection1_shard1_replica_t43] o.a.s.c.SyncStrategy Sync replicas to http://127.0.0.1:45341/xh/p/collection1_shard1_replica_t43/
   [junit4]   2> 440170 INFO  (qtp20678736-2672) [n:127.0.0.1:45341_xh%2Fp c:collection1 s:shard1  x:collection1_shard1_replica_t43] o.a.s.c.SyncStrategy Sync Success - now sync replicas to me
   [junit4]   2> 440170 INFO  (qtp20678736-2672) [n:127.0.0.1:45341_xh%2Fp c:collection1 s:shard1  x:collection1_shard1_replica_t43] o.a.s.c.SyncStrategy http://127.0.0.1:45341/xh/p/collection1_shard1_replica_t43/ has no replicas
   [junit4]   2> 440170 INFO  (qtp20678736-2672) [n:127.0.0.1:45341_xh%2Fp c:collection1 s:shard1  x:collection1_shard1_replica_t43] o.a.s.c.ShardLeaderElectionContext Found all replicas participating in election, clear LIR
   [junit4]   2> 440170 INFO  (qtp20678736-2672) [n:127.0.0.1:45341_xh%2Fp c:collection1 s:shard1  x:collection1_shard1_replica_t43] o.a.s.c.ZkController collection1_shard1_replica_t43 stopping background replication from leader
   [junit4]   2> 440171 INFO  (qtp20678736-2672) [n:127.0.0.1:45341_xh%2Fp c:collection1 s:shard1  x:collection1_shard1_replica_t43] o.a.s.c.ShardLeaderElectionContext I am the new leader: http://127.0.0.1:45341/xh/p/collection1_shard1_replica_t43/ shard1
   [junit4]   2> 440273 INFO  (zkCallback-392-thread-1-processing-n:127.0.0.1:44687_xh%2Fp) [n:127.0.0.1:44687_xh%2Fp    ] o.a.s.c.c.ZkStateReader A cluster state change: [WatchedEvent state:SyncConnected type:NodeDataChanged path:/collections/collection1/state.json] for collection [collection1] has occurred - updating... (live nodes size: [3])
   [junit4]   2> 440273 INFO  (zkCallback-398-thread-1-processing-n:127.0.0.1:45341_xh%2Fp) [n:127.0.0.1:45341_xh%2Fp    ] o.a.s.c.c.ZkStateReader A cluster state change: [WatchedEvent state:SyncConnected type:NodeDataChanged path:/collections/collection1/state.json] for collection [collection1] has occurred - updating... (live nodes size: [3])
   [junit4]   2> 440322 INFO  (qtp20678736-2672) [n:127.0.0.1:45341_xh%2Fp c:collection1 s:shard1  x:collection1_shard1_replica_t43] o.a.s.c.ZkController I am the leader, no recovery necessary
   [junit4]   2> 440323 INFO  (qtp20678736-2672) [n:127.0.0.1:45341_xh%2Fp c:collection1 s:shard1  x:collection1_shard1_replica_t43] o.a.s.s.HttpSolrCall [admin] webapp=null path=/admin/cores params={qt=/admin/cores&collection.configName=conf1&name=collection1_shard1_replica_t43&action=CREATE&collection=collection1&shard=shard1&wt=javabin&version=2&replicaType=TLOG} status=0 QTime=1350
   [junit4]   2> 440327 INFO  (qtp20678736-2670) [n:127.0.0.1:45341_xh%2Fp    ] o.a.s.s.HttpSolrCall [admin] webapp=null path=/admin/collections params={node=127.0.0.1:45341_xh%252Fp&action=ADDREPLICA&collection=collection1&shard=shard1&type=TLOG&wt=javabin&version=2} status=0 QTime=1358
   [junit4]   2> 440416 INFO  (TEST-HttpPartitionTest.test-seed#[81332594CF3169AA]) [    ] o.a.s.c.AbstractFullDistribZkTestBase create jetty 3 in directory /home/jenkins/workspace/Lucene-Solr-master-Linux/solr/build/solr-core/test/J2/temp/solr.cloud.HttpPartitionTest_81332594CF3169AA-001/shard-3-001 of type TLOG
   [junit4]   2> 440416 INFO  (TEST-HttpPartitionTest.test-seed#[81332594CF3169AA]) [    ] o.e.j.s.Server jetty-9.3.20.v20170531
   [junit4]   2> 440417 INFO  (TEST-HttpPartitionTest.test-seed#[81332594CF3169AA]) [    ] o.e.j.s.h.ContextHandler Started o.e.j.s.ServletContextHandler@fb2107{/xh/p,null,AVAILABLE}
   [junit4]   2> 440417 INFO  (TEST-HttpPartitionTest.test-seed#[81332594CF3169AA]) [    ] o.e.j.s.AbstractConnector Started ServerConnector@a12fad{HTTP/1.1,[http/1.1]}{127.0.0.1:32865}
   [junit4]   2> 440417 INFO  (TEST-HttpPartitionTest.test-seed#[81332594CF3169AA]) [    ] o.e.j.s.Server Started @441354ms
   [junit4]   2> 440418 INFO  (TEST-HttpPartitionTest.test-seed#[81332594CF3169AA]) [    ] o.a.s.c.s.e.JettySolrRunner Jetty properties: {solr.data.dir=/home/jenkins/workspace/Lucene-Solr-master-Linux/solr/build/solr-core/test/J2/temp/solr.cloud.HttpPartitionTest_81332594CF3169AA-001/tempDir-001/jetty3, replicaType=TLOG, solrconfig=solrconfig.xml, hostContext=/xh/p, hostPort=35321, coreRootDirectory=/home/jenkins/workspace/Lucene-Solr-master-Linux/solr/build/solr-core/test/J2/temp/solr.cloud.HttpPartitionTest_81332594CF3169AA-001/shard-3-001/cores}
   [junit4]   2> 440418 ERROR (TEST-HttpPartitionTest.test-seed#[81332594CF3169AA]) [    ] o.a.s.u.StartupLoggingUtils Missing Java Option solr.log.dir. Logging may be missing or incomplete.
   [junit4]   2> 440418 INFO  (TEST-HttpPartitionTest.test-seed#[81332594CF3169AA]) [    ] o.a.s.s.SolrDispatchFilter  ___      _       Welcome to Apache Solr? version 8.0.0
   [junit4]   2> 440418 INFO  (TEST-HttpPartitionTest.test-seed#[81332594CF3169AA]) [    ] o.a.s.s.SolrDispatchFilter / __| ___| |_ _   Starting in cloud mode on port null
   [junit4]   2> 440418 INFO  (TEST-HttpPartitionTest.test-seed#[81332594CF3169AA]) [    ] o.a.s.s.SolrDispatchFilter \__ \/ _ \ | '_|  Install dir: null, Default config dir: null
   [junit4]   2> 440418 INFO  (TEST-HttpPartitionTest.test-seed#[81332594CF3169AA]) [    ] o.a.s.s.SolrDispatchFilter |___/\___/_|_|    Start time: 2017-08-22T11:59:36.984Z
   [junit4]   2> 440420 INFO  (TEST-HttpPartitionTest.test-seed#[81332594CF3169AA]) [    ] o.a.s.s.SolrDispatchFilter Loading solr.xml from SolrHome (not found in ZooKeeper)
   [junit4]   2> 440420 INFO  (TEST-HttpPartitionTest.test-seed#[81332594CF3169AA]) [    ] o.a.s.c.SolrXmlConfig Loading container configuration from /home/jenkins/workspace/Lucene-Solr-master-Linux/solr/build/solr-core/test/J2/temp/solr.cloud.HttpPartitionTest_81332594CF3169AA-001/shard-3-001/solr.xml
   [junit4]   2> 440424 INFO  (TEST-HttpPartitionTest.test-seed#[81332594CF3169AA]) [    ] o.a.s.c.SolrXmlConfig MBean server found: com.sun.jmx.mbeanserver.JmxMBeanServer@e269fa, but no JMX reporters were configured - adding default JMX reporter.
   [junit4]   2> 440426 INFO  (TEST-HttpPartitionTest.test-seed#[81332594CF3169AA]) [    ] o.a.s.c.ZkContainer Zookeeper client=127.0.0.1:37945/solr
   [junit4]   2> 440426 INFO  (zkCallback-392-thread-1-processing-n:127.0.0.1:44687_xh%2Fp) [n:127.0.0.1:44687_xh%2Fp    ] o.a.s.c.c.ZkStateReader A cluster state change: [WatchedEvent state:SyncConnected type:NodeDataChanged path:/collections/collection1/state.json] for collection [collection1] has occurred - updating... (live nodes size: [3])
   [junit4]   2> 440426 INFO  (zkCallback-398-thread-1-processing-n:127.0.0.1:45341_xh%2Fp) [n:127.0.0.1:45341_xh%2Fp    ] o.a.s.c.c.ZkStateReader A cluster state change: [WatchedEvent state:SyncConnected type:NodeDataChanged path:/collections/collection1/state.json] for collection [collection1] has occurred - updating... (live nodes size: [3])
   [junit4]   2> 440432 INFO  (TEST-HttpPartitionTest.test-seed#[81332594CF3169AA]) [n:127.0.0.1:35321_xh%2Fp    ] o.a.s.c.c.ZkStateReader Updated live nodes from ZooKeeper... (0) -> (3)
   [junit4]   2> 440432 INFO  (TEST-HttpPartitionTest.test-seed#[81332594CF3169AA]) [n:127.0.0.1:35321_xh%2Fp    ] o.a.s.c.Overseer Overseer (id=null) closing
   [junit4]   2> 440434 INFO  (TEST-HttpPartitionTest.test-seed#[81332594CF3169AA]) [n:127.0.0.1:35321_xh%2Fp    ] o.a.s.c.ZkController Register node as live in ZooKeeper:/live_nodes/127.0.0.1:35321_xh%2Fp
   [junit4]   2> 440434 INFO  (zkCallback-387-thread-1) [    ] o.a.s.c.c.ZkStateReader Updated live nodes from ZooKeeper... (3) -> (4)
   [junit4]   2> 440434 INFO  (zkCallback-380-thread-2-processing-n:127.0.0.1:37257_xh%2Fp) [n:127.0.0.1:37257_xh%2Fp    ] o.a.s.c.c.ZkStateReader Updated live nodes from ZooKeeper... (3) -> (4)
   [junit4]   2> 440434 INFO  (zkCallback-398-thread-1-processing-n:127.0.0.1:45341_xh%2Fp) [n:127.0.0.1:45341_xh%2Fp    ] o.a.s.c.c.ZkStateReader Updated live nodes from ZooKeeper... (3) -> (4)
   [junit4]   2> 440434 INFO  (zkCallback-392-thread-1-processing-n:127.0.0.1:44687_xh%2Fp) [n:127.0.0.1:44687_xh%2Fp    ] o.a.s.c.c.ZkStateReader Updated live nodes from ZooKeeper... (3) -> (4)
   [junit4]   2> 440435 INFO  (zkCallback-404-thread-1-processing-n:127.0.0.1:35321_xh%2Fp) [n:127.0.0.1:35321_xh%2Fp    ] o.a.s.c.c.ZkStateReader Updated live nodes from ZooKeeper... (3) -> (4)
   [junit4]   2> 440715 INFO  (TEST-HttpPartitionTest.test-seed#[81332594CF3169AA]) [n:127.0.0.1:35321_xh%2Fp    ] o.a.s.m.r.SolrJmxReporter JMX monitoring for 'solr.node' (registry 'solr.node') enabled at server: com.sun.jmx.mbeanserver.JmxMBeanServer@e269fa
   [junit4]   2> 440725 INFO  (TEST-HttpPartitionTest.test-seed#[81332594CF3169AA]) [n:127.0.0.1:35321_xh%2Fp    ] o.a.s.m.r.SolrJmxReporter JMX monitoring for 'solr.jvm' (registry 'solr.jvm') enabled at server: com.sun.jmx.mbeanserver.JmxMBeanServer@e269fa
   [junit4]   2> 440725 INFO  (TEST-HttpPartitionTest.test-seed#[81332594CF3169AA]) [n:127.0.0.1:35321_xh%2Fp    ] o.a.s.m.r.SolrJmxReporter JMX monitoring for 'solr.jetty' (registry 'solr.jetty') enabled at server: com.sun.jmx.mbeanserver.JmxMBeanServer@e269fa
   [junit4]   2> 440727 INFO  (TEST-HttpPartitionTest.test-seed#[81332594CF3169AA]) [n:127.0.0.1:35321_xh%2Fp    ] o.a.s.c.CorePropertiesLocator Found 0 core definitions underneath /home/jenkins/workspace/Lucene-Solr-master-Linux/solr/build/solr-core/test/J2/temp/solr.cloud.HttpPartitionTest_81332594CF3169AA-001/shard-3-001/cores
   [junit4]   2> 440783 INFO  (qtp20678736-2671) [n:127.0.0.1:45341_xh%2Fp    ] o.a.s.h.a.CollectionsHandler Invoked Collection Action :addreplica with params node=127.0.0.1:35321_xh%252Fp&action=ADDREPLICA&collection=collection1&shard=shard2&type=TLOG&wt=javabin&version=2 and sendToOCPQueue=true
   [junit4]   2> 440784 INFO  (OverseerCollectionConfigSetProcessor-98527030165831684-127.0.0.1:37257_xh%2Fp-n_0000000000) [n:127.0.0.1:37257_xh%2Fp    ] o.a.s.c.OverseerTaskQueue Response ZK path: /overseer/collection-queue-work/qnr-0000000006 doesn't exist.  Requestor may have disconnected from ZooKeeper
   [junit4]   2> 440785 INFO  (OverseerThreadFactory-970-thread-5-processing-n:127.0.0.1:37257_xh%2Fp) [n:127.0.0.1:37257_xh%2Fp    ] o.a.s.c.AddReplicaCmd Node Identified 127.0.0.1:35321_xh%2Fp for creating new replica
   [junit4]   2> 440786 INFO  (SocketProxy-Acceptor-35321) [    ] o.a.s.c.SocketProxy accepted Socket[addr=/127.0.0.1,port=50048,localport=35321], receiveBufferSize:531000
   [junit4]   2> 440788 INFO  (SocketProxy-Acceptor-35321) [    ] o.a.s.c.SocketProxy proxy connection Socket[addr=/127.0.0.1,port=32865,localport=52032], receiveBufferSize=530904
   [junit4]   2> 440789 INFO  (qtp5319492-2705) [n:127.0.0.1:35321_xh%2Fp    ] o.a.s.h.a.CoreAdminOperation core create command qt=/admin/cores&collection.configName=conf1&name=collection1_shard2_replica_t45&action=CREATE&collection=collection1&shard=shard2&wt=javabin&version=2&replicaType=TLOG
   [junit4]   2> 440789 INFO  (qtp5319492-2705) [n:127.0.0.1:35321_xh%2Fp    ] o.a.s.c.TransientSolrCoreCacheDefault Allocating transient cache for 4 transient cores
   [junit4]   2> 440893 INFO  (zkCallback-392-thread-1-processing-n:127.0.0.1:44687_xh%2Fp) [n:127.0.0.1:44687_xh%2Fp    ] o.a.s.c.c.ZkStateReader A cluster state change: [WatchedEvent state:SyncConnected type:NodeDataChanged path:/collections/collection1/state.json] for collection [collection1] has occurred - updating... (live nodes size: [4])
   [junit4]   2> 440893 INFO  (zkCallback-398-thread-1-processing-n:127.0.0.1:45341_xh%2Fp) [n:127.0.0.1:45341_xh%2Fp    ] o.a.s.c.c.ZkStateReader A cluster state change: [WatchedEvent state:SyncConnected type:NodeDataChanged path:/collections/collection1/state.json] for collection [collection1] has occurred - updating... (live nodes size: [4])
   [junit4]   2> 440893 INFO  (zkCallback-404-thread-1-processing-n:127.0.0.1:35321_xh%2Fp) [n:127.0.0.1:35321_xh%2Fp    ] o.a.s.c.c.ZkStateReader A cluster state change: [WatchedEvent state:SyncConnected type:NodeDataChanged path:/collections/collection1/state.json] for collection [collection1] has occurred - updating... (live nodes size: [4])
   [junit4]   2> 441827 INFO  (qtp5319492-2705) [n:127.0.0.1:35321_xh%2Fp c:collection1 s:shard2  x:collection1_shard2_replica_t45] o.a.s.c.SolrConfig Using Lucene MatchVersion: 8.0.0
   [junit4]   2> 441846 INFO  (qtp5319492-2705) [n:127.0.0.1:35321_xh%2Fp c:collection1 s:shard2  x:collection1_shard2_replica_t45] o.a.s.s.IndexSchema [collection1_shard2_replica_t45] Schema name=test
   [junit4]   2> 441939 INFO  (qtp5319492-2705) [n:127.0.0.1:35321_xh%2Fp c:collection1 s:shard2  x:collection1_shard2_replica_t45] o.a.s.s.IndexSchema Loaded schema test/1.0 with uniqueid field id
   [junit4]   2> 441951 INFO  (qtp5319492-2705) [n:127.0.0.1:35321_xh%2Fp c:collection1 s:shard2  x:collection1_shard2_replica_t45] o.a.s.c.CoreContainer Creating SolrCore 'collection1_shard2_replica_t45' using configuration from collection collection1, trusted=true
   [junit4]   2> 441952 INFO  (qtp5319492-2705) [n:127.0.0.1:35321_xh%2Fp c:collection1 s:shard2  x:collection1_shard2_replica_t45] o.a.s.m.r.SolrJmxReporter JMX monitoring for 'solr.core.collection1.shard2.replica_t45' (registry 'solr.core.collection1.shard2.replica_t45') enabled at server: com.sun.jmx.mbeanserver.JmxMBeanServer@e269fa
   [junit4]   2> 441952 INFO  (qtp5319492-2705) [n:127.0.0.1:35321_xh%2Fp c:collection1 s:shard2  x:collection1_shard2_replica_t45] o.a.s.c.SolrCore solr.RecoveryStrategy.Builder
   [junit4]   2> 441952 INFO  (qtp5319492-2705) [n:127.0.0.1:35321_xh%2Fp c:collection1 s:shard2  x:collection1_shard2_replica_t45] o.a.s.c.SolrCore [[collection1_shard2_replica_t45] ] Opening new SolrCore at [/home/jenkins/workspace/Lucene-Solr-master-Linux/solr/build/solr-core/test/J2/temp/solr.cloud.HttpPartitionTest_81332594CF3169AA-001/shard-3-001/cores/collection1_shard2_replica_t45], dataDir=[/home/jenkins/workspace/Lucene-Solr-master-Linux/solr/build/solr-core/test/J2/temp/solr.cloud.HttpPartitionTest_81332594CF3169AA-001/shard-3-001/cores/collection1_shard2_replica_t45/data/]
   [junit4]   2> 441954 INFO  (qtp5319492-2705) [n:127.0.0.1:35321_xh%2Fp c:collection1 s:shard2  x:collection1_shard2_replica_t45] o.a.s.u.RandomMergePolicy RandomMergePolicy wrapping class org.apache.lucene.index.LogDocMergePolicy: [LogDocMergePolicy: minMergeSize=1000, mergeFactor=48, maxMergeSize=9223372036854775807, maxMergeSizeForForcedMerge=9223372036854775807, calibrateSizeByDeletes=true, maxMergeDocs=2147483647, maxCFSSegmentSizeMB=8.796093022207999E12, noCFSRatio=1.0]
   [junit4]   2> 441963 WARN  (qtp5319492-2705) [n:127.0.0.1:35321_xh%2Fp c:collection1 s:shard2  x:collection1_shard2_replica_t45] o.a.s.c.RequestHandlers INVALID paramSet a in requestHandler {type = requestHandler,name = /dump,class = DumpRequestHandler,attributes = {initParams=a, name=/dump, class=DumpRequestHandler},args = {defaults={a=A,b=B}}}
   [junit4]   2> 442002 INFO  (qtp5319492-2705) [n:127.0.0.1:35321_xh%2Fp c:collection1 s:shard2  x:collection1_shard2_replica_t45] o.a.s.u.UpdateHandler Using UpdateLog implementation: org.apache.solr.update.UpdateLog
   [junit4]   2> 442002 INFO  (qtp5319492-2705) [n:127.0.0.1:35321_xh%2Fp c:collection1 s:shard2  x:collection1_shard2_replica_t45] o.a.s.u.UpdateLog Initializing UpdateLog: dataDir= defaultSyncLevel=FLUSH numRecordsToKeep=100 maxNumLogsToKeep=10 numVersionBuckets=65536
   [junit4]   2> 442003 INFO  (qtp5319492-2705) [n:127.0.0.1:35321_xh%2Fp c:collection1 s:shard2  x:collection1_shard2_replica_t45] o.a.s.u.CommitTracker Hard AutoCommit: disabled
   [junit4]   2> 442003 INFO  (qtp5319492-2705) [n:127.0.0.1:35321_xh%2Fp c:collection1 s:shard2  x:collection1_shard2_replica_t45] o.a.s.u.CommitTracker Soft AutoCommit: disabled
   [junit4]   2> 442004 INFO  (qtp5319492-2705) [n:127.0.0.1:35321_xh%2Fp c:collection1 s:shard2  x:collection1_shard2_replica_t45] o.a.s.u.RandomMergePolicy RandomMergePolicy wrapping class org.apache.lucene.index.TieredMergePolicy: [TieredMergePolicy: maxMergeAtOnce=34, maxMergeAtOnceExplicit=33, maxMergedSegmentMB=1.6982421875, floorSegmentMB=1.0224609375, forceMergeDeletesPctAllowed=24.595564567763446, segmentsPerTier=36.0, maxCFSSegmentSizeMB=0.6201171875, noCFSRatio=0.20630070084716712
   [junit4]   2> 442004 INFO  (qtp5319492-2705) [n:127.0.0.1:35321_xh%2Fp c:collection1 s:shard2  x:collection1_shard2_replica_t45] o.a.s.s.SolrIndexSearcher Opening [Searcher@1df750c[collection1_shard2_replica_t45] main]
   [junit4]   2> 442005 INFO  (qtp5319492-2705) [n:127.0.0.1:35321_xh%2Fp c:collection1 s:shard2  x:collection1_shard2_replica_t45] o.a.s.r.ManagedResourceStorage Configured ZooKeeperStorageIO with znodeBase: /configs/conf1
   [junit4]   2> 442005 INFO  (qtp5319492-2705) [n:127.0.0.1:35321_xh%2Fp c:collection1 s:shard2  x:collection1_shard2_replica_t45] o.a.s.r.ManagedResourceStorage Loaded null at path _rest_managed.json using ZooKeeperStorageIO:path=/configs/conf1
   [junit4]   2> 442006 INFO  (qtp5319492-2705) [n:127.0.0.1:35321_xh%2Fp c:collection1 s:shard2  x:collection1_shard2_replica_t45] o.a.s.h.ReplicationHandler Commits will be reserved for  10000
   [junit4]   2> 442006 INFO  (qtp5319492-2705) [n:127.0.0.1:35321_xh%2Fp c:collection1 s:shard2  x:collection1_shard2_replica_t45] o.a.s.u.UpdateLog Could not find max version in index or recent updates, using new clock 1576432491374313472
   [junit4]   2> 442008 INFO  (searcherExecutor-1006-thread-1-processing-n:127.0.0.1:35321_xh%2Fp x:collection1_shard2_replica_t45 s:shard2 c:collection1) [n:127.0.0.1:35321_xh%2Fp c:collection1 s:shard2  x:collection1_shard2_replica_t45] o.a.s.c.SolrCore [collection1_shard2_replica_t45] Registered new searcher Searcher@1df750c[collection1_shard2_replica_t45] main{ExitableDirectoryReader(UninvertingDirectoryReader())}
   [junit4]   2> 442009 INFO  (qtp5319492-2705) [n:127.0.0.1:35321_xh%2Fp c:collection1 s:shard2  x:collection1_shard2_replica_t45] o.a.s.c.ZkController Core needs to recover:collection1_shard2_replica_t45
   [junit4]   2> 442009 INFO  (updateExecutor-401-thread-1-processing-n:127.0.0.1:35321_xh%2Fp x:collection1_shard2_replica_t45 s:shard2 c:collection1) [n:127.0.0.1:35321_xh%2Fp c:collection1 s:shard2 r:core_node46 x:collection1_shard2_replica_t45] o.a.s.u.DefaultSolrCoreState Running recovery
   [junit4]   2> 442009 INFO  (recoveryExecutor-402-thread-1-processing-n:127.0.0.1:35321_xh%2Fp x:collection1_shard2_replica_t45 s:shard2 c:collection1 r:core_node46) [n:127.0.0.1:35321_xh%2Fp c:collection1 s:shard2 r:core_node46 x:collection1_shard2_replica_t45] o.a.s.c.RecoveryStrategy Starting recovery process. recoveringAfterStartup=true
   [junit4]   2> 442009 INFO  (qtp5319492-2705) [n:127.0.0.1:35321_xh%2Fp c:collection1 s:shard2  x:collection1_shard2_replica_t45] o.a.s.s.HttpSolrCall [admin] webapp=null path=/admin/cores params={qt=/admin/cores&collection.configName=conf1&name=collection1_shard2_replica_t45&action=CREATE&collection=collection1&shard=shard2&wt=javabin&version=2&replicaType=TLOG} status=0 QTime=1220
   [junit4]   2> 442010 INFO  (recoveryExecutor-402-thread-1-processing-n:127.0.0.1:35321_xh%2Fp x:collection1_shard2_replica_t45 s:shard2 c:collection1 r:core_node46) [n:127.0.0.1:35321_xh%2Fp c:collection1 s:shard2 r:core_node46 x:collection1_shard2_replica_t45] o.a.s.c.RecoveryStrategy ###### startupVersions=[[]]
   [junit4]   2> 442010 INFO  (recoveryExecutor-402-thread-1-processing-n:127.0.0.1:35321_xh%2Fp x:collection1_shard2_replica_t45 s:shard2 c:collection1 r:core_node46) [n:127.0.0.1:35321_xh%2Fp c:collection1 s:shard2 r:core_node46 x:collection1_shard2_replica_t45] o.a.s.c.ZkController collection1_shard2_replica_t45 stopping background replication from leader
   [junit4]   2> 442010 INFO  (recoveryExecutor-402-thread-1-processing-n:127.0.0.1:35321_xh%2Fp x:collection1_shard2_replica_t45 s:shard2 c:collection1 r:core_node46) [n:127.0.0.1:35321_xh%2Fp c:collection1 s:shard2 r:core_node46 x:collection1_shard2_replica_t45] o.a.s.c.RecoveryStrategy Begin buffering updates. core=[collection1_shard2_replica_t45]
   [junit4]   2> 442010 INFO  (recoveryExecutor-402-thread-1-processing-n:127.0.0.1:35321_xh%2Fp x:collection1_shard2_replica_t45 s:shard2 c:collection1 r:core_node46) [n:127.0.0.1:35321_xh%2Fp c:collection1 s:shard2 r:core_node46 x:collection1_shard2_replica_t45] o.a.s.u.UpdateLog Starting to buffer updates. FSUpdateLog{state=ACTIVE, tlog=null}
   [junit4]   2> 442010 INFO  (recoveryExecutor-402-thread-1-processing-n:127.0.0.1:35321_xh%2Fp x:collection1_shard2_replica_t45 s:shard2 c:collection1 r:core_node46) [n:127.0.0.1:35321_xh%2Fp c:collection1 s:shard2 r:core_node46 x:collection1_shard2_replica_t45] o.a.s.c.RecoveryStrategy Publishing state of core [collection1_shard2_replica_t45] as recovering, leader is [http://127.0.0.1:44687/xh/p/collection1_shard2_replica_t41/] and I am [http://127.0.0.1:35321/xh/p/collection1_shard2_replica_t45/]
   [junit4]   2> 442012 INFO  (qtp20678736-2671) [n:127.0.0.1:45341_xh%2Fp    ] o.a.s.s.HttpSolrCall [admin] webapp=null path=/admin/collections params={node=127.0.0.1:35321_xh%252Fp&action=ADDREPLICA&collection=collection1&shard=shard2&type=TLOG&wt=javabin&version=2} status=0 QTime=1229
   [junit4]   2> 442012 INFO  (recoveryExecutor-402-thread-1-processing-n:127.0.0.1:35321_xh%2Fp x:collection1_shard2_replica_t45 s:shard2 c:collection1 r:core_node46) [n:127.0.0.1:35321_xh%2Fp c:collection1 s:shard2 r:core_node46 x:collection1_shard2_replica_t45] o.a.s.c.RecoveryStrategy Sending prep recovery command to [http://127.0.0.1:44687/xh/p]; [WaitForState: action=PREPRECOVERY&core=collection1_shard2_replica_t41&nodeName=127.0.0.1:35321_xh%252Fp&coreNodeName=core_node46&state=recovering&checkLive=true&onlyIfLeader=true&onlyIfLeaderActive=true]
   [junit4]   2> 442012 INFO  (SocketProxy-Acceptor-44687) [    ] o.a.s.c.SocketProxy accepted Socket[addr=/127.0.0.1,port=53082,localport=44687], receiveBufferSize:531000
   [junit4]   2> 442013 INFO  (SocketProxy-Acceptor-44687) [    ] o.a.s.c.SocketProxy proxy connection Socket[addr=/127.0.0.1,port=35763,localport=40436], receiveBufferSize=530904
   [junit4]   2> 442013 INFO  (qtp13401326-2640) [n:127.0.0.1:44687_xh%2Fp    ] o.a.s.h.a.PrepRecoveryOp Going to wait for coreNodeName: core_node46, state: recovering, checkLive: true, onlyIfLeader: true, onlyIfLeaderActive: true, maxTime: 183 s
   [junit4]   2> 442013 INFO  (qtp13401326-2640) [n:127.0.0.1:44687_xh%2Fp    ] o.a.s.h.a.PrepRecoveryOp In WaitForState(recovering): collection=collection1, shard=shard2, thisCore=collection1_shard2_replica_t41, leaderDoesNotNeedRecovery=false, isLeader? true, live=true, checkLive=true, currentState=down, localState=active, nodeName=127.0.0.1:35321_xh%2Fp, coreNodeName=core_node46, onlyIfActiveCheckResult=false, nodeProps: core_node46:{"core":"collection1_shard2_replica_t45","base_url":"http://127.0.0.1:35321/xh/p","node_name":"127.0.0.1:35321_xh%2Fp","state":"down","type":"TLOG"}
   [junit4]   2> 442014 INFO  (TEST-HttpPartitionTest.test-seed#[81332594CF3169AA]) [    ] o.a.s.SolrTestCaseJ4 ###Starting test
   [junit4]   2> 442014 INFO  (TEST-HttpPartitionTest.test-seed#[81332594CF3169AA]) [    ] o.a.s.c.AbstractFullDistribZkTestBase Wait for recoveries to finish - wait 30000 for each attempt
   [junit4]   2> 442014 INFO  (TEST-HttpPartitionTest.test-seed#[81332594CF3169AA]) [    ] o.a.s.c.AbstractDistribZkTestBase Wait for recoveries to finish - collection: collection1 failOnTimeout:true timeout (sec):30000
   [junit4]   2> 442113 INFO  (zkCallback-398-thread-1-processing-n:127.0.0.1:45341_xh%2Fp) [n:127.0.0.1:45341_xh%2Fp    ] o.a.s.c.c.ZkStateReader A cluster state change: [WatchedEvent state:SyncConnected type:NodeDataChanged path:/collections/collection1/state.json] for collection [collection1] has occurred - updating... (live nodes size: [4])
   [junit4]   2> 442113 INFO  (zkCallback-404-thread-1-processing-n:127.0.0.1:35321_xh%2Fp) [n:127.0.0.1:35321_xh%2Fp    ] o.a.s.c.c.ZkStateReader A cluster state change: [WatchedEvent state:SyncConnected type:NodeDataChanged path:/collections/collection1/state.json] for collection [collection1] has occurred - updating... (live nodes size: [4])
   [junit4]   2> 442113 INFO  (zkCallback-392-thread-1-processing-n:127.0.0.1:44687_xh%2Fp) [n:127.0.0.1:44687_xh%2Fp    ] o.a.s.c.c.ZkStateReader A cluster state change: [WatchedEvent state:SyncConnected type:NodeDataChanged path:/collections/collection1/state.json] for collection [collection1] has occurred - updating... (live nodes size: [4])
   [junit4]   2> 442785 INFO  (OverseerCollectionConfigSetProcessor-98527030165831684-127.0.0.1:37257_xh%2Fp-n_0000000000) [n:127.0.0.1:37257_xh%2Fp    ] o.a.s.c.OverseerTaskQueue Response ZK path: /overseer/collection-queue-work/qnr-0000000008 doesn't exist.  Requestor may have disconnected from ZooKeeper
   [junit4]   2> 443013 INFO  (qtp13401326-2640) [n:127.0.0.1:44687_xh%2Fp    ] o.a.s.h.a.PrepRecoveryOp In WaitForState(recovering): collection=collection1, shard=shard2, thisCore=collection1_shard2_replica_t41, leaderDoesNotNeedRecovery=false

[...truncated too long message...]

ate/delete watches above limit:
   [junit4]   2> 
   [junit4]   2> 	6	/solr/aliases.json
   [junit4]   2> 	4	/solr/security.json
   [junit4]   2> 	4	/solr/configs/conf1
   [junit4]   2> 
   [junit4]   2> Maximum concurrent data watches above limit:
   [junit4]   2> 
   [junit4]   2> 	6	/solr/clusterprops.json
   [junit4]   2> 	6	/solr/clusterstate.json
   [junit4]   2> 	3	/solr/collections/collection1/state.json
   [junit4]   2> 	3	/solr/collections/collMinRf_1x3/state.json
   [junit4]   2> 	2	/solr/collections/c8n_crud_1x2/state.json
   [junit4]   2> 
   [junit4]   2> Maximum concurrent children watches above limit:
   [junit4]   2> 
   [junit4]   2> 	6	/solr/live_nodes
   [junit4]   2> 	6	/solr/collections
   [junit4]   2> 	4	/solr/overseer/queue
   [junit4]   2> 	4	/solr/overseer/collection-queue-work
   [junit4]   2> 
   [junit4]   2> 468643 WARN  (TEST-HttpPartitionTest.test-seed#[81332594CF3169AA]) [    ] o.a.s.c.SocketProxy Closing 8 connections to: http://127.0.0.1:44687/xh/p, target: http://127.0.0.1:35763/xh/p
   [junit4]   2> 468643 WARN  (TEST-HttpPartitionTest.test-seed#[81332594CF3169AA]) [    ] o.a.s.c.SocketProxy Closing 9 connections to: http://127.0.0.1:37257/xh/p, target: http://127.0.0.1:37691/xh/p
   [junit4]   2> 468643 WARN  (TEST-HttpPartitionTest.test-seed#[81332594CF3169AA]) [    ] o.a.s.c.SocketProxy Closing 6 connections to: http://127.0.0.1:35321/xh/p, target: http://127.0.0.1:32865/xh/p
   [junit4]   2> 468643 WARN  (TEST-HttpPartitionTest.test-seed#[81332594CF3169AA]) [    ] o.a.s.c.SocketProxy Closing 2 connections to: http://127.0.0.1:45341/xh/p, target: http://127.0.0.1:37767/xh/p
   [junit4]   2> NOTE: reproduce with: ant test  -Dtestcase=HttpPartitionTest -Dtests.method=test -Dtests.seed=81332594CF3169AA -Dtests.multiplier=3 -Dtests.slow=true -Dtests.locale=de -Dtests.timezone=Asia/Colombo -Dtests.asserts=true -Dtests.file.encoding=ISO-8859-1
   [junit4] FAILURE 35.0s J2 | HttpPartitionTest.test <<<
   [junit4]    > Throwable #1: java.lang.AssertionError: Doc with id=1 not found in http://127.0.0.1:35321/xh/p/collMinRf_1x3 due to: Path not found: /id; rsp={doc=null}
   [junit4]    > 	at __randomizedtesting.SeedInfo.seed([81332594CF3169AA:9671A4E61CD0452]:0)
   [junit4]    > 	at org.apache.solr.cloud.HttpPartitionTest.assertDocExists(HttpPartitionTest.java:603)
   [junit4]    > 	at org.apache.solr.cloud.HttpPartitionTest.assertDocsExistInAllReplicas(HttpPartitionTest.java:558)
   [junit4]    > 	at org.apache.solr.cloud.HttpPartitionTest.testMinRf(HttpPartitionTest.java:249)
   [junit4]    > 	at org.apache.solr.cloud.HttpPartitionTest.test(HttpPartitionTest.java:127)
   [junit4]    > 	at org.apache.solr.BaseDistributedSearchTestCase$ShardsRepeatRule$ShardsFixedStatement.callStatement(BaseDistributedSearchTestCase.java:993)
   [junit4]    > 	at org.apache.solr.BaseDistributedSearchTestCase$ShardsRepeatRule$ShardsStatement.evaluate(BaseDistributedSearchTestCase.java:968)
   [junit4]    > 	at java.lang.Thread.run(Thread.java:748)
   [junit4]   2> NOTE: leaving temporary files on disk at: /home/jenkins/workspace/Lucene-Solr-master-Linux/solr/build/solr-core/test/J2/temp/solr.cloud.HttpPartitionTest_81332594CF3169AA-001
   [junit4]   2> NOTE: test params are: codec=Asserting(Lucene70): {multiDefault=PostingsFormat(name=LuceneVarGapFixedInterval), a_t=PostingsFormat(name=LuceneVarGapFixedInterval), id=Lucene50(blocksize=128), text=PostingsFormat(name=LuceneVarGapDocFreqInterval)}, docValues:{range_facet_l_dv=DocValuesFormat(name=Direct), _version_=DocValuesFormat(name=Memory), range_facet_i_dv=DocValuesFormat(name=Lucene70), intDvoDefault=DocValuesFormat(name=Direct), timestamp=DocValuesFormat(name=Lucene70)}, maxPointsInLeafNode=254, maxMBSortInHeap=7.202515039122083, sim=RandomSimilarity(queryNorm=true): {}, locale=de, timezone=Asia/Colombo
   [junit4]   2> NOTE: Linux 4.10.0-27-generic i386/Oracle Corporation 1.8.0_144 (32-bit)/cpus=8,threads=1,free=58276208,total=271183872
   [junit4]   2> NOTE: All tests run in this JVM: [TestLeaderElectionZkExpiry, NotRequiredUniqueKeyTest, URLClassifyProcessorTest, BlockJoinFacetSimpleTest, UtilsToolTest, SSLMigrationTest, FullSolrCloudDistribCmdsTest, HdfsChaosMonkeyNothingIsSafeTest, SolrCoreCheckLockOnStartupTest, CdcrVersionReplicationTest, TestLFUCache, TestAuthenticationFramework, TestSchemaSimilarityResource, MigrateRouteKeyTest, TestZkChroot, TestSimpleTextCodec, SolrJmxReporterTest, TestPerFieldSimilarityWithDefaultOverride, ResponseLogComponentTest, TestConfigSetImmutable, TestLegacyTerms, TestRandomFlRTGCloud, CollectionsAPIAsyncDistributedZkTest, RecoveryAfterSoftCommitTest, HttpSolrCallGetCoreTest, TestRestoreCore, TestJsonRequest, SimplePostToolTest, SortByFunctionTest, TestLegacyNumericRangeQueryBuilder, RecoveryZkTest, HttpPartitionTest]
   [junit4] Completed [113/731 (1!)] on J2 in 35.01s, 1 test, 1 failure <<< FAILURES!

[...truncated 1798 lines...]
   [junit4] Suite: org.apache.solr.metrics.reporters.SolrSlf4jReporterTest
   [junit4]   2> Creating dataDir: /home/jenkins/workspace/Lucene-Solr-master-Linux/solr/build/solr-core/test/J0/temp/solr.metrics.reporters.SolrSlf4jReporterTest_81332594CF3169AA-001/init-core-data-001
   [junit4]   2> 2838239 WARN  (SUITE-SolrSlf4jReporterTest-seed#[81332594CF3169AA]-worker) [    ] o.a.s.SolrTestCaseJ4 startTrackingSearchers: numOpens=44 numCloses=44
   [junit4]   2> NOTE: reproduce with: ant test  -Dtestcase=SolrSlf4jReporterTest -Dtests.method=testReporter -Dtests.seed=81332594CF3169AA -Dtests.multiplier=3 -Dtests.slow=true -Dtests.locale=de-LU -Dtests.timezone=Etc/Greenwich -Dtests.asserts=true -Dtests.file.encoding=ISO-8859-1
   [junit4] FAILURE 5.40s J0 | SolrSlf4jReporterTest.testReporter <<<
   [junit4]    > Throwable #1: java.lang.AssertionError
   [junit4]    > 	at __randomizedtesting.SeedInfo.seed([81332594CF3169AA:DED708A3A43DFAEF]:0)
   [junit4]    > 	at org.apache.solr.metrics.reporters.SolrSlf4jReporterTest.testReporter(SolrSlf4jReporterTest.java:74)
   [junit4]    > 	at java.lang.Thread.run(Thread.java:748)
   [junit4]   2> NOTE: leaving temporary files on disk at: /home/jenkins/workspace/Lucene-Solr-master-Linux/solr/build/solr-core/test/J0/temp/solr.metrics.reporters.SolrSlf4jReporterTest_81332594CF3169AA-001
   [junit4]   2> NOTE: test params are: codec=Asserting(Lucene70): {}, docValues:{}, maxPointsInLeafNode=318, maxMBSortInHeap=7.300867220801491, sim=RandomSimilarity(queryNorm=false): {}, locale=de-LU, timezone=Etc/Greenwich
   [junit4]   2> NOTE: Linux 4.10.0-27-generic i386/Oracle Corporation 1.8.0_144 (32-bit)/cpus=8,threads=1,free=151688992,total=496271360
   [junit4]   2> NOTE: All tests run in this JVM: [WrapperMergePolicyFactoryTest, TestAuthorizationFramework, LargeFieldTest, TestBadConfig, TestRealTimeGet, TestSolrConfigHandler, TestExpandComponent, TestWordDelimiterFilterFactory, TestReloadAndDeleteDocs, TestDFISimilarityFactory, TestFreeTextSuggestions, DistributedExpandComponentTest, TestDocBasedVersionConstraints, BadCopyFieldTest, TestRangeQuery, TestSolrCoreSnapshots, TestStreamBody, OverseerTaskQueueTest, TestInPlaceUpdatesDistrib, TestFastOutputStream, TestReloadDeadlock, VersionInfoTest, TestMiniSolrCloudClusterSSL, TestFaceting, TestMultiValuedNumericRangeQuery, TestLuceneMatchVersion, ZkFailoverTest, TestMaxScoreQueryParser, TestManagedStopFilterFactory, TestAnalyzeInfixSuggestions, TestCrossCoreJoin, LeaderInitiatedRecoveryOnCommitTest, SolrRequestParserTest, ExitableDirectoryReaderTest, BasicZkTest, TestSha256AuthenticationProvider, DocumentAnalysisRequestHandlerTest, SpellingQueryConverterTest, TestMergePolicyConfig, LeaderElectionContextKeyTest, TestConfigsApi, OutputWriterTest, TestRestManager, EchoParamsTest, RequestHandlersTest, SolrIndexConfigTest, TestHdfsCloudBackupRestore, TestNoOpRegenerator, TestQuerySenderNoQuery, AnalyticsMergeStrategyTest, CurrencyFieldTypeTest, RestartWhileUpdatingTest, PropertiesRequestHandlerTest, ForceLeaderTest, SynonymTokenizerTest, EnumFieldTest, TestSQLHandler, TestPHPSerializedResponseWriter, ZkNodePropsTest, TestExactSharedStatsCache, HdfsUnloadDistributedZkTest, TestRequestForwarding, SolrPluginUtilsTest, TestLazyCores, SolrCloudExampleTest, TestCloudPivotFacet, DistributedFacetPivotLongTailTest, SolrMetricReporterTest, TestDocSet, TestSolr4Spatial, SyncSliceTest, BinaryUpdateRequestHandlerTest, SharedFSAutoReplicaFailoverUtilsTest, SuggesterWFSTTest, ResponseHeaderTest, BlockDirectoryTest, TestManagedSchemaThreadSafety, TestPayloadScoreQParserPlugin, TestComplexPhraseLeadingWildcard, GraphQueryTest, TestLeaderInitiatedRecoveryThread, AssignBackwardCompatibilityTest, TestFieldSortValues, TestPullReplica, TestFunctionQuery, CleanupOldIndexTest, TestBackupRepositoryFactory, AddBlockUpdateTest, SolrGraphiteReporterTest, DeleteReplicaTest, TlogReplayBufferedWhileIndexingTest, CollectionsAPISolrJTest, TestLegacyFieldReuse, XmlUpdateRequestHandlerTest, TestSchemaVersionResource, TestNumericTokenStream, TestGraphMLResponseWriter, TestHashQParserPlugin, BasicAuthIntegrationTest, HdfsLockFactoryTest, StatsReloadRaceTest, CloudMLTQParserTest, V2StandaloneTest, TestDynamicFieldCollectionResource, TestFieldCacheReopen, TestIBSimilarityFactory, HdfsRecoverLeaseTest, BasicDistributedZkTest, TestSolrDeletionPolicy1, TestTrackingShardHandlerFactory, PluginInfoTest, TestCustomDocTransformer, HdfsSyncSliceTest, TestBinaryField, TestRandomRequestDistribution, TestShortCircuitedRequests, TestSolrCloudWithDelegationTokens, TestStressInPlaceUpdates, AutoScalingHandlerTest, HdfsBasicDistributedZk2Test, HdfsChaosMonkeySafeLeaderTest, HdfsNNFailoverTest, HdfsWriteToMultipleCollectionsTest, TestClusterStateMutator, ZkStateReaderTest, TestConfigOverlay, TestConfigSetProperties, TestCustomStream, TestConfigReload, TestSystemCollAutoCreate, DistributedSuggestComponentTest, SuggestComponentTest, SolrSlf4jReporterTest]
   [junit4] Completed [625/731 (2!)] on J0 in 5.45s, 1 test, 1 failure <<< FAILURES!

[...truncated 39689 lines...]

Mime
View raw message