lucene-dev mailing list archives

Site index · List index
Message view « Date » · « Thread »
Top « Date » · « Thread »
From Policeman Jenkins Server <jenk...@thetaphi.de>
Subject [JENKINS] Lucene-Solr-master-Windows (32bit/jdk1.8.0_144) - Build # 6813 - Still Unstable!
Date Thu, 10 Aug 2017 17:46:10 GMT
Build: https://jenkins.thetaphi.de/job/Lucene-Solr-master-Windows/6813/
Java: 32bit/jdk1.8.0_144 -server -XX:+UseG1GC

2 tests failed.
FAILED:  org.apache.solr.cloud.TestAuthenticationFramework.testBasics

Error Message:
Error from server at http://127.0.0.1:56355/solr/testcollection_shard1_replica_n2: Expected mime type application/octet-stream but got text/html. <html> <head> <meta http-equiv="Content-Type" content="text/html;charset=ISO-8859-1"/> <title>Error 404 </title> </head> <body> <h2>HTTP ERROR: 404</h2> <p>Problem accessing /solr/testcollection_shard1_replica_n2/update. Reason: <pre>    Can not find: /solr/testcollection_shard1_replica_n2/update</pre></p> <hr /><a href="http://eclipse.org/jetty">Powered by Jetty:// 9.3.14.v20161028</a><hr/> </body> </html> 

Stack Trace:
org.apache.solr.client.solrj.impl.CloudSolrClient$RouteException: Error from server at http://127.0.0.1:56355/solr/testcollection_shard1_replica_n2: Expected mime type application/octet-stream but got text/html. <html>
<head>
<meta http-equiv="Content-Type" content="text/html;charset=ISO-8859-1"/>
<title>Error 404 </title>
</head>
<body>
<h2>HTTP ERROR: 404</h2>
<p>Problem accessing /solr/testcollection_shard1_replica_n2/update. Reason:
<pre>    Can not find: /solr/testcollection_shard1_replica_n2/update</pre></p>
<hr /><a href="http://eclipse.org/jetty">Powered by Jetty:// 9.3.14.v20161028</a><hr/>
</body>
</html>

	at __randomizedtesting.SeedInfo.seed([D32CE2E6E52511C5:EEF44CCADDCB4FB5]:0)
	at org.apache.solr.client.solrj.impl.CloudSolrClient.directUpdate(CloudSolrClient.java:539)
	at org.apache.solr.client.solrj.impl.CloudSolrClient.sendRequest(CloudSolrClient.java:993)
	at org.apache.solr.client.solrj.impl.CloudSolrClient.requestWithRetryOnStaleState(CloudSolrClient.java:862)
	at org.apache.solr.client.solrj.impl.CloudSolrClient.request(CloudSolrClient.java:793)
	at org.apache.solr.client.solrj.SolrRequest.process(SolrRequest.java:178)
	at org.apache.solr.client.solrj.request.UpdateRequest.commit(UpdateRequest.java:233)
	at org.apache.solr.cloud.TestAuthenticationFramework.collectionCreateSearchDeleteTwice(TestAuthenticationFramework.java:126)
	at org.apache.solr.cloud.TestAuthenticationFramework.testBasics(TestAuthenticationFramework.java:74)
	at sun.reflect.NativeMethodAccessorImpl.invoke0(Native Method)
	at sun.reflect.NativeMethodAccessorImpl.invoke(NativeMethodAccessorImpl.java:62)
	at sun.reflect.DelegatingMethodAccessorImpl.invoke(DelegatingMethodAccessorImpl.java:43)
	at java.lang.reflect.Method.invoke(Method.java:498)
	at com.carrotsearch.randomizedtesting.RandomizedRunner.invoke(RandomizedRunner.java:1713)
	at com.carrotsearch.randomizedtesting.RandomizedRunner$8.evaluate(RandomizedRunner.java:907)
	at com.carrotsearch.randomizedtesting.RandomizedRunner$9.evaluate(RandomizedRunner.java:943)
	at com.carrotsearch.randomizedtesting.RandomizedRunner$10.evaluate(RandomizedRunner.java:957)
	at com.carrotsearch.randomizedtesting.rules.SystemPropertiesRestoreRule$1.evaluate(SystemPropertiesRestoreRule.java:57)
	at org.apache.lucene.util.TestRuleSetupTeardownChained$1.evaluate(TestRuleSetupTeardownChained.java:49)
	at org.apache.lucene.util.AbstractBeforeAfterRule$1.evaluate(AbstractBeforeAfterRule.java:45)
	at org.apache.lucene.util.TestRuleThreadAndTestName$1.evaluate(TestRuleThreadAndTestName.java:48)
	at org.apache.lucene.util.TestRuleIgnoreAfterMaxFailures$1.evaluate(TestRuleIgnoreAfterMaxFailures.java:64)
	at org.apache.lucene.util.TestRuleMarkFailure$1.evaluate(TestRuleMarkFailure.java:47)
	at com.carrotsearch.randomizedtesting.rules.StatementAdapter.evaluate(StatementAdapter.java:36)
	at com.carrotsearch.randomizedtesting.ThreadLeakControl$StatementRunner.run(ThreadLeakControl.java:368)
	at com.carrotsearch.randomizedtesting.ThreadLeakControl.forkTimeoutingTask(ThreadLeakControl.java:817)
	at com.carrotsearch.randomizedtesting.ThreadLeakControl$3.evaluate(ThreadLeakControl.java:468)
	at com.carrotsearch.randomizedtesting.RandomizedRunner.runSingleTest(RandomizedRunner.java:916)
	at com.carrotsearch.randomizedtesting.RandomizedRunner$5.evaluate(RandomizedRunner.java:802)
	at com.carrotsearch.randomizedtesting.RandomizedRunner$6.evaluate(RandomizedRunner.java:852)
	at com.carrotsearch.randomizedtesting.RandomizedRunner$7.evaluate(RandomizedRunner.java:863)
	at com.carrotsearch.randomizedtesting.rules.StatementAdapter.evaluate(StatementAdapter.java:36)
	at com.carrotsearch.randomizedtesting.rules.SystemPropertiesRestoreRule$1.evaluate(SystemPropertiesRestoreRule.java:57)
	at org.apache.lucene.util.AbstractBeforeAfterRule$1.evaluate(AbstractBeforeAfterRule.java:45)
	at com.carrotsearch.randomizedtesting.rules.StatementAdapter.evaluate(StatementAdapter.java:36)
	at org.apache.lucene.util.TestRuleStoreClassName$1.evaluate(TestRuleStoreClassName.java:41)
	at com.carrotsearch.randomizedtesting.rules.NoShadowingOrOverridesOnMethodsRule$1.evaluate(NoShadowingOrOverridesOnMethodsRule.java:40)
	at com.carrotsearch.randomizedtesting.rules.NoShadowingOrOverridesOnMethodsRule$1.evaluate(NoShadowingOrOverridesOnMethodsRule.java:40)
	at com.carrotsearch.randomizedtesting.rules.StatementAdapter.evaluate(StatementAdapter.java:36)
	at com.carrotsearch.randomizedtesting.rules.StatementAdapter.evaluate(StatementAdapter.java:36)
	at com.carrotsearch.randomizedtesting.rules.StatementAdapter.evaluate(StatementAdapter.java:36)
	at org.apache.lucene.util.TestRuleAssertionsRequired$1.evaluate(TestRuleAssertionsRequired.java:53)
	at org.apache.lucene.util.TestRuleMarkFailure$1.evaluate(TestRuleMarkFailure.java:47)
	at org.apache.lucene.util.TestRuleIgnoreAfterMaxFailures$1.evaluate(TestRuleIgnoreAfterMaxFailures.java:64)
	at org.apache.lucene.util.TestRuleIgnoreTestSuites$1.evaluate(TestRuleIgnoreTestSuites.java:54)
	at com.carrotsearch.randomizedtesting.rules.StatementAdapter.evaluate(StatementAdapter.java:36)
	at com.carrotsearch.randomizedtesting.ThreadLeakControl$StatementRunner.run(ThreadLeakControl.java:368)
	at java.lang.Thread.run(Thread.java:748)
Caused by: org.apache.solr.client.solrj.impl.HttpSolrClient$RemoteSolrException: Error from server at http://127.0.0.1:56355/solr/testcollection_shard1_replica_n2: Expected mime type application/octet-stream but got text/html. <html>
<head>
<meta http-equiv="Content-Type" content="text/html;charset=ISO-8859-1"/>
<title>Error 404 </title>
</head>
<body>
<h2>HTTP ERROR: 404</h2>
<p>Problem accessing /solr/testcollection_shard1_replica_n2/update. Reason:
<pre>    Can not find: /solr/testcollection_shard1_replica_n2/update</pre></p>
<hr /><a href="http://eclipse.org/jetty">Powered by Jetty:// 9.3.14.v20161028</a><hr/>
</body>
</html>

	at org.apache.solr.client.solrj.impl.HttpSolrClient.executeMethod(HttpSolrClient.java:591)
	at org.apache.solr.client.solrj.impl.HttpSolrClient.request(HttpSolrClient.java:253)
	at org.apache.solr.client.solrj.impl.HttpSolrClient.request(HttpSolrClient.java:242)
	at org.apache.solr.client.solrj.impl.LBHttpSolrClient.doRequest(LBHttpSolrClient.java:483)
	at org.apache.solr.client.solrj.impl.LBHttpSolrClient.request(LBHttpSolrClient.java:413)
	at org.apache.solr.client.solrj.impl.CloudSolrClient.lambda$directUpdate$0(CloudSolrClient.java:516)
	at java.util.concurrent.FutureTask.run(FutureTask.java:266)
	at org.apache.solr.common.util.ExecutorUtil$MDCAwareThreadPoolExecutor.lambda$execute$0(ExecutorUtil.java:188)
	at java.util.concurrent.ThreadPoolExecutor.runWorker(ThreadPoolExecutor.java:1149)
	at java.util.concurrent.ThreadPoolExecutor$Worker.run(ThreadPoolExecutor.java:624)
	... 1 more


FAILED:  junit.framework.TestSuite.org.apache.solr.cloud.ZkCLITest

Error Message:
Could not remove the following files (in the order of attempts):    C:\Users\jenkins\workspace\Lucene-Solr-master-Windows\solr\build\solr-core\test\J0\temp\solr.cloud.ZkCLITest_D32CE2E6E52511C5-001\tempDir-013\solrtest-confdropspot-org.apache.solr.cloud.ZkCLITest-99490656585004: java.nio.file.DirectoryNotEmptyException: C:\Users\jenkins\workspace\Lucene-Solr-master-Windows\solr\build\solr-core\test\J0\temp\solr.cloud.ZkCLITest_D32CE2E6E52511C5-001\tempDir-013\solrtest-confdropspot-org.apache.solr.cloud.ZkCLITest-99490656585004    C:\Users\jenkins\workspace\Lucene-Solr-master-Windows\solr\build\solr-core\test\J0\temp\solr.cloud.ZkCLITest_D32CE2E6E52511C5-001\tempDir-013: java.nio.file.DirectoryNotEmptyException: C:\Users\jenkins\workspace\Lucene-Solr-master-Windows\solr\build\solr-core\test\J0\temp\solr.cloud.ZkCLITest_D32CE2E6E52511C5-001\tempDir-013 

Stack Trace:
java.io.IOException: Could not remove the following files (in the order of attempts):
   C:\Users\jenkins\workspace\Lucene-Solr-master-Windows\solr\build\solr-core\test\J0\temp\solr.cloud.ZkCLITest_D32CE2E6E52511C5-001\tempDir-013\solrtest-confdropspot-org.apache.solr.cloud.ZkCLITest-99490656585004: java.nio.file.DirectoryNotEmptyException: C:\Users\jenkins\workspace\Lucene-Solr-master-Windows\solr\build\solr-core\test\J0\temp\solr.cloud.ZkCLITest_D32CE2E6E52511C5-001\tempDir-013\solrtest-confdropspot-org.apache.solr.cloud.ZkCLITest-99490656585004
   C:\Users\jenkins\workspace\Lucene-Solr-master-Windows\solr\build\solr-core\test\J0\temp\solr.cloud.ZkCLITest_D32CE2E6E52511C5-001\tempDir-013: java.nio.file.DirectoryNotEmptyException: C:\Users\jenkins\workspace\Lucene-Solr-master-Windows\solr\build\solr-core\test\J0\temp\solr.cloud.ZkCLITest_D32CE2E6E52511C5-001\tempDir-013

	at __randomizedtesting.SeedInfo.seed([D32CE2E6E52511C5]:0)
	at org.apache.lucene.util.IOUtils.rm(IOUtils.java:329)
	at org.apache.lucene.util.TestRuleTemporaryFilesCleanup.afterAlways(TestRuleTemporaryFilesCleanup.java:216)
	at com.carrotsearch.randomizedtesting.rules.TestRuleAdapter$1.afterAlways(TestRuleAdapter.java:31)
	at com.carrotsearch.randomizedtesting.rules.StatementAdapter.evaluate(StatementAdapter.java:43)
	at com.carrotsearch.randomizedtesting.rules.StatementAdapter.evaluate(StatementAdapter.java:36)
	at org.apache.lucene.util.TestRuleAssertionsRequired$1.evaluate(TestRuleAssertionsRequired.java:53)
	at org.apache.lucene.util.TestRuleMarkFailure$1.evaluate(TestRuleMarkFailure.java:47)
	at org.apache.lucene.util.TestRuleIgnoreAfterMaxFailures$1.evaluate(TestRuleIgnoreAfterMaxFailures.java:64)
	at org.apache.lucene.util.TestRuleIgnoreTestSuites$1.evaluate(TestRuleIgnoreTestSuites.java:54)
	at com.carrotsearch.randomizedtesting.rules.StatementAdapter.evaluate(StatementAdapter.java:36)
	at com.carrotsearch.randomizedtesting.ThreadLeakControl$StatementRunner.run(ThreadLeakControl.java:368)
	at java.lang.Thread.run(Thread.java:748)




Build Log:
[...truncated 11546 lines...]
   [junit4] Suite: org.apache.solr.cloud.TestAuthenticationFramework
   [junit4]   2> Creating dataDir: C:\Users\jenkins\workspace\Lucene-Solr-master-Windows\solr\build\solr-core\test\J1\temp\solr.cloud.TestAuthenticationFramework_D32CE2E6E52511C5-001\init-core-data-001
   [junit4]   2> 949082 WARN  (SUITE-TestAuthenticationFramework-seed#[D32CE2E6E52511C5]-worker) [    ] o.a.s.SolrTestCaseJ4 startTrackingSearchers: numOpens=2 numCloses=2
   [junit4]   2> 949082 INFO  (SUITE-TestAuthenticationFramework-seed#[D32CE2E6E52511C5]-worker) [    ] o.a.s.SolrTestCaseJ4 Using TrieFields (NUMERIC_POINTS_SYSPROP=false) w/NUMERIC_DOCVALUES_SYSPROP=false
   [junit4]   2> 949086 INFO  (SUITE-TestAuthenticationFramework-seed#[D32CE2E6E52511C5]-worker) [    ] o.a.s.SolrTestCaseJ4 Randomized ssl (false) and clientAuth (false) via: @org.apache.solr.util.RandomizeSSL(reason=, value=NaN, ssl=NaN, clientAuth=NaN)
   [junit4]   2> 949086 INFO  (SUITE-TestAuthenticationFramework-seed#[D32CE2E6E52511C5]-worker) [    ] o.a.s.SolrTestCaseJ4 SecureRandom sanity checks: test.solr.allowed.securerandom=null & java.security.egd=file:/dev/./urandom
   [junit4]   2> 949088 INFO  (TEST-TestAuthenticationFramework.testBasics-seed#[D32CE2E6E52511C5]) [    ] o.a.s.c.MiniSolrCloudCluster Starting cluster of 2 servers in C:\Users\jenkins\workspace\Lucene-Solr-master-Windows\solr\build\solr-core\test\J1\temp\solr.cloud.TestAuthenticationFramework_D32CE2E6E52511C5-001\tempDir-001
   [junit4]   2> 949088 INFO  (TEST-TestAuthenticationFramework.testBasics-seed#[D32CE2E6E52511C5]) [    ] o.a.s.c.ZkTestServer STARTING ZK TEST SERVER
   [junit4]   2> 949089 INFO  (Thread-1695) [    ] o.a.s.c.ZkTestServer client port:0.0.0.0/0.0.0.0:0
   [junit4]   2> 949089 INFO  (Thread-1695) [    ] o.a.s.c.ZkTestServer Starting server
   [junit4]   2> 949093 ERROR (Thread-1695) [    ] o.a.z.s.ZooKeeperServer ZKShutdownHandler is not registered, so ZooKeeper server won't take any action on ERROR or SHUTDOWN server state changes
   [junit4]   2> 949190 INFO  (TEST-TestAuthenticationFramework.testBasics-seed#[D32CE2E6E52511C5]) [    ] o.a.s.c.ZkTestServer start zk server on port:56350
   [junit4]   2> 949199 INFO  (jetty-launcher-1206-thread-1) [    ] o.e.j.s.Server jetty-9.3.14.v20161028
   [junit4]   2> 949199 INFO  (jetty-launcher-1206-thread-2) [    ] o.e.j.s.Server jetty-9.3.14.v20161028
   [junit4]   2> 949200 INFO  (jetty-launcher-1206-thread-1) [    ] o.e.j.s.h.ContextHandler Started o.e.j.s.ServletContextHandler@1c4df9b{/solr,null,AVAILABLE}
   [junit4]   2> 949200 INFO  (jetty-launcher-1206-thread-2) [    ] o.e.j.s.h.ContextHandler Started o.e.j.s.ServletContextHandler@301996{/solr,null,AVAILABLE}
   [junit4]   2> 949201 INFO  (jetty-launcher-1206-thread-2) [    ] o.e.j.s.AbstractConnector Started ServerConnector@ce5d75{HTTP/1.1,[http/1.1]}{127.0.0.1:56355}
   [junit4]   2> 949201 INFO  (jetty-launcher-1206-thread-1) [    ] o.e.j.s.AbstractConnector Started ServerConnector@8ffffc{HTTP/1.1,[http/1.1]}{127.0.0.1:56354}
   [junit4]   2> 949201 INFO  (jetty-launcher-1206-thread-2) [    ] o.e.j.s.Server Started @957190ms
   [junit4]   2> 949201 INFO  (jetty-launcher-1206-thread-1) [    ] o.e.j.s.Server Started @957190ms
   [junit4]   2> 949201 INFO  (jetty-launcher-1206-thread-2) [    ] o.a.s.c.s.e.JettySolrRunner Jetty properties: {hostContext=/solr, hostPort=56355}
   [junit4]   2> 949201 INFO  (jetty-launcher-1206-thread-1) [    ] o.a.s.c.s.e.JettySolrRunner Jetty properties: {hostContext=/solr, hostPort=56354}
   [junit4]   2> 949201 ERROR (jetty-launcher-1206-thread-2) [    ] o.a.s.s.StartupLoggingUtils Missing Java Option solr.log.dir. Logging may be missing or incomplete.
   [junit4]   2> 949201 ERROR (jetty-launcher-1206-thread-1) [    ] o.a.s.s.StartupLoggingUtils Missing Java Option solr.log.dir. Logging may be missing or incomplete.
   [junit4]   2> 949201 INFO  (jetty-launcher-1206-thread-2) [    ] o.a.s.s.SolrDispatchFilter  ___      _       Welcome to Apache Solr? version 8.0.0
   [junit4]   2> 949201 INFO  (jetty-launcher-1206-thread-1) [    ] o.a.s.s.SolrDispatchFilter  ___      _       Welcome to Apache Solr? version 8.0.0
   [junit4]   2> 949201 INFO  (jetty-launcher-1206-thread-2) [    ] o.a.s.s.SolrDispatchFilter / __| ___| |_ _   Starting in cloud mode on port null
   [junit4]   2> 949201 INFO  (jetty-launcher-1206-thread-1) [    ] o.a.s.s.SolrDispatchFilter / __| ___| |_ _   Starting in cloud mode on port null
   [junit4]   2> 949201 INFO  (jetty-launcher-1206-thread-2) [    ] o.a.s.s.SolrDispatchFilter \__ \/ _ \ | '_|  Install dir: null, Default config dir: null
   [junit4]   2> 949201 INFO  (jetty-launcher-1206-thread-1) [    ] o.a.s.s.SolrDispatchFilter \__ \/ _ \ | '_|  Install dir: null, Default config dir: null
   [junit4]   2> 949201 INFO  (jetty-launcher-1206-thread-2) [    ] o.a.s.s.SolrDispatchFilter |___/\___/_|_|    Start time: 2017-08-10T16:44:42.791Z
   [junit4]   2> 949201 INFO  (jetty-launcher-1206-thread-1) [    ] o.a.s.s.SolrDispatchFilter |___/\___/_|_|    Start time: 2017-08-10T16:44:42.791Z
   [junit4]   2> 949211 INFO  (jetty-launcher-1206-thread-1) [    ] o.a.s.s.SolrDispatchFilter solr.xml found in ZooKeeper. Loading...
   [junit4]   2> 949211 INFO  (jetty-launcher-1206-thread-2) [    ] o.a.s.s.SolrDispatchFilter solr.xml found in ZooKeeper. Loading...
   [junit4]   2> 949219 WARN  (NIOServerCxn.Factory:0.0.0.0/0.0.0.0:0) [    ] o.a.z.s.NIOServerCnxn caught end of stream exception
   [junit4]   2> EndOfStreamException: Unable to read additional data from client sessionid 0x15dcd08a73b0002, likely client has closed socket
   [junit4]   2> 	at org.apache.zookeeper.server.NIOServerCnxn.doIO(NIOServerCnxn.java:239)
   [junit4]   2> 	at org.apache.zookeeper.server.NIOServerCnxnFactory.run(NIOServerCnxnFactory.java:203)
   [junit4]   2> 	at java.lang.Thread.run(Thread.java:748)
   [junit4]   2> 949220 WARN  (NIOServerCxn.Factory:0.0.0.0/0.0.0.0:0) [    ] o.a.z.s.NIOServerCnxn caught end of stream exception
   [junit4]   2> EndOfStreamException: Unable to read additional data from client sessionid 0x15dcd08a73b0001, likely client has closed socket
   [junit4]   2> 	at org.apache.zookeeper.server.NIOServerCnxn.doIO(NIOServerCnxn.java:239)
   [junit4]   2> 	at org.apache.zookeeper.server.NIOServerCnxnFactory.run(NIOServerCnxnFactory.java:203)
   [junit4]   2> 	at java.lang.Thread.run(Thread.java:748)
   [junit4]   2> 949223 INFO  (jetty-launcher-1206-thread-2) [    ] o.a.s.c.ZkContainer Zookeeper client=127.0.0.1:56350/solr
   [junit4]   2> 949224 INFO  (jetty-launcher-1206-thread-1) [    ] o.a.s.c.ZkContainer Zookeeper client=127.0.0.1:56350/solr
   [junit4]   2> 949228 WARN  (NIOServerCxn.Factory:0.0.0.0/0.0.0.0:0) [    ] o.a.z.s.NIOServerCnxn caught end of stream exception
   [junit4]   2> EndOfStreamException: Unable to read additional data from client sessionid 0x15dcd08a73b0004, likely client has closed socket
   [junit4]   2> 	at org.apache.zookeeper.server.NIOServerCnxn.doIO(NIOServerCnxn.java:239)
   [junit4]   2> 	at org.apache.zookeeper.server.NIOServerCnxnFactory.run(NIOServerCnxnFactory.java:203)
   [junit4]   2> 	at java.lang.Thread.run(Thread.java:748)
   [junit4]   2> 949366 INFO  (jetty-launcher-1206-thread-2) [n:127.0.0.1:56355_solr    ] o.a.s.c.Overseer Overseer (id=null) closing
   [junit4]   2> 949366 INFO  (jetty-launcher-1206-thread-1) [n:127.0.0.1:56354_solr    ] o.a.s.c.Overseer Overseer (id=null) closing
   [junit4]   2> 949367 INFO  (jetty-launcher-1206-thread-2) [n:127.0.0.1:56355_solr    ] o.a.s.c.OverseerElectionContext I am going to be the leader 127.0.0.1:56355_solr
   [junit4]   2> 949367 INFO  (jetty-launcher-1206-thread-1) [n:127.0.0.1:56354_solr    ] o.a.s.c.ZkController Register node as live in ZooKeeper:/live_nodes/127.0.0.1:56354_solr
   [junit4]   2> 949368 INFO  (jetty-launcher-1206-thread-2) [n:127.0.0.1:56355_solr    ] o.a.s.c.Overseer Overseer (id=98460203921113093-127.0.0.1:56355_solr-n_0000000000) starting
   [junit4]   2> 949369 INFO  (zkCallback-1218-thread-1-processing-n:127.0.0.1:56354_solr) [n:127.0.0.1:56354_solr    ] o.a.s.c.c.ZkStateReader Updated live nodes from ZooKeeper... (0) -> (1)
   [junit4]   2> 949369 INFO  (zkCallback-1217-thread-1-processing-n:127.0.0.1:56355_solr) [n:127.0.0.1:56355_solr    ] o.a.s.c.c.ZkStateReader Updated live nodes from ZooKeeper... (0) -> (1)
   [junit4]   2> 949374 INFO  (jetty-launcher-1206-thread-2) [n:127.0.0.1:56355_solr    ] o.a.s.c.ZkController Register node as live in ZooKeeper:/live_nodes/127.0.0.1:56355_solr
   [junit4]   2> 949375 INFO  (zkCallback-1218-thread-1-processing-n:127.0.0.1:56354_solr) [n:127.0.0.1:56354_solr    ] o.a.s.c.c.ZkStateReader Updated live nodes from ZooKeeper... (1) -> (2)
   [junit4]   2> 949375 INFO  (zkCallback-1217-thread-1-processing-n:127.0.0.1:56355_solr) [n:127.0.0.1:56355_solr    ] o.a.s.c.c.ZkStateReader Updated live nodes from ZooKeeper... (1) -> (2)
   [junit4]   2> 949432 INFO  (jetty-launcher-1206-thread-1) [n:127.0.0.1:56354_solr    ] o.a.s.c.CoreContainer Initializing authentication plugin: org.apache.solr.cloud.TestAuthenticationFramework$MockAuthenticationPlugin
   [junit4]   2> 949460 INFO  (jetty-launcher-1206-thread-2) [n:127.0.0.1:56355_solr    ] o.a.s.c.CoreContainer Initializing authentication plugin: org.apache.solr.cloud.TestAuthenticationFramework$MockAuthenticationPlugin
   [junit4]   2> 949527 INFO  (jetty-launcher-1206-thread-2) [n:127.0.0.1:56355_solr    ] o.a.s.m.r.SolrJmxReporter JMX monitoring for 'solr_56355.solr.node' (registry 'solr.node') enabled at server: com.sun.jmx.mbeanserver.JmxMBeanServer@dd33e0
   [junit4]   2> 949528 INFO  (jetty-launcher-1206-thread-1) [n:127.0.0.1:56354_solr    ] o.a.s.m.r.SolrJmxReporter JMX monitoring for 'solr_56354.solr.node' (registry 'solr.node') enabled at server: com.sun.jmx.mbeanserver.JmxMBeanServer@dd33e0
   [junit4]   2> 949531 INFO  (jetty-launcher-1206-thread-2) [n:127.0.0.1:56355_solr    ] o.a.s.m.r.SolrJmxReporter JMX monitoring for 'solr_56355.solr.jvm' (registry 'solr.jvm') enabled at server: com.sun.jmx.mbeanserver.JmxMBeanServer@dd33e0
   [junit4]   2> 949532 INFO  (jetty-launcher-1206-thread-2) [n:127.0.0.1:56355_solr    ] o.a.s.m.r.SolrJmxReporter JMX monitoring for 'solr_56355.solr.jetty' (registry 'solr.jetty') enabled at server: com.sun.jmx.mbeanserver.JmxMBeanServer@dd33e0
   [junit4]   2> 949535 INFO  (jetty-launcher-1206-thread-1) [n:127.0.0.1:56354_solr    ] o.a.s.m.r.SolrJmxReporter JMX monitoring for 'solr_56354.solr.jvm' (registry 'solr.jvm') enabled at server: com.sun.jmx.mbeanserver.JmxMBeanServer@dd33e0
   [junit4]   2> 949535 INFO  (jetty-launcher-1206-thread-2) [n:127.0.0.1:56355_solr    ] o.a.s.c.CorePropertiesLocator Found 0 core definitions underneath C:\Users\jenkins\workspace\Lucene-Solr-master-Windows\solr\build\solr-core\test\J1\temp\solr.cloud.TestAuthenticationFramework_D32CE2E6E52511C5-001\tempDir-001\node2\.
   [junit4]   2> 949535 INFO  (jetty-launcher-1206-thread-1) [n:127.0.0.1:56354_solr    ] o.a.s.m.r.SolrJmxReporter JMX monitoring for 'solr_56354.solr.jetty' (registry 'solr.jetty') enabled at server: com.sun.jmx.mbeanserver.JmxMBeanServer@dd33e0
   [junit4]   2> 949537 INFO  (jetty-launcher-1206-thread-1) [n:127.0.0.1:56354_solr    ] o.a.s.c.CorePropertiesLocator Found 0 core definitions underneath C:\Users\jenkins\workspace\Lucene-Solr-master-Windows\solr\build\solr-core\test\J1\temp\solr.cloud.TestAuthenticationFramework_D32CE2E6E52511C5-001\tempDir-001\node1\.
   [junit4]   2> 949577 WARN  (NIOServerCxn.Factory:0.0.0.0/0.0.0.0:0) [    ] o.a.z.s.NIOServerCnxn caught end of stream exception
   [junit4]   2> EndOfStreamException: Unable to read additional data from client sessionid 0x15dcd08a73b0007, likely client has closed socket
   [junit4]   2> 	at org.apache.zookeeper.server.NIOServerCnxn.doIO(NIOServerCnxn.java:239)
   [junit4]   2> 	at org.apache.zookeeper.server.NIOServerCnxnFactory.run(NIOServerCnxnFactory.java:203)
   [junit4]   2> 	at java.lang.Thread.run(Thread.java:748)
   [junit4]   2> 949583 INFO  (TEST-TestAuthenticationFramework.testBasics-seed#[D32CE2E6E52511C5]) [    ] o.a.s.c.c.ZkStateReader Updated live nodes from ZooKeeper... (0) -> (2)
   [junit4]   2> 949585 INFO  (TEST-TestAuthenticationFramework.testBasics-seed#[D32CE2E6E52511C5]) [    ] o.a.s.c.s.i.ZkClientClusterStateProvider Cluster at 127.0.0.1:56350/solr ready
   [junit4]   2> 949589 INFO  (TEST-TestAuthenticationFramework.testBasics-seed#[D32CE2E6E52511C5]) [    ] o.a.s.SolrTestCaseJ4 ###Starting testBasics
   [junit4]   2> 949592 INFO  (qtp2181037-8083) [n:127.0.0.1:56355_solr    ] o.a.s.h.a.CollectionsHandler Invoked Collection Action :create with params replicationFactor=2&collection.configName=solrCloudCollectionConfig&maxShardsPerNode=2&name=testcollection&nrtReplicas=2&action=CREATE&numShards=2&wt=javabin&version=2 and sendToOCPQueue=true
   [junit4]   2> 949594 INFO  (OverseerThreadFactory-3350-thread-1-processing-n:127.0.0.1:56355_solr) [n:127.0.0.1:56355_solr    ] o.a.s.c.CreateCollectionCmd Create collection testcollection
   [junit4]   2> 949703 INFO  (OverseerStateUpdate-98460203921113093-127.0.0.1:56355_solr-n_0000000000) [n:127.0.0.1:56355_solr    ] o.a.s.c.o.SliceMutator createReplica() {
   [junit4]   2>   "operation":"ADDREPLICA",
   [junit4]   2>   "collection":"testcollection",
   [junit4]   2>   "shard":"shard1",
   [junit4]   2>   "core":"testcollection_shard1_replica_n1",
   [junit4]   2>   "state":"down",
   [junit4]   2>   "base_url":"http://127.0.0.1:56354/solr",
   [junit4]   2>   "type":"NRT"} 
   [junit4]   2> 949707 INFO  (OverseerStateUpdate-98460203921113093-127.0.0.1:56355_solr-n_0000000000) [n:127.0.0.1:56355_solr    ] o.a.s.c.o.SliceMutator createReplica() {
   [junit4]   2>   "operation":"ADDREPLICA",
   [junit4]   2>   "collection":"testcollection",
   [junit4]   2>   "shard":"shard1",
   [junit4]   2>   "core":"testcollection_shard1_replica_n2",
   [junit4]   2>   "state":"down",
   [junit4]   2>   "base_url":"http://127.0.0.1:56355/solr",
   [junit4]   2>   "type":"NRT"} 
   [junit4]   2> 949709 INFO  (OverseerStateUpdate-98460203921113093-127.0.0.1:56355_solr-n_0000000000) [n:127.0.0.1:56355_solr    ] o.a.s.c.o.SliceMutator createReplica() {
   [junit4]   2>   "operation":"ADDREPLICA",
   [junit4]   2>   "collection":"testcollection",
   [junit4]   2>   "shard":"shard2",
   [junit4]   2>   "core":"testcollection_shard2_replica_n4",
   [junit4]   2>   "state":"down",
   [junit4]   2>   "base_url":"http://127.0.0.1:56354/solr",
   [junit4]   2>   "type":"NRT"} 
   [junit4]   2> 949712 INFO  (OverseerStateUpdate-98460203921113093-127.0.0.1:56355_solr-n_0000000000) [n:127.0.0.1:56355_solr    ] o.a.s.c.o.SliceMutator createReplica() {
   [junit4]   2>   "operation":"ADDREPLICA",
   [junit4]   2>   "collection":"testcollection",
   [junit4]   2>   "shard":"shard2",
   [junit4]   2>   "core":"testcollection_shard2_replica_n6",
   [junit4]   2>   "state":"down",
   [junit4]   2>   "base_url":"http://127.0.0.1:56355/solr",
   [junit4]   2>   "type":"NRT"} 
   [junit4]   2> 949916 INFO  (qtp2181037-8081) [n:127.0.0.1:56355_solr    ] o.a.s.h.a.CoreAdminOperation core create command qt=/admin/cores&coreNodeName=core_node5&collection.configName=solrCloudCollectionConfig&newCollection=true&name=testcollection_shard1_replica_n2&action=CREATE&numShards=2&collection=testcollection&shard=shard1&wt=javabin&version=2&replicaType=NRT
   [junit4]   2> 949917 INFO  (qtp20660907-8069) [n:127.0.0.1:56354_solr    ] o.a.s.h.a.CoreAdminOperation core create command qt=/admin/cores&coreNodeName=core_node7&collection.configName=solrCloudCollectionConfig&newCollection=true&name=testcollection_shard2_replica_n4&action=CREATE&numShards=2&collection=testcollection&shard=shard2&wt=javabin&version=2&replicaType=NRT
   [junit4]   2> 949917 INFO  (qtp2181037-8081) [n:127.0.0.1:56355_solr    ] o.a.s.c.TransientSolrCoreCacheDefault Allocating transient cache for 2147483647 transient cores
   [junit4]   2> 949917 INFO  (qtp20660907-8069) [n:127.0.0.1:56354_solr    ] o.a.s.c.TransientSolrCoreCacheDefault Allocating transient cache for 2147483647 transient cores
   [junit4]   2> 949917 INFO  (qtp2181037-8080) [n:127.0.0.1:56355_solr    ] o.a.s.h.a.CoreAdminOperation core create command qt=/admin/cores&coreNodeName=core_node8&collection.configName=solrCloudCollectionConfig&newCollection=true&name=testcollection_shard2_replica_n6&action=CREATE&numShards=2&collection=testcollection&shard=shard2&wt=javabin&version=2&replicaType=NRT
   [junit4]   2> 949922 INFO  (qtp20660907-8091) [n:127.0.0.1:56354_solr    ] o.a.s.h.a.CoreAdminOperation core create command qt=/admin/cores&coreNodeName=core_node3&collection.configName=solrCloudCollectionConfig&newCollection=true&name=testcollection_shard1_replica_n1&action=CREATE&numShards=2&collection=testcollection&shard=shard1&wt=javabin&version=2&replicaType=NRT
   [junit4]   2> 950040 INFO  (zkCallback-1218-thread-1-processing-n:127.0.0.1:56354_solr) [n:127.0.0.1:56354_solr    ] o.a.s.c.c.ZkStateReader A cluster state change: [WatchedEvent state:SyncConnected type:NodeDataChanged path:/collections/testcollection/state.json] for collection [testcollection] has occurred - updating... (live nodes size: [2])
   [junit4]   2> 950040 INFO  (zkCallback-1217-thread-2-processing-n:127.0.0.1:56355_solr) [n:127.0.0.1:56355_solr    ] o.a.s.c.c.ZkStateReader A cluster state change: [WatchedEvent state:SyncConnected type:NodeDataChanged path:/collections/testcollection/state.json] for collection [testcollection] has occurred - updating... (live nodes size: [2])
   [junit4]   2> 950041 INFO  (zkCallback-1217-thread-1-processing-n:127.0.0.1:56355_solr) [n:127.0.0.1:56355_solr    ] o.a.s.c.c.ZkStateReader A cluster state change: [WatchedEvent state:SyncConnected type:NodeDataChanged path:/collections/testcollection/state.json] for collection [testcollection] has occurred - updating... (live nodes size: [2])
   [junit4]   2> 950042 INFO  (zkCallback-1218-thread-2-processing-n:127.0.0.1:56354_solr) [n:127.0.0.1:56354_solr    ] o.a.s.c.c.ZkStateReader A cluster state change: [WatchedEvent state:SyncConnected type:NodeDataChanged path:/collections/testcollection/state.json] for collection [testcollection] has occurred - updating... (live nodes size: [2])
   [junit4]   2> 950949 INFO  (qtp20660907-8091) [n:127.0.0.1:56354_solr c:testcollection s:shard1 r:core_node3 x:testcollection_shard1_replica_n1] o.a.s.c.SolrConfig Using Lucene MatchVersion: 8.0.0
   [junit4]   2> 950949 INFO  (qtp2181037-8081) [n:127.0.0.1:56355_solr c:testcollection s:shard1 r:core_node5 x:testcollection_shard1_replica_n2] o.a.s.c.SolrConfig Using Lucene MatchVersion: 8.0.0
   [junit4]   2> 950950 INFO  (qtp20660907-8069) [n:127.0.0.1:56354_solr c:testcollection s:shard2 r:core_node7 x:testcollection_shard2_replica_n4] o.a.s.c.SolrConfig Using Lucene MatchVersion: 8.0.0
   [junit4]   2> 950956 INFO  (qtp2181037-8080) [n:127.0.0.1:56355_solr c:testcollection s:shard2 r:core_node8 x:testcollection_shard2_replica_n6] o.a.s.c.SolrConfig Using Lucene MatchVersion: 8.0.0
   [junit4]   2> 950956 INFO  (qtp20660907-8069) [n:127.0.0.1:56354_solr c:testcollection s:shard2 r:core_node7 x:testcollection_shard2_replica_n4] o.a.s.s.IndexSchema [testcollection_shard2_replica_n4] Schema name=minimal
   [junit4]   2> 950960 INFO  (qtp20660907-8091) [n:127.0.0.1:56354_solr c:testcollection s:shard1 r:core_node3 x:testcollection_shard1_replica_n1] o.a.s.s.IndexSchema [testcollection_shard1_replica_n1] Schema name=minimal
   [junit4]   2> 950960 INFO  (qtp2181037-8081) [n:127.0.0.1:56355_solr c:testcollection s:shard1 r:core_node5 x:testcollection_shard1_replica_n2] o.a.s.s.IndexSchema [testcollection_shard1_replica_n2] Schema name=minimal
   [junit4]   2> 950962 INFO  (qtp2181037-8080) [n:127.0.0.1:56355_solr c:testcollection s:shard2 r:core_node8 x:testcollection_shard2_replica_n6] o.a.s.s.IndexSchema [testcollection_shard2_replica_n6] Schema name=minimal
   [junit4]   2> 950963 INFO  (qtp2181037-8081) [n:127.0.0.1:56355_solr c:testcollection s:shard1 r:core_node5 x:testcollection_shard1_replica_n2] o.a.s.s.IndexSchema Loaded schema minimal/1.1 with uniqueid field id
   [junit4]   2> 950963 INFO  (qtp2181037-8081) [n:127.0.0.1:56355_solr c:testcollection s:shard1 r:core_node5 x:testcollection_shard1_replica_n2] o.a.s.c.CoreContainer Creating SolrCore 'testcollection_shard1_replica_n2' using configuration from collection testcollection, trusted=true
   [junit4]   2> 950963 INFO  (qtp2181037-8080) [n:127.0.0.1:56355_solr c:testcollection s:shard2 r:core_node8 x:testcollection_shard2_replica_n6] o.a.s.s.IndexSchema Loaded schema minimal/1.1 with uniqueid field id
   [junit4]   2> 950963 INFO  (qtp2181037-8080) [n:127.0.0.1:56355_solr c:testcollection s:shard2 r:core_node8 x:testcollection_shard2_replica_n6] o.a.s.c.CoreContainer Creating SolrCore 'testcollection_shard2_replica_n6' using configuration from collection testcollection, trusted=true
   [junit4]   2> 950963 INFO  (qtp20660907-8069) [n:127.0.0.1:56354_solr c:testcollection s:shard2 r:core_node7 x:testcollection_shard2_replica_n4] o.a.s.s.IndexSchema Loaded schema minimal/1.1 with uniqueid field id
   [junit4]   2> 950975 INFO  (qtp20660907-8069) [n:127.0.0.1:56354_solr c:testcollection s:shard2 r:core_node7 x:testcollection_shard2_replica_n4] o.a.s.c.CoreContainer Creating SolrCore 'testcollection_shard2_replica_n4' using configuration from collection testcollection, trusted=true
   [junit4]   2> 950975 INFO  (qtp20660907-8069) [n:127.0.0.1:56354_solr c:testcollection s:shard2 r:core_node7 x:testcollection_shard2_replica_n4] o.a.s.m.r.SolrJmxReporter JMX monitoring for 'solr_56354.solr.core.testcollection.shard2.replica_n4' (registry 'solr.core.testcollection.shard2.replica_n4') enabled at server: com.sun.jmx.mbeanserver.JmxMBeanServer@dd33e0
   [junit4]   2> 950975 INFO  (qtp2181037-8080) [n:127.0.0.1:56355_solr c:testcollection s:shard2 r:core_node8 x:testcollection_shard2_replica_n6] o.a.s.m.r.SolrJmxReporter JMX monitoring for 'solr_56355.solr.core.testcollection.shard2.replica_n6' (registry 'solr.core.testcollection.shard2.replica_n6') enabled at server: com.sun.jmx.mbeanserver.JmxMBeanServer@dd33e0
   [junit4]   2> 950975 INFO  (qtp20660907-8069) [n:127.0.0.1:56354_solr c:testcollection s:shard2 r:core_node7 x:testcollection_shard2_replica_n4] o.a.s.c.SolrCore solr.RecoveryStrategy.Builder
   [junit4]   2> 950975 INFO  (qtp2181037-8080) [n:127.0.0.1:56355_solr c:testcollection s:shard2 r:core_node8 x:testcollection_shard2_replica_n6] o.a.s.c.SolrCore solr.RecoveryStrategy.Builder
   [junit4]   2> 950975 INFO  (qtp20660907-8069) [n:127.0.0.1:56354_solr c:testcollection s:shard2 r:core_node7 x:testcollection_shard2_replica_n4] o.a.s.c.SolrCore [[testcollection_shard2_replica_n4] ] Opening new SolrCore at [C:\Users\jenkins\workspace\Lucene-Solr-master-Windows\solr\build\solr-core\test\J1\temp\solr.cloud.TestAuthenticationFramework_D32CE2E6E52511C5-001\tempDir-001\node1\testcollection_shard2_replica_n4], dataDir=[C:\Users\jenkins\workspace\Lucene-Solr-master-Windows\solr\build\solr-core\test\J1\temp\solr.cloud.TestAuthenticationFramework_D32CE2E6E52511C5-001\tempDir-001\node1\.\testcollection_shard2_replica_n4\data\]
   [junit4]   2> 950976 INFO  (qtp20660907-8091) [n:127.0.0.1:56354_solr c:testcollection s:shard1 r:core_node3 x:testcollection_shard1_replica_n1] o.a.s.s.IndexSchema Loaded schema minimal/1.1 with uniqueid field id
   [junit4]   2> 950976 INFO  (qtp20660907-8091) [n:127.0.0.1:56354_solr c:testcollection s:shard1 r:core_node3 x:testcollection_shard1_replica_n1] o.a.s.c.CoreContainer Creating SolrCore 'testcollection_shard1_replica_n1' using configuration from collection testcollection, trusted=true
   [junit4]   2> 950976 INFO  (qtp20660907-8091) [n:127.0.0.1:56354_solr c:testcollection s:shard1 r:core_node3 x:testcollection_shard1_replica_n1] o.a.s.m.r.SolrJmxReporter JMX monitoring for 'solr_56354.solr.core.testcollection.shard1.replica_n1' (registry 'solr.core.testcollection.shard1.replica_n1') enabled at server: com.sun.jmx.mbeanserver.JmxMBeanServer@dd33e0
   [junit4]   2> 950976 INFO  (qtp20660907-8091) [n:127.0.0.1:56354_solr c:testcollection s:shard1 r:core_node3 x:testcollection_shard1_replica_n1] o.a.s.c.SolrCore solr.RecoveryStrategy.Builder
   [junit4]   2> 950977 INFO  (qtp20660907-8091) [n:127.0.0.1:56354_solr c:testcollection s:shard1 r:core_node3 x:testcollection_shard1_replica_n1] o.a.s.c.SolrCore [[testcollection_shard1_replica_n1] ] Opening new SolrCore at [C:\Users\jenkins\workspace\Lucene-Solr-master-Windows\solr\build\solr-core\test\J1\temp\solr.cloud.TestAuthenticationFramework_D32CE2E6E52511C5-001\tempDir-001\node1\testcollection_shard1_replica_n1], dataDir=[C:\Users\jenkins\workspace\Lucene-Solr-master-Windows\solr\build\solr-core\test\J1\temp\solr.cloud.TestAuthenticationFramework_D32CE2E6E52511C5-001\tempDir-001\node1\.\testcollection_shard1_replica_n1\data\]
   [junit4]   2> 950977 INFO  (qtp2181037-8081) [n:127.0.0.1:56355_solr c:testcollection s:shard1 r:core_node5 x:testcollection_shard1_replica_n2] o.a.s.m.r.SolrJmxReporter JMX monitoring for 'solr_56355.solr.core.testcollection.shard1.replica_n2' (registry 'solr.core.testcollection.shard1.replica_n2') enabled at server: com.sun.jmx.mbeanserver.JmxMBeanServer@dd33e0
   [junit4]   2> 950975 INFO  (qtp2181037-8080) [n:127.0.0.1:56355_solr c:testcollection s:shard2 r:core_node8 x:testcollection_shard2_replica_n6] o.a.s.c.SolrCore [[testcollection_shard2_replica_n6] ] Opening new SolrCore at [C:\Users\jenkins\workspace\Lucene-Solr-master-Windows\solr\build\solr-core\test\J1\temp\solr.cloud.TestAuthenticationFramework_D32CE2E6E52511C5-001\tempDir-001\node2\testcollection_shard2_replica_n6], dataDir=[C:\Users\jenkins\workspace\Lucene-Solr-master-Windows\solr\build\solr-core\test\J1\temp\solr.cloud.TestAuthenticationFramework_D32CE2E6E52511C5-001\tempDir-001\node2\.\testcollection_shard2_replica_n6\data\]
   [junit4]   2> 950977 INFO  (qtp2181037-8081) [n:127.0.0.1:56355_solr c:testcollection s:shard1 r:core_node5 x:testcollection_shard1_replica_n2] o.a.s.c.SolrCore solr.RecoveryStrategy.Builder
   [junit4]   2> 950977 INFO  (qtp2181037-8081) [n:127.0.0.1:56355_solr c:testcollection s:shard1 r:core_node5 x:testcollection_shard1_replica_n2] o.a.s.c.SolrCore [[testcollection_shard1_replica_n2] ] Opening new SolrCore at [C:\Users\jenkins\workspace\Lucene-Solr-master-Windows\solr\build\solr-core\test\J1\temp\solr.cloud.TestAuthenticationFramework_D32CE2E6E52511C5-001\tempDir-001\node2\testcollection_shard1_replica_n2], dataDir=[C:\Users\jenkins\workspace\Lucene-Solr-master-Windows\solr\build\solr-core\test\J1\temp\solr.cloud.TestAuthenticationFramework_D32CE2E6E52511C5-001\tempDir-001\node2\.\testcollection_shard1_replica_n2\data\]
   [junit4]   2> 951076 INFO  (qtp20660907-8091) [n:127.0.0.1:56354_solr c:testcollection s:shard1 r:core_node3 x:testcollection_shard1_replica_n1] o.a.s.u.UpdateHandler Using UpdateLog implementation: org.apache.solr.update.UpdateLog
   [junit4]   2> 951076 INFO  (qtp20660907-8091) [n:127.0.0.1:56354_solr c:testcollection s:shard1 r:core_node3 x:testcollection_shard1_replica_n1] o.a.s.u.UpdateLog Initializing UpdateLog: dataDir=null defaultSyncLevel=FLUSH numRecordsToKeep=100 maxNumLogsToKeep=10 numVersionBuckets=65536
   [junit4]   2> 951077 INFO  (qtp20660907-8091) [n:127.0.0.1:56354_solr c:testcollection s:shard1 r:core_node3 x:testcollection_shard1_replica_n1] o.a.s.u.CommitTracker Hard AutoCommit: disabled
   [junit4]   2> 951077 INFO  (qtp20660907-8091) [n:127.0.0.1:56354_solr c:testcollection s:shard1 r:core_node3 x:testcollection_shard1_replica_n1] o.a.s.u.CommitTracker Soft AutoCommit: disabled
   [junit4]   2> 951077 INFO  (qtp2181037-8081) [n:127.0.0.1:56355_solr c:testcollection s:shard1 r:core_node5 x:testcollection_shard1_replica_n2] o.a.s.u.UpdateHandler Using UpdateLog implementation: org.apache.solr.update.UpdateLog
   [junit4]   2> 951077 INFO  (qtp2181037-8081) [n:127.0.0.1:56355_solr c:testcollection s:shard1 r:core_node5 x:testcollection_shard1_replica_n2] o.a.s.u.UpdateLog Initializing UpdateLog: dataDir=null defaultSyncLevel=FLUSH numRecordsToKeep=100 maxNumLogsToKeep=10 numVersionBuckets=65536
   [junit4]   2> 951079 INFO  (qtp2181037-8081) [n:127.0.0.1:56355_solr c:testcollection s:shard1 r:core_node5 x:testcollection_shard1_replica_n2] o.a.s.u.CommitTracker Hard AutoCommit: disabled
   [junit4]   2> 951079 INFO  (qtp2181037-8081) [n:127.0.0.1:56355_solr c:testcollection s:shard1 r:core_node5 x:testcollection_shard1_replica_n2] o.a.s.u.CommitTracker Soft AutoCommit: disabled
   [junit4]   2> 951081 INFO  (qtp20660907-8091) [n:127.0.0.1:56354_solr c:testcollection s:shard1 r:core_node3 x:testcollection_shard1_replica_n1] o.a.s.s.SolrIndexSearcher Opening [Searcher@35d6b5[testcollection_shard1_replica_n1] main]
   [junit4]   2> 951082 INFO  (qtp20660907-8091) [n:127.0.0.1:56354_solr c:testcollection s:shard1 r:core_node3 x:testcollection_shard1_replica_n1] o.a.s.r.ManagedResourceStorage Configured ZooKeeperStorageIO with znodeBase: /configs/solrCloudCollectionConfig
   [junit4]   2> 951082 INFO  (qtp20660907-8091) [n:127.0.0.1:56354_solr c:testcollection s:shard1 r:core_node3 x:testcollection_shard1_replica_n1] o.a.s.r.ManagedResourceStorage Loaded null at path _rest_managed.json using ZooKeeperStorageIO:path=/configs/solrCloudCollectionConfig
   [junit4]   2> 951082 INFO  (qtp20660907-8091) [n:127.0.0.1:56354_solr c:testcollection s:shard1 r:core_node3 x:testcollection_shard1_replica_n1] o.a.s.h.ReplicationHandler Commits will be reserved for  10000
   [junit4]   2> 951082 INFO  (qtp2181037-8081) [n:127.0.0.1:56355_solr c:testcollection s:shard1 r:core_node5 x:testcollection_shard1_replica_n2] o.a.s.s.SolrIndexSearcher Opening [Searcher@13de6af[testcollection_shard1_replica_n2] main]
   [junit4]   2> 951084 INFO  (qtp2181037-8080) [n:127.0.0.1:56355_solr c:testcollection s:shard2 r:core_node8 x:testcollection_shard2_replica_n6] o.a.s.u.UpdateHandler Using UpdateLog implementation: org.apache.solr.update.UpdateLog
   [junit4]   2> 951084 INFO  (qtp2181037-8080) [n:127.0.0.1:56355_solr c:testcollection s:shard2 r:core_node8 x:testcollection_shard2_replica_n6] o.a.s.u.UpdateLog Initializing UpdateLog: dataDir=null defaultSyncLevel=FLUSH numRecordsToKeep=100 maxNumLogsToKeep=10 numVersionBuckets=65536
   [junit4]   2> 951086 INFO  (qtp2181037-8080) [n:127.0.0.1:56355_solr c:testcollection s:shard2 r:core_node8 x:testcollection_shard2_replica_n6] o.a.s.u.CommitTracker Hard AutoCommit: disabled
   [junit4]   2> 951086 INFO  (qtp2181037-8080) [n:127.0.0.1:56355_solr c:testcollection s:shard2 r:core_node8 x:testcollection_shard2_replica_n6] o.a.s.u.CommitTracker Soft AutoCommit: disabled
   [junit4]   2> 951086 INFO  (qtp2181037-8081) [n:127.0.0.1:56355_solr c:testcollection s:shard1 r:core_node5 x:testcollection_shard1_replica_n2] o.a.s.r.ManagedResourceStorage Configured ZooKeeperStorageIO with znodeBase: /configs/solrCloudCollectionConfig
   [junit4]   2> 951086 INFO  (qtp2181037-8081) [n:127.0.0.1:56355_solr c:testcollection s:shard1 r:core_node5 x:testcollection_shard1_replica_n2] o.a.s.r.ManagedResourceStorage Loaded null at path _rest_managed.json using ZooKeeperStorageIO:path=/configs/solrCloudCollectionConfig
   [junit4]   2> 951087 INFO  (qtp20660907-8091) [n:127.0.0.1:56354_solr c:testcollection s:shard1 r:core_node3 x:testcollection_shard1_replica_n1] o.a.s.u.UpdateLog Could not find max version in index or recent updates, using new clock 1575363264828669952
   [junit4]   2> 951087 INFO  (qtp2181037-8081) [n:127.0.0.1:56355_solr c:testcollection s:shard1 r:core_node5 x:testcollection_shard1_replica_n2] o.a.s.h.ReplicationHandler Commits will be reserved for  10000
   [junit4]   2> 951087 INFO  (qtp2181037-8081) [n:127.0.0.1:56355_solr c:testcollection s:shard1 r:core_node5 x:testcollection_shard1_replica_n2] o.a.s.u.UpdateLog Could not find max version in index or recent updates, using new clock 1575363264828669952
   [junit4]   2> 951093 INFO  (qtp2181037-8081) [n:127.0.0.1:56355_solr c:testcollection s:shard1 r:core_node5 x:testcollection_shard1_replica_n2] o.a.s.c.ShardLeaderElectionContext Enough replicas found to continue.
   [junit4]   2> 951093 INFO  (qtp2181037-8081) [n:127.0.0.1:56355_solr c:testcollection s:shard1 r:core_node5 x:testcollection_shard1_replica_n2] o.a.s.c.ShardLeaderElectionContext I may be the new leader - try and sync
   [junit4]   2> 951093 INFO  (qtp2181037-8081) [n:127.0.0.1:56355_solr c:testcollection s:shard1 r:core_node5 x:testcollection_shard1_replica_n2] o.a.s.c.SyncStrategy Sync replicas to http://127.0.0.1:56355/solr/testcollection_shard1_replica_n2/
   [junit4]   2> 951093 INFO  (qtp2181037-8081) [n:127.0.0.1:56355_solr c:testcollection s:shard1 r:core_node5 x:testcollection_shard1_replica_n2] o.a.s.u.PeerSync PeerSync: core=testcollection_shard1_replica_n2 url=http://127.0.0.1:56355/solr START replicas=[http://127.0.0.1:56354/solr/testcollection_shard1_replica_n1/] nUpdates=100
   [junit4]   2> 951095 INFO  (searcherExecutor-3358-thread-1-processing-n:127.0.0.1:56354_solr x:testcollection_shard1_replica_n1 s:shard1 c:testcollection r:core_node3) [n:127.0.0.1:56354_solr c:testcollection s:shard1 r:core_node3 x:testcollection_shard1_replica_n1] o.a.s.c.SolrCore [testcollection_shard1_replica_n1] Registered new searcher Searcher@35d6b5[testcollection_shard1_replica_n1] main{ExitableDirectoryReader(UninvertingDirectoryReader())}
   [junit4]   2> 951096 INFO  (searcherExecutor-3355-thread-1-processing-n:127.0.0.1:56355_solr x:testcollection_shard1_replica_n2 s:shard1 c:testcollection r:core_node5) [n:127.0.0.1:56355_solr c:testcollection s:shard1 r:core_node5 x:testcollection_shard1_replica_n2] o.a.s.c.SolrCore [testcollection_shard1_replica_n2] Registered new searcher Searcher@13de6af[testcollection_shard1_replica_n2] main{ExitableDirectoryReader(UninvertingDirectoryReader())}
   [junit4]   2> 951097 INFO  (qtp2181037-8080) [n:127.0.0.1:56355_solr c:testcollection s:shard2 r:core_node8 x:testcollection_shard2_replica_n6] o.a.s.s.SolrIndexSearcher Opening [Searcher@af292[testcollection_shard2_replica_n6] main]
   [junit4]   2> 951098 INFO  (qtp2181037-8080) [n:127.0.0.1:56355_solr c:testcollection s:shard2 r:core_node8 x:testcollection_shard2_replica_n6] o.a.s.r.ManagedResourceStorage Configured ZooKeeperStorageIO with znodeBase: /configs/solrCloudCollectionConfig
   [junit4]   2> 951098 INFO  (qtp2181037-8080) [n:127.0.0.1:56355_solr c:testcollection s:shard2 r:core_node8 x:testcollection_shard2_replica_n6] o.a.s.r.ManagedResourceStorage Loaded null at path _rest_managed.json using ZooKeeperStorageIO:path=/configs/solrCloudCollectionConfig
   [junit4]   2> 951099 INFO  (qtp2181037-8080) [n:127.0.0.1:56355_solr c:testcollection s:shard2 r:core_node8 x:testcollection_shard2_replica_n6] o.a.s.h.ReplicationHandler Commits will be reserved for  10000
   [junit4]   2> 951099 INFO  (qtp2181037-8080) [n:127.0.0.1:56355_solr c:testcollection s:shard2 r:core_node8 x:testcollection_shard2_replica_n6] o.a.s.u.UpdateLog Could not find max version in index or recent updates, using new clock 1575363264841252864
   [junit4]   2> 951099 INFO  (qtp20660907-8076) [n:127.0.0.1:56354_solr c:testcollection s:shard1 r:core_node3 x:testcollection_shard1_replica_n1] o.a.s.c.S.Request [testcollection_shard1_replica_n1]  webapp=/solr path=/get params={distrib=false&qt=/get&fingerprint=false&getVersions=100&wt=javabin&version=2} status=0 QTime=0
   [junit4]   2> 951100 INFO  (searcherExecutor-3356-thread-1-processing-n:127.0.0.1:56355_solr x:testcollection_shard2_replica_n6 s:shard2 c:testcollection r:core_node8) [n:127.0.0.1:56355_solr c:testcollection s:shard2 r:core_node8 x:testcollection_shard2_replica_n6] o.a.s.c.SolrCore [testcollection_shard2_replica_n6] Registered new searcher Searcher@af292[testcollection_shard2_replica_n6] main{ExitableDirectoryReader(UninvertingDirectoryReader())}
   [junit4]   2> 951103 INFO  (qtp2181037-8080) [n:127.0.0.1:56355_solr c:testcollection s:shard2 r:core_node8 x:testcollection_shard2_replica_n6] o.a.s.c.ShardLeaderElectionContext Waiting until we see more replicas up for shard shard2: total=2 found=1 timeoutin=9999ms
   [junit4]   2> 951109 INFO  (qtp20660907-8069) [n:127.0.0.1:56354_solr c:testcollection s:shard2 r:core_node7 x:testcollection_shard2_replica_n4] o.a.s.u.UpdateHandler Using UpdateLog implementation: org.apache.solr.update.UpdateLog
   [junit4]   2> 951109 INFO  (qtp20660907-8069) [n:127.0.0.1:56354_solr c:testcollection s:shard2 r:core_node7 x:testcollection_shard2_replica_n4] o.a.s.u.UpdateLog Initializing UpdateLog: dataDir=null defaultSyncLevel=FLUSH numRecordsToKeep=100 maxNumLogsToKeep=10 numVersionBuckets=65536
   [junit4]   2> 951110 INFO  (qtp20660907-8069) [n:127.0.0.1:56354_solr c:testcollection s:shard2 r:core_node7 x:testcollection_shard2_replica_n4] o.a.s.u.CommitTracker Hard AutoCommit: disabled
   [junit4]   2> 951110 INFO  (qtp20660907-8069) [n:127.0.0.1:56354_solr c:testcollection s:shard2 r:core_node7 x:testcollection_shard2_replica_n4] o.a.s.u.CommitTracker Soft AutoCommit: disabled
   [junit4]   2> 951110 INFO  (qtp20660907-8069) [n:127.0.0.1:56354_solr c:testcollection s:shard2 r:core_node7 x:testcollection_shard2_replica_n4] o.a.s.s.SolrIndexSearcher Opening [Searcher@417c6b[testcollection_shard2_replica_n4] main]
   [junit4]   2> 951112 INFO  (qtp20660907-8069) [n:127.0.0.1:56354_solr c:testcollection s:shard2 r:core_node7 x:testcollection_shard2_replica_n4] o.a.s.r.ManagedResourceStorage Configured ZooKeeperStorageIO with znodeBase: /configs/solrCloudCollectionConfig
   [junit4]   2> 951112 INFO  (qtp20660907-8069) [n:127.0.0.1:56354_solr c:testcollection s:shard2 r:core_node7 x:testcollection_shard2_replica_n4] o.a.s.r.ManagedResourceStorage Loaded null at path _rest_managed.json using ZooKeeperStorageIO:path=/configs/solrCloudCollectionConfig
   [junit4]   2> 951113 INFO  (qtp20660907-8069) [n:127.0.0.1:56354_solr c:testcollection s:shard2 r:core_node7 x:testcollection_shard2_replica_n4] o.a.s.h.ReplicationHandler Commits will be reserved for  10000
   [junit4]   2> 951113 INFO  (qtp20660907-8069) [n:127.0.0.1:56354_solr c:testcollection s:shard2 r:core_node7 x:testcollection_shard2_replica_n4] o.a.s.u.UpdateLog Could not find max version in index or recent updates, using new clock 1575363264855932928
   [junit4]   2> 951113 INFO  (searcherExecutor-3357-thread-1-processing-n:127.0.0.1:56354_solr x:testcollection_shard2_replica_n4 s:shard2 c:testcollection r:core_node7) [n:127.0.0.1:56354_solr c:testcollection s:shard2 r:core_node7 x:testcollection_shard2_replica_n4] o.a.s.c.SolrCore [testcollection_shard2_replica_n4] Registered new searcher Searcher@417c6b[testcollection_shard2_replica_n4] main{ExitableDirectoryReader(UninvertingDirectoryReader())}
   [junit4]   2> 951206 INFO  (zkCallback-1218-thread-2-processing-n:127.0.0.1:56354_solr) [n:127.0.0.1:56354_solr    ] o.a.s.c.c.ZkStateReader A cluster state change: [WatchedEvent state:SyncConnected type:NodeDataChanged path:/collections/testcollection/state.json] for collection [testcollection] has occurred - updating... (live nodes size: [2])
   [junit4]   2> 951206 INFO  (zkCallback-1217-thread-1-processing-n:127.0.0.1:56355_solr) [n:127.0.0.1:56355_solr    ] o.a.s.c.c.ZkStateReader A cluster state change: [WatchedEvent state:SyncConnected type:NodeDataChanged path:/collections/testcollection/state.json] for collection [testcollection] has occurred - updating... (live nodes size: [2])
   [junit4]   2> 951206 INFO  (zkCallback-1217-thread-2-processing-n:127.0.0.1:56355_solr) [n:127.0.0.1:56355_solr    ] o.a.s.c.c.ZkStateReader A cluster state change: [WatchedEvent state:SyncConnected type:NodeDataChanged path:/collections/testcollection/state.json] for collection [testcollection] has occurred - updating... (live nodes size: [2])
   [junit4]   2> 951206 INFO  (zkCallback-1218-thread-1-processing-n:127.0.0.1:56354_solr) [n:127.0.0.1:56354_solr    ] o.a.s.c.c.ZkStateReader A cluster state change: [WatchedEvent state:SyncConnected type:NodeDataChanged path:/collections/testcollection/state.json] for collection [testcollection] has occurred - updating... (live nodes size: [2])
   [junit4]   2> 951393 INFO  (qtp2181037-8081) [n:127.0.0.1:56355_solr c:testcollection s:shard1 r:core_node5 x:testcollection_shard1_replica_n2] o.a.s.u.PeerSync PeerSync: core=testcollection_shard1_replica_n2 url=http://127.0.0.1:56355/solr DONE.  We have no versions.  sync failed.
   [junit4]   2> 951393 INFO  (qtp2181037-8081) [n:127.0.0.1:56355_solr c:testcollection s:shard1 r:core_node5 x:testcollection_shard1_replica_n2] o.a.s.c.SyncStrategy Leader's attempt to sync with shard failed, moving to the next candidate
   [junit4]   2> 951393 INFO  (qtp2181037-8081) [n:127.0.0.1:56355_solr c:testcollection s:shard1 r:core_node5 x:testcollection_shard1_replica_n2] o.a.s.c.ShardLeaderElectionContext We failed sync, but we have no versions - we can't sync in that case - we were active before, so become leader anyway
   [junit4]   2> 951393 INFO  (qtp2181037-8081) [n:127.0.0.1:56355_solr c:testcollection s:shard1 r:core_node5 x:testcollection_shard1_replica_n2] o.a.s.c.ShardLeaderElectionContext Found all replicas participating in election, clear LIR
   [junit4]   2> 951398 INFO  (qtp2181037-8081) [n:127.0.0.1:56355_solr c:testcollection s:shard1 r:core_node5 x:testcollection_shard1_replica_n2] o.a.s.c.ShardLeaderElectionContext I am the new leader: http://127.0.0.1:56355/solr/testcollection_shard1_replica_n2/ shard1
   [junit4]   2> 951503 INFO  (zkCallback-1218-thread-1-processing-n:127.0.0.1:56354_solr) [n:127.0.0.1:56354_solr    ] o.a.s.c.c.ZkStateReader A cluster state change: [WatchedEvent state:SyncConnected type:NodeDataChanged path:/collections/testcollection/state.json] for collection [testcollection] has occurred - updating... (live nodes size: [2])
   [junit4]   2> 951503 INFO  (zkCallback-1217-thread-2-processing-n:127.0.0.1:56355_solr) [n:127.0.0.1:56355_solr    ] o.a.s.c.c.ZkStateReader A cluster state change: [WatchedEvent state:SyncConnected type:NodeDataChanged path:/collections/testcollection/state.json] for collection [testcollection] has occurred - updating... (live nodes size: [2])
   [junit4]   2> 951503 INFO  (zkCallback-1217-thread-1-processing-n:127.0.0.1:56355_solr) [n:127.0.0.1:56355_solr    ] o.a.s.c.c.ZkStateReader A cluster state change: [WatchedEvent state:SyncConnected type:NodeDataChanged path:/collections/testcollection/state.json] for collection [testcollection] has occurred - updating... (live nodes size: [2])
   [junit4]   2> 951503 INFO  (zkCallback-1218-thread-2-processing-n:127.0.0.1:56354_solr) [n:127.0.0.1:56354_solr    ] o.a.s.c.c.ZkStateReader A cluster state change: [WatchedEvent state:SyncConnected type:NodeDataChanged path:/collections/testcollection/state.json] for collection [testcollection] has occurred - updating... (live nodes size: [2])
   [junit4]   2> 951503 INFO  (qtp2181037-8081) [n:127.0.0.1:56355_solr c:testcollection s:shard1 r:core_node5 x:testcollection_shard1_replica_n2] o.a.s.c.ZkController I am the leader, no recovery necessary
   [junit4]   2> 951505 INFO  (qtp2181037-8081) [n:127.0.0.1:56355_solr c:testcollection s:shard1 r:core_node5 x:testcollection_shard1_replica_n2] o.a.s.s.HttpSolrCall [admin] webapp=null path=/admin/cores params={qt=/admin/cores&coreNodeName=core_node5&collection.configName=solrCloudCollectionConfig&newCollection=true&name=testcollection_shard1_replica_n2&action=CREATE&numShards=2&collection=testcollection&shard=shard1&wt=javabin&version=2&replicaType=NRT} status=0 QTime=1589
   [junit4]   2> 951604 INFO  (qtp2181037-8080) [n:127.0.0.1:56355_solr c:testcollection s:shard2 r:core_node8 x:testcollection_shard2_replica_n6] o.a.s.c.ShardLeaderElectionContext Enough replicas found to continue.
   [junit4]   2> 951604 INFO  (qtp2181037-8080) [n:127.0.0.1:56355_solr c:testcollection s:shard2 r:core_node8 x:testcollection_shard2_replica_n6] o.a.s.c.ShardLeaderElectionContext I may be the new leader - try and sync
   [junit4]   2> 951604 INFO  (qtp2181037-8080) [n:127.0.0.1:56355_solr c:testcollection s:shard2 r:core_node8 x:testcollection_shard2_replica_n6] o.a.s.c.SyncStrategy Sync replicas to http://127.0.0.1:56355/solr/testcollection_shard2_replica_n6/
   [junit4]   2> 951605 INFO  (qtp2181037-8080) [n:127.0.0.1:56355_solr c:testcollection s:shard2 r:core_node8 x:testcollection_shard2_replica_n6] o.a.s.u.PeerSync PeerSync: core=testcollection_shard2_replica_n6 url=http://127.0.0.1:56355/solr START replicas=[http://127.0.0.1:56354/solr/testcollection_shard2_replica_n4/] nUpdates=100
   [junit4]   2> 951606 INFO  (qtp20660907-8076) [n:127.0.0.1:56354_solr c:testcollection s:shard2 r:core_node7 x:testcollection_shard2_replica_n4] o.a.s.c.S.Request [testcollection_shard2_replica_n4]  webapp=/solr path=/get params={distrib=false&qt=/get&fingerprint=false&getVersions=100&wt=javabin&version=2} status=0 QTime=0
   [junit4]   2> 951608 INFO  (zkCallback-1217-thread-1-processing-n:127.0.0.1:56355_solr) [n:127.0.0.1:56355_solr    ] o.a.s.c.c.ZkStateReader A cluster state change: [WatchedEvent state:SyncConnected type:NodeDataChanged path:/collections/testcollection/state.json] for collection [testcollection] has occurred - updating... (live nodes size: [2])
   [junit4]   2> 951608 INFO  (zkCallback-1218-thread-2-processing-n:127.0.0.1:56354_solr) [n:127.0.0.1:56354_solr    ] o.a.s.c.c.ZkStateReader A cluster state change: [WatchedEvent state:SyncConnected type:NodeDataChanged path:/collections/testcollection/state.json] for collection [testcollection] has occurred - updating... (live nodes size: [2])
   [junit4]   2> 951608 INFO  (zkCallback-1218-thread-1-processing-n:127.0.0.1:56354_solr) [n:127.0.0.1:56354_solr    ] o.a.s.c.c.ZkStateReader A cluster state change: [WatchedEvent state:SyncConnected type:NodeDataChanged path:/collections/testcollection/state.json] for collection [testcollection] has occurred - updating... (live nodes size: [2])
   [junit4]   2> 951608 INFO  (zkCallback-1217-thread-2-processing-n:127.0.0.1:56355_solr) [n:127.0.0.1:56355_solr    ] o.a.s.c.c.ZkStateReader A cluster state change: [WatchedEvent state:SyncConnected type:NodeDataChanged path:/collections/testcollection/state.json] for collection [testcollection] has occurred - updating... (live nodes size: [2])
   [junit4]   2> 951906 INFO  (qtp2181037-8080) [n:127.0.0.1:56355_solr c:testcollection s:shard2 r:core_node8 x:testcollection_shard2_replica_n6] o.a.s.u.PeerSync PeerSync: core=testcollection_shard2_replica_n6 url=http://127.0.0.1:56355/solr DONE.  We have no versions.  sync failed.
   [junit4]   2> 951906 INFO  (qtp2181037-8080) [n:127.0.0.1:56355_solr c:testcollection s:shard2 r:core_node8 x:testcollection_shard2_replica_n6] o.a.s.c.SyncStrategy Leader's attempt to sync with shard failed, moving to the next candidate
   [junit4]   2> 951906 INFO  (qtp2181037-8080) [n:127.0.0.1:56355_solr c:testcollection s:shard2 r:core_node8 x:testcollection_shard2_replica_n6] o.a.s.c.ShardLeaderElectionContext We failed sync, but we have no versions - we can't sync in that case - we were active before, so become leader anyway
   [junit4]   2> 951906 INFO  (qtp2181037-8080) [n:127.0.0.1:56355_solr c:testcollection s:shard2 r:core_node8 x:testcollection_shard2_replica_n6] o.a.s.c.ShardLeaderElectionContext Found all replicas participating in election, clear LIR
   [junit4]   2> 951911 INFO  (qtp2181037-8080) [n:127.0.0.1:56355_solr c:testcollection s:shard2 r:core_node8 x:testcollection_shard2_replica_n6] o.a.s.c.ShardLeaderElectionContext I am the new leader: http://127.0.0.1:56355/solr/testcollection_shard2_replica_n6/ shard2
   [junit4]   2> 952017 INFO  (zkCallback-1218-thread-2-processing-n:127.0.0.1:56354_solr) [n:127.0.0.1:56354_solr    ] o.a.s.c.c.ZkStateReader A cluster state change: [WatchedEvent state:SyncConnected type:NodeDataChanged path:/collections/testcollection/state.json] for collection [testcollection] has occurred - updating... (live nodes size: [2])
   [junit4]   2> 952017 INFO  (zkCallback-1217-thread-1-processing-n:127.0.0.1:56355_solr) [n:127.0.0.1:56355_solr    ] o.a.s.c.c.ZkStateReader A cluster state change: [WatchedEvent state:SyncConnected type:NodeDataChanged path:/collections/testcollection/state.json] for collection [testcollection] has occurred - updating... (live nodes size: [2])
   [junit4]   2> 952017 INFO  (zkCallback-1217-thread-2-processing-n:127.0.0.1:56355_solr) [n:127.0.0.1:56355_solr    ] o.a.s.c.c.ZkStateReader A cluster state change: [WatchedEvent state:SyncConnected type:NodeDataChanged path:/collections/testcollection/state.json] for collection [testcollection] has occurred - updating... (live nodes size: [2])
   [junit4]   2> 952017 INFO  (zkCallback-1218-thread-1-processing-n:127.0.0.1:56354_solr) [n:127.0.0.1:56354_solr    ] o.a.s.c.c.ZkStateReader A cluster state change: [WatchedEvent state:SyncConnected type:NodeDataChanged path:/collections/testcollection/state.json] for collection [testcollection] has occurred - updating... (live nodes size: [2])
   [junit4]   2> 952067 INFO  (qtp2181037-8080) [n:127.0.0.1:56355_solr c:testcollection s:shard2 r:core_node8 x:testcollection_shard2_replica_n6] o.a.s.c.ZkController I am the leader, no recovery necessary
   [junit4]   2> 952068 INFO  (qtp2181037-8080) [n:127.0.0.1:56355_solr c:testcollection s:shard2 r:core_node8 x:testcollection_shard2_replica_n6] o.a.s.s.HttpSolrCall [admin] webapp=null path=/admin/cores params={qt=/admin/cores&coreNodeName=core_node8&collection.configName=solrCloudCollectionConfig&newCollection=true&name=testcollection_shard2_replica_n6&action=CREATE&numShards=2&collection=testcollection&shard=shard2&wt=javabin&version=2&replicaType=NRT} status=0 QTime=2150
   [junit4]   2> 952095 INFO  (qtp20660907-8091) [n:127.0.0.1:56354_solr c:testcollection s:shard1 r:core_node3 x:testcollection_shard1_replica_n1] o.a.s.s.HttpSolrCall [admin] webapp=null path=/admin/cores params={qt=/admin/cores&coreNodeName=core_node3&collection.configName=solrCloudCollectionConfig&newCollection=true&name=testcollection_shard1_replica_n1&action=CREATE&numShards=2&collection=testcollection&shard=shard1&wt=javabin&version=2&replicaType=NRT} status=0 QTime=2172
   [junit4]   2> 952119 INFO  (qtp20660907-8069) [n:127.0.0.1:56354_solr c:testcollection s:shard2 r:core_node7 x:testcollection_shard2_replica_n4] o.a.s.s.HttpSolrCall [admin] webapp=null path=/admin/cores params={qt=/admin/cores&coreNodeName=core_node7&collection.configName=solrCloudCollectionConfig&newCollection=true&name=testcollection_shard2_replica_n4&action=CREATE&numShards=2&collection=testcollection&shard=shard2&wt=javabin&version=2&replicaType=NRT} status=0 QTime=2202
   [junit4]   2> 952122 INFO  (qtp2181037-8083) [n:127.0.0.1:56355_solr    ] o.a.s.h.a.CollectionsHandler Wait for new collection to be active for at most 30 seconds. Check all shard replicas
   [junit4]   2> 952223 INFO  (zkCallback-1218-thread-1-processing-n:127.0.0.1:56354_solr) [n:127.0.0.1:56354_solr    ] o.a.s.c.c.ZkStateReader A cluster state change: [WatchedEvent state:SyncConnected type:NodeDataChanged path:/collections/testcollection/state.json] for collection [testcollection] has occurred - updating... (live nodes size: [2])
   [junit4]   2> 952223 INFO  (zkCallback-1218-thread-2-processing-n:127.0.0.1:56354_solr) [n:127.0.0.1:56354_solr    ] o.a.s.c.c.ZkStateReader A cluster state change: [WatchedEvent state:SyncConnected type:NodeDataChanged path:/collections/testcollection/state.json] for collection [testcollection] has occurred - updating... (live nodes size: [2])
   [junit4]   2> 952223 INFO  (zkCallback-1217-thread-2-processing-n:127.0.0.1:56355_solr) [n:127.0.0.1:56355_solr    ] o.a.s.c.c.ZkStateReader A cluster state change: [WatchedEvent state:SyncConnected type:NodeDataChanged path:/collections/testcollection/state.json] for collection [testcollection] has occurred - updating... (live nodes size: [2])
   [junit4]   2> 952223 INFO  (zkCallback-1217-thread-1-processing-n:127.0.0.1:56355_solr) [n:127.0.0.1:56355_solr    ] o.a.s.c.c.ZkStateReader A cluster state change: [WatchedEvent state:SyncConnected type:NodeDataChanged path:/collections/testcollection/state.json] for collection [testcollection] has occurred - updating... (live nodes size: [2])
   [junit4]   2> 953122 INFO  (qtp2181037-8083) [n:127.0.0.1:56355_solr    ] o.a.s.s.HttpSolrCall [admin] webapp=null path=/admin/collections params={replicationFactor=2&collection.configName=solrCloudCollectionConfig&maxShardsPerNode=2&name=testcollection&nrtReplicas=2&action=CREATE&numShards=2&wt=javabin&version=2} status=0 QTime=3529
   [junit4]   2> 953122 INFO  (TEST-TestAuthenticationFramework.testBasics-seed#[D32CE2E6E52511C5]) [    ] o.a.s.c.AbstractDistribZkTestBase Wait for recoveries to finish - collection: testcollection failOnTimeout:true timeout (sec):330
   [junit4]   1> -
   [junit4]   1> replica:core_node3 rstate:active live:true
   [junit4]   1> replica:core_node5 rstate:active live:true
   [junit4]   1> replica:core_node7 rstate:active live:true
   [junit4]   1> replica:core_node8 rstate:active live:true
   [junit4]   1> no one is recoverying
   [junit4]   2> 953123 INFO  (TEST-TestAuthenticationFramework.testBasics-seed#[D32CE2E6E52511C5]) [    ] o.a.s.c.AbstractDistribZkTestBase Recoveries finished - collection: testcollection
   [junit4]   2> 953126 INFO  (qtp2181037-8077) [n:127.0.0.1:56355_solr c:testcollection s:shard1 r:core_node5 x:testcollection_shard1_replica_n2] o.a.s.c.S.Request [testcollection_shard1_replica_n2]  webapp=/solr path=/select params={df=text&distrib=false&_stateVer_=testcollection:7&fl=id&fl=score&shards.purpose=4&start=0&fsv=true&shard.url=http://127.0.0.1:56355/solr/testcollection_shard1_replica_n2/|http://127.0.0.1:56354/solr/testcollection_shard1_replica_n1/&rows=10&version=2&q=*:*&NOW=1502383486714&isShard=true&wt=javabin} hits=0 status=0 QTime=0
   [junit4]   2> 953127 INFO  (qtp20660907-8093) [n:127.0.0.1:56354_solr c:testcollection s:shard2 r:core_node7 x:testcollection_shard2_replica_n4] o.a.s.c.S.Request [testcollection_shard2_replica_n4]  webapp=/solr path=/select params={df=text&distrib=false&_stateVer_=testcollection:7&fl=id&fl=score&shards.purpose=4&start=0&fsv=true&shard.url=http://127.0.0.1:56354/solr/testcollection_shard2_replica_n4/|http://127.0.0.1:56355/solr/testcollection_shard2_replica_n6/&rows=10&version=2&q=*:*&NOW=1502383486714&isShard=true&wt=javabin} hits=0 status=0 QTime=0
   [junit4]   2> 953128 INFO  (qtp20660907-8071) [n:127.0.0.1:56354_solr c:testcollection s:shard1 r:core_node3 x:testcollection_shard1_replica_n1] o.a.s.c.S.Request [testcollection_shard1_replica_n1]  webapp=/solr path=/select params={q=*:*&_stateVer_=testcollection:7&wt=javabin&version=2} hits=0 status=0 QTime=3
   [junit4]   2> 953143 INFO  (qtp20660907-8075) [n:127.0.0.1:56354_solr c:testcollection s:shard1 r:core_node3 x:testcollection_shard1_replica_n1] o.a.s.u.p.LogUpdateProcessorFactory [testcollection_shard1_replica_n1]  webapp=/solr path=/update params={update.distrib=FROMLEADER&distrib.from=http://127.0.0.1:56355/solr/testcollection_shard1_replica_n2/&wt=javabin&version=2}{add=[1 (1575363266969862144)]} 0 10
   [junit4]   2> 953143 INFO  (qtp2181037-8095) [n:127.0.0.1:56355_solr c:testcollection s:shard1 r:core_node5 x:testcollection_shard1_replica_n2] o.a.s.u.p.LogUpdateProcessorFactory [testcollection_shard1_replica_n2]  webapp=/solr path=/update params={_stateVer_=testcollection:7&wt=javabin&version=2}{add=[1 (1575363266969862144)]} 0 13
   [junit4]   2> 953143 INFO  (qtp20660907-8074) [n:127.0.0.1:56354_solr c:testcollection s:shard1 r:core_node3 x:testcollection_shard1_replica_n1] o.a.s.u.DirectUpdateHandler2 start commit{_version_=1575363266984542208,optimize=false,openSearcher=true,waitSearcher=true,expungeDeletes=false,softCommit=false,prepareCommit=false}
   [junit4]   2> 953143 INFO  (qtp20660907-8074) [n:127.0.0.1:56354_solr c:testcollection s:shard1 r:core_node3 x:testcollection_shard1_replica_n1] o.a.s.u.SolrIndexWriter Calling setCommitData with IW:org.apache.solr.update.SolrIndexWriter@10b8313 commitCommandVersion:1575363266984542208
   [junit4]   2> 953146 INFO  (qtp2181037-8096) [n:127.0.0.1:56355_solr c:testcollection s:shard1 r:core_node5 x:testcollection_shard1_replica_n2] o.a.s.u.DirectUpdateHandler2 start commit{_version_=1575363266987687936,optimize=false,openSearcher=true,waitSearcher=true,expungeDeletes=false,softCommit=false,prepareCommit=false}
   [junit4]   2> 953146 INFO  (qtp2181037-8096) [n:127.0.0.1:56355_solr c:testcollection s:shard1 r:core_node5 x:testcollection_shard1_replica_n2] o.a.s.u.SolrIndexWriter Calling setCommitData with IW:org.apache.solr.update.SolrIndexWriter@5fe3ed commitCommandVersion:1575363266987687936
   [junit4]   2> 953146 INFO  (qtp20660907-8091) [n:127.0.0.1:56354_solr c:testcollection s:shard2 r:core_node7 x:testcollection_shard2_replica_n4] o.a.s.u.DirectUpdateHandler2 start commit{_version_=1575363266987687936,optimize=false,openSearcher=true,waitSearcher=true,expungeDeletes=false,softCommit=false,prepareCommit=false}
   [junit4]   2> 953146 INFO  (qtp20660907-8091) [n:127.0.0.1:56354_solr c:testcollection s:shard2 r:core_node7 x:testcollection_shard2_replica_n4] o.a.s.u.DirectUpdateHandler2 No uncommitted changes. Skipping IW.commit.
   [junit4]   2> 953147 INFO  (qtp20660907-8091) [n:127.0.0.1:56354_solr c:testcollection s:shard2 r:core_node7 x:testcollection_shard2_replica_n4] o.a.s.u.DirectUpdateHandler2 end_commit_flush
   [junit4]   2> 953147 INFO  (qtp20660907-8091) [n:127.0.0.1:56354_solr c:testcollection s:shard2 r:core_node7 x:testcollection_shard2_replica_n4] o.a.s.u.p.LogUpdateProcessorFactory [testcollection_shard2_replica_n4]  webapp=/solr path=/update params={update.distrib=FROMLEADER&waitSearcher=true&openSearcher=true&commit=true&softCommit=false&distrib.from=http://127.0.0.1:56355/solr/testcollection_shard1_replica_n2/&commit_end_point=true&wt=javabin&version=2&expungeDeletes=false}{commit=} 0 1
   [junit4]   2> 953147 INFO  (qtp2181037-8081) [n:127.0.0.1:56355_solr c:testcollection s:shard2 r:core_node8 x:testcollection_shard2_replica_n6] o.a.s.u.DirectUpdateHandler2 start commit{_version_=1575363266988736512,optimize=false,openSearcher=true,waitSearcher=true,expungeDeletes=false,softCommit=false,prepareCommit=false}
   [junit4]   2> 953147 INFO  (qtp2181037-8081) [n:127.0.0.1:56355_solr c:testcollection s:shard2 r:core_node8 x:testcollection_shard2_replica_n6] o.a.s.u.DirectUpdateHandler2 No uncommitted changes. Skipping IW.commit.
   [junit4]   2> 953148 INFO  (qtp2181037-8081) [n:127.0.0.1:56355_solr c:testcollection s:shard2 r:core_node8 x:testcollection_shard2_replica_n6] o.a.s.u.DirectUpdateHandler2 end_commit_flush
   [junit4]   2> 953148 INFO  (qtp2181037-8081) [n:127.0.0.1:56355_solr c:testcollection s:shard2 r:core_node8 x:testcollection_shard2_replica_n6] o.a.s.u.p.LogUpdateProcessorFactory [testcollection_shard2_replica_n6]  webapp=/solr path=/update params={update.distrib=FROMLEADER&waitSearcher=true&openSearcher=true&commit=true&softCommit=false&distrib.from=http://127.0.0.1:56355/solr/testcollection_shard1_replica_n2/&commit_end_point=true&wt=javabin&version=2&expungeDeletes=false}{commit=} 0 0
   [junit4]   2> 953153 INFO  (qtp20660907-8074) [n:127.0.0.1:56354_solr c:testcollection s:shard1 r:core_node3 x:testcollection_shard1_replica_n1] o.a.s.s.SolrIndexSearcher Opening [Searcher@a726[testcollection_shard1_replica_n1] main]
   [junit4]   2> 953155 INFO  (searcherExecutor-3358-thread-1-processing-n:127.0.0.1:56354_solr x:testcollection_shard1_replica_n1 s:shard1 c:testcollection r:core_node3) [n:127.0.0.1:56354_solr c:testcollection s:shard1 r:core_node3 x:testcollection_shard1_replica_n1] o.a.s.c.SolrCore [testcollection_shard1_replica_n1] Registered new searcher Searcher@a726[testcollection_shard1_replica_n1] main{ExitableDirectoryReader(UninvertingDirectoryReader(Uninverting(_0(8.0.0):C1)))}
   [junit4]   2> 953155 INFO  (qtp20660907-8074) [n:127.0.0.1:56354_solr c:testcollection s:shard1 r:core_node3 x:testcollection_shard1_replica_n1] o.a.s.u.DirectUpdateHandler2 end_commit_flush
   [junit4]   2> 953156 INFO  (qtp20660907-8074) [n:127.0.0.1:56354_solr c:testcollection s:shard1 r:core_node3 x:testcollection_shard1_replica_n1] o.a.s.u.p.LogUpdateProcessorFactory [testcollection_shard1_replica_n1]  webapp=/solr path=/update params={update.distrib=FROMLEADER&waitSearcher=true&openSearcher=true&commit=true&softCommit=false&distrib.from=http://127.0.0.1:56355/solr/testcollection_shard1_replica_n2/&commit_end_point=true&wt=javabin&version=2&expungeDeletes=false}{commit=} 0 11
   [junit4]   2> 953156 INFO  (qtp2181037-8096) [n:127.0.0.1:56355_solr c:testcollection s:shard1 r:core_node5 x:testcollection_shard1_replica_n2] o.a.s.s.SolrIndexSearcher Opening [Searcher@115a428[testcollection_shard1_replica_n2] main]
   [junit4]   2> 953157 INFO  (qtp2181037-8096) [n:127.0.0.1:56355_solr c:testcollection s:shard1 r:core_node5 x:testcollection_shard1_replica_n2] o.a.s.u.DirectUpdateHandler2 end_commit_flush
   [junit4]   2> 953157 INFO  (searcherExecutor-3355-thread-1-processing-n:127.0.0.1:56355_solr x:testcollection_shard1_replica_n2 s:shard1 c:testcollection r:core_node5) [n:127.0.0.1:56355_solr c:testcollection s:shard1 r:core_node5 x:testcollection_shard1_replica_n2] o.a.s.c.SolrCore [testcollection_shard1_replica_n2] Registered new searcher Searcher@115a428[testcollection_shard1_replica_n2] main{ExitableDirectoryReader(UninvertingDirectoryReader(Uninverting(_0(8.0.0):C1)))}
   [junit4]   2> 953158 INFO  (qtp2181037-8096) [n:127.0.0.1:56355_solr c:testcollection s:shard1 r:core_node5 x:testcollection_shard1_replica_n2] o.a.s.u.p.LogUpdateProcessorFactory [testcollection_shard1_replica_n2]  webapp=/solr path=/update params={update.distrib=FROMLEADER&waitSearcher=true&openSearcher=true&commit=true&softCommit=false&distrib.from=http://127.0.0.1:56355/solr/testcollection_shard1_replica_n2/&commit_end_point=true&wt=javabin&version=2&expungeDeletes=false}{commit=} 0 12
   [junit4]   2> 953158 INFO  (qtp2181037-8094) [n:127.0.0.1:56355_solr c:testcollection s:shard1 r:core_node5 x:testcollection_shard1_replica_n2] o.a.s.u.p.LogUpdateProcessorFactory [testcollection_shard1_replica_n2]  webapp=/solr path=/update params={_stateVer_=testcollection:7&commit=true&wt=javabin&version=2}{commit=} 0 14
   [junit4]   2> 953159 INFO  (qtp2181037-8080) [n:127.0.0.1:56355_solr c:testcollection s:shard2 r:core_node8 x:testcollection_shard2_replica_n6] o.a.s.c.S.Request [testcollection_shard2_replica_n6]  webapp=/solr path=/select params={df=text&distrib=false&_stateVer_=testcollection:7&fl=id&fl=score&shards.purpose=4&start=0&fsv=true&shard.url=http://127.0.0.1:56355/solr/testcollection_shard2_replica_n6/|http://127.0.0.1:56354/solr/testcollection_shard2_replica_n4/&rows=10&version=2&q=*:*&NOW=1502383486748&isShard=true&wt=javabin} hits=0 status=0 QTime=0
   [junit4]   2> 953159 INFO  (qtp2181037-8080) [n:127.0.0.1:56355_solr c:testcollection s:shard1 r:core_node5 x:testcollection_shard1_replica_n2] o.a.s.c.S.Request [testcollection_shard1_replica_n2]  webapp=/solr path=/select params={df=text&distrib=false&_stateVer_=testcollection:7&fl=id&fl=score&shards.purpose=4&start=0&fsv=true&shard.url=http://127.0.0.1:56355/solr/testcollection_shard1_replica_n2/|http://127.0.0.1:56354/solr/testcollection_shard1_replica_n1/&rows=10&version=2&q=*:*&NOW=1502383486748&isShard=true&wt=javabin} hits=1 status=0 QTime=0
   [junit4]   2> 953160 INFO  (qtp2181037-8079) [n:127.0.0.1:56355_solr c:testcollection s:shard1 r:core_node5 x:testcollection_shard1_replica_n2] o.a.s.c.S.Request [testcollection_shard1_replica_n2]  webapp=/solr path=/select params={q=*:*&df=text&distrib=false&_stateVer_=testcollection:7&shards.purpose=64&NOW=1502383486748&ids=1&isShard=true&shard.url=http://127.0.0.1:56355/solr/testcollection_shard1_replica_n2/|http://127.0.0.1:56354/solr/testcollection_shard1_replica_n1/&wt=javabin&version=2} status=0 QTime=0
   [junit4]   2> 953161 INFO  (qtp20660907-8069) [n:127.0.0.1:56354_solr c:testcollection s:shard1 r:core_node3 x:testcollection_shard1_replica_n1] o.a.s.c.S.Request [testcollection_shard1_replica_n1]  webapp=/solr path=/select params={q=*:*&_stateVer_=testcollection:7&wt=javabin&version=2} hits=1 status=0 QTime=2
   [junit4]   2> 953161 INFO  (qtp2181037-8095) [n:127.0.0.1:56355_solr    ] o.a.s.h.a.CollectionsHandler Invoked Collection Action :delete with params name=testcollection&action=DELETE&wt=javabin&version=2 and sendToOCPQueue=true
   [junit4]   2> 953164 INFO  (OverseerCollectionConfigSetProcessor-98460203921113093-127.0.0.1:56355_solr-n_0000000000) [n:127.0.0.1:56355_solr    ] o.a.s.c.OverseerTaskQueue Response ZK path: /overseer/collection-queue-work/qnr-0000000000 doesn't exist.  Requestor may have disconnected from ZooKeeper
   [junit4]   2> 953165 INFO  (OverseerThreadFactory-3350-thread-2-processing-n:127.0.0.1:56355_solr) [n:127.0.0.1:56355_solr    ] o.a.s.c.OverseerCollectionMessageHandler Executing Collection Cmd : action=UNLOAD&deleteInstanceDir=true&deleteDataDir=true
   [junit4]   2> 953167 INFO  (qtp20660907-8073) [n:127.0.0.1:56354_solr    ] o.a.s.m.SolrMetricManager Closing metric reporters for registry=solr.core.testcollection.shard1.replica_n1, tag=null
   [junit4]   2> 953167 INFO  (qtp2181037-8085) [n:127.0.0.1:56355_solr    ] o.a.s.m.SolrMetricManager Closing metric reporters for registry=solr.core.testcollection.shard1.replica_n2, tag=null
   [junit4]   2> 953172 INFO  (qtp20660907-8072) [n:127.0.0.1:56354_solr    ] o.a.s.m.SolrMetricManager Closing metric reporters for registry=solr.core.testcollection.shard2.replica_n4, tag=null
   [junit4]   2> 953172 INFO  (qtp20660907-8073) [n:127.0.0.1:56354_solr    ] o.a.s.c.SolrCore [testcollection_shard1_replica_n1]  CLOSING SolrCore org.apache.solr.core.SolrCore@18d15d3
   [junit4]   2> 953172 INFO  (qtp2181037-8081) [n:127.0.0.1:56355_solr    ] o.a.s.m.SolrMetricManager Closing metric reporters for registry=solr.core.testcollection.shard2.replica_n6, tag=null
   [junit4]   2> 953172 INFO  (qtp2181037-8085) [n:127.0.0.1:56355_solr    ] o.a.s.c.SolrCore [testcollection_shard1_replica_n2]  CLOSING SolrCore org.apache.solr.core.SolrCore@14ba1b0
   [junit4]   2> 953179 INFO  (qtp2181037-8085) [n:127.0.0.1:56355_solr    ] o.a.s.m.SolrMetricManager Closing metric reporters for registry=solr.core.testcollection.shard1.replica_n2, tag=21733808
   [junit4]   2> 953179 INFO  (qtp2181037-8081) [n:127.0.0.1:56355_solr    ] o.a.s.c.SolrCore [testcollection_shard2_replica_n6]  CLOSING SolrCore org.apache.solr.core.SolrCore@80a5d5
   [junit4]   2> 953179 INFO  (qtp2181037-8085) [n:127.0.0.1:56355_solr    ] o.a.s.m.SolrMetricManager Closing metric reporters for registry=solr.collection.testcollection.shard1.leader, tag=21733808
   [junit4]   2> 953180 INFO  (qtp20660907-8073) [n:127.0.0.1:56354_solr    ] o.a.s.m.SolrMetricManager Closing metric reporters for registry=solr.core.testcollection.shard1.replica_n1, tag=26023379
   [junit4]   2> 953180 INFO  (qtp20660907-8072) [n:127.0.0.1:56354_solr    ] o.a.s.c.SolrCore [testcollection_shard2_replica_n4]  CLOSING SolrCore org.apache.solr.core.SolrCore@18bab0b
   [junit4]   2> 953180 INFO  (qtp20660907-8073) [n:127.0.0.1:56354_solr    ] o.a.s.m.SolrMetricManager Closing metric reporters for registry=solr.collection.testcollection.shard1.leader, tag=26023379
   [junit4]   2> 953181 INFO  (qtp2181037-8081) [n:127.0.0.1:56355_solr    ] o.a.s.m.SolrMetricManager Closing metric reporters for registry=solr.core.testcollection.shard2.replica_n6, tag=8431061
   [junit4]   2> 953181 INFO  (qtp2181037-8081) [n:127.0.0.1:56355_solr    ] o.a.s.m.SolrMetricManager Closing metric reporters for registry=solr.collection.testcollection.shard2.leader, tag=8431061
   [junit4]   2> 953181 INFO  (qtp20660907-8072) [n:127.0.0.1:56354_solr    ] o.a.s.m.SolrMetricManager Closing metric reporters for registry=solr.core.testcollection.shard2.replica_n4, tag=25930507
   [junit4]   2> 953181 INFO  (qtp20660907-8072) [n:127.0.0.1:56354_solr    ] o.a.s.m.SolrMetricManager Closing metric reporters for registry=solr.collection.testcollection.shard2.leader, tag=25930507
   [junit4]   2> 953188 WARN  (zkCallback-1218-thread-2-processing-n:127.0.0.1:56354_solr) [n:127.0.0.1:56354_solr    ] o.a.s.c.LeaderElector 
   [junit4]   2> org.apache.solr.common.SolrException: SolrCore not found:testcollection_shard1_replica_n1 in []
   [junit4]   2> 	at org.apache.solr.cloud.ShardLeaderElectionContext.runLeaderProcess(ElectionContext.java:297)
   [junit4]   2> 	at org.apache.solr.cloud.LeaderElector.runIamLeaderProcess(LeaderElector.java:170)
   [junit4]   2> 	at org.apache.solr.cloud.LeaderElector.checkIfIamLeader(LeaderElector.java:135)
   [junit4]   2> 	at org.apache.solr.cloud.LeaderElector.access$200(LeaderElector.java:56)
   [junit4]   2> 	at org.apache.solr.cloud.LeaderElector$ElectionWatcher.process(LeaderElector.java:348)
   [junit4]   2> 	at org.apache.solr.common.cloud.SolrZkClient$3.lambda$process$0(SolrZkClient.java:269)
   [junit4]   2> 	at java.util.concurrent.Executors$RunnableAdapter.call(Executors.java:511)
   [junit4]   2> 	at java.util.concurrent.FutureTask.run(FutureTask.java:266)
   [junit4]   2> 	at org.apache.solr.common.util.ExecutorUtil$MDCAwareThreadPoolExecutor.lambda$execute$0(ExecutorUtil.java:188)
   [junit4]   2> 	at java.util.concurrent.ThreadPoolExecutor.runWorker(ThreadPoolExecutor.java:1149)
   [junit4]   2> 	at java.util.concurrent.ThreadPoolExecutor$Worker.run(ThreadPoolExecutor.java:624)
   [junit4]   2> 	at java.lang.Thread.run(Thread.java:748)
   [junit4]   2> 953191 INFO  (qtp2181037-8085) [n:127.0.0.1:56355_solr    ] o.a.s.s.HttpSolrCall [admin] webapp=null path=/admin/cores params={deleteInstanceDir=true&core=testcollection_shard1_replica_n2&qt=/admin/cores&deleteDataDir=true&action=UNLOAD&wt=javabin&version=2} status=0 QTime=25
   [junit4]   2> 953191 INFO  (qtp20660907-8072) [n:127.0.0.1:56354_solr    ] o.a.s.c.ShardLeaderElectionContextBase No version found for ephemeral leader parent node, won't remove previous leader registration.
   [junit4]   2> 953191 WARN  (zkCallback-1218-thread-2-processing-n:127.0.0.1:56354_solr) [n:127.0.0.1:56354_solr    ] o.a.s.c.LeaderElector Our node is no longer in line to be leader
   [junit4]   2> 953191 INFO  (qtp2181037-8081) [n:127.0.0.1:56355_solr    ] o.a.s.s.HttpSolrCall [admin] webapp=null path=/admin/cores params={deleteInstanceDir=true&core=testcollection_shard2_replica_n6&qt=/admin/cores&deleteDataDir=true&action=UNLOAD&wt=javabin&version=2} status=0 QTime=21
   [junit4]   2> 953192 INFO  (qtp20660907-8072) [n:127.0.0.1:56354_solr    ] o.a.s.s.HttpSolrCall [admin] webapp=null path=/admin/cores params={deleteInstanceDir=true&core=testcollection_shard2_replica_n4&qt=/admin/cores&deleteDataDir=true&action=UNLOAD&wt=javabin&version=2} status=0 QTime=22
   [junit4]   2> 953200 INFO  (qtp20660907-8073) [n:127.0.0.1:56354_solr    ] o.a.s.c.ShardLeaderElectionContextBase No version found for ephemeral leader parent node, won't remove previous leader registration.
   [junit4]   2> 953201 INFO  (qtp20660907-8073) [n:127.0.0.1:56354_solr    ] o.a.s.s.HttpSolrCall [admin] webapp=null path=/admin/cores params={deleteInstanceDir=true&core=testcollection_shard1_replica_n1&qt=/admin/cores&deleteDataDir=true&action=UNLOAD&wt=javabin&version=2} status=0 QTime=35
   [junit4]   2> 953905 INFO  (qtp2181037-8095) [n:127.0.0.1:56355_solr    ] o.a.s.s.HttpSolrCall [admin] webapp=null path=/admin/collections params={name=testcollection&action=DELETE&wt=javabin&version=2} status=0 QTime=743
   [junit4]   2> 953905 INFO  (TEST-TestAuthenticationFramework.testBasics-seed#[D32CE2E6E52511C5]) [    ] o.a.s.c.AbstractDistribZkTestBase Wait for collection to disappear - collection: testcollection failOnTimeout:true timeout (sec):330
   [junit4]   1> -
   [junit4]   2> 953905 INFO  (TEST-TestAuthenticationFramework.testBasics-seed#[D32CE2E6E52511C5]) [    ] o.a.s.c.AbstractDistribZkTestBase Collection has disappeared - collection: testcollection
   [junit4]   2> 953906 INFO  (qtp2181037-8096) [n:127.0.0.1:56355_solr    ] o.a.s.h.a.CollectionsHandler Invoked Collection Action :create with params async=eb673538-8ce9-442d-a1f7-6cd59bdcd86c&replicationFactor=2&collection.configName=solrCloudCollectionConfig&maxShardsPerNode=2&name=testcollection&nrtReplicas=2&action=CREATE&numShards=2&wt=javabin&version=2 and sendToOCPQueue=true
   [junit4]   2> 953908 INFO  (qtp2181037-8096) [n:127.0.0.1:56355_solr    ] o.a.s.s.HttpSolrCall [admin] webapp=null path=/admin/collections params={async=eb673538-8ce9-442d-a1f7-6cd59bdcd86c&replicationFactor=2&collection.configName=solrCloudCollectionConfig&maxShardsPerNode=2&name=testcollection&nrtReplicas=2&action=CREATE&numShards=2&wt=javabin&version=2} status=0 QTime=1
   [junit4]   2> 953908 INFO  (qtp2181037-8094) [n:127.0.0.1:56355_solr    ] o.a.s.h.a.CollectionsHandler Invoked Collection Action :requeststatus with params requestid=eb673538-8ce9-442d-a1f7-6cd59bdcd86c&action=REQUESTSTATUS&wt=javabin&version=2 and sendToOCPQueue=true
   [junit4]   2> 953909 INFO  (qtp2181037-8094) [n:127.0.0.1:56355_solr    ] o.a.s.s.HttpSolrCall [admin] webapp=null path=/admin/collections params={requestid=eb673538-8ce9-442d-a1f7-6cd59bdcd86c&action=REQUESTSTATUS&wt=javabin&version=2} status=0 QTime=1
   [junit4]   2> 953909 INFO  (OverseerThreadFactory-3350-thread-3-processing-n:127.0.0.1:56355_solr) [n:127.0.0.1:56355_solr    ] o.a.s.c.CreateCollectionCmd Create collection testcollection
   [junit4]   2> 953909 INFO  (OverseerCollectionConfigSetProcessor-98460203921113093-127.0.0.1:56355_solr-n_0000000000) [n:127.0.0.1:56355_solr    ] o.a.s.c.OverseerTaskQueue Response ZK path: /overseer/collection-queue-work/qnr-0000000002 doesn't exist.  Requestor may have disconnected from ZooKeeper
   [junit4]   2> 954116 INFO  (OverseerStateUpdate-98460203921113093-127.0.0.1:56355_solr-n_0000000000) [n:127.0.0.1:56355_solr    ] o.a.s.c.o.SliceMutator createReplica() {
   [junit4]   2>   "operation":"ADDREPLICA",
   [junit4]   2>   "collection":"testcollection",
   [junit4]   2>   "shard":"shard1",
   [junit4]   2>   "core":"testcollection_shard1_replica_n1",
   [junit4]   2>   "state":"down",
   [junit4]   2>   "base_url":"http://127.0.0.1:56355/solr",
   [junit4]   2>   "type":"NRT"} 
   [junit4]   2> 954121 INFO  (OverseerStateUpdate-98460203921113093-127.0.0.1:56355_solr-n_0000000000) [n:127.0.0.1:56355_solr    ] o.a.s.c.o.SliceMutator createReplica() {
   [junit4]   2>   "operation":"ADDREPLICA",
   [junit4]   2>   "collection":"testcollection",
   [junit4]   2>   "shard":"shard1",
   [junit4]   2>   "core":"testcollection_shard1_replica_n3",
   [junit4]   2>   "state":"down",
   [junit4]   2>   "base_url":"http://127.0.0.1:56354/solr",
   [junit4]   2>   "type":"NRT"} 
   [junit4]   2> 954124 INFO  (OverseerStateUpdate-98460203921113093-127.0.0.1:56355_solr-n_0000000000) [n:127.0.0.1:56355_solr    ] o.a.s.c.o.SliceMutator createReplica() {
   [junit4]   2>   "operation":"ADDREPLICA",
   [junit4]   2>   "collection":"testcollection",
   [junit4]   2>   "shard":"shard2",
   [junit4]   2>   "core":"testcollection_shard2_replica_n4",
   [junit4]   2>   "state":"down",
   [junit4]   2>   "base_url":"http://127.0.0.1:56355/solr",
   [junit4]   2>   "type":"NRT"} 
   [junit4]   2> 954127 INFO  (OverseerStateUpdate-98460203921113093-127.0.0.1:56355_solr-n_0000000000) [n:127.0.0.1:56355_solr    ] o.a.s.c.o.SliceMutator createReplica() {
   [junit4]   2>   "operation":"ADDREPLICA",
   [junit4]   2>   "collection":"testcollection",
   [junit4]   2>   "shard":"shard2",
   [junit4]   2>   "core":"testcollection_shard2_replica_n6",
   [junit4]   2>   "state":"down",
   [junit4]   2>   "base_url":"http://127.0.0.1:56354/solr",
   [junit4]   2>   "type":"NRT"} 
   [junit4]   2> 954327 INFO  (qtp2181037-8077) [n:127.0.0.1:56355_solr    ] o.a.s.s.HttpSolrCall [admin] webapp=null path=/admin/cores params={qt=/admin/cores&collection.configName=solrCloudCollectionConfig&newCollection=true&collection=testcollection&version=2&replicaType=NRT&async=eb673538-8ce9-442d-a1f7-6cd59bdcd86c98506919267817&coreNodeName=core_node2&name=testcollection_shard1_replica_n1&action=CREATE&numShards=2&shard=shard1&wt=javabin} status=0 QTime=0
   [junit4]   2> 954327 INFO  (qtp20660907-8071) [n:127.0.0.1:56354_solr    ] o.a.s.s.HttpSolrCall [admin] webapp=null path=/admin/cores params={qt=/admin/cores&collection.configName=solrCloudCollectionConfig&newCollection=true&collection=testcollection&version=2&replicaType=NRT&async=eb673538-8ce9-442d-a1f7-6cd59bdcd86c98506927726628&coreNodeName=core_node8&name=testcollection_shard2_replica_n6&action=CREATE&numShards=2&shard=shard2&wt=javabin} status=0 QTime=0
   [junit4]   2> 954327 INFO  (qtp20660907-8093) [n:127.0.0.1:56354_solr    ] o.a.s.s.HttpSolrCall [admin] webapp=null path=/admin/cores params={qt=/admin/cores&collection.configName=solrCloudCollectionConfig&newCollection=true&collection=testcollection&version=2&replicaType=NRT&async=eb673538-8ce9-442d-a1f7-6cd59bdcd86c98506922803462&coreNodeName=core_node5&name=testcollection_shard1_replica_n3&action=CREATE&numShards=2&shard=shard1&wt=javabin} status=0 QTime=0
   [junit4]   2> 954327 INFO  (qtp2181037-8083) [n:127.0.0.1:56355_solr    ] o.a.s.s.HttpSolrCall [admin] webapp=null path=/admin/cores params={qt=/admin/cores&collection.configName=solrCloudCollectionConfig&newCollection=true&collection=testcollection&version=2&replicaType=NRT&async=eb673538-8ce9-442d-a1f7-6cd59bdcd86c98506925274147&coreNodeName=core_node7&name=testcollection_shard2_replica_n4&action=CREATE&numShards=2&shard=shard2&wt=javabin} status=0 QTime=0
   [junit4]   2> 954327 INFO  (parallelCoreAdminExecutor-3352-thread-1-processing-n:127.0.0.1:56355_solr eb673538-8ce9-442d-a1f7-6cd59bdcd86c98506919267817 CREATE) [n:127.0.0.1:56355_solr    ] o.a.s.h.a.CoreAdminOperation core create command qt=/admin/cores&collection.configName=solrCloudCollectionConfig&newCollection=true&collection=testcollection&version=2&replicaType=NRT&async=eb673538-8ce9-442d-a1f7-6cd59bdcd86c98506919267817&coreNodeName=core_node2&name=testcollection_shard1_replica_n1&action=CREATE&numShards=2&shard=shard1&wt=javabin
   [junit4]   2> 954327 INFO  (qtp20660907-8075) [n:127.0.0.1:56354_solr    ] o.a.s.h.a.CoreAdminOperation Checking request status for : eb673538-8ce9-442d-a1f7-6cd59bdcd86c98506927726628
   [junit4]   2> 954327 INFO  (qtp20660907-8075) [n:127.0.0.1:56354_solr    ] o.a.s.s.HttpSolrCall [admin] webapp=null path=/admin/cores params={qt=/admin/cores&requestid=eb673538-8ce9-442d-a1f7-6cd59bdcd86c98506927726628&action=REQUESTST

[...truncated too long message...]

cb0003, likely client has closed socket
   [junit4]   2> 	at org.apache.zookeeper.server.NIOServerCnxn.doIO(NIOServerCnxn.java:239)
   [junit4]   2> 	at org.apache.zookeeper.server.NIOServerCnxnFactory.run(NIOServerCnxnFactory.java:203)
   [junit4]   2> 	at java.lang.Thread.run(Thread.java:748)
   [junit4]   2> 1940728 WARN  (NIOServerCxn.Factory:0.0.0.0/0.0.0.0:0) [    ] o.a.z.s.NIOServerCnxn caught end of stream exception
   [junit4]   2> EndOfStreamException: Unable to read additional data from client sessionid 0x15dcd17c7cb0001, likely client has closed socket
   [junit4]   2> 	at org.apache.zookeeper.server.NIOServerCnxn.doIO(NIOServerCnxn.java:239)
   [junit4]   2> 	at org.apache.zookeeper.server.NIOServerCnxnFactory.run(NIOServerCnxnFactory.java:203)
   [junit4]   2> 	at java.lang.Thread.run(Thread.java:748)
   [junit4]   2> 1940729 ERROR (TEST-ZkCLITest.testUpdateAcls-seed#[D32CE2E6E52511C5]) [    ] o.a.z.s.ZooKeeperServer ZKShutdownHandler is not registered, so ZooKeeper server won't take any action on ERROR or SHUTDOWN server state changes
   [junit4]   2> 1940729 INFO  (TEST-ZkCLITest.testUpdateAcls-seed#[D32CE2E6E52511C5]) [    ] o.a.s.c.ZkTestServer connecting to 127.0.0.1:49890 49890
   [junit4]   2> 1940730 INFO  (Thread-3437) [    ] o.a.s.c.ZkTestServer connecting to 127.0.0.1:49890 49890
   [junit4]   2> 1940731 INFO  (TEST-ZkCLITest.testUpdateAcls-seed#[D32CE2E6E52511C5]) [    ] o.a.s.SolrTestCaseJ4 ###Ending testUpdateAcls
   [junit4]   2> 1940733 INFO  (TEST-ZkCLITest.testGet-seed#[D32CE2E6E52511C5]) [    ] o.a.s.SolrTestCaseJ4 ###Starting testGet
   [junit4]   2> 1940733 INFO  (TEST-ZkCLITest.testGet-seed#[D32CE2E6E52511C5]) [    ] o.a.s.c.ZkCLITest ####SETUP_START testGet
   [junit4]   2> 1940860 INFO  (TEST-ZkCLITest.testGet-seed#[D32CE2E6E52511C5]) [    ] o.a.s.c.ZkCLITest ZooKeeper dataDir:C:\Users\jenkins\workspace\Lucene-Solr-master-Windows\solr\build\solr-core\test\J0\temp\solr.cloud.ZkCLITest_D32CE2E6E52511C5-001\tempDir-032\zookeeper/server1/data
   [junit4]   2> 1940860 INFO  (TEST-ZkCLITest.testGet-seed#[D32CE2E6E52511C5]) [    ] o.a.s.c.ZkTestServer STARTING ZK TEST SERVER
   [junit4]   2> 1940860 INFO  (Thread-3438) [    ] o.a.s.c.ZkTestServer client port:0.0.0.0/0.0.0.0:0
   [junit4]   2> 1940860 INFO  (Thread-3438) [    ] o.a.s.c.ZkTestServer Starting server
   [junit4]   2> 1940864 ERROR (Thread-3438) [    ] o.a.z.s.ZooKeeperServer ZKShutdownHandler is not registered, so ZooKeeper server won't take any action on ERROR or SHUTDOWN server state changes
   [junit4]   2> 1940961 INFO  (TEST-ZkCLITest.testGet-seed#[D32CE2E6E52511C5]) [    ] o.a.s.c.ZkTestServer start zk server on port:49905
   [junit4]   2> 1940975 INFO  (TEST-ZkCLITest.testGet-seed#[D32CE2E6E52511C5]) [    ] o.a.s.c.ZkCLITest ####SETUP_END testGet
   [junit4]   2> 1940978 ERROR (TEST-ZkCLITest.testGet-seed#[D32CE2E6E52511C5]) [    ] o.a.z.s.ZooKeeperServer ZKShutdownHandler is not registered, so ZooKeeper server won't take any action on ERROR or SHUTDOWN server state changes
   [junit4]   2> 1940979 INFO  (TEST-ZkCLITest.testGet-seed#[D32CE2E6E52511C5]) [    ] o.a.s.c.ZkTestServer connecting to 127.0.0.1:49905 49905
   [junit4]   2> 1940979 INFO  (Thread-3438) [    ] o.a.s.c.ZkTestServer connecting to 127.0.0.1:49905 49905
   [junit4]   2> 1940980 INFO  (TEST-ZkCLITest.testGet-seed#[D32CE2E6E52511C5]) [    ] o.a.s.SolrTestCaseJ4 ###Ending testGet
   [junit4]   2> 1940981 INFO  (SUITE-ZkCLITest-seed#[D32CE2E6E52511C5]-worker) [    ] o.a.s.SolrTestCaseJ4 ------------------------------------------------------- Done waiting for tracked resources to be released
   [junit4]   2> Aug 10, 2017 5:01:14 PM com.carrotsearch.randomizedtesting.ThreadLeakControl checkThreadLeaks
   [junit4]   2> WARNING: Will linger awaiting termination of 2 leaked thread(s).
   [junit4]   2> NOTE: test params are: codec=CheapBastard, sim=RandomSimilarity(queryNorm=false): {}, locale=ar-AE, timezone=America/Chihuahua
   [junit4]   2> NOTE: Windows 10 10.0 x86/Oracle Corporation 1.8.0_144 (32-bit)/cpus=3,threads=1,free=78051176,total=536870912
   [junit4]   2> NOTE: All tests run in this JVM: [TestConfigSetsAPIZkFailure, HLLSerializationTest, TestTolerantUpdateProcessorCloud, TestStressCloudBlindAtomicUpdates, CollectionStateFormat2Test, NoCacheHeaderTest, SuggestComponentContextFilterQueryTest, TestHdfsBackupRestoreCore, TestMiniSolrCloudClusterSSL, DateMathParserTest, TestRandomRequestDistribution, TestFaceting, MultiThreadedOCPTest, TestConfigsApi, GraphQueryTest, CloudExitableDirectoryReaderTest, TestNRTOpen, UniqFieldsUpdateProcessorFactoryTest, CurrencyFieldTypeTest, BlockCacheTest, TestSurroundQueryParser, BufferStoreTest, TestSolrDeletionPolicy2, TestMacros, TestBlobHandler, ReplaceNodeTest, ResponseHeaderTest, PropertiesRequestHandlerTest, TestLegacyNumericUtils, MoveReplicaHDFSUlogDirTest, OutputWriterTest, CdcrReplicationDistributedZkTest, SolrShardReporterTest, SyncSliceTest, SolrInfoBeanTest, TestCorePropertiesReload, DefaultValueUpdateProcessorTest, TestSubQueryTransformer, TestBulkSchemaConcurrent, SuggesterTest, TestDistributedSearch, TestPullReplicaErrorHandling, TestPayloadCheckQParserPlugin, DeleteReplicaTest, TestTrackingShardHandlerFactory, CoreSorterTest, UUIDFieldTest, TestBlendedInfixSuggestions, BlockJoinFacetRandomTest, SimplePostToolTest, PrimUtilsTest, CursorPagingTest, TestFoldingMultitermQuery, TestSolrConfigHandler, TestHashQParserPlugin, TestHashPartitioner, TestCollectionAPI, TestNonDefinedSimilarityFactory, QueryResultKeyTest, SpatialFilterTest, DisMaxRequestHandlerTest, SoftAutoCommitTest, TestNamedUpdateProcessors, TestClusterStateMutator, DirectUpdateHandlerTest, OverseerTest, SuggesterWFSTTest, TestGeoJSONResponseWriter, TestAddFieldRealTimeGet, CdcrRequestHandlerTest, TlogReplayBufferedWhileIndexingTest, TestFreeTextSuggestions, TestPolicyCloud, TestCloudSearcherWarming, MissingSegmentRecoveryTest, TestLFUCache, TestNumericTerms64, RecoveryZkTest, MultiTermTest, BJQParserTest, ShardRoutingTest, HighlighterMaxOffsetTest, CloudMLTQParserTest, TestSegmentSorting, LeaderInitiatedRecoveryOnShardRestartTest, DistributedQueryComponentCustomSortTest, BooleanFieldTest, TestSolrCloudWithKerberosAlt, URLClassifyProcessorTest, TestComplexPhraseLeadingWildcard, TestLazyCores, InfoHandlerTest, LeaderElectionContextKeyTest, TestSQLHandler, TestClassicSimilarityFactory, TestHdfsCloudBackupRestore, TestHttpShardHandlerFactory, TestTrieFacet, RequestLoggingTest, DirectSolrConnectionTest, ResourceLoaderTest, OutOfBoxZkACLAndCredentialsProvidersTest, SolrMetricManagerTest, TestPhraseSuggestions, TestSolrCoreParser, NotRequiredUniqueKeyTest, FieldAnalysisRequestHandlerTest, DocValuesNotIndexedTest, TestRecoveryHdfs, ReturnFieldsTest, TestConfigSetsAPI, TestCloudSchemaless, TestFieldCacheVsDocValues, TestMissingGroups, XmlUpdateRequestHandlerTest, TestIBSimilarityFactory, TestReversedWildcardFilterFactory, TestSchemalessBufferedUpdates, ResponseLogComponentTest, DocExpirationUpdateProcessorFactoryTest, DistributedSuggestComponentTest, HighlighterTest, TestQuerySenderListener, ZkStateWriterTest, SolrGraphiteReporterTest, TestStressLiveNodes, TestOrdValues, PeerSyncWithIndexFingerprintCachingTest, SolrXmlInZkTest, TestSolrConfigHandlerCloud, OverseerCollectionConfigSetProcessorTest, TestCoreContainer, TestBinaryField, TestFunctionQuery, AliasIntegrationTest, SortByFunctionTest, SegmentsInfoRequestHandlerTest, TestCodecSupport, TestIndexingPerformance, TestManagedSynonymGraphFilterFactory, TestDFRSimilarityFactory, BasicAuthIntegrationTest, DistributedFacetExistsSmallTest, TestStandardQParsers, CustomCollectionTest, BaseCdcrDistributedZkTest, TestMultiValuedNumericRangeQuery, TestCustomDocTransformer, SolrTestCaseJ4Test, TestLeaderElectionZkExpiry, SolrIndexSplitterTest, TestQueryWrapperFilter, TestManagedResourceStorage, TestSmileRequest, SolrCLIZkUtilsTest, ScriptEngineTest, DistributedSpellCheckComponentTest, TestDynamicLoading, QueryElevationComponentTest, V2StandaloneTest, TestReqParamsAPI, HdfsLockFactoryTest, TestInPlaceUpdatesStandalone, TestDeleteCollectionOnDownNodes, ZkControllerTest, CircularListTest, LeaderFailureAfterFreshStartTest, TestHighlightDedupGrouping, SimpleFacetsTest, VersionInfoTest, FastVectorHighlighterTest, TestSolrCoreProperties, SpellCheckCollatorWithCollapseTest, HdfsWriteToMultipleCollectionsTest, BasicDistributedZkTest, ZkCLITest]
   [junit4]   2> NOTE: reproduce with: ant test  -Dtestcase=ZkCLITest -Dtests.seed=D32CE2E6E52511C5 -Dtests.slow=true -Dtests.locale=ar-AE -Dtests.timezone=America/Chihuahua -Dtests.asserts=true -Dtests.file.encoding=ISO-8859-1
   [junit4] ERROR   0.00s J0 | ZkCLITest (suite) <<<
   [junit4]    > Throwable #1: java.io.IOException: Could not remove the following files (in the order of attempts):
   [junit4]    >    C:\Users\jenkins\workspace\Lucene-Solr-master-Windows\solr\build\solr-core\test\J0\temp\solr.cloud.ZkCLITest_D32CE2E6E52511C5-001\tempDir-013\solrtest-confdropspot-org.apache.solr.cloud.ZkCLITest-99490656585004: java.nio.file.DirectoryNotEmptyException: C:\Users\jenkins\workspace\Lucene-Solr-master-Windows\solr\build\solr-core\test\J0\temp\solr.cloud.ZkCLITest_D32CE2E6E52511C5-001\tempDir-013\solrtest-confdropspot-org.apache.solr.cloud.ZkCLITest-99490656585004
   [junit4]    >    C:\Users\jenkins\workspace\Lucene-Solr-master-Windows\solr\build\solr-core\test\J0\temp\solr.cloud.ZkCLITest_D32CE2E6E52511C5-001\tempDir-013: java.nio.file.DirectoryNotEmptyException: C:\Users\jenkins\workspace\Lucene-Solr-master-Windows\solr\build\solr-core\test\J0\temp\solr.cloud.ZkCLITest_D32CE2E6E52511C5-001\tempDir-013
   [junit4]    > 	at __randomizedtesting.SeedInfo.seed([D32CE2E6E52511C5]:0)
   [junit4]    > 	at org.apache.lucene.util.IOUtils.rm(IOUtils.java:329)
   [junit4]    > 	at java.lang.Thread.run(Thread.java:748)
   [junit4] Completed [375/729 (2!)] on J0 in 6.72s, 15 tests, 1 error <<< FAILURES!

[...truncated 40459 lines...]

Mime
View raw message