lucene-dev mailing list archives

Site index · List index
Message view « Date » · « Thread »
Top « Date » · « Thread »
From Policeman Jenkins Server <jenk...@thetaphi.de>
Subject [JENKINS] Lucene-Solr-6.6-Windows (32bit/jdk1.8.0_144) - Build # 22 - Failure!
Date Sun, 20 Aug 2017 13:21:53 GMT
Build: https://jenkins.thetaphi.de/job/Lucene-Solr-6.6-Windows/22/
Java: 32bit/jdk1.8.0_144 -server -XX:+UseConcMarkSweepGC

2 tests failed.
FAILED:  org.apache.solr.cloud.MissingSegmentRecoveryTest.testLeaderRecovery

Error Message:
Expected a collection with one shard and two replicas null Last available state: DocCollection(MissingSegmentRecoveryTest//collections/MissingSegmentRecoveryTest/state.json/5)={   "replicationFactor":"2",   "shards":{"shard1":{       "range":"80000000-7fffffff",       "state":"active",       "replicas":{         "core_node1":{           "core":"MissingSegmentRecoveryTest_shard1_replica1",           "base_url":"http://127.0.0.1:65123/solr",           "node_name":"127.0.0.1:65123_solr",           "state":"down"},         "core_node2":{           "core":"MissingSegmentRecoveryTest_shard1_replica2",           "base_url":"http://127.0.0.1:65124/solr",           "node_name":"127.0.0.1:65124_solr",           "state":"active",           "leader":"true"}}}},   "router":{"name":"compositeId"},   "maxShardsPerNode":"1",   "autoAddReplicas":"false"}

Stack Trace:
java.lang.AssertionError: Expected a collection with one shard and two replicas
null
Last available state: DocCollection(MissingSegmentRecoveryTest//collections/MissingSegmentRecoveryTest/state.json/5)={
  "replicationFactor":"2",
  "shards":{"shard1":{
      "range":"80000000-7fffffff",
      "state":"active",
      "replicas":{
        "core_node1":{
          "core":"MissingSegmentRecoveryTest_shard1_replica1",
          "base_url":"http://127.0.0.1:65123/solr",
          "node_name":"127.0.0.1:65123_solr",
          "state":"down"},
        "core_node2":{
          "core":"MissingSegmentRecoveryTest_shard1_replica2",
          "base_url":"http://127.0.0.1:65124/solr",
          "node_name":"127.0.0.1:65124_solr",
          "state":"active",
          "leader":"true"}}}},
  "router":{"name":"compositeId"},
  "maxShardsPerNode":"1",
  "autoAddReplicas":"false"}
	at __randomizedtesting.SeedInfo.seed([CD6ECB74B7EA62BC:9D3B5377EECBD4A1]:0)
	at org.junit.Assert.fail(Assert.java:93)
	at org.apache.solr.cloud.SolrCloudTestCase.waitForState(SolrCloudTestCase.java:265)
	at org.apache.solr.cloud.MissingSegmentRecoveryTest.testLeaderRecovery(MissingSegmentRecoveryTest.java:105)
	at sun.reflect.NativeMethodAccessorImpl.invoke0(Native Method)
	at sun.reflect.NativeMethodAccessorImpl.invoke(NativeMethodAccessorImpl.java:62)
	at sun.reflect.DelegatingMethodAccessorImpl.invoke(DelegatingMethodAccessorImpl.java:43)
	at java.lang.reflect.Method.invoke(Method.java:498)
	at com.carrotsearch.randomizedtesting.RandomizedRunner.invoke(RandomizedRunner.java:1713)
	at com.carrotsearch.randomizedtesting.RandomizedRunner$8.evaluate(RandomizedRunner.java:907)
	at com.carrotsearch.randomizedtesting.RandomizedRunner$9.evaluate(RandomizedRunner.java:943)
	at com.carrotsearch.randomizedtesting.RandomizedRunner$10.evaluate(RandomizedRunner.java:957)
	at com.carrotsearch.randomizedtesting.rules.SystemPropertiesRestoreRule$1.evaluate(SystemPropertiesRestoreRule.java:57)
	at org.apache.lucene.util.TestRuleSetupTeardownChained$1.evaluate(TestRuleSetupTeardownChained.java:49)
	at org.apache.lucene.util.AbstractBeforeAfterRule$1.evaluate(AbstractBeforeAfterRule.java:45)
	at org.apache.lucene.util.TestRuleThreadAndTestName$1.evaluate(TestRuleThreadAndTestName.java:48)
	at org.apache.lucene.util.TestRuleIgnoreAfterMaxFailures$1.evaluate(TestRuleIgnoreAfterMaxFailures.java:64)
	at org.apache.lucene.util.TestRuleMarkFailure$1.evaluate(TestRuleMarkFailure.java:47)
	at com.carrotsearch.randomizedtesting.rules.StatementAdapter.evaluate(StatementAdapter.java:36)
	at com.carrotsearch.randomizedtesting.ThreadLeakControl$StatementRunner.run(ThreadLeakControl.java:368)
	at com.carrotsearch.randomizedtesting.ThreadLeakControl.forkTimeoutingTask(ThreadLeakControl.java:817)
	at com.carrotsearch.randomizedtesting.ThreadLeakControl$3.evaluate(ThreadLeakControl.java:468)
	at com.carrotsearch.randomizedtesting.RandomizedRunner.runSingleTest(RandomizedRunner.java:916)
	at com.carrotsearch.randomizedtesting.RandomizedRunner$5.evaluate(RandomizedRunner.java:802)
	at com.carrotsearch.randomizedtesting.RandomizedRunner$6.evaluate(RandomizedRunner.java:852)
	at com.carrotsearch.randomizedtesting.RandomizedRunner$7.evaluate(RandomizedRunner.java:863)
	at com.carrotsearch.randomizedtesting.rules.StatementAdapter.evaluate(StatementAdapter.java:36)
	at com.carrotsearch.randomizedtesting.rules.SystemPropertiesRestoreRule$1.evaluate(SystemPropertiesRestoreRule.java:57)
	at org.apache.lucene.util.AbstractBeforeAfterRule$1.evaluate(AbstractBeforeAfterRule.java:45)
	at com.carrotsearch.randomizedtesting.rules.StatementAdapter.evaluate(StatementAdapter.java:36)
	at org.apache.lucene.util.TestRuleStoreClassName$1.evaluate(TestRuleStoreClassName.java:41)
	at com.carrotsearch.randomizedtesting.rules.NoShadowingOrOverridesOnMethodsRule$1.evaluate(NoShadowingOrOverridesOnMethodsRule.java:40)
	at com.carrotsearch.randomizedtesting.rules.NoShadowingOrOverridesOnMethodsRule$1.evaluate(NoShadowingOrOverridesOnMethodsRule.java:40)
	at com.carrotsearch.randomizedtesting.rules.StatementAdapter.evaluate(StatementAdapter.java:36)
	at com.carrotsearch.randomizedtesting.rules.StatementAdapter.evaluate(StatementAdapter.java:36)
	at com.carrotsearch.randomizedtesting.rules.StatementAdapter.evaluate(StatementAdapter.java:36)
	at org.apache.lucene.util.TestRuleAssertionsRequired$1.evaluate(TestRuleAssertionsRequired.java:53)
	at org.apache.lucene.util.TestRuleMarkFailure$1.evaluate(TestRuleMarkFailure.java:47)
	at org.apache.lucene.util.TestRuleIgnoreAfterMaxFailures$1.evaluate(TestRuleIgnoreAfterMaxFailures.java:64)
	at org.apache.lucene.util.TestRuleIgnoreTestSuites$1.evaluate(TestRuleIgnoreTestSuites.java:54)
	at com.carrotsearch.randomizedtesting.rules.StatementAdapter.evaluate(StatementAdapter.java:36)
	at com.carrotsearch.randomizedtesting.ThreadLeakControl$StatementRunner.run(ThreadLeakControl.java:368)
	at java.lang.Thread.run(Thread.java:748)


FAILED:  org.apache.solr.common.cloud.TestCollectionStateWatchers.testWaitForStateWatcherIsRetainedOnPredicateFailure

Error Message:
Did not see a fully active cluster after 30 seconds

Stack Trace:
java.lang.AssertionError: Did not see a fully active cluster after 30 seconds
	at __randomizedtesting.SeedInfo.seed([C7CECEA4CB717CF2:4FF86CF713DE94E0]:0)
	at org.junit.Assert.fail(Assert.java:93)
	at org.junit.Assert.assertTrue(Assert.java:43)
	at org.apache.solr.common.cloud.TestCollectionStateWatchers.testWaitForStateWatcherIsRetainedOnPredicateFailure(TestCollectionStateWatchers.java:250)
	at sun.reflect.NativeMethodAccessorImpl.invoke0(Native Method)
	at sun.reflect.NativeMethodAccessorImpl.invoke(NativeMethodAccessorImpl.java:62)
	at sun.reflect.DelegatingMethodAccessorImpl.invoke(DelegatingMethodAccessorImpl.java:43)
	at java.lang.reflect.Method.invoke(Method.java:498)
	at com.carrotsearch.randomizedtesting.RandomizedRunner.invoke(RandomizedRunner.java:1713)
	at com.carrotsearch.randomizedtesting.RandomizedRunner$8.evaluate(RandomizedRunner.java:907)
	at com.carrotsearch.randomizedtesting.RandomizedRunner$9.evaluate(RandomizedRunner.java:943)
	at com.carrotsearch.randomizedtesting.RandomizedRunner$10.evaluate(RandomizedRunner.java:957)
	at com.carrotsearch.randomizedtesting.rules.SystemPropertiesRestoreRule$1.evaluate(SystemPropertiesRestoreRule.java:57)
	at org.apache.lucene.util.TestRuleSetupTeardownChained$1.evaluate(TestRuleSetupTeardownChained.java:49)
	at org.apache.lucene.util.AbstractBeforeAfterRule$1.evaluate(AbstractBeforeAfterRule.java:45)
	at org.apache.lucene.util.TestRuleThreadAndTestName$1.evaluate(TestRuleThreadAndTestName.java:48)
	at org.apache.lucene.util.TestRuleIgnoreAfterMaxFailures$1.evaluate(TestRuleIgnoreAfterMaxFailures.java:64)
	at org.apache.lucene.util.TestRuleMarkFailure$1.evaluate(TestRuleMarkFailure.java:47)
	at com.carrotsearch.randomizedtesting.rules.StatementAdapter.evaluate(StatementAdapter.java:36)
	at com.carrotsearch.randomizedtesting.ThreadLeakControl$StatementRunner.run(ThreadLeakControl.java:368)
	at com.carrotsearch.randomizedtesting.ThreadLeakControl.forkTimeoutingTask(ThreadLeakControl.java:817)
	at com.carrotsearch.randomizedtesting.ThreadLeakControl$3.evaluate(ThreadLeakControl.java:468)
	at com.carrotsearch.randomizedtesting.RandomizedRunner.runSingleTest(RandomizedRunner.java:916)
	at com.carrotsearch.randomizedtesting.RandomizedRunner$5.evaluate(RandomizedRunner.java:802)
	at com.carrotsearch.randomizedtesting.RandomizedRunner$6.evaluate(RandomizedRunner.java:852)
	at com.carrotsearch.randomizedtesting.RandomizedRunner$7.evaluate(RandomizedRunner.java:863)
	at com.carrotsearch.randomizedtesting.rules.StatementAdapter.evaluate(StatementAdapter.java:36)
	at com.carrotsearch.randomizedtesting.rules.SystemPropertiesRestoreRule$1.evaluate(SystemPropertiesRestoreRule.java:57)
	at org.apache.lucene.util.AbstractBeforeAfterRule$1.evaluate(AbstractBeforeAfterRule.java:45)
	at com.carrotsearch.randomizedtesting.rules.StatementAdapter.evaluate(StatementAdapter.java:36)
	at org.apache.lucene.util.TestRuleStoreClassName$1.evaluate(TestRuleStoreClassName.java:41)
	at com.carrotsearch.randomizedtesting.rules.NoShadowingOrOverridesOnMethodsRule$1.evaluate(NoShadowingOrOverridesOnMethodsRule.java:40)
	at com.carrotsearch.randomizedtesting.rules.NoShadowingOrOverridesOnMethodsRule$1.evaluate(NoShadowingOrOverridesOnMethodsRule.java:40)
	at com.carrotsearch.randomizedtesting.rules.StatementAdapter.evaluate(StatementAdapter.java:36)
	at com.carrotsearch.randomizedtesting.rules.StatementAdapter.evaluate(StatementAdapter.java:36)
	at com.carrotsearch.randomizedtesting.rules.StatementAdapter.evaluate(StatementAdapter.java:36)
	at org.apache.lucene.util.TestRuleAssertionsRequired$1.evaluate(TestRuleAssertionsRequired.java:53)
	at org.apache.lucene.util.TestRuleMarkFailure$1.evaluate(TestRuleMarkFailure.java:47)
	at org.apache.lucene.util.TestRuleIgnoreAfterMaxFailures$1.evaluate(TestRuleIgnoreAfterMaxFailures.java:64)
	at org.apache.lucene.util.TestRuleIgnoreTestSuites$1.evaluate(TestRuleIgnoreTestSuites.java:54)
	at com.carrotsearch.randomizedtesting.rules.StatementAdapter.evaluate(StatementAdapter.java:36)
	at com.carrotsearch.randomizedtesting.ThreadLeakControl$StatementRunner.run(ThreadLeakControl.java:368)
	at java.lang.Thread.run(Thread.java:748)




Build Log:
[...truncated 12640 lines...]
   [junit4] Suite: org.apache.solr.cloud.MissingSegmentRecoveryTest
   [junit4]   2> Creating dataDir: C:\Users\jenkins\workspace\Lucene-Solr-6.6-Windows\solr\build\solr-core\test\J0\temp\solr.cloud.MissingSegmentRecoveryTest_CD6ECB74B7EA62BC-001\init-core-data-001
   [junit4]   2> 2036168 WARN  (SUITE-MissingSegmentRecoveryTest-seed#[CD6ECB74B7EA62BC]-worker) [    ] o.a.s.SolrTestCaseJ4 startTrackingSearchers: numOpens=12 numCloses=12
   [junit4]   2> 2036168 INFO  (SUITE-MissingSegmentRecoveryTest-seed#[CD6ECB74B7EA62BC]-worker) [    ] o.a.s.SolrTestCaseJ4 Using TrieFields
   [junit4]   2> 2036174 INFO  (SUITE-MissingSegmentRecoveryTest-seed#[CD6ECB74B7EA62BC]-worker) [    ] o.a.s.SolrTestCaseJ4 Randomized ssl (false) and clientAuth (false) via: @org.apache.solr.util.RandomizeSSL(reason=, value=NaN, ssl=NaN, clientAuth=NaN)
   [junit4]   2> 2036177 INFO  (SUITE-MissingSegmentRecoveryTest-seed#[CD6ECB74B7EA62BC]-worker) [    ] o.a.s.c.MiniSolrCloudCluster Starting cluster of 2 servers in C:\Users\jenkins\workspace\Lucene-Solr-6.6-Windows\solr\build\solr-core\test\J0\temp\solr.cloud.MissingSegmentRecoveryTest_CD6ECB74B7EA62BC-001\tempDir-001
   [junit4]   2> 2036178 INFO  (SUITE-MissingSegmentRecoveryTest-seed#[CD6ECB74B7EA62BC]-worker) [    ] o.a.s.c.ZkTestServer STARTING ZK TEST SERVER
   [junit4]   2> 2036179 INFO  (Thread-4385) [    ] o.a.s.c.ZkTestServer client port:0.0.0.0/0.0.0.0:0
   [junit4]   2> 2036179 INFO  (Thread-4385) [    ] o.a.s.c.ZkTestServer Starting server
   [junit4]   2> 2036184 ERROR (Thread-4385) [    ] o.a.z.s.ZooKeeperServer ZKShutdownHandler is not registered, so ZooKeeper server won't take any action on ERROR or SHUTDOWN server state changes
   [junit4]   2> 2036278 INFO  (SUITE-MissingSegmentRecoveryTest-seed#[CD6ECB74B7EA62BC]-worker) [    ] o.a.s.c.ZkTestServer start zk server on port:65119
   [junit4]   2> 2036291 WARN  (NIOServerCxn.Factory:0.0.0.0/0.0.0.0:0) [    ] o.a.z.s.NIOServerCnxn caught end of stream exception
   [junit4]   2> EndOfStreamException: Unable to read additional data from client sessionid 0x15dffb8916f0000, likely client has closed socket
   [junit4]   2> 	at org.apache.zookeeper.server.NIOServerCnxn.doIO(NIOServerCnxn.java:239)
   [junit4]   2> 	at org.apache.zookeeper.server.NIOServerCnxnFactory.run(NIOServerCnxnFactory.java:203)
   [junit4]   2> 	at java.lang.Thread.run(Thread.java:748)
   [junit4]   2> 2036294 INFO  (jetty-launcher-2869-thread-1) [    ] o.e.j.s.Server jetty-9.3.14.v20161028
   [junit4]   2> 2036294 INFO  (jetty-launcher-2869-thread-2) [    ] o.e.j.s.Server jetty-9.3.14.v20161028
   [junit4]   2> 2036296 INFO  (jetty-launcher-2869-thread-1) [    ] o.e.j.s.h.ContextHandler Started o.e.j.s.ServletContextHandler@147607{/solr,null,AVAILABLE}
   [junit4]   2> 2036296 INFO  (jetty-launcher-2869-thread-2) [    ] o.e.j.s.h.ContextHandler Started o.e.j.s.ServletContextHandler@1830b6a{/solr,null,AVAILABLE}
   [junit4]   2> 2036296 INFO  (jetty-launcher-2869-thread-1) [    ] o.e.j.s.AbstractConnector Started ServerConnector@12d7357{HTTP/1.1,[http/1.1]}{127.0.0.1:65123}
   [junit4]   2> 2036297 INFO  (jetty-launcher-2869-thread-2) [    ] o.e.j.s.AbstractConnector Started ServerConnector@199eb88{HTTP/1.1,[http/1.1]}{127.0.0.1:65124}
   [junit4]   2> 2036297 INFO  (jetty-launcher-2869-thread-1) [    ] o.e.j.s.Server Started @2043593ms
   [junit4]   2> 2036297 INFO  (jetty-launcher-2869-thread-2) [    ] o.e.j.s.Server Started @2043593ms
   [junit4]   2> 2036297 INFO  (jetty-launcher-2869-thread-1) [    ] o.a.s.c.s.e.JettySolrRunner Jetty properties: {hostContext=/solr, hostPort=65123}
   [junit4]   2> 2036297 INFO  (jetty-launcher-2869-thread-2) [    ] o.a.s.c.s.e.JettySolrRunner Jetty properties: {hostContext=/solr, hostPort=65124}
   [junit4]   2> 2036297 ERROR (jetty-launcher-2869-thread-2) [    ] o.a.s.s.StartupLoggingUtils Missing Java Option solr.log.dir. Logging may be missing or incomplete.
   [junit4]   2> 2036297 ERROR (jetty-launcher-2869-thread-1) [    ] o.a.s.s.StartupLoggingUtils Missing Java Option solr.log.dir. Logging may be missing or incomplete.
   [junit4]   2> 2036298 INFO  (jetty-launcher-2869-thread-2) [    ] o.a.s.s.SolrDispatchFilter  ___      _       Welcome to Apache Solr? version 6.6.1
   [junit4]   2> 2036298 INFO  (jetty-launcher-2869-thread-1) [    ] o.a.s.s.SolrDispatchFilter  ___      _       Welcome to Apache Solr? version 6.6.1
   [junit4]   2> 2036298 INFO  (jetty-launcher-2869-thread-1) [    ] o.a.s.s.SolrDispatchFilter / __| ___| |_ _   Starting in cloud mode on port null
   [junit4]   2> 2036298 INFO  (jetty-launcher-2869-thread-2) [    ] o.a.s.s.SolrDispatchFilter / __| ___| |_ _   Starting in cloud mode on port null
   [junit4]   2> 2036298 INFO  (jetty-launcher-2869-thread-1) [    ] o.a.s.s.SolrDispatchFilter \__ \/ _ \ | '_|  Install dir: null
   [junit4]   2> 2036298 INFO  (jetty-launcher-2869-thread-2) [    ] o.a.s.s.SolrDispatchFilter \__ \/ _ \ | '_|  Install dir: null
   [junit4]   2> 2036298 INFO  (jetty-launcher-2869-thread-1) [    ] o.a.s.s.SolrDispatchFilter |___/\___/_|_|    Start time: 2017-08-20T12:57:52.353Z
   [junit4]   2> 2036298 INFO  (jetty-launcher-2869-thread-2) [    ] o.a.s.s.SolrDispatchFilter |___/\___/_|_|    Start time: 2017-08-20T12:57:52.353Z
   [junit4]   2> 2036307 INFO  (jetty-launcher-2869-thread-2) [    ] o.a.s.s.SolrDispatchFilter solr.xml found in ZooKeeper. Loading...
   [junit4]   2> 2036307 INFO  (jetty-launcher-2869-thread-1) [    ] o.a.s.s.SolrDispatchFilter solr.xml found in ZooKeeper. Loading...
   [junit4]   2> 2036324 WARN  (NIOServerCxn.Factory:0.0.0.0/0.0.0.0:0) [    ] o.a.z.s.NIOServerCnxn caught end of stream exception
   [junit4]   2> EndOfStreamException: Unable to read additional data from client sessionid 0x15dffb8916f0002, likely client has closed socket
   [junit4]   2> 	at org.apache.zookeeper.server.NIOServerCnxn.doIO(NIOServerCnxn.java:239)
   [junit4]   2> 	at org.apache.zookeeper.server.NIOServerCnxnFactory.run(NIOServerCnxnFactory.java:203)
   [junit4]   2> 	at java.lang.Thread.run(Thread.java:748)
   [junit4]   2> 2036326 WARN  (NIOServerCxn.Factory:0.0.0.0/0.0.0.0:0) [    ] o.a.z.s.NIOServerCnxn caught end of stream exception
   [junit4]   2> EndOfStreamException: Unable to read additional data from client sessionid 0x15dffb8916f0001, likely client has closed socket
   [junit4]   2> 	at org.apache.zookeeper.server.NIOServerCnxn.doIO(NIOServerCnxn.java:239)
   [junit4]   2> 	at org.apache.zookeeper.server.NIOServerCnxnFactory.run(NIOServerCnxnFactory.java:203)
   [junit4]   2> 	at java.lang.Thread.run(Thread.java:748)
   [junit4]   2> 2036329 INFO  (jetty-launcher-2869-thread-2) [    ] o.a.s.u.UpdateShardHandler Creating UpdateShardHandler HTTP client with params: socketTimeout=340000&connTimeout=45000&retry=true
   [junit4]   2> 2036331 INFO  (jetty-launcher-2869-thread-2) [    ] o.a.s.c.ZkContainer Zookeeper client=127.0.0.1:65119/solr
   [junit4]   2> 2036332 INFO  (jetty-launcher-2869-thread-1) [    ] o.a.s.u.UpdateShardHandler Creating UpdateShardHandler HTTP client with params: socketTimeout=340000&connTimeout=45000&retry=true
   [junit4]   2> 2036333 INFO  (jetty-launcher-2869-thread-1) [    ] o.a.s.c.ZkContainer Zookeeper client=127.0.0.1:65119/solr
   [junit4]   2> 2036377 INFO  (jetty-launcher-2869-thread-2) [n:127.0.0.1:65124_solr    ] o.a.s.c.Overseer Overseer (id=null) closing
   [junit4]   2> 2036377 INFO  (jetty-launcher-2869-thread-1) [n:127.0.0.1:65123_solr    ] o.a.s.c.Overseer Overseer (id=null) closing
   [junit4]   2> 2036378 INFO  (jetty-launcher-2869-thread-2) [n:127.0.0.1:65124_solr    ] o.a.s.c.OverseerElectionContext I am going to be the leader 127.0.0.1:65124_solr
   [junit4]   2> 2036379 INFO  (jetty-launcher-2869-thread-1) [n:127.0.0.1:65123_solr    ] o.a.s.c.ZkController Register node as live in ZooKeeper:/live_nodes/127.0.0.1:65123_solr
   [junit4]   2> 2036380 INFO  (jetty-launcher-2869-thread-2) [n:127.0.0.1:65124_solr    ] o.a.s.c.Overseer Overseer (id=98515935051055109-127.0.0.1:65124_solr-n_0000000000) starting
   [junit4]   2> 2036382 INFO  (zkCallback-2880-thread-1-processing-n:127.0.0.1:65124_solr) [n:127.0.0.1:65124_solr    ] o.a.s.c.c.ZkStateReader Updated live nodes from ZooKeeper... (0) -> (1)
   [junit4]   2> 2036382 INFO  (zkCallback-2881-thread-1-processing-n:127.0.0.1:65123_solr) [n:127.0.0.1:65123_solr    ] o.a.s.c.c.ZkStateReader Updated live nodes from ZooKeeper... (0) -> (1)
   [junit4]   2> 2036406 INFO  (jetty-launcher-2869-thread-2) [n:127.0.0.1:65124_solr    ] o.a.s.c.ZkController Register node as live in ZooKeeper:/live_nodes/127.0.0.1:65124_solr
   [junit4]   2> 2036409 INFO  (zkCallback-2881-thread-1-processing-n:127.0.0.1:65123_solr) [n:127.0.0.1:65123_solr    ] o.a.s.c.c.ZkStateReader Updated live nodes from ZooKeeper... (1) -> (2)
   [junit4]   2> 2036410 INFO  (zkCallback-2880-thread-1-processing-n:127.0.0.1:65124_solr) [n:127.0.0.1:65124_solr    ] o.a.s.c.c.ZkStateReader Updated live nodes from ZooKeeper... (1) -> (2)
   [junit4]   2> 2036579 INFO  (jetty-launcher-2869-thread-1) [n:127.0.0.1:65123_solr    ] o.a.s.c.CorePropertiesLocator Found 0 core definitions underneath C:\Users\jenkins\workspace\Lucene-Solr-6.6-Windows\solr\build\solr-core\test\J0\temp\solr.cloud.MissingSegmentRecoveryTest_CD6ECB74B7EA62BC-001\tempDir-001\node1\.
   [junit4]   2> 2036579 INFO  (jetty-launcher-2869-thread-2) [n:127.0.0.1:65124_solr    ] o.a.s.c.CorePropertiesLocator Found 0 core definitions underneath C:\Users\jenkins\workspace\Lucene-Solr-6.6-Windows\solr\build\solr-core\test\J0\temp\solr.cloud.MissingSegmentRecoveryTest_CD6ECB74B7EA62BC-001\tempDir-001\node2\.
   [junit4]   2> 2036625 INFO  (SUITE-MissingSegmentRecoveryTest-seed#[CD6ECB74B7EA62BC]-worker) [    ] o.a.s.c.c.ZkStateReader Updated live nodes from ZooKeeper... (0) -> (2)
   [junit4]   2> 2036627 INFO  (SUITE-MissingSegmentRecoveryTest-seed#[CD6ECB74B7EA62BC]-worker) [    ] o.a.s.c.s.i.ZkClientClusterStateProvider Cluster at 127.0.0.1:65119/solr ready
   [junit4]   2> 2036660 INFO  (TEST-MissingSegmentRecoveryTest.testLeaderRecovery-seed#[CD6ECB74B7EA62BC]) [    ] o.a.s.SolrTestCaseJ4 ###Starting testLeaderRecovery
   [junit4]   2> 2036667 INFO  (qtp2656833-17870) [n:127.0.0.1:65124_solr    ] o.a.s.h.a.CollectionsHandler Invoked Collection Action :create with params replicationFactor=2&collection.configName=conf&maxShardsPerNode=1&name=MissingSegmentRecoveryTest&action=CREATE&numShards=1&wt=javabin&version=2 and sendToOCPQueue=true
   [junit4]   2> 2036674 INFO  (OverseerThreadFactory-8644-thread-1-processing-n:127.0.0.1:65124_solr) [n:127.0.0.1:65124_solr    ] o.a.s.c.CreateCollectionCmd Create collection MissingSegmentRecoveryTest
   [junit4]   2> 2036805 INFO  (qtp179629-17873) [n:127.0.0.1:65123_solr    ] o.a.s.h.a.CoreAdminOperation core create command qt=/admin/cores&collection.configName=conf&newCollection=true&name=MissingSegmentRecoveryTest_shard1_replica1&action=CREATE&numShards=1&collection=MissingSegmentRecoveryTest&shard=shard1&wt=javabin&version=2
   [junit4]   2> 2036805 INFO  (qtp2656833-17868) [n:127.0.0.1:65124_solr    ] o.a.s.h.a.CoreAdminOperation core create command qt=/admin/cores&collection.configName=conf&newCollection=true&name=MissingSegmentRecoveryTest_shard1_replica2&action=CREATE&numShards=1&collection=MissingSegmentRecoveryTest&shard=shard1&wt=javabin&version=2
   [junit4]   2> 2036811 INFO  (qtp179629-17873) [n:127.0.0.1:65123_solr    ] o.a.s.c.TransientSolrCoreCacheDefault Allocating transient cache for 2147483647 transient cores
   [junit4]   2> 2036814 INFO  (qtp2656833-17868) [n:127.0.0.1:65124_solr    ] o.a.s.c.TransientSolrCoreCacheDefault Allocating transient cache for 2147483647 transient cores
   [junit4]   2> 2036924 INFO  (zkCallback-2880-thread-1-processing-n:127.0.0.1:65124_solr) [n:127.0.0.1:65124_solr    ] o.a.s.c.c.ZkStateReader A cluster state change: [WatchedEvent state:SyncConnected type:NodeDataChanged path:/collections/MissingSegmentRecoveryTest/state.json] for collection [MissingSegmentRecoveryTest] has occurred - updating... (live nodes size: [2])
   [junit4]   2> 2036924 INFO  (zkCallback-2881-thread-1-processing-n:127.0.0.1:65123_solr) [n:127.0.0.1:65123_solr    ] o.a.s.c.c.ZkStateReader A cluster state change: [WatchedEvent state:SyncConnected type:NodeDataChanged path:/collections/MissingSegmentRecoveryTest/state.json] for collection [MissingSegmentRecoveryTest] has occurred - updating... (live nodes size: [2])
   [junit4]   2> 2037874 INFO  (qtp2656833-17868) [n:127.0.0.1:65124_solr c:MissingSegmentRecoveryTest s:shard1  x:MissingSegmentRecoveryTest_shard1_replica2] o.a.s.c.SolrConfig Using Lucene MatchVersion: 6.6.1
   [junit4]   2> 2037883 INFO  (qtp179629-17873) [n:127.0.0.1:65123_solr c:MissingSegmentRecoveryTest s:shard1  x:MissingSegmentRecoveryTest_shard1_replica1] o.a.s.c.SolrConfig Using Lucene MatchVersion: 6.6.1
   [junit4]   2> 2037903 INFO  (qtp2656833-17868) [n:127.0.0.1:65124_solr c:MissingSegmentRecoveryTest s:shard1  x:MissingSegmentRecoveryTest_shard1_replica2] o.a.s.s.IndexSchema [MissingSegmentRecoveryTest_shard1_replica2] Schema name=minimal
   [junit4]   2> 2037903 INFO  (qtp179629-17873) [n:127.0.0.1:65123_solr c:MissingSegmentRecoveryTest s:shard1  x:MissingSegmentRecoveryTest_shard1_replica1] o.a.s.s.IndexSchema [MissingSegmentRecoveryTest_shard1_replica1] Schema name=minimal
   [junit4]   2> 2037918 INFO  (qtp179629-17873) [n:127.0.0.1:65123_solr c:MissingSegmentRecoveryTest s:shard1  x:MissingSegmentRecoveryTest_shard1_replica1] o.a.s.s.IndexSchema Loaded schema minimal/1.1 with uniqueid field id
   [junit4]   2> 2037918 INFO  (qtp179629-17873) [n:127.0.0.1:65123_solr c:MissingSegmentRecoveryTest s:shard1  x:MissingSegmentRecoveryTest_shard1_replica1] o.a.s.c.CoreContainer Creating SolrCore 'MissingSegmentRecoveryTest_shard1_replica1' using configuration from collection MissingSegmentRecoveryTest, trusted=true
   [junit4]   2> 2037918 INFO  (qtp2656833-17868) [n:127.0.0.1:65124_solr c:MissingSegmentRecoveryTest s:shard1  x:MissingSegmentRecoveryTest_shard1_replica2] o.a.s.s.IndexSchema Loaded schema minimal/1.1 with uniqueid field id
   [junit4]   2> 2037919 INFO  (qtp2656833-17868) [n:127.0.0.1:65124_solr c:MissingSegmentRecoveryTest s:shard1  x:MissingSegmentRecoveryTest_shard1_replica2] o.a.s.c.CoreContainer Creating SolrCore 'MissingSegmentRecoveryTest_shard1_replica2' using configuration from collection MissingSegmentRecoveryTest, trusted=true
   [junit4]   2> 2037919 INFO  (qtp179629-17873) [n:127.0.0.1:65123_solr c:MissingSegmentRecoveryTest s:shard1  x:MissingSegmentRecoveryTest_shard1_replica1] o.a.s.c.SolrCore solr.RecoveryStrategy.Builder
   [junit4]   2> 2037919 INFO  (qtp2656833-17868) [n:127.0.0.1:65124_solr c:MissingSegmentRecoveryTest s:shard1  x:MissingSegmentRecoveryTest_shard1_replica2] o.a.s.c.SolrCore solr.RecoveryStrategy.Builder
   [junit4]   2> 2037919 INFO  (qtp179629-17873) [n:127.0.0.1:65123_solr c:MissingSegmentRecoveryTest s:shard1  x:MissingSegmentRecoveryTest_shard1_replica1] o.a.s.c.SolrCore [[MissingSegmentRecoveryTest_shard1_replica1] ] Opening new SolrCore at [C:\Users\jenkins\workspace\Lucene-Solr-6.6-Windows\solr\build\solr-core\test\J0\temp\solr.cloud.MissingSegmentRecoveryTest_CD6ECB74B7EA62BC-001\tempDir-001\node1\MissingSegmentRecoveryTest_shard1_replica1], dataDir=[C:\Users\jenkins\workspace\Lucene-Solr-6.6-Windows\solr\build\solr-core\test\J0\temp\solr.cloud.MissingSegmentRecoveryTest_CD6ECB74B7EA62BC-001\tempDir-001\node1\.\MissingSegmentRecoveryTest_shard1_replica1\data\]
   [junit4]   2> 2037919 INFO  (qtp2656833-17868) [n:127.0.0.1:65124_solr c:MissingSegmentRecoveryTest s:shard1  x:MissingSegmentRecoveryTest_shard1_replica2] o.a.s.c.SolrCore [[MissingSegmentRecoveryTest_shard1_replica2] ] Opening new SolrCore at [C:\Users\jenkins\workspace\Lucene-Solr-6.6-Windows\solr\build\solr-core\test\J0\temp\solr.cloud.MissingSegmentRecoveryTest_CD6ECB74B7EA62BC-001\tempDir-001\node2\MissingSegmentRecoveryTest_shard1_replica2], dataDir=[C:\Users\jenkins\workspace\Lucene-Solr-6.6-Windows\solr\build\solr-core\test\J0\temp\solr.cloud.MissingSegmentRecoveryTest_CD6ECB74B7EA62BC-001\tempDir-001\node2\.\MissingSegmentRecoveryTest_shard1_replica2\data\]
   [junit4]   2> 2038103 INFO  (qtp2656833-17868) [n:127.0.0.1:65124_solr c:MissingSegmentRecoveryTest s:shard1  x:MissingSegmentRecoveryTest_shard1_replica2] o.a.s.u.UpdateHandler Using UpdateLog implementation: org.apache.solr.update.UpdateLog
   [junit4]   2> 2038103 INFO  (qtp2656833-17868) [n:127.0.0.1:65124_solr c:MissingSegmentRecoveryTest s:shard1  x:MissingSegmentRecoveryTest_shard1_replica2] o.a.s.u.UpdateLog Initializing UpdateLog: dataDir=null defaultSyncLevel=FLUSH numRecordsToKeep=100 maxNumLogsToKeep=10 numVersionBuckets=65536
   [junit4]   2> 2038104 INFO  (qtp2656833-17868) [n:127.0.0.1:65124_solr c:MissingSegmentRecoveryTest s:shard1  x:MissingSegmentRecoveryTest_shard1_replica2] o.a.s.u.CommitTracker Hard AutoCommit: disabled
   [junit4]   2> 2038104 INFO  (qtp2656833-17868) [n:127.0.0.1:65124_solr c:MissingSegmentRecoveryTest s:shard1  x:MissingSegmentRecoveryTest_shard1_replica2] o.a.s.u.CommitTracker Soft AutoCommit: disabled
   [junit4]   2> 2038105 INFO  (qtp179629-17873) [n:127.0.0.1:65123_solr c:MissingSegmentRecoveryTest s:shard1  x:MissingSegmentRecoveryTest_shard1_replica1] o.a.s.u.UpdateHandler Using UpdateLog implementation: org.apache.solr.update.UpdateLog
   [junit4]   2> 2038106 INFO  (qtp179629-17873) [n:127.0.0.1:65123_solr c:MissingSegmentRecoveryTest s:shard1  x:MissingSegmentRecoveryTest_shard1_replica1] o.a.s.u.UpdateLog Initializing UpdateLog: dataDir=null defaultSyncLevel=FLUSH numRecordsToKeep=100 maxNumLogsToKeep=10 numVersionBuckets=65536
   [junit4]   2> 2038106 INFO  (qtp2656833-17868) [n:127.0.0.1:65124_solr c:MissingSegmentRecoveryTest s:shard1  x:MissingSegmentRecoveryTest_shard1_replica2] o.a.s.s.SolrIndexSearcher Opening [Searcher@1d9eb3c[MissingSegmentRecoveryTest_shard1_replica2] main]
   [junit4]   2> 2038107 INFO  (qtp179629-17873) [n:127.0.0.1:65123_solr c:MissingSegmentRecoveryTest s:shard1  x:MissingSegmentRecoveryTest_shard1_replica1] o.a.s.u.CommitTracker Hard AutoCommit: disabled
   [junit4]   2> 2038108 INFO  (qtp179629-17873) [n:127.0.0.1:65123_solr c:MissingSegmentRecoveryTest s:shard1  x:MissingSegmentRecoveryTest_shard1_replica1] o.a.s.u.CommitTracker Soft AutoCommit: disabled
   [junit4]   2> 2038110 INFO  (qtp2656833-17868) [n:127.0.0.1:65124_solr c:MissingSegmentRecoveryTest s:shard1  x:MissingSegmentRecoveryTest_shard1_replica2] o.a.s.r.ManagedResourceStorage Configured ZooKeeperStorageIO with znodeBase: /configs/conf
   [junit4]   2> 2038110 INFO  (qtp179629-17873) [n:127.0.0.1:65123_solr c:MissingSegmentRecoveryTest s:shard1  x:MissingSegmentRecoveryTest_shard1_replica1] o.a.s.s.SolrIndexSearcher Opening [Searcher@91942c[MissingSegmentRecoveryTest_shard1_replica1] main]
   [junit4]   2> 2038110 INFO  (qtp2656833-17868) [n:127.0.0.1:65124_solr c:MissingSegmentRecoveryTest s:shard1  x:MissingSegmentRecoveryTest_shard1_replica2] o.a.s.r.ManagedResourceStorage Loaded null at path _rest_managed.json using ZooKeeperStorageIO:path=/configs/conf
   [junit4]   2> 2038111 INFO  (qtp2656833-17868) [n:127.0.0.1:65124_solr c:MissingSegmentRecoveryTest s:shard1  x:MissingSegmentRecoveryTest_shard1_replica2] o.a.s.h.ReplicationHandler Commits will be reserved for  10000
   [junit4]   2> 2038111 INFO  (searcherExecutor-8650-thread-1-processing-n:127.0.0.1:65124_solr x:MissingSegmentRecoveryTest_shard1_replica2 s:shard1 c:MissingSegmentRecoveryTest) [n:127.0.0.1:65124_solr c:MissingSegmentRecoveryTest s:shard1  x:MissingSegmentRecoveryTest_shard1_replica2] o.a.s.c.SolrCore [MissingSegmentRecoveryTest_shard1_replica2] Registered new searcher Searcher@1d9eb3c[MissingSegmentRecoveryTest_shard1_replica2] main{ExitableDirectoryReader(UninvertingDirectoryReader())}
   [junit4]   2> 2038111 INFO  (qtp2656833-17868) [n:127.0.0.1:65124_solr c:MissingSegmentRecoveryTest s:shard1  x:MissingSegmentRecoveryTest_shard1_replica2] o.a.s.u.UpdateLog Could not find max version in index or recent updates, using new clock 1576254962837487616
   [junit4]   2> 2038113 INFO  (qtp179629-17873) [n:127.0.0.1:65123_solr c:MissingSegmentRecoveryTest s:shard1  x:MissingSegmentRecoveryTest_shard1_replica1] o.a.s.r.ManagedResourceStorage Configured ZooKeeperStorageIO with znodeBase: /configs/conf
   [junit4]   2> 2038113 INFO  (qtp179629-17873) [n:127.0.0.1:65123_solr c:MissingSegmentRecoveryTest s:shard1  x:MissingSegmentRecoveryTest_shard1_replica1] o.a.s.r.ManagedResourceStorage Loaded null at path _rest_managed.json using ZooKeeperStorageIO:path=/configs/conf
   [junit4]   2> 2038114 INFO  (qtp179629-17873) [n:127.0.0.1:65123_solr c:MissingSegmentRecoveryTest s:shard1  x:MissingSegmentRecoveryTest_shard1_replica1] o.a.s.h.ReplicationHandler Commits will be reserved for  10000
   [junit4]   2> 2038114 INFO  (searcherExecutor-8649-thread-1-processing-n:127.0.0.1:65123_solr x:MissingSegmentRecoveryTest_shard1_replica1 s:shard1 c:MissingSegmentRecoveryTest) [n:127.0.0.1:65123_solr c:MissingSegmentRecoveryTest s:shard1  x:MissingSegmentRecoveryTest_shard1_replica1] o.a.s.c.SolrCore [MissingSegmentRecoveryTest_shard1_replica1] Registered new searcher Searcher@91942c[MissingSegmentRecoveryTest_shard1_replica1] main{ExitableDirectoryReader(UninvertingDirectoryReader())}
   [junit4]   2> 2038114 INFO  (qtp179629-17873) [n:127.0.0.1:65123_solr c:MissingSegmentRecoveryTest s:shard1  x:MissingSegmentRecoveryTest_shard1_replica1] o.a.s.u.UpdateLog Could not find max version in index or recent updates, using new clock 1576254962840633344
   [junit4]   2> 2038118 INFO  (qtp2656833-17868) [n:127.0.0.1:65124_solr c:MissingSegmentRecoveryTest s:shard1  x:MissingSegmentRecoveryTest_shard1_replica2] o.a.s.c.ShardLeaderElectionContext Enough replicas found to continue.
   [junit4]   2> 2038118 INFO  (qtp2656833-17868) [n:127.0.0.1:65124_solr c:MissingSegmentRecoveryTest s:shard1  x:MissingSegmentRecoveryTest_shard1_replica2] o.a.s.c.ShardLeaderElectionContext I may be the new leader - try and sync
   [junit4]   2> 2038118 INFO  (qtp2656833-17868) [n:127.0.0.1:65124_solr c:MissingSegmentRecoveryTest s:shard1  x:MissingSegmentRecoveryTest_shard1_replica2] o.a.s.c.SyncStrategy Sync replicas to http://127.0.0.1:65124/solr/MissingSegmentRecoveryTest_shard1_replica2/
   [junit4]   2> 2038119 INFO  (qtp2656833-17868) [n:127.0.0.1:65124_solr c:MissingSegmentRecoveryTest s:shard1  x:MissingSegmentRecoveryTest_shard1_replica2] o.a.s.u.PeerSync PeerSync: core=MissingSegmentRecoveryTest_shard1_replica2 url=http://127.0.0.1:65124/solr START replicas=[http://127.0.0.1:65123/solr/MissingSegmentRecoveryTest_shard1_replica1/] nUpdates=100
   [junit4]   2> 2038119 INFO  (qtp2656833-17868) [n:127.0.0.1:65124_solr c:MissingSegmentRecoveryTest s:shard1  x:MissingSegmentRecoveryTest_shard1_replica2] o.a.s.u.PeerSync PeerSync: core=MissingSegmentRecoveryTest_shard1_replica2 url=http://127.0.0.1:65124/solr DONE.  We have no versions.  sync failed.
   [junit4]   2> 2038121 INFO  (qtp179629-17859) [n:127.0.0.1:65123_solr c:MissingSegmentRecoveryTest s:shard1 r:core_node1 x:MissingSegmentRecoveryTest_shard1_replica1] o.a.s.c.S.Request [MissingSegmentRecoveryTest_shard1_replica1]  webapp=/solr path=/get params={distrib=false&qt=/get&fingerprint=false&getVersions=100&wt=javabin&version=2} status=0 QTime=0
   [junit4]   2> 2038121 INFO  (qtp2656833-17868) [n:127.0.0.1:65124_solr c:MissingSegmentRecoveryTest s:shard1  x:MissingSegmentRecoveryTest_shard1_replica2] o.a.s.c.SyncStrategy Leader's attempt to sync with shard failed, moving to the next candidate
   [junit4]   2> 2038121 INFO  (qtp2656833-17868) [n:127.0.0.1:65124_solr c:MissingSegmentRecoveryTest s:shard1  x:MissingSegmentRecoveryTest_shard1_replica2] o.a.s.c.ShardLeaderElectionContext We failed sync, but we have no versions - we can't sync in that case - we were active before, so become leader anyway
   [junit4]   2> 2038121 INFO  (qtp2656833-17868) [n:127.0.0.1:65124_solr c:MissingSegmentRecoveryTest s:shard1  x:MissingSegmentRecoveryTest_shard1_replica2] o.a.s.c.ShardLeaderElectionContext Found all replicas participating in election, clear LIR
   [junit4]   2> 2038126 INFO  (qtp2656833-17868) [n:127.0.0.1:65124_solr c:MissingSegmentRecoveryTest s:shard1  x:MissingSegmentRecoveryTest_shard1_replica2] o.a.s.c.ShardLeaderElectionContext I am the new leader: http://127.0.0.1:65124/solr/MissingSegmentRecoveryTest_shard1_replica2/ shard1
   [junit4]   2> 2038230 INFO  (zkCallback-2881-thread-1-processing-n:127.0.0.1:65123_solr) [n:127.0.0.1:65123_solr    ] o.a.s.c.c.ZkStateReader A cluster state change: [WatchedEvent state:SyncConnected type:NodeDataChanged path:/collections/MissingSegmentRecoveryTest/state.json] for collection [MissingSegmentRecoveryTest] has occurred - updating... (live nodes size: [2])
   [junit4]   2> 2038230 INFO  (zkCallback-2880-thread-1-processing-n:127.0.0.1:65124_solr) [n:127.0.0.1:65124_solr    ] o.a.s.c.c.ZkStateReader A cluster state change: [WatchedEvent state:SyncConnected type:NodeDataChanged path:/collections/MissingSegmentRecoveryTest/state.json] for collection [MissingSegmentRecoveryTest] has occurred - updating... (live nodes size: [2])
   [junit4]   2> 2038279 INFO  (qtp2656833-17868) [n:127.0.0.1:65124_solr c:MissingSegmentRecoveryTest s:shard1  x:MissingSegmentRecoveryTest_shard1_replica2] o.a.s.c.ZkController I am the leader, no recovery necessary
   [junit4]   2> 2038281 INFO  (qtp2656833-17868) [n:127.0.0.1:65124_solr c:MissingSegmentRecoveryTest s:shard1  x:MissingSegmentRecoveryTest_shard1_replica2] o.a.s.s.HttpSolrCall [admin] webapp=null path=/admin/cores params={qt=/admin/cores&collection.configName=conf&newCollection=true&name=MissingSegmentRecoveryTest_shard1_replica2&action=CREATE&numShards=1&collection=MissingSegmentRecoveryTest&shard=shard1&wt=javabin&version=2} status=0 QTime=1474
   [junit4]   2> 2038383 INFO  (zkCallback-2881-thread-1-processing-n:127.0.0.1:65123_solr) [n:127.0.0.1:65123_solr    ] o.a.s.c.c.ZkStateReader A cluster state change: [WatchedEvent state:SyncConnected type:NodeDataChanged path:/collections/MissingSegmentRecoveryTest/state.json] for collection [MissingSegmentRecoveryTest] has occurred - updating... (live nodes size: [2])
   [junit4]   2> 2038383 INFO  (zkCallback-2880-thread-1-processing-n:127.0.0.1:65124_solr) [n:127.0.0.1:65124_solr    ] o.a.s.c.c.ZkStateReader A cluster state change: [WatchedEvent state:SyncConnected type:NodeDataChanged path:/collections/MissingSegmentRecoveryTest/state.json] for collection [MissingSegmentRecoveryTest] has occurred - updating... (live nodes size: [2])
   [junit4]   2> 2039121 INFO  (qtp179629-17873) [n:127.0.0.1:65123_solr c:MissingSegmentRecoveryTest s:shard1  x:MissingSegmentRecoveryTest_shard1_replica1] o.a.s.s.HttpSolrCall [admin] webapp=null path=/admin/cores params={qt=/admin/cores&collection.configName=conf&newCollection=true&name=MissingSegmentRecoveryTest_shard1_replica1&action=CREATE&numShards=1&collection=MissingSegmentRecoveryTest&shard=shard1&wt=javabin&version=2} status=0 QTime=2314
   [junit4]   2> 2039123 INFO  (qtp2656833-17870) [n:127.0.0.1:65124_solr    ] o.a.s.h.a.CollectionsHandler Wait for new collection to be active for at most 30 seconds. Check all shard replicas
   [junit4]   2> 2039224 INFO  (zkCallback-2881-thread-1-processing-n:127.0.0.1:65123_solr) [n:127.0.0.1:65123_solr    ] o.a.s.c.c.ZkStateReader A cluster state change: [WatchedEvent state:SyncConnected type:NodeDataChanged path:/collections/MissingSegmentRecoveryTest/state.json] for collection [MissingSegmentRecoveryTest] has occurred - updating... (live nodes size: [2])
   [junit4]   2> 2039225 INFO  (zkCallback-2880-thread-1-processing-n:127.0.0.1:65124_solr) [n:127.0.0.1:65124_solr    ] o.a.s.c.c.ZkStateReader A cluster state change: [WatchedEvent state:SyncConnected type:NodeDataChanged path:/collections/MissingSegmentRecoveryTest/state.json] for collection [MissingSegmentRecoveryTest] has occurred - updating... (live nodes size: [2])
   [junit4]   2> 2040124 INFO  (qtp2656833-17870) [n:127.0.0.1:65124_solr    ] o.a.s.s.HttpSolrCall [admin] webapp=null path=/admin/collections params={replicationFactor=2&collection.configName=conf&maxShardsPerNode=1&name=MissingSegmentRecoveryTest&action=CREATE&numShards=1&wt=javabin&version=2} status=0 QTime=3457
   [junit4]   2> 2040142 INFO  (qtp179629-17858) [n:127.0.0.1:65123_solr c:MissingSegmentRecoveryTest s:shard1 r:core_node1 x:MissingSegmentRecoveryTest_shard1_replica1] o.a.s.u.p.LogUpdateProcessorFactory [MissingSegmentRecoveryTest_shard1_replica1]  webapp=/solr path=/update params={update.distrib=FROMLEADER&distrib.from=http://127.0.0.1:65124/solr/MissingSegmentRecoveryTest_shard1_replica2/&wt=javabin&version=2}{add=[0 (1576254964953513984), 1 (1576254964959805440), 2 (1576254964959805441), 3 (1576254964959805442), 4 (1576254964959805443), 5 (1576254964959805444), 6 (1576254964959805445), 7 (1576254964959805446), 8 (1576254964959805447), 9 (1576254964959805448)]} 0 6
   [junit4]   2> 2040142 INFO  (qtp2656833-17864) [n:127.0.0.1:65124_solr c:MissingSegmentRecoveryTest s:shard1 r:core_node2 x:MissingSegmentRecoveryTest_shard1_replica2] o.a.s.u.p.LogUpdateProcessorFactory [MissingSegmentRecoveryTest_shard1_replica2]  webapp=/solr path=/update params={wt=javabin&version=2}{add=[0 (1576254964953513984), 1 (1576254964959805440), 2 (1576254964959805441), 3 (1576254964959805442), 4 (1576254964959805443), 5 (1576254964959805444), 6 (1576254964959805445), 7 (1576254964959805446), 8 (1576254964959805447), 9 (1576254964959805448)]} 0 16
   [junit4]   2> 2040148 INFO  (qtp179629-17856) [n:127.0.0.1:65123_solr c:MissingSegmentRecoveryTest s:shard1 r:core_node1 x:MissingSegmentRecoveryTest_shard1_replica1] o.a.s.u.DirectUpdateHandler2 start commit{,optimize=false,openSearcher=true,waitSearcher=true,expungeDeletes=false,softCommit=false,prepareCommit=false}
   [junit4]   2> 2040149 INFO  (qtp179629-17856) [n:127.0.0.1:65123_solr c:MissingSegmentRecoveryTest s:shard1 r:core_node1 x:MissingSegmentRecoveryTest_shard1_replica1] o.a.s.u.SolrIndexWriter Calling setCommitData with IW:org.apache.solr.update.SolrIndexWriter@7f640b
   [junit4]   2> 2040150 INFO  (qtp2656833-17861) [n:127.0.0.1:65124_solr c:MissingSegmentRecoveryTest s:shard1 r:core_node2 x:MissingSegmentRecoveryTest_shard1_replica2] o.a.s.u.DirectUpdateHandler2 start commit{,optimize=false,openSearcher=true,waitSearcher=true,expungeDeletes=false,softCommit=false,prepareCommit=false}
   [junit4]   2> 2040150 INFO  (qtp2656833-17861) [n:127.0.0.1:65124_solr c:MissingSegmentRecoveryTest s:shard1 r:core_node2 x:MissingSegmentRecoveryTest_shard1_replica2] o.a.s.u.SolrIndexWriter Calling setCommitData with IW:org.apache.solr.update.SolrIndexWriter@774e5d
   [junit4]   2> 2040197 INFO  (qtp179629-17856) [n:127.0.0.1:65123_solr c:MissingSegmentRecoveryTest s:shard1 r:core_node1 x:MissingSegmentRecoveryTest_shard1_replica1] o.a.s.s.SolrIndexSearcher Opening [Searcher@1e43743[MissingSegmentRecoveryTest_shard1_replica1] main]
   [junit4]   2> 2040197 INFO  (qtp2656833-17861) [n:127.0.0.1:65124_solr c:MissingSegmentRecoveryTest s:shard1 r:core_node2 x:MissingSegmentRecoveryTest_shard1_replica2] o.a.s.s.SolrIndexSearcher Opening [Searcher@114380b[MissingSegmentRecoveryTest_shard1_replica2] main]
   [junit4]   2> 2040198 INFO  (qtp179629-17856) [n:127.0.0.1:65123_solr c:MissingSegmentRecoveryTest s:shard1 r:core_node1 x:MissingSegmentRecoveryTest_shard1_replica1] o.a.s.u.DirectUpdateHandler2 end_commit_flush
   [junit4]   2> 2040198 INFO  (qtp2656833-17861) [n:127.0.0.1:65124_solr c:MissingSegmentRecoveryTest s:shard1 r:core_node2 x:MissingSegmentRecoveryTest_shard1_replica2] o.a.s.u.DirectUpdateHandler2 end_commit_flush
   [junit4]   2> 2040198 INFO  (searcherExecutor-8649-thread-1-processing-n:127.0.0.1:65123_solr x:MissingSegmentRecoveryTest_shard1_replica1 s:shard1 c:MissingSegmentRecoveryTest r:core_node1) [n:127.0.0.1:65123_solr c:MissingSegmentRecoveryTest s:shard1 r:core_node1 x:MissingSegmentRecoveryTest_shard1_replica1] o.a.s.c.SolrCore [MissingSegmentRecoveryTest_shard1_replica1] Registered new searcher Searcher@1e43743[MissingSegmentRecoveryTest_shard1_replica1] main{ExitableDirectoryReader(UninvertingDirectoryReader(Uninverting(_0(6.6.1):C10)))}
   [junit4]   2> 2040198 INFO  (searcherExecutor-8650-thread-1-processing-n:127.0.0.1:65124_solr x:MissingSegmentRecoveryTest_shard1_replica2 s:shard1 c:MissingSegmentRecoveryTest r:core_node2) [n:127.0.0.1:65124_solr c:MissingSegmentRecoveryTest s:shard1 r:core_node2 x:MissingSegmentRecoveryTest_shard1_replica2] o.a.s.c.SolrCore [MissingSegmentRecoveryTest_shard1_replica2] Registered new searcher Searcher@114380b[MissingSegmentRecoveryTest_shard1_replica2] main{ExitableDirectoryReader(UninvertingDirectoryReader(Uninverting(_0(6.6.1):C10)))}
   [junit4]   2> 2040199 INFO  (qtp179629-17856) [n:127.0.0.1:65123_solr c:MissingSegmentRecoveryTest s:shard1 r:core_node1 x:MissingSegmentRecoveryTest_shard1_replica1] o.a.s.u.p.LogUpdateProcessorFactory [MissingSegmentRecoveryTest_shard1_replica1]  webapp=/solr path=/update params={update.distrib=FROMLEADER&waitSearcher=true&openSearcher=true&commit=true&softCommit=false&distrib.from=http://127.0.0.1:65124/solr/MissingSegmentRecoveryTest_shard1_replica2/&commit_end_point=true&wt=javabin&version=2&expungeDeletes=false}{commit=} 0 49
   [junit4]   2> 2040199 INFO  (qtp2656833-17861) [n:127.0.0.1:65124_solr c:MissingSegmentRecoveryTest s:shard1 r:core_node2 x:MissingSegmentRecoveryTest_shard1_replica2] o.a.s.u.p.LogUpdateProcessorFactory [MissingSegmentRecoveryTest_shard1_replica2]  webapp=/solr path=/update params={update.distrib=FROMLEADER&waitSearcher=true&openSearcher=true&commit=true&softCommit=false&distrib.from=http://127.0.0.1:65124/solr/MissingSegmentRecoveryTest_shard1_replica2/&commit_end_point=true&wt=javabin&version=2&expungeDeletes=false}{commit=} 0 48
   [junit4]   2> 2040199 INFO  (qtp2656833-17863) [n:127.0.0.1:65124_solr c:MissingSegmentRecoveryTest s:shard1 r:core_node2 x:MissingSegmentRecoveryTest_shard1_replica2] o.a.s.u.p.LogUpdateProcessorFactory [MissingSegmentRecoveryTest_shard1_replica2]  webapp=/solr path=/update params={_stateVer_=MissingSegmentRecoveryTest:4&waitSearcher=true&commit=true&softCommit=false&wt=javabin&version=2}{commit=} 0 52
   [junit4]   2> 2040204 INFO  (TEST-MissingSegmentRecoveryTest.testLeaderRecovery-seed#[CD6ECB74B7EA62BC]) [    ] o.e.j.s.AbstractConnector Stopped ServerConnector@12d7357{HTTP/1.1,[http/1.1]}{127.0.0.1:0}
   [junit4]   2> 2040205 INFO  (TEST-MissingSegmentRecoveryTest.testLeaderRecovery-seed#[CD6ECB74B7EA62BC]) [    ] o.a.s.c.CoreContainer Shutting down CoreContainer instance=5262495
   [junit4]   2> 2040205 INFO  (TEST-MissingSegmentRecoveryTest.testLeaderRecovery-seed#[CD6ECB74B7EA62BC]) [    ] o.a.s.m.SolrMetricManager Closing metric reporters for: solr.node
   [junit4]   2> 2040205 INFO  (TEST-MissingSegmentRecoveryTest.testLeaderRecovery-seed#[CD6ECB74B7EA62BC]) [    ] o.a.s.m.SolrMetricManager Closing metric reporters for: solr.jvm
   [junit4]   2> 2040205 INFO  (TEST-MissingSegmentRecoveryTest.testLeaderRecovery-seed#[CD6ECB74B7EA62BC]) [    ] o.a.s.m.SolrMetricManager Closing metric reporters for: solr.jetty
   [junit4]   2> 2040211 INFO  (coreCloseExecutor-8659-thread-1) [n:127.0.0.1:65123_solr c:MissingSegmentRecoveryTest s:shard1 r:core_node1 x:MissingSegmentRecoveryTest_shard1_replica1] o.a.s.c.SolrCore [MissingSegmentRecoveryTest_shard1_replica1]  CLOSING SolrCore org.apache.solr.core.SolrCore@a4c214
   [junit4]   2> 2040213 INFO  (coreCloseExecutor-8659-thread-1) [n:127.0.0.1:65123_solr c:MissingSegmentRecoveryTest s:shard1 r:core_node1 x:MissingSegmentRecoveryTest_shard1_replica1] o.a.s.m.SolrMetricManager Closing metric reporters for: solr.core.MissingSegmentRecoveryTest.shard1.replica1
   [junit4]   2> 2040218 WARN  (NIOServerCxn.Factory:0.0.0.0/0.0.0.0:0) [    ] o.a.z.s.NIOServerCnxn caught end of stream exception
   [junit4]   2> EndOfStreamException: Unable to read additional data from client sessionid 0x15dffb8916f0006, likely client has closed socket
   [junit4]   2> 	at org.apache.zookeeper.server.NIOServerCnxn.doIO(NIOServerCnxn.java:239)
   [junit4]   2> 	at org.apache.zookeeper.server.NIOServerCnxnFactory.run(NIOServerCnxnFactory.java:203)
   [junit4]   2> 	at java.lang.Thread.run(Thread.java:748)
   [junit4]   2> 2040220 INFO  (TEST-MissingSegmentRecoveryTest.testLeaderRecovery-seed#[CD6ECB74B7EA62BC]) [    ] o.e.j.s.h.ContextHandler Stopped o.e.j.s.ServletContextHandler@147607{/solr,null,UNAVAILABLE}
   [junit4]   2> 2040221 INFO  (zkCallback-2880-thread-1-processing-n:127.0.0.1:65124_solr) [n:127.0.0.1:65124_solr    ] o.a.s.c.c.ZkStateReader Updated live nodes from ZooKeeper... (2) -> (1)
   [junit4]   2> 2040222 INFO  (zkCallback-2887-thread-1) [    ] o.a.s.c.c.ZkStateReader Updated live nodes from ZooKeeper... (2) -> (1)
   [junit4]   2> 2040223 INFO  (TEST-MissingSegmentRecoveryTest.testLeaderRecovery-seed#[CD6ECB74B7EA62BC]) [    ] o.e.j.s.Server jetty-9.3.14.v20161028
   [junit4]   2> 2040225 INFO  (TEST-MissingSegmentRecoveryTest.testLeaderRecovery-seed#[CD6ECB74B7EA62BC]) [    ] o.e.j.s.h.ContextHandler Started o.e.j.s.ServletContextHandler@a024e3{/solr,null,AVAILABLE}
   [junit4]   2> 2040226 INFO  (TEST-MissingSegmentRecoveryTest.testLeaderRecovery-seed#[CD6ECB74B7EA62BC]) [    ] o.e.j.s.AbstractConnector Started ServerConnector@1bcab10{HTTP/1.1,[http/1.1]}{127.0.0.1:65123}
   [junit4]   2> 2040227 INFO  (TEST-MissingSegmentRecoveryTest.testLeaderRecovery-seed#[CD6ECB74B7EA62BC]) [    ] o.e.j.s.Server Started @2047523ms
   [junit4]   2> 2040227 INFO  (TEST-MissingSegmentRecoveryTest.testLeaderRecovery-seed#[CD6ECB74B7EA62BC]) [    ] o.a.s.c.s.e.JettySolrRunner Jetty properties: {hostContext=/solr, hostPort=65123}
   [junit4]   2> 2040227 ERROR (TEST-MissingSegmentRecoveryTest.testLeaderRecovery-seed#[CD6ECB74B7EA62BC]) [    ] o.a.s.s.StartupLoggingUtils Missing Java Option solr.log.dir. Logging may be missing or incomplete.
   [junit4]   2> 2040227 INFO  (TEST-MissingSegmentRecoveryTest.testLeaderRecovery-seed#[CD6ECB74B7EA62BC]) [    ] o.a.s.s.SolrDispatchFilter  ___      _       Welcome to Apache Solr? version 6.6.1
   [junit4]   2> 2040227 INFO  (TEST-MissingSegmentRecoveryTest.testLeaderRecovery-seed#[CD6ECB74B7EA62BC]) [    ] o.a.s.s.SolrDispatchFilter / __| ___| |_ _   Starting in cloud mode on port null
   [junit4]   2> 2040227 INFO  (TEST-MissingSegmentRecoveryTest.testLeaderRecovery-seed#[CD6ECB74B7EA62BC]) [    ] o.a.s.s.SolrDispatchFilter \__ \/ _ \ | '_|  Install dir: null
   [junit4]   2> 2040227 INFO  (TEST-MissingSegmentRecoveryTest.testLeaderRecovery-seed#[CD6ECB74B7EA62BC]) [    ] o.a.s.s.SolrDispatchFilter |___/\___/_|_|    Start time: 2017-08-20T12:57:56.282Z
   [junit4]   2> 2040235 INFO  (TEST-MissingSegmentRecoveryTest.testLeaderRecovery-seed#[CD6ECB74B7EA62BC]) [    ] o.a.s.s.SolrDispatchFilter solr.xml found in ZooKeeper. Loading...
   [junit4]   2> 2040271 WARN  (NIOServerCxn.Factory:0.0.0.0/0.0.0.0:0) [    ] o.a.z.s.NIOServerCnxn caught end of stream exception
   [junit4]   2> EndOfStreamException: Unable to read additional data from client sessionid 0x15dffb8916f0009, likely client has closed socket
   [junit4]   2> 	at org.apache.zookeeper.server.NIOServerCnxn.doIO(NIOServerCnxn.java:239)
   [junit4]   2> 	at org.apache.zookeeper.server.NIOServerCnxnFactory.run(NIOServerCnxnFactory.java:203)
   [junit4]   2> 	at java.lang.Thread.run(Thread.java:748)
   [junit4]   2> 2040278 INFO  (TEST-MissingSegmentRecoveryTest.testLeaderRecovery-seed#[CD6ECB74B7EA62BC]) [    ] o.a.s.u.UpdateShardHandler Creating UpdateShardHandler HTTP client with params: socketTimeout=340000&connTimeout=45000&retry=true
   [junit4]   2> 2040280 INFO  (TEST-MissingSegmentRecoveryTest.testLeaderRecovery-seed#[CD6ECB74B7EA62BC]) [    ] o.a.s.c.ZkContainer Zookeeper client=127.0.0.1:65119/solr
   [junit4]   2> 2040287 WARN  (NIOServerCxn.Factory:0.0.0.0/0.0.0.0:0) [    ] o.a.z.s.NIOServerCnxn caught end of stream exception
   [junit4]   2> EndOfStreamException: Unable to read additional data from client sessionid 0x15dffb8916f000a, likely client has closed socket
   [junit4]   2> 	at org.apache.zookeeper.server.NIOServerCnxn.doIO(NIOServerCnxn.java:239)
   [junit4]   2> 	at org.apache.zookeeper.server.NIOServerCnxnFactory.run(NIOServerCnxnFactory.java:203)
   [junit4]   2> 	at java.lang.Thread.run(Thread.java:748)
   [junit4]   2> 2040302 INFO  (TEST-MissingSegmentRecoveryTest.testLeaderRecovery-seed#[CD6ECB74B7EA62BC]) [n:127.0.0.1:65123_solr    ] o.a.s.c.c.ZkStateReader Updated live nodes from ZooKeeper... (0) -> (1)
   [junit4]   2> 2040306 INFO  (TEST-MissingSegmentRecoveryTest.testLeaderRecovery-seed#[CD6ECB74B7EA62BC]) [n:127.0.0.1:65123_solr    ] o.a.s.c.Overseer Overseer (id=null) closing
   [junit4]   2> 2040310 INFO  (TEST-MissingSegmentRecoveryTest.testLeaderRecovery-seed#[CD6ECB74B7EA62BC]) [n:127.0.0.1:65123_solr    ] o.a.s.c.ZkController Register node as live in ZooKeeper:/live_nodes/127.0.0.1:65123_solr
   [junit4]   2> 2040315 INFO  (zkCallback-2892-thread-1-processing-n:127.0.0.1:65123_solr) [n:127.0.0.1:65123_solr    ] o.a.s.c.c.ZkStateReader Updated live nodes from ZooKeeper... (1) -> (2)
   [junit4]   2> 2040315 INFO  (zkCallback-2880-thread-1-processing-n:127.0.0.1:65124_solr) [n:127.0.0.1:65124_solr    ] o.a.s.c.c.ZkStateReader Updated live nodes from ZooKeeper... (1) -> (2)
   [junit4]   2> 2040315 INFO  (zkCallback-2887-thread-1) [    ] o.a.s.c.c.ZkStateReader Updated live nodes from ZooKeeper... (1) -> (2)
   [junit4]   2> 2040399 INFO  (TEST-MissingSegmentRecoveryTest.testLeaderRecovery-seed#[CD6ECB74B7EA62BC]) [n:127.0.0.1:65123_solr    ] o.a.s.c.CorePropertiesLocator Found 1 core definitions underneath C:\Users\jenkins\workspace\Lucene-Solr-6.6-Windows\solr\build\solr-core\test\J0\temp\solr.cloud.MissingSegmentRecoveryTest_CD6ECB74B7EA62BC-001\tempDir-001\node1\.
   [junit4]   2> 2040399 INFO  (TEST-MissingSegmentRecoveryTest.testLeaderRecovery-seed#[CD6ECB74B7EA62BC]) [n:127.0.0.1:65123_solr    ] o.a.s.c.CorePropertiesLocator Cores are: [MissingSegmentRecoveryTest_shard1_replica1]
   [junit4]   2> 2040404 INFO  (coreLoadExecutor-8666-thread-1-processing-n:127.0.0.1:65123_solr) [n:127.0.0.1:65123_solr c:MissingSegmentRecoveryTest s:shard1  x:MissingSegmentRecoveryTest_shard1_replica1] o.a.s.c.TransientSolrCoreCacheDefault Allocating transient cache for 2147483647 transient cores
   [junit4]   2> 2040431 INFO  (coreLoadExecutor-8666-thread-1-processing-n:127.0.0.1:65123_solr) [n:127.0.0.1:65123_solr c:MissingSegmentRecoveryTest s:shard1  x:MissingSegmentRecoveryTest_shard1_replica1] o.a.s.c.SolrConfig Using Lucene MatchVersion: 6.6.1
   [junit4]   2> 2040440 INFO  (coreLoadExecutor-8666-thread-1-processing-n:127.0.0.1:65123_solr) [n:127.0.0.1:65123_solr c:MissingSegmentRecoveryTest s:shard1  x:MissingSegmentRecoveryTest_shard1_replica1] o.a.s.s.IndexSchema [MissingSegmentRecoveryTest_shard1_replica1] Schema name=minimal
   [junit4]   2> 2040446 INFO  (coreLoadExecutor-8666-thread-1-processing-n:127.0.0.1:65123_solr) [n:127.0.0.1:65123_solr c:MissingSegmentRecoveryTest s:shard1  x:MissingSegmentRecoveryTest_shard1_replica1] o.a.s.s.IndexSchema Loaded schema minimal/1.1 with uniqueid field id
   [junit4]   2> 2040446 INFO  (coreLoadExecutor-8666-thread-1-processing-n:127.0.0.1:65123_solr) [n:127.0.0.1:65123_solr c:MissingSegmentRecoveryTest s:shard1  x:MissingSegmentRecoveryTest_shard1_replica1] o.a.s.c.CoreContainer Creating SolrCore 'MissingSegmentRecoveryTest_shard1_replica1' using configuration from collection MissingSegmentRecoveryTest, trusted=true
   [junit4]   2> 2040447 INFO  (coreLoadExecutor-8666-thread-1-processing-n:127.0.0.1:65123_solr) [n:127.0.0.1:65123_solr c:MissingSegmentRecoveryTest s:shard1  x:MissingSegmentRecoveryTest_shard1_replica1] o.a.s.c.SolrCore solr.RecoveryStrategy.Builder
   [junit4]   2> 2040447 INFO  (coreLoadExecutor-8666-thread-1-processing-n:127.0.0.1:65123_solr) [n:127.0.0.1:65123_solr c:MissingSegmentRecoveryTest s:shard1  x:MissingSegmentRecoveryTest_shard1_replica1] o.a.s.c.SolrCore [[MissingSegmentRecoveryTest_shard1_replica1] ] Opening new SolrCore at [C:\Users\jenkins\workspace\Lucene-Solr-6.6-Windows\solr\build\solr-core\test\J0\temp\solr.cloud.MissingSegmentRecoveryTest_CD6ECB74B7EA62BC-001\tempDir-001\node1\MissingSegmentRecoveryTest_shard1_replica1], dataDir=[C:\Users\jenkins\workspace\Lucene-Solr-6.6-Windows\solr\build\solr-core\test\J0\temp\solr.cloud.MissingSegmentRecoveryTest_CD6ECB74B7EA62BC-001\tempDir-001\node1\.\MissingSegmentRecoveryTest_shard1_replica1\data\]
   [junit4]   2> 2040511 INFO  (zkCallback-2880-thread-1-processing-n:127.0.0.1:65124_solr) [n:127.0.0.1:65124_solr    ] o.a.s.c.c.ZkStateReader A cluster state change: [WatchedEvent state:SyncConnected type:NodeDataChanged path:/collections/MissingSegmentRecoveryTest/state.json] for collection [MissingSegmentRecoveryTest] has occurred - updating... (live nodes size: [2])
   [junit4]   2> 2040511 INFO  (zkCallback-2892-thread-1-processing-n:127.0.0.1:65123_solr) [n:127.0.0.1:65123_solr    ] o.a.s.c.c.ZkStateReader A cluster state change: [WatchedEvent state:SyncConnected type:NodeDataChanged path:/collections/MissingSegmentRecoveryTest/state.json] for collection [MissingSegmentRecoveryTest] has occurred - updating... (live nodes size: [2])
   [junit4]   2> 2040549 INFO  (coreLoadExecutor-8666-thread-1-processing-n:127.0.0.1:65123_solr) [n:127.0.0.1:65123_solr c:MissingSegmentRecoveryTest s:shard1  x:MissingSegmentRecoveryTest_shard1_replica1] o.a.s.u.UpdateHandler Using UpdateLog implementation: org.apache.solr.update.UpdateLog
   [junit4]   2> 2040549 INFO  (coreLoadExecutor-8666-thread-1-processing-n:127.0.0.1:65123_solr) [n:127.0.0.1:65123_solr c:MissingSegmentRecoveryTest s:shard1  x:MissingSegmentRecoveryTest_shard1_replica1] o.a.s.u.UpdateLog Initializing UpdateLog: dataDir=null defaultSyncLevel=FLUSH numRecordsToKeep=100 maxNumLogsToKeep=10 numVersionBuckets=65536
   [junit4]   2> 2040552 INFO  (coreLoadExecutor-8666-thread-1-processing-n:127.0.0.1:65123_solr) [n:127.0.0.1:65123_solr c:MissingSegmentRecoveryTest s:shard1  x:MissingSegmentRecoveryTest_shard1_replica1] o.a.s.u.CommitTracker Hard AutoCommit: disabled
   [junit4]   2> 2040552 INFO  (coreLoadExecutor-8666-thread-1-processing-n:127.0.0.1:65123_solr) [n:127.0.0.1:65123_solr c:MissingSegmentRecoveryTest s:shard1  x:MissingSegmentRecoveryTest_shard1_replica1] o.a.s.u.CommitTracker Soft AutoCommit: disabled
   [junit4]   2> 2040554 INFO  (coreLoadExecutor-8666-thread-1-processing-n:127.0.0.1:65123_solr) [n:127.0.0.1:65123_solr c:MissingSegmentRecoveryTest s:shard1  x:MissingSegmentRecoveryTest_shard1_replica1] o.a.s.c.SolrCore [MissingSegmentRecoveryTest_shard1_replica1]  CLOSING SolrCore org.apache.solr.core.SolrCore@312b4
   [junit4]   2> 2040555 INFO  (coreLoadExecutor-8666-thread-1-processing-n:127.0.0.1:65123_solr) [n:127.0.0.1:65123_solr c:MissingSegmentRecoveryTest s:shard1  x:MissingSegmentRecoveryTest_shard1_replica1] o.a.s.m.SolrMetricManager Closing metric reporters for: solr.core.MissingSegmentRecoveryTest.shard1.replica1
   [junit4]   2> 2040558 INFO  (coreLoadExecutor-8666-thread-1-processing-n:127.0.0.1:65123_solr) [n:127.0.0.1:65123_solr c:MissingSegmentRecoveryTest s:shard1  x:MissingSegmentRecoveryTest_shard1_replica1] o.a.s.c.CoreContainer Found active leader, will attempt to create fresh core and recover.
   [junit4]   2> 2040559 INFO  (coreLoadExecutor-8666-thread-1-processing-n:127.0.0.1:65123_solr) [n:127.0.0.1:65123_solr c:MissingSegmentRecoveryTest s:shard1  x:MissingSegmentRecoveryTest_shard1_replica1] o.a.s.c.SolrCore Updating index properties... index=index.20170820155756614
   [junit4]   2> 2040563 INFO  (coreLoadExecutor-8666-thread-1-processing-n:127.0.0.1:65123_solr) [n:127.0.0.1:65123_solr c:MissingSegmentRecoveryTest s:shard1  x:MissingSegmentRecoveryTest_shard1_replica1] o.a.s.c.SolrCore solr.RecoveryStrategy.Builder
   [junit4]   2> 2040563 INFO  (coreLoadExecutor-8666-thread-1-processing-n:127.0.0.1:65123_solr) [n:127.0.0.1:65123_solr c:MissingSegmentRecoveryTest s:shard1  x:MissingSegmentRecoveryTest_shard1_replica1] o.a.s.c.SolrCore [[MissingSegmentRecoveryTest_shard1_replica1] ] Opening new SolrCore at [C:\Users\jenkins\workspace\Lucene-Solr-6.6-Windows\solr\build\solr-core\test\J0\temp\solr.cloud.MissingSegmentRecoveryTest_CD6ECB74B7EA62BC-001\tempDir-001\node1\MissingSegmentRecoveryTest_shard1_replica1], dataDir=[C:\Users\jenkins\workspace\Lucene-Solr-6.6-Windows\solr\build\solr-core\test\J0\temp\solr.cloud.MissingSegmentRecoveryTest_CD6ECB74B7EA62BC-001\tempDir-001\node1\.\MissingSegmentRecoveryTest_shard1_replica1\data\]
   [junit4]   2> 2040590 INFO  (OldIndexDirectoryCleanupThreadForCore-MissingSegmentRecoveryTest_shard1_replica1) [n:127.0.0.1:65123_solr c:MissingSegmentRecoveryTest s:shard1  x:MissingSegmentRecoveryTest_shard1_replica1] o.a.s.c.DirectoryFactory Found 1 old index directories to clean-up under C:\Users\jenkins\workspace\Lucene-Solr-6.6-Windows\solr\build\solr-core\test\J0\temp\solr.cloud.MissingSegmentRecoveryTest_CD6ECB74B7EA62BC-001\tempDir-001\node1\.\MissingSegmentRecoveryTest_shard1_replica1\data\ afterReload=false
   [junit4]   2> 2040593 INFO  (OldIndexDirectoryCleanupThreadForCore-MissingSegmentRecoveryTest_shard1_replica1) [n:127.0.0.1:65123_solr c:MissingSegmentRecoveryTest s:shard1  x:MissingSegmentRecoveryTest_shard1_replica1] o.a.s.c.DirectoryFactory Found 1 old index directories to clean-up under C:\Users\jenkins\workspace\Lucene-Solr-6.6-Windows\solr\build\solr-core\test\J0\temp\solr.cloud.MissingSegmentRecoveryTest_CD6ECB74B7EA62BC-001\tempDir-001\node1\.\MissingSegmentRecoveryTest_shard1_replica1\data\ afterReload=false
   [junit4]   2> 2040601 INFO  (OldIndexDirectoryCleanupThreadForCore-MissingSegmentRecoveryTest_shard1_replica1) [n:127.0.0.1:65123_solr c:MissingSegmentRecoveryTest s:shard1  x:MissingSegmentRecoveryTest_shard1_replica1] o.a.s.c.DirectoryFactory Deleted old index directory: C:\Users\jenkins\workspace\Lucene-Solr-6.6-Windows\solr\build\solr-core\test\J0\temp\solr.cloud.MissingSegmentRecoveryTest_CD6ECB74B7EA62BC-001\tempDir-001\node1\.\MissingSegmentRecoveryTest_shard1_replica1\data\index.20170820155756614
   [junit4]   2> 2040618 INFO  (OldIndexDirectoryCleanupThreadForCore-MissingSegmentRecoveryTest_shard1_replica1) [n:127.0.0.1:65123_solr c:MissingSegmentRecoveryTest s:shard1  x:MissingSegmentRecoveryTest_shard1_replica1] o.a.s.c.DirectoryFactory Deleted old index directory: C:\Users\jenkins\workspace\Lucene-Solr-6.6-Windows\solr\build\solr-core\test\J0\temp\solr.cloud.MissingSegmentRecoveryTest_CD6ECB74B7EA62BC-001\tempDir-001\node1\.\MissingSegmentRecoveryTest_shard1_replica1\data\index
   [junit4]   2> 2040673 INFO  (coreLoadExecutor-8666-thread-1-processing-n:127.0.0.1:65123_solr) [n:127.0.0.1:65123_solr c:MissingSegmentRecoveryTest s:shard1  x:MissingSegmentRecoveryTest_shard1_replica1] o.a.s.u.UpdateHandler Using UpdateLog implementation: org.apache.solr.update.UpdateLog
   [junit4]   2> 2040673 INFO  (coreLoadExecutor-8666-thread-1-processing-n:127.0.0.1:65123_solr) [n:127.0.0.1:65123_solr c:MissingSegmentRecoveryTest s:shard1  x:MissingSegmentRecoveryTest_shard1_replica1] o.a.s.u.UpdateLog Initializing UpdateLog: dataDir=null defaultSyncLevel=FLUSH numRecordsToKeep=100 maxNumLogsToKeep=10 numVersionBuckets=65536
   [junit4]   2> 2040675 INFO  (coreLoadExecutor-8666-thread-1-processing-n:127.0.0.1:65123_solr) [n:127.0.0.1:65123_solr c:MissingSegmentRecoveryTest s:shard1  x:MissingSegmentRecoveryTest_shard1_replica1] o.a.s.u.CommitTracker Hard AutoCommit: disabled
   [junit4]   2> 2040675 INFO  (coreLoadExecutor-8666-thread-1-processing-n:127.0.0.1:65123_solr) [n:127.0.0.1:65123_solr c:MissingSegmentRecoveryTest s:shard1  x:MissingSegmentRecoveryTest_shard1_replica1] o.a.s.u.CommitTracker Soft AutoCommit: disabled
   [junit4]   2> 2040677 INFO  (OverseerCollectionConfigSetProcessor-98515935051055109-127.0.0.1:65124_solr-n_0000000000) [n:127.0.0.1:65124_solr    ] o.a.s.c.OverseerTaskQueue Response ZK path: /overseer/collection-queue-work/qnr-0000000000 doesn't exist.  Requestor may have disconnected from ZooKeeper
   [junit4]   2> 2040678 INFO  (coreLoadExecutor-8666-thread-1-processing-n:127.0.0.1:65123_solr) [n:127.0.0.1:65123_solr c:MissingSegmentRecoveryTest s:shard1  x:MissingSegmentRecoveryTest_shard1_replica1] o.a.s.c.SolrCore [MissingSegmentRecoveryTest_shard1_replica1]  CLOSING SolrCore org.apache.solr.core.SolrCore@15a0f2c
   [junit4]   2> 2040679 INFO  (coreLoadExecutor-8666-thread-1-processing-n:127.0.0.1:65123_solr) [n:127.0.0.1:65123_solr c:MissingSegmentRecoveryTest s:shard1  x:MissingSegmentRecoveryTest_shard1_replica1] o.a.s.m.SolrMetricManager Closing metric reporters for: solr.core.MissingSegmentRecoveryTest.shard1.replica1
   [junit4]   2> 2040679 ERROR (coreContainerWorkExecutor-8662-thread-1-processing-n:127.0.0.1:65123_solr) [n:127.0.0.1:65123_solr    ] o.a.s.c.CoreContainer Error waiting for SolrCore to be created
   [junit4]   2> java.util.concurrent.ExecutionException: org.apache.solr.common.SolrException: Unable to create core [MissingSegmentRecoveryTest_shard1_replica1]
   [junit4]   2> 	at java.util.concurrent.FutureTask.report(FutureTask.java:122)
   [junit4]   2> 	at java.util.concurrent.FutureTask.get(FutureTask.java:192)
   [junit4]   2> 	at org.apache.solr.core.CoreContainer.lambda$load$6(CoreContainer.java:592)
   [junit4]   2> 	at com.codahale.metrics.InstrumentedExecutorService$InstrumentedRunnable.run(InstrumentedExecutorService.java:176)
   [junit4]   2> 	at java.util.concurrent.Executors$RunnableAdapter.call(Executors.java:511)
   [junit4]   2> 	at java.util.concurrent.FutureTask.run(FutureTask.java:266)
   [junit4]   2> 	at org.apache.solr.common.util.ExecutorUtil$MDCAwareThreadPoolExecutor.lambda$execute$0(ExecutorUtil.java:229)
   [junit4]   2> 	at java.util.concurrent.ThreadPoolExecutor.runWorker(ThreadPoolExecutor.java:1149)
   [junit4]   2> 	at java.util.concurrent.ThreadPoolExecutor$Worker.run(ThreadPoolExecutor.java:624)
   [junit4]   2> 	at java.lang.Thread.run(Thread.java:748)
   [junit4]   2> Caused by: org.apache.solr.common.SolrException: Unable to create core [MissingSegmentRecoveryTest_shard1_replica1]
   [junit4]   2> 	at org.apache.solr.core.CoreContainer.createFromDescriptor(CoreContainer.java:938)
   [junit4]   2> 	at org.apache.solr.core.CoreContainer.lambda$load$5(CoreContainer.java:564)
   [junit4]   2> 	at com.codahale.metrics.InstrumentedExecutorService$InstrumentedCallable.call(InstrumentedExecutorService.java:197)
   [junit4]   2> 	... 5 more
   [junit4]   2> Caused by: org.apache.solr.common.SolrException: Error opening new searcher
   [junit4]   2> 	at org.apache.solr.core.SolrCore.<init>(SolrCore.java:977)
   [junit4]   2> 	at org.apache.solr.core.SolrCore.<init>(SolrCore.java:830)
   [junit4]   2> 	at org.apache.solr.core.CoreContainer.processCoreCreateException(CoreContainer.java:998)
   [junit4]   2> 	at org.apache.solr.core.CoreContainer.createFromDescriptor(CoreContainer.java:924)
   [junit4]   2> 	... 7 more
   [junit4]   2> 	Suppressed: org.apache.solr.common.SolrException: Error opening new searcher
   [junit4]   2> 		at org.apache.solr.core.SolrCore.<init>(SolrCore.java:977)
   [junit4]   2> 		at org.apache.solr.core.SolrCore.<init>(SolrCore.java:830)
   [junit4]   2> 		at org.apache.solr.core.CoreContainer.createFromDescriptor(CoreContainer.java:922)
   [junit4]   2> 		... 7 more
   [junit4]   2> 	Caused by: org.apache.solr.common.SolrException: Error opening new searcher
   [junit4]   2> 		at org.apache.solr.core.SolrCore.openNewSearcher(SolrCore.java:2069)
   [junit4]   2> 		at org.apache.solr.core.SolrCore.getSearcher(SolrCore.java:2189)
   [junit4]   2> 		at org.apache.solr.core.SolrCore.initSearcher(SolrCore.java:1071)
   [junit4]   2> 		at org.apache.solr.core.SolrCore.<init>(SolrCore.java:949)
   [junit4]   2> 		... 9 more
   [junit4]   2> 	Caused by: org.apache.lucene.index.CorruptIndexException: Unexpected file read error while reading index. (resource=BufferedChecksumIndexInput(SimpleFSIndexInput(path="C:\Users\jenkins\workspace\Lucene-Solr-6.6-Windows\solr\build\solr-core\test\J0\temp\solr.cloud.MissingSegmentRecoveryTest_CD6ECB74B7EA62BC-001\tempDir-001\node1\MissingSegmentRecoveryTest_shard1_replica1\data\index\segments_2")))
   [junit4]   2> 		at org.apache.lucene.index.SegmentInfos.readCommit(SegmentInfos.java:290)
   [junit4]   2> 		at org.apache.lucene.index.IndexWriter.<init>(IndexWriter.java:930)
   [junit4]   2> 		at org.apache.solr.update.SolrIndexWriter.<init>(SolrIndexWriter.java:118)
   [junit4]   2> 		at org.apache.solr.update.SolrIndexWriter.create(SolrIndexWriter.java:93)
   [junit4]   2> 		at org.apache.solr.update.DefaultSolrCoreState.createMainIndexWriter(DefaultSolrCoreState.java:257)
   [junit4]   2> 		at org.apache.solr.update.DefaultSolrCoreState.getIndexWriter(DefaultSolrCoreState.java:131)
   [junit4]   2> 		at org.apache.solr.core.SolrCore.openNewSearcher(SolrCore.java:2030)
   [junit4]   2> 		... 12 more
   [junit4]   2> 	Caused by: java.io.EOFException: read past EOF: SimpleFSIndexInput(path="C:\Users\jenkins\workspace\Lucene-Solr-6.6-Windows\solr\build\solr-core\test\J0\temp\solr.cloud.MissingSegmentRecoveryTest_CD6ECB74B7EA62BC-001\tempDir-001\node1\MissingSegmentRecoveryTest_shard1_replica1\data\index\segments_2")
   [junit4]   2> 		at org.apache.lucene.store.BufferedIndexInput.refill(BufferedIndexInput.java:336)
   [junit4]   2> 		at org.apache.lucene.store.BufferedIndexInput.readByte(BufferedIndexInput.java:54)
   [junit4]   2> 		at org.apache.lucene.store.BufferedChecksumIndexInput.readByte(BufferedChecksumIndexInput.java:41)
   [junit4]   2> 		at org.apache.lucene.store.DataInput.readInt(DataInput.java:101)
   [junit4]   2> 		at org.apache.lucene.index.SegmentInfos.readCommit(SegmentInfos.java:300)
   [junit4]   2> 		at org.apache.lucene.index.SegmentInfos.readCommit(SegmentInfos.java:288)
   [junit4]   2> 		... 18 more
   [junit4]   2> Caused by: org.apache.solr.common.SolrException: Error opening new searcher
   [junit4]   2> 	at org.apache.solr.core.SolrCore.openNewSearcher(SolrCore.java:2069)
   [junit4]   2> 	at org.apache.solr.core.SolrCore.getSearcher(SolrCore.java:2189)
   [junit4]   2> 	at org.apache.solr.core.SolrCore.initSearcher(SolrCore.java:1071)
   [junit4]   2> 	at org.apache.solr.core.SolrCore.<init>(SolrCore.java:949)
   [junit4]   2> 	... 10 more
   [junit4]   2> Caused by: org.apache.lucene.index.IndexNotFoundException: no segments* file found in LockValidatingDirectoryWrapper(SimpleFSDirectory@C:\Users\jenkins\workspace\Lucene-Solr-6.6-Windows\solr\build\solr-core\test\J0\temp\solr.cloud.MissingSegmentRecoveryTest_CD6ECB74B7EA62BC-001\tempDir-001\node1\MissingSegmentRecoveryTest_shard1_replica1\data\index.20170820155756614 lockFactory=org.apache.lucene.store.NativeFSLockFactory@c52bbd): files: [write.lock]
   [junit4]   2> 	at org.apache.lucene.index.IndexWriter.<init>(IndexWriter.java:925)
   [junit4]   2> 	at org.apache.solr.update.SolrIndexWriter.<init>(SolrIndexWriter.java:118)
   [junit4]   2> 	at org.apache.solr.update.SolrIndexWriter.create(SolrIndexWriter.java:93)
   [junit4]   2> 	at org.apache.solr.update.DefaultSolrCoreState.createMainIndexWriter(DefaultSolrCoreState.java:257)
   [junit4]   2> 	at org.apache.solr.update.DefaultSolrCoreState.getIndexWriter(DefaultSolrCoreState.java:131)
   [junit4]   2> 	at org.apache.solr.core.SolrCore.openNewSearcher(SolrCore.java:2030)
   [junit4]   2> 	... 13 more
   [junit4]   2> 2130916 INFO  (qtp2656833-17878) [n:127.0.0.1:65124_solr    ] o.a.s.h.a.CollectionsHandler Invoked Collection Action :delete with params name=MissingSegmentRecoveryTest&action=DELETE&wt=javabin&version=2 and sendToOCPQueue=true
   [junit4]   2> 2130919 INFO  (OverseerThreadFactory-8644-thread-2-processing-n:127.0.0.1:65124_solr) [n:127.0.0.1:65124_solr    ] o.a.s.c.OverseerCollectionMessageHandler Executing Collection Cmd : action=UNLOAD&deleteInstanceDir=true&deleteDataDir=true
   [junit4]   2> 2130927 INFO  (qtp2656833-17870) [n:127.0.0.1:65124_solr    ] o.a.s.m.SolrMetricManager Closing metric reporters for: solr.core.MissingSegmentRecoveryTest.shard1.replica2
   [junit4]   2> 2130928 INFO  (qtp2656833-17870) [n:127.0.0.1:65124_solr    ] o.a.s.c.SolrCore [MissingSegmentRecoveryTest_shard1_replica2]  CLOSING SolrCore org.apache.solr.core.SolrCore@14c0d2b
   [junit4]   2> 2130932 INFO  (qtp2656833-17870) [n:127.0.0.1:65124_solr    ] o.a.s.m.SolrMetricManager Closing metric reporters for: solr.core.MissingSegmentRecoveryTest.shard1.replica2
   [junit4]   2> 2130945 INFO  (qtp11953081-17933) [n:127.0.0.1:65123_solr    ] o.a.s.s.HttpSolrCall [admin] webapp=null path=/admin/cores params={deleteInstanceDir=true&core=MissingSegmentRecoveryTest_shard1_replica1&qt=/admin/cores&deleteDataDir=true&action=UNLOAD&wt=javabin&version=2} status=0 QTime=25
   [junit4]   2> 2130952 INFO  (qtp2656833-17870) [n:127.0.0.1:65124_solr    ] o.a.s.s.HttpSolrCall [admin] webapp=null path=/admin/cores params={deleteInstanceDir=true&core=MissingSegmentRecoveryTest_shard1_replica2&qt=/admin/cores&deleteDataDir=true&action=UNLOAD&wt=javabin&version=2} status=0 QTime=25
   [junit4]   2> 2130958 INFO  (zkCallback-2892-thread-2-processing-n:127.0.0.1:65123_solr) [n:127.0.0.1:65123_solr    ] o.a.s.c.c.ZkStateReader A cluster state change: [WatchedEvent state:SyncConnected type:NodeDataChanged path:/collections/MissingSegmentRecoveryTest/state.json] for collection [MissingSegmentRecoveryTest] has occurred - updating... (live nodes size: [2])
   [junit4]   2> 2131060 INFO  (zkCallback-2892-thread-2-processing-n:127.0.0.1:65123_solr) [n:127.0.0.1:65123_solr    ] o.a.s.c.c.ZkStateReader A cluster state change: [WatchedEvent state:SyncConnected type:NodeDeleted path:/collections/MissingSegmentRecoveryTest/state.json] for collection [MissingSegmentRecoveryTest] has occurred - updating... (live nodes size: [2])
   [junit4]   2> 2131655 INFO  (qtp2656833-17878) [n:127.0.0.1:65124_solr    ] o.a.s.s.HttpSolrCall [admin] webapp=null path=/admin/collections params={name=MissingSegmentRecoveryTest&action=DELETE&wt=javabin&version=2} status=0 QTime=741
   [junit4]   2> 2131655 INFO  (TEST-MissingSegmentRecoveryTest.testLeaderRecovery-seed#[CD6ECB74B7EA62BC]) [    ] o.a.s.SolrTestCaseJ4 ###Ending testLeaderRecovery
   [junit4]   2> NOTE: reproduce with: ant test  -Dtestcase=MissingSegmentRecoveryTest -Dtests.method=testLeaderRecovery -Dtests.seed=CD6ECB74B7EA62BC -Dtests.slow=true -Dtests.locale=en-AU -Dtests.timezone=Europe/Vilnius -Dtests.asserts=true -Dtests.file.encoding=US-ASCII
   [junit4] FAILURE 95.0s J0 | MissingSegmentRecoveryTest.testLeaderRecovery <<<
   [junit4]    > Throwable #1: java.lang.AssertionError: Expected a collection with one shard and two replicas
   [junit4]    > null
   [junit4]    > Last available state: DocCollection(MissingSegmentRecoveryTest//collections/MissingSegmentRecoveryTest/state.json/5)={
   [junit4]    >   "replicationFactor":"2",
   [junit4]    >   "shards":{"shard1":{
   [junit4]    >       "range":"80000000-7fffffff",
   [junit4]    >       "state":"active",
   [junit4]    >       "replicas":{
   [junit4]    >         "core_node1":{
   [junit4]    >           "core":"MissingSegmentRecoveryTest_shard1_replica1",
   [junit4]    >           "base_url":"http://127.0.0.1:65123/solr",
   [junit4]    >           "node_name":"127.0.0.1:65123_solr",
   [junit4]    >           "state":"down"},
   [junit4]    >         "core_node2":{
   [junit4]    >           "core":"MissingSegmentRecoveryTest_shard1_replica2",
   [junit4]    >           "base_url":"http://127.0.0.1:65124/solr",
   [junit4]    >           "node_name":"127.0.0.1:65124_solr",
   [junit4]    >           "state":"active",
   [junit4]    >           "leader":"true"}}}},
   [junit4]    >   "router":{"name":"compositeId"},
   [junit4]    >   "maxShardsPerNode":"1",
   [junit4]    >   "autoAddReplicas":"false"}
   [junit4]    > 	at __randomizedtesting.SeedInfo.seed([CD6ECB74B7EA62BC:9D3B5377EECBD4A1]:0)
   [junit4]    > 	at org.apache.solr.cloud.SolrCloudTestCase.waitForState(SolrCloudTestCase.java:265)
   [junit4]    > 	at org.apache.solr.cloud.MissingSegmentRecoveryTest.testLeaderRecovery(MissingSegmentRecoveryTest.java:105)
   [junit4]    > 	at java.lang.Thread.run(Thread.java:748)
   [junit4]   2> 2131660 WARN  (NIOServerCxn.Factory:0.0.0.0/0.0.0.0:0) [    ] o.a.z.s.NIOServerCnxn caught end of stream exception
   [junit4]   2> EndOfStreamException: Unable to read additional data from client sessionid 0x15dffb8916f0008, likely client has closed socket
   [junit4]   2> 	at org.apache.zookeeper.server.NIOServerCnxn.doIO(NIOServerCnxn.java:239)
   [junit4]   2> 	at org.apache.zookeeper.server.NIOServerCnxnFactory.run(NIOServerCnxnFactory.java:203)
   [junit4]   2> 	at java.lang.Thread.run(Thread.java:748)
   [junit4]   2> 2131662 INFO  (jetty-closer-2870-thread-2) [    ] o.e.j.s.AbstractConnector Stopped ServerConnector@1bcab10{HTTP/1.1,[http/1.1]}{127.0.0.1:65123}
   [junit4]   2> 2131664 INFO  (jetty-closer-2870-thread-2) [    ] o.a.s.c.CoreContainer Shutting down CoreContainer instance=10534105
   [junit4]   2> 2131664 INFO  (jetty-closer-2870-thread-2) [    ] o.a.s.m.SolrMetricManager Closing metric reporters for: solr.node
   [junit4]   2> 2131664 INFO  (jetty-closer-2870-thread-2) [    ] o.a.s.m.SolrMetricManager Closing metric reporters for: solr.jvm
   [junit4]   2> 2131664 INFO  (jetty-closer-2870-thread-2) [    ] o.a.s.m.SolrMetricManager Closing metric reporters for: solr.jetty
   [junit4]   2> 2131664 INFO  (jetty-closer-2870-thread-1) [    ] o.e.j.s.AbstractConnector Stopped ServerConnector@199eb88{HTTP/1.1,[http/1.1]}{127.0.0.1:0}
   [junit4]   2> 2131665 INFO  (jetty-closer-2870-thread-1) [    ] o.a.s.c.CoreContainer Shutting down CoreContainer instance=28822470
   [junit4]   2> 2131665 INFO  (jetty-closer-2870-thread-1) [    ] o.a.s.m.SolrMetricManager Closing metric reporters for: solr.node
   [junit4]   2> 2131665 INFO  (jetty-closer-2870-thread-1) [    ] o.a.s.m.SolrMetricManager Closing metric reporters for: solr.jvm
   [junit4]   2> 2131665 INFO  (jetty-closer-2870-thread-1) [    ] o.a.s.m.SolrMetricManager Closing metric reporters for: solr.jetty
   [junit4]   2> 2131668 INFO  (jetty-closer-2870-thread-1) [    ] o.a.s.c.Overseer Overseer (id=98515935051055109-127.0.0.1:65124_solr-n_0000000000) closing
   [junit4]   2> 2131668 INFO  (OverseerStateUpdate-98515935051055109-127.0.0.1:65124_solr-n_0000000000) [n:127.0.0.1:65124_solr    ] o.a.s.c.Overseer Overseer Loop exiting : 127.0.0.1:65124_solr
   [junit4]   2> 2131668 WARN  (NIOServerCxn.Factory:0.0.0.0/0.0.0.0:0) [    ] o.a.z.s.NIOServerCnxn caught end of stream exception
   [junit4]   2> EndOfStreamException: Unable to read additional data from client sessionid 0x15dffb8916f000b, likely client has closed socket
   [junit4]   2> 	at org.apache.zookeeper.server.NIOServerCnxn.doIO(NIOServerCnxn.java:239)
   [junit4]   2> 	at org.apache.zookeeper.server.NIOServerCnxnFactory.run(NIOServerCnxnFactory.java:203)
   [junit4]   2> 	at java.lang.Thread.run(Thread.java:748)
   [junit4]   2> 2131668 WARN  (zkCallback-2892-thread-2-processing-n:127.0.0.1:65123_solr) [n:127.0.0.1:65123_solr    ] o.a.s.c.c.ZkStateReader ZooKeeper watch triggered, but Solr cannot talk to ZK: [KeeperErrorCode = Session expired for /live_nodes]
   [junit4]   2> 2131670 INFO  (zkCallback-2880-thread-2-processing-n:127.0.0.1:65124_solr) [n:127.0.0.1:65124_solr    ] o.a.s.c.c.ZkStateReader Updated live nodes from ZooKeeper... (2) -> (1)
   [junit4]   2> 2131671 WARN  (zkCallback-2880-thread-2-processing-n:127.0.0.1:65124_solr) [n:127.0.0.1:65124_solr    ] o.a.s.c.c.ZkStateReader ZooKeeper watch triggered, but Solr cannot talk to ZK: [KeeperErrorCode = Session expired for /live_nodes]
   [junit4]   2> 2131671 INFO  (jetty-closer-2870-thread-2) [    ] o.e.j.s.h.ContextHandler Stopped o.e.j.s.ServletContextHandler@a024e3{/solr,null,UNAVAILABLE}
   [junit4]   2> 2131671 INFO  (jetty-closer-2870-thread-1) [    ] o.e.j.s.h.ContextHandler Stopped o.e.j.s.ServletContextHandler@1830b6a{/solr,null,UNAVAILABLE}
   [junit4]   2> 2131672 ERROR (SUITE-MissingSegmentRecoveryTest-seed#[CD6ECB74B7EA62BC]-worker) [    ] o.a.z.s.ZooKeeperServer ZKShutdownHandler is not registered, so ZooKeeper server won't take any action on ERROR or SHUTDOWN server state changes
   [junit4]   2> 2131672 INFO  (SUITE-MissingSegmentRecoveryTest-seed#[CD6ECB74B7EA62BC]-worker) [    ] o.a.s.c.ZkTestServer connecting to 127.0.0.1:65119 65119
   [junit4]   2> 2131674 INFO  (Thread-4385) [    ] o.a.s.c.ZkTestServer connecting to 127.0.0.1:65119 65119
   [junit4]   2> 2131674 WARN  (Thread-4385) [    ] o.a.s.c.ZkTestServer Watch limit violations: 
   [junit4]   2> Maximum concurrent create/delete watches above limit:
   [junit4]   2> 
   [junit4]   2> 	4	/solr/aliases.json
   [junit4]   2> 	4	/solr/clusterprops.json
   [junit4]   2> 	3	/solr/security.json
   [junit4]   2> 	2	/solr/configs/conf
   [junit4]   2> 
   [junit4]   2> Maximum concurrent data watches above limit:
   [junit4]   2> 
   [junit4]   2> 	4	/solr/clusterstate.json
   [junit4]   2> 	4	/solr/collections/MissingSegmentRecoveryTest/state.json
   [junit4]   2> 	2	/solr/overseer_elect/election/98515935051055109-127.0.0.1:65124_solr-n_0000000000
   [junit4]   2> 
   [junit4]   2> Maximum concurrent children watches above limit:
   [junit4]   2> 
   [junit4]   2> 	4	/solr/collections
   [junit4]   2> 	3	/solr/live_nodes
   [junit4]   2> 
   [junit4]   2> 2131675 INFO  (SUITE-MissingSegmentRecoveryTest-seed#[CD6ECB74B7EA62BC]-worker) [    ] o.a.s.SolrTestCaseJ4 ###deleteCore
   [junit4]   2> NOTE: leaving temporary files on disk at: C:\Users\jenkins\workspace\Lucene-Solr-6.6-Windows\solr\build\solr-core\test\J0\temp\solr.cloud.MissingSegmentRecoveryTest_CD6ECB74B7EA62BC-001
   [junit4]   2> Aug 20, 2017 12:59:27 PM com.carrotsearch.randomizedtesting.ThreadLeakControl checkThreadLeaks
   [junit4]   2> WARNING: Will linger awaiting termination of 4 leaked thread(s).
   [junit4]   2> NOTE: test params are: codec=Asserting(Lucene62): {_version_=PostingsFormat(name=Memory doPackFST= false), id=BlockTreeOrds(blocksize=128)}, docValues:{}, maxPointsInLeafNode=1909, maxMBSortInHeap=6.673660432768466, sim=RandomSimilarity(queryNorm=false,coord=yes): {}, locale=en-AU, timezone=Europe/Vilnius
   [junit4]   2> NOTE: Windows 10 10.0 x86/Oracle Corporation 1.8.0_144 (32-bit)/cpus=3,threads=1,free=144729736,total=354385920
   [junit4]   2> NOTE: All tests run in this JVM: [TestInitQParser, BadComponentTest, DistribDocExpirationUpdateProcessorTest, TestIBSimilarityFactory, ActionThrottleTest, TestTestInjection, TestSubQueryTransformer, PeerSyncTest, JsonValidatorTest, TestCollectionAPI, TestCSVResponseWriter, DeleteStatusTest, TestLockTree, TestFieldTypeResource, TestFunctionQuery, NumericFieldsTest, HdfsBasicDistributedZk2Test, PeerSyncWithIndexFingerprintCachingTest, MoreLikeThisHandlerTest, SolrPluginUtilsTest, RulesTest, TestInitParams, TestCloudInspectUtil, TestRTimerTree, DistributedFacetPivotLongTailTest, TestSolrDynamicMBean, DirectoryFactoryTest, FullHLLTest, DistributedQueueTest, TestSmileRequest, LeaderInitiatedRecoveryOnCommitTest, InfoHandlerTest, TestRecoveryHdfs, HttpPartitionTest, AnalysisAfterCoreReloadTest, GraphQueryTest, BlockJoinFacetRandomTest, MetricUtilsTest, TestAnalyzeInfixSuggestions, TestRandomRequestDistribution, PingRequestHandlerTest, QueryElevationComponentTest, TestReloadAndDeleteDocs, MergeStrategyTest, QueryEqualityTest, DocValuesMultiTest, BigEndianAscendingWordDeserializerTest, TestSolrCoreParser, StressHdfsTest, TestReplicationHandler, TestCustomDocTransformer, BaseCdcrDistributedZkTest, DocValuesTest, TestBulkSchemaConcurrent, TestIntervalFaceting, SortSpecParsingTest, TestTolerantSearch, TestBM25SimilarityFactory, HighlighterTest, TestTolerantUpdateProcessorRandomCloud, SolrSlf4jReporterTest, AnalyticsMergeStrategyTest, TestCopyFieldCollectionResource, ZkStateReaderTest, PrimitiveFieldTypeTest, SchemaVersionSpecificBehaviorTest, HdfsUnloadDistributedZkTest, TestEmbeddedSolrServerConstructors, TestManagedResourceStorage, TestManagedSchema, TestFieldCacheReopen, ClusterStateUpdateTest, BooleanFieldTest, RollingRestartTest, DistributedDebugComponentTest, TestPivotHelperCode, TestHighlightDedupGrouping, TestDistributedSearch, MoveReplicaTest, BitVectorTest, TestConfigsApi, CursorMarkTest, TestStandardQParsers, SuggesterFSTTest, TestExtendedDismaxParser, TestReplicaProperties, SuggestComponentContextFilterQueryTest, BJQParserTest, HdfsRestartWhileUpdatingTest, SystemInfoHandlerTest, JavabinLoaderTest, TestExactSharedStatsCache, OverseerModifyCollectionTest, OpenExchangeRatesOrgProviderTest, ResponseLogComponentTest, OverriddenZkACLAndCredentialsProvidersTest, TestAnalyzedSuggestions, TestJettySolrRunner, CdcrRequestHandlerTest, PrimUtilsTest, FastVectorHighlighterTest, SolrCloudExampleTest, FileUtilsTest, EnumFieldTest, TestUnifiedSolrHighlighter, InfixSuggestersTest, SimpleCollectionCreateDeleteTest, TestSolrCloudSnapshots, TestSchemaVersionResource, TestSchemaManager, TimeZoneUtilsTest, TriLevelCompositeIdRoutingTest, TestReplicationHandlerBackup, UUIDUpdateProcessorFallbackTest, TestLeaderElectionWithEmptyReplica, DistributedSpellCheckComponentTest, ZkControllerTest, SimpleFacetsTest, TestStressLucene, TestBinaryResponseWriter, TestPseudoReturnFields, TestSegmentSorting, VersionInfoTest, TestBulkSchemaAPI, ConfigureRecoveryStrategyTest, DOMUtilTest, ConjunctionSolrSpellCheckerTest, SynonymTokenizerTest, NodeMutatorTest, SolrCoreTest, PathHierarchyTokenizerFactoryTest, CoreAdminRequestStatusTest, TestConfigSetImmutable, TestSolrQueryResponse, TestPostingsSolrHighlighter, TestRemoteStreaming, TestAuthenticationFramework, SmileWriterTest, TestUseDocValuesAsStored, ClassificationUpdateProcessorFactoryTest, OverseerTest, TestFastLRUCache, UnloadDistributedZkTest, XsltUpdateRequestHandlerTest, AlternateDirectoryTest, TestStressRecovery, TestSweetSpotSimilarityFactory, CloudExitableDirectoryReaderTest, TestFieldCacheSort, TestLeaderInitiatedRecoveryThread, DistributedFacetExistsSmallTest, ZkCLITest, SoftAutoCommitTest, SolrTestCaseJ4Test, CursorPagingTest, DirectSolrConnectionTest, SyncSliceTest, TestNestedDocsSort, TestCharFilters, TestSolrConfigHandlerConcurrent, TestFaceting, PolyFieldTest, DistributedFacetPivotSmallTest, TestSolrJ, ConnectionManagerTest, SolrRequestParserTest, HdfsDirectoryTest, DocumentAnalysisRequestHandlerTest, TestSolrCloudWithHadoopAuthPlugin, TestRuleBasedAuthorizationPlugin, DeleteReplicaTest, SharedFSAutoReplicaFailoverTest, TestSizeLimitedDistributedMap, BasicDistributedZkTest, BasicDistributedZk2Test, OpenCloseCoreStressTest, ShardRoutingTest, BasicZkTest, FullSolrCloudDistribCmdsTest, TestRandomDVFaceting, TestHashPartitioner, TestJoin, TestStressVersions, HardAutoCommitTest, TestCoreContainer, TestSolr4Spatial, SpellCheckComponentTest, TestGroupingSearch, SolrCmdDistributorTest, TestSort, DirectUpdateHandlerTest, CurrencyFieldOpenExchangeTest, DistributedQueryElevationComponentTest, SuggesterTSTTest, TestTrie, SpatialFilterTest, WordBreakSolrSpellCheckerTest, SolrCoreCheckLockOnStartupTest, TestAtomicUpdateErrorCases, DefaultValueUpdateProcessorTest, SortByFunctionTest, SolrInfoMBeanTest, TestSurroundQueryParser, TestQueryUtils, StandardRequestHandlerTest, DirectSolrSpellCheckerTest, TermsComponentTest, XmlUpdateRequestHandlerTest, TestIndexingPerformance, TestSolrQueryParser, TestJmxIntegration, UpdateRequestProcessorFactoryTest, MBeansHandlerTest, UniqFieldsUpdateProcessorFactoryTest, TestPartialUpdateDeduplication, TestPHPSerializedResponseWriter, TestComponentsName, HighlighterConfigTest, SOLR749Test, UpdateParamsTest, TestSolrIndexConfig, SolrIndexConfigTest, TestMergePolicyConfig, MultiTermTest, SampleTest, TestBinaryField, TestSearchPerf, TestElisionMultitermQuery, OutputWriterTest, ExternalFileFieldSortTest, TestSolrCoreProperties, TestLuceneMatchVersion, SpellPossibilityIteratorTest, TestCodecSupport, TestFastOutputStream, PluginInfoTest, TestSuggestSpellingConverter, DateFieldTest, SpellingQueryConverterTest, TestLRUCache, TestDocumentBuilder, ZkNodePropsTest, SliceStateTest, UUIDFieldTest, CircularListTest, DistributedMLTComponentTest, TestRTGBase, TestCrossCoreJoin, TestCursorMarkWithoutUniqueKey, TestDistributedMissingSort, AliasIntegrationTest, AssignTest, CdcrBootstrapTest, CollectionStateFormat2Test, ConcurrentDeleteAndCreateCollectionTest, ConfigSetsAPITest, CreateCollectionCleanupTest, CustomCollectionTest, DeleteLastCustomShardedReplicaTest, DeleteShardTest, DistributedVersionInfoTest, LeaderElectionContextKeyTest, LeaderFailoverAfterPartitionTest, LeaderInitiatedRecoveryOnShardRestartTest, MigrateRouteKeyTest, MissingSegmentRecoveryTest]
   [junit4] Completed [521/713 (1!)] on J0 in 96.04s, 1 test, 1 failure <<< FAILURES!

[...truncated 664 lines...]
   [junit4] JVM J1: stdout was not empty, see: C:\Users\jenkins\workspace\Lucene-Solr-6.6-Windows\solr\build\solr-core\test\temp\junit4-J1-20170820_122348_8535843306300978319843.sysout
   [junit4] >>> JVM J1 emitted unexpected output (verbatim) ----
   [junit4] java.lang.OutOfMemoryError: Java heap space
   [junit4] Dumping heap to C:\Users\jenkins\workspace\Lucene-Solr-6.6-Windows\heapdumps\java_pid248.hprof ...
   [junit4] Heap dump file created [93765965 bytes in 0.525 secs]
   [junit4] <<< JVM J1: EOF ----

[...truncated 803 lines...]
   [junit4] Suite: org.apache.solr.common.cloud.TestCollectionStateWatchers
   [junit4]   2> Creating dataDir: C:\Users\jenkins\workspace\Lucene-Solr-6.6-Windows\solr\build\solr-solrj\test\J0\temp\solr.common.cloud.TestCollectionStateWatchers_C7CECEA4CB717CF2-001\init-core-data-001
   [junit4]   2> 216834 WARN  (SUITE-TestCollectionStateWatchers-seed#[C7CECEA4CB717CF2]-worker) [    ] o.a.s.SolrTestCaseJ4 startTrackingSearchers: numOpens=8 numCloses=8
   [junit4]   2> 216835 INFO  (SUITE-TestCollectionStateWatchers-seed#[C7CECEA4CB717CF2]-worker) [    ] o.a.s.SolrTestCaseJ4 Using PointFields
   [junit4]   2> 216841 INFO  (SUITE-TestCollectionStateWatchers-seed#[C7CECEA4CB717CF2]-worker) [    ] o.a.s.SolrTestCaseJ4 Randomized ssl (false) and clientAuth (false) via: @org.apache.solr.util.RandomizeSSL(reason=, value=NaN, ssl=NaN, clientAuth=NaN)
   [junit4]   2> 216844 INFO  (SUITE-TestCollectionStateWatchers-seed#[C7CECEA4CB717CF2]-worker) [    ] o.a.s.c.MiniSolrCloudCluster Starting cluster of 4 servers in C:\Users\jenkins\workspace\Lucene-Solr-6.6-Windows\solr\build\solr-solrj\test\J0\temp\solr.common.cloud.TestCollectionStateWatchers_C7CECEA4CB717CF2-001\tempDir-001
   [junit4]   2> 216845 INFO  (SUITE-TestCollectionStateWatchers-seed#[C7CECEA4CB717C

[...truncated too long message...]

[n:127.0.0.1:57816_solr c:falsepredicate s:shard2 r:core_node6 x:falsepredicate_shard2_replica1] o.a.s.m.SolrMetricManager Closing metric reporters for: solr.core.falsepredicate.shard2.replica1
   [junit4]   2> 274741 INFO  (coreCloseExecutor-912-thread-3) [n:127.0.0.1:57816_solr c:currentstate s:shard1 r:core_node1 x:currentstate_shard1_replica1] o.a.s.m.SolrMetricManager Closing metric reporters for: solr.core.currentstate.shard1.replica1
   [junit4]   2> 274743 INFO  (coreCloseExecutor-913-thread-3) [n:127.0.0.1:57804_solr c:testcollection s:shard3 r:core_node3 x:testcollection_shard3_replica1] o.a.s.m.SolrMetricManager Closing metric reporters for: solr.core.testcollection.shard3.replica1
   [junit4]   2> 274743 INFO  (coreCloseExecutor-915-thread-1) [n:127.0.0.1:57746_solr c:falsepredicate s:shard4 r:core_node3 x:falsepredicate_shard4_replica1] o.a.s.m.SolrMetricManager Closing metric reporters for: solr.core.falsepredicate.shard4.replica1
   [junit4]   2> 274744 INFO  (coreCloseExecutor-913-thread-1) [n:127.0.0.1:57804_solr c:falsepredicate s:shard1 r:core_node5 x:falsepredicate_shard1_replica1] o.a.s.m.SolrMetricManager Closing metric reporters for: solr.core.falsepredicate.shard1.replica1
   [junit4]   2> 274746 INFO  (coreCloseExecutor-915-thread-3) [n:127.0.0.1:57746_solr c:testcollection s:shard1 r:core_node2 x:testcollection_shard1_replica1] o.a.s.m.SolrMetricManager Closing metric reporters for: solr.core.testcollection.shard1.replica1
   [junit4]   2> 274747 WARN  (NIOServerCxn.Factory:0.0.0.0/0.0.0.0:0) [    ] o.a.z.s.NIOServerCnxn caught end of stream exception
   [junit4]   2> EndOfStreamException: Unable to read additional data from client sessionid 0x15dffc6cb180017, likely client has closed socket
   [junit4]   2> 	at org.apache.zookeeper.server.NIOServerCnxn.doIO(NIOServerCnxn.java:239)
   [junit4]   2> 	at org.apache.zookeeper.server.NIOServerCnxnFactory.run(NIOServerCnxnFactory.java:203)
   [junit4]   2> 	at java.lang.Thread.run(Thread.java:748)
   [junit4]   2> 274747 INFO  (zkCallback-1807-thread-1-processing-n:127.0.0.1:57746_solr) [n:127.0.0.1:57746_solr    ] o.a.s.c.c.ZkStateReader Updated live nodes from ZooKeeper... (3) -> (2)
   [junit4]   2> 274748 INFO  (zkCallback-1824-thread-2-processing-n:127.0.0.1:57804_solr) [n:127.0.0.1:57804_solr    ] o.a.s.c.c.ZkStateReader Updated live nodes from ZooKeeper... (3) -> (2)
   [junit4]   2> 274748 INFO  (coreCloseExecutor-915-thread-2) [n:127.0.0.1:57746_solr c:stateformat1 s:shard1 r:core_node1 x:stateformat1_shard1_replica1] o.a.s.m.SolrMetricManager Closing metric reporters for: solr.core.stateformat1.shard1.replica1
   [junit4]   2> 274753 INFO  (jetty-closer-1787-thread-1) [    ] o.a.s.c.Overseer Overseer (id=98515996147974155-127.0.0.1:57746_solr-n_0000000001) closing
   [junit4]   2> 274753 WARN  (zkCallback-1824-thread-2-processing-n:127.0.0.1:57804_solr) [n:127.0.0.1:57804_solr    ] o.a.s.c.c.ZkStateReader ZooKeeper watch triggered, but Solr cannot talk to ZK: [KeeperErrorCode = Session expired for /live_nodes]
   [junit4]   2> 274754 INFO  (OverseerStateUpdate-98515996147974155-127.0.0.1:57746_solr-n_0000000001) [n:127.0.0.1:57746_solr    ] o.a.s.c.Overseer Overseer Loop exiting : 127.0.0.1:57746_solr
   [junit4]   2> 274755 INFO  (jetty-closer-1787-thread-2) [    ] o.e.j.s.h.ContextHandler Stopped o.e.j.s.ServletContextHandler@46a78c{/solr,null,UNAVAILABLE}
   [junit4]   2> 274755 INFO  (zkCallback-1807-thread-1-processing-n:127.0.0.1:57746_solr) [n:127.0.0.1:57746_solr    ] o.a.s.c.c.ZkStateReader Updated live nodes from ZooKeeper... (2) -> (1)
   [junit4]   2> 274755 WARN  (NIOServerCxn.Factory:0.0.0.0/0.0.0.0:0) [    ] o.a.z.s.NIOServerCnxn caught end of stream exception
   [junit4]   2> EndOfStreamException: Unable to read additional data from client sessionid 0x15dffc6cb18000b, likely client has closed socket
   [junit4]   2> 	at org.apache.zookeeper.server.NIOServerCnxn.doIO(NIOServerCnxn.java:239)
   [junit4]   2> 	at org.apache.zookeeper.server.NIOServerCnxnFactory.run(NIOServerCnxnFactory.java:203)
   [junit4]   2> 	at java.lang.Thread.run(Thread.java:748)
   [junit4]   2> 274755 WARN  (zkCallback-1807-thread-1-processing-n:127.0.0.1:57746_solr) [n:127.0.0.1:57746_solr    ] o.a.s.c.c.ZkStateReader ZooKeeper watch triggered, but Solr cannot talk to ZK: [KeeperErrorCode = Session expired for /live_nodes]
   [junit4]   2> 274756 INFO  (jetty-closer-1787-thread-1) [    ] o.e.j.s.h.ContextHandler Stopped o.e.j.s.ServletContextHandler@97dc23{/solr,null,UNAVAILABLE}
   [junit4]   2> 276248 WARN  (zkCallback-1830-thread-1-processing-n:127.0.0.1:57816_solr) [n:127.0.0.1:57816_solr    ] o.a.s.c.c.ZkStateReader ZooKeeper watch triggered, but Solr cannot talk to ZK: [KeeperErrorCode = Session expired for /live_nodes]
   [junit4]   2> 276248 INFO  (jetty-closer-1787-thread-3) [    ] o.e.j.s.h.ContextHandler Stopped o.e.j.s.ServletContextHandler@2e8364{/solr,null,UNAVAILABLE}
   [junit4]   2> 276248 ERROR (SUITE-TestCollectionStateWatchers-seed#[C7CECEA4CB717CF2]-worker) [    ] o.a.z.s.ZooKeeperServer ZKShutdownHandler is not registered, so ZooKeeper server won't take any action on ERROR or SHUTDOWN server state changes
   [junit4]   2> 276248 INFO  (SUITE-TestCollectionStateWatchers-seed#[C7CECEA4CB717CF2]-worker) [    ] o.a.s.c.ZkTestServer connecting to 127.0.0.1:57732 57732
   [junit4]   2> 276248 INFO  (Thread-258) [    ] o.a.s.c.ZkTestServer connecting to 127.0.0.1:57732 57732
   [junit4]   2> 276253 WARN  (Thread-258) [    ] o.a.s.c.ZkTestServer Watch limit violations: 
   [junit4]   2> Maximum concurrent create/delete watches above limit:
   [junit4]   2> 
   [junit4]   2> 	8	/solr/aliases.json
   [junit4]   2> 	8	/solr/clusterprops.json
   [junit4]   2> 	7	/solr/security.json
   [junit4]   2> 	7	/solr/configs/config
   [junit4]   2> 	3	/solr/collections/stateformat1/state.json
   [junit4]   2> 
   [junit4]   2> Maximum concurrent data watches above limit:
   [junit4]   2> 
   [junit4]   2> 	18	/solr/collections/falsepredicate/state.json
   [junit4]   2> 	12	/solr/collections/waitforstate/state.json
   [junit4]   2> 	8	/solr/clusterstate.json
   [junit4]   2> 	7	/solr/collections/testcollection/state.json
   [junit4]   2> 	3	/solr/overseer_elect/election/98515996147974155-127.0.0.1:57746_solr-n_0000000001
   [junit4]   2> 	3	/solr/collections/stateformat1/state.json
   [junit4]   2> 	2	/solr/collections/currentstate/state.json
   [junit4]   2> 	2	/solr/collections/delayed/state.json
   [junit4]   2> 	2	/solr/collections/tobedeleted/state.json
   [junit4]   2> 
   [junit4]   2> Maximum concurrent children watches above limit:
   [junit4]   2> 
   [junit4]   2> 	8	/solr/collections
   [junit4]   2> 	5	/solr/live_nodes
   [junit4]   2> 	2	/solr/overseer/queue
   [junit4]   2> 	2	/solr/overseer/collection-queue-work
   [junit4]   2> 
   [junit4]   2> 276253 INFO  (SUITE-TestCollectionStateWatchers-seed#[C7CECEA4CB717CF2]-worker) [    ] o.a.s.SolrTestCaseJ4 ###deleteCore
   [junit4]   2> NOTE: leaving temporary files on disk at: C:\Users\jenkins\workspace\Lucene-Solr-6.6-Windows\solr\build\solr-solrj\test\J0\temp\solr.common.cloud.TestCollectionStateWatchers_C7CECEA4CB717CF2-001
   [junit4]   2> Aug 20, 2017 1:14:23 PM com.carrotsearch.randomizedtesting.ThreadLeakControl checkThreadLeaks
   [junit4]   2> WARNING: Will linger awaiting termination of 1 leaked thread(s).
   [junit4]   2> NOTE: test params are: codec=CheapBastard, sim=RandomSimilarity(queryNorm=false,coord=yes): {}, locale=ro, timezone=America/Noronha
   [junit4]   2> NOTE: Windows 10 10.0 x86/Oracle Corporation 1.8.0_144 (32-bit)/cpus=3,threads=1,free=54495504,total=138178560
   [junit4]   2> NOTE: All tests run in this JVM: [SolrExampleStreamingTest, RawValueEvaluatorTest, StreamExpressionToExplanationTest, AnlysisResponseBaseTest, CosineEvaluatorTest, SubtractEvaluatorTest, SolrPingTest, GreaterThanEvaluatorTest, SolrSchemalessExampleTest, SolrZkClientTest, ConcurrentUpdateSolrClientBuilderTest, AbsoluteValueEvaluatorTest, TestSolrProperties, FloorEvaluatorTest, JettyWebappTest, StreamExpressionParserTest, JDBCStreamTest, StreamExpressionTest, ArcSineEvaluatorTest, ModuloEvaluatorTest, SolrExampleXMLTest, TestXMLEscaping, TestZkConfigManager, LessThanEqualToEvaluatorTest, TestJavaBinCodec, CollectionAdminRequestRequiredParamsTest, CloudSolrClientBuilderTest, OrEvaluatorTest, SolrExampleEmbeddedTest, HyperbolicSineEvaluatorTest, OperationsTest, SineEvaluatorTest, SolrExampleJettyTest, TestSpellCheckResponse, TermsResponseTest, TestCoreAdmin, BasicHttpSolrClientTest, CloudSolrClientCacheTest, CloudSolrClientMultiConstructorTest, ConcurrentUpdateSolrClientTest, HttpSolrClientSSLAuthConPoolTest, GraphTest, AndEvaluatorTest, ArcTangentEvaluatorTest, CeilingEvaluatorTest, CompoundEvaluatorTest, CubedRootEvaluatorTest, DivideEvaluatorTest, EqualsEvaluatorTest, ExclusiveOrEvaluatorTest, FieldEvaluatorTest, GreaterThanEqualToEvaluatorTest, LessThanEvaluatorTest, NaturalLogEvaluatorTest, PowerEvaluatorTest, RoundEvaluatorTest, TangentEvaluatorTest, TestCollectionAdminRequest, TestConfigSetAdminRequest, TestClusteringResponse, TestSuggesterResponse, TestToleratedUpdateError, TestCollectionStateWatchers]
   [junit4] Completed [130/130 (1!)] on J0 in 59.74s, 9 tests, 1 failure <<< FAILURES!

[...truncated 6668 lines...]
BUILD FAILED
C:\Users\jenkins\workspace\Lucene-Solr-6.6-Windows\build.xml:775: The following error occurred while executing this line:
C:\Users\jenkins\workspace\Lucene-Solr-6.6-Windows\build.xml:727: Some of the tests produced a heap dump, but did not fail. Maybe a suppressed OutOfMemoryError? Dumps created:
* java_pid248.hprof

Total time: 75 minutes 13 seconds
Build step 'Invoke Ant' marked build as failure
Archiving artifacts
[WARNINGS] Skipping publisher since build result is FAILURE
Recording test results
Email was triggered for: Failure - Any
Sending email for trigger: Failure - Any

Mime
View raw message