lucene-dev mailing list archives

Site index · List index
Message view « Date » · « Thread »
Top « Date » · « Thread »
From Policeman Jenkins Server <jenk...@thetaphi.de>
Subject [JENKINS] Lucene-Solr-7.x-MacOSX (64bit/jdk1.8.0) - Build # 92 - Unstable!
Date Tue, 01 Aug 2017 05:39:53 GMT
Build: https://jenkins.thetaphi.de/job/Lucene-Solr-7.x-MacOSX/92/
Java: 64bit/jdk1.8.0 -XX:-UseCompressedOops -XX:+UseSerialGC

22 tests failed.
FAILED:  org.apache.solr.CursorPagingTest.testFacetingWithRandomSorts

Error Message:
Cannot use facet.mincount=0 on field int which is Points-based

Stack Trace:
org.apache.solr.common.SolrException: Cannot use facet.mincount=0 on field int which is Points-based
	at __randomizedtesting.SeedInfo.seed([88A7C010FF146B44:5C6EDFB715B5C2B3]:0)
	at org.apache.solr.request.NumericFacets.getCountsSingleValue(NumericFacets.java:184)
	at org.apache.solr.request.NumericFacets.getCounts(NumericFacets.java:170)
	at org.apache.solr.request.SimpleFacets.getTermCounts(SimpleFacets.java:499)
	at org.apache.solr.request.SimpleFacets.getTermCounts(SimpleFacets.java:405)
	at org.apache.solr.request.SimpleFacets.lambda$getFacetFieldCounts$0(SimpleFacets.java:803)
	at java.util.concurrent.FutureTask.run(FutureTask.java:266)
	at org.apache.solr.request.SimpleFacets$3.execute(SimpleFacets.java:742)
	at org.apache.solr.request.SimpleFacets.getFacetFieldCounts(SimpleFacets.java:818)
	at org.apache.solr.handler.component.FacetComponent.getFacetCounts(FacetComponent.java:329)
	at org.apache.solr.handler.component.FacetComponent.process(FacetComponent.java:273)
	at org.apache.solr.handler.component.SearchHandler.handleRequestBody(SearchHandler.java:295)
	at org.apache.solr.handler.RequestHandlerBase.handleRequest(RequestHandlerBase.java:177)
	at org.apache.solr.core.SolrCore.execute(SolrCore.java:2473)
	at org.apache.solr.util.TestHarness.query(TestHarness.java:337)
	at org.apache.solr.util.TestHarness.query(TestHarness.java:319)
	at org.apache.solr.SolrTestCaseJ4.assertJQ(SolrTestCaseJ4.java:952)
	at org.apache.solr.SolrTestCaseJ4.assertJQ(SolrTestCaseJ4.java:921)
	at org.apache.solr.CursorPagingTest.assertFullWalkNoDupsWithFacets(CursorPagingTest.java:760)
	at org.apache.solr.CursorPagingTest.testFacetingWithRandomSorts(CursorPagingTest.java:726)
	at sun.reflect.NativeMethodAccessorImpl.invoke0(Native Method)
	at sun.reflect.NativeMethodAccessorImpl.invoke(NativeMethodAccessorImpl.java:62)
	at sun.reflect.DelegatingMethodAccessorImpl.invoke(DelegatingMethodAccessorImpl.java:43)
	at java.lang.reflect.Method.invoke(Method.java:498)
	at com.carrotsearch.randomizedtesting.RandomizedRunner.invoke(RandomizedRunner.java:1713)
	at com.carrotsearch.randomizedtesting.RandomizedRunner$8.evaluate(RandomizedRunner.java:907)
	at com.carrotsearch.randomizedtesting.RandomizedRunner$9.evaluate(RandomizedRunner.java:943)
	at com.carrotsearch.randomizedtesting.RandomizedRunner$10.evaluate(RandomizedRunner.java:957)
	at com.carrotsearch.randomizedtesting.rules.SystemPropertiesRestoreRule$1.evaluate(SystemPropertiesRestoreRule.java:57)
	at org.apache.lucene.util.TestRuleSetupTeardownChained$1.evaluate(TestRuleSetupTeardownChained.java:49)
	at org.apache.lucene.util.AbstractBeforeAfterRule$1.evaluate(AbstractBeforeAfterRule.java:45)
	at org.apache.lucene.util.TestRuleThreadAndTestName$1.evaluate(TestRuleThreadAndTestName.java:48)
	at org.apache.lucene.util.TestRuleIgnoreAfterMaxFailures$1.evaluate(TestRuleIgnoreAfterMaxFailures.java:64)
	at org.apache.lucene.util.TestRuleMarkFailure$1.evaluate(TestRuleMarkFailure.java:47)
	at com.carrotsearch.randomizedtesting.rules.StatementAdapter.evaluate(StatementAdapter.java:36)
	at com.carrotsearch.randomizedtesting.ThreadLeakControl$StatementRunner.run(ThreadLeakControl.java:368)
	at com.carrotsearch.randomizedtesting.ThreadLeakControl.forkTimeoutingTask(ThreadLeakControl.java:817)
	at com.carrotsearch.randomizedtesting.ThreadLeakControl$3.evaluate(ThreadLeakControl.java:468)
	at com.carrotsearch.randomizedtesting.RandomizedRunner.runSingleTest(RandomizedRunner.java:916)
	at com.carrotsearch.randomizedtesting.RandomizedRunner$5.evaluate(RandomizedRunner.java:802)
	at com.carrotsearch.randomizedtesting.RandomizedRunner$6.evaluate(RandomizedRunner.java:852)
	at com.carrotsearch.randomizedtesting.RandomizedRunner$7.evaluate(RandomizedRunner.java:863)
	at com.carrotsearch.randomizedtesting.rules.StatementAdapter.evaluate(StatementAdapter.java:36)
	at com.carrotsearch.randomizedtesting.rules.SystemPropertiesRestoreRule$1.evaluate(SystemPropertiesRestoreRule.java:57)
	at org.apache.lucene.util.AbstractBeforeAfterRule$1.evaluate(AbstractBeforeAfterRule.java:45)
	at com.carrotsearch.randomizedtesting.rules.StatementAdapter.evaluate(StatementAdapter.java:36)
	at org.apache.lucene.util.TestRuleStoreClassName$1.evaluate(TestRuleStoreClassName.java:41)
	at com.carrotsearch.randomizedtesting.rules.NoShadowingOrOverridesOnMethodsRule$1.evaluate(NoShadowingOrOverridesOnMethodsRule.java:40)
	at com.carrotsearch.randomizedtesting.rules.NoShadowingOrOverridesOnMethodsRule$1.evaluate(NoShadowingOrOverridesOnMethodsRule.java:40)
	at com.carrotsearch.randomizedtesting.rules.StatementAdapter.evaluate(StatementAdapter.java:36)
	at com.carrotsearch.randomizedtesting.rules.StatementAdapter.evaluate(StatementAdapter.java:36)
	at com.carrotsearch.randomizedtesting.rules.StatementAdapter.evaluate(StatementAdapter.java:36)
	at org.apache.lucene.util.TestRuleAssertionsRequired$1.evaluate(TestRuleAssertionsRequired.java:53)
	at org.apache.lucene.util.TestRuleMarkFailure$1.evaluate(TestRuleMarkFailure.java:47)
	at org.apache.lucene.util.TestRuleIgnoreAfterMaxFailures$1.evaluate(TestRuleIgnoreAfterMaxFailures.java:64)
	at org.apache.lucene.util.TestRuleIgnoreTestSuites$1.evaluate(TestRuleIgnoreTestSuites.java:54)
	at com.carrotsearch.randomizedtesting.rules.StatementAdapter.evaluate(StatementAdapter.java:36)
	at com.carrotsearch.randomizedtesting.ThreadLeakControl$StatementRunner.run(ThreadLeakControl.java:368)
	at java.lang.Thread.run(Thread.java:748)


FAILED:  org.apache.solr.TestDistributedSearch.test

Error Message:
Error from server at http://127.0.0.1:51528/vm_/j/collection1: Cannot use facet.mincount=0 on field a_n_tdt which is Points-based

Stack Trace:
org.apache.solr.client.solrj.impl.HttpSolrClient$RemoteSolrException: Error from server at http://127.0.0.1:51528/vm_/j/collection1: Cannot use facet.mincount=0 on field a_n_tdt which is Points-based
	at __randomizedtesting.SeedInfo.seed([88A7C010FF146B44:F3FFCA51E806BC]:0)
	at org.apache.solr.client.solrj.impl.HttpSolrClient.executeMethod(HttpSolrClient.java:626)
	at org.apache.solr.client.solrj.impl.HttpSolrClient.request(HttpSolrClient.java:252)
	at org.apache.solr.client.solrj.impl.HttpSolrClient.request(HttpSolrClient.java:241)
	at org.apache.solr.client.solrj.SolrRequest.process(SolrRequest.java:178)
	at org.apache.solr.client.solrj.SolrClient.query(SolrClient.java:942)
	at org.apache.solr.client.solrj.SolrClient.query(SolrClient.java:957)
	at org.apache.solr.BaseDistributedSearchTestCase.query(BaseDistributedSearchTestCase.java:599)
	at org.apache.solr.BaseDistributedSearchTestCase.query(BaseDistributedSearchTestCase.java:587)
	at org.apache.solr.BaseDistributedSearchTestCase.query(BaseDistributedSearchTestCase.java:566)
	at org.apache.solr.TestDistributedSearch.test(TestDistributedSearch.java:241)
	at sun.reflect.NativeMethodAccessorImpl.invoke0(Native Method)
	at sun.reflect.NativeMethodAccessorImpl.invoke(NativeMethodAccessorImpl.java:62)
	at sun.reflect.DelegatingMethodAccessorImpl.invoke(DelegatingMethodAccessorImpl.java:43)
	at java.lang.reflect.Method.invoke(Method.java:498)
	at com.carrotsearch.randomizedtesting.RandomizedRunner.invoke(RandomizedRunner.java:1713)
	at com.carrotsearch.randomizedtesting.RandomizedRunner$8.evaluate(RandomizedRunner.java:907)
	at com.carrotsearch.randomizedtesting.RandomizedRunner$9.evaluate(RandomizedRunner.java:943)
	at com.carrotsearch.randomizedtesting.RandomizedRunner$10.evaluate(RandomizedRunner.java:957)
	at org.apache.solr.BaseDistributedSearchTestCase$ShardsRepeatRule$ShardsRepeatStatement.callStatement(BaseDistributedSearchTestCase.java:1011)
	at org.apache.solr.BaseDistributedSearchTestCase$ShardsRepeatRule$ShardsStatement.evaluate(BaseDistributedSearchTestCase.java:960)
	at com.carrotsearch.randomizedtesting.rules.SystemPropertiesRestoreRule$1.evaluate(SystemPropertiesRestoreRule.java:57)
	at org.apache.lucene.util.TestRuleSetupTeardownChained$1.evaluate(TestRuleSetupTeardownChained.java:49)
	at org.apache.lucene.util.AbstractBeforeAfterRule$1.evaluate(AbstractBeforeAfterRule.java:45)
	at org.apache.lucene.util.TestRuleThreadAndTestName$1.evaluate(TestRuleThreadAndTestName.java:48)
	at org.apache.lucene.util.TestRuleIgnoreAfterMaxFailures$1.evaluate(TestRuleIgnoreAfterMaxFailures.java:64)
	at org.apache.lucene.util.TestRuleMarkFailure$1.evaluate(TestRuleMarkFailure.java:47)
	at com.carrotsearch.randomizedtesting.rules.StatementAdapter.evaluate(StatementAdapter.java:36)
	at com.carrotsearch.randomizedtesting.ThreadLeakControl$StatementRunner.run(ThreadLeakControl.java:368)
	at com.carrotsearch.randomizedtesting.ThreadLeakControl.forkTimeoutingTask(ThreadLeakControl.java:817)
	at com.carrotsearch.randomizedtesting.ThreadLeakControl$3.evaluate(ThreadLeakControl.java:468)
	at com.carrotsearch.randomizedtesting.RandomizedRunner.runSingleTest(RandomizedRunner.java:916)
	at com.carrotsearch.randomizedtesting.RandomizedRunner$5.evaluate(RandomizedRunner.java:802)
	at com.carrotsearch.randomizedtesting.RandomizedRunner$6.evaluate(RandomizedRunner.java:852)
	at com.carrotsearch.randomizedtesting.RandomizedRunner$7.evaluate(RandomizedRunner.java:863)
	at com.carrotsearch.randomizedtesting.rules.StatementAdapter.evaluate(StatementAdapter.java:36)
	at com.carrotsearch.randomizedtesting.rules.SystemPropertiesRestoreRule$1.evaluate(SystemPropertiesRestoreRule.java:57)
	at org.apache.lucene.util.AbstractBeforeAfterRule$1.evaluate(AbstractBeforeAfterRule.java:45)
	at com.carrotsearch.randomizedtesting.rules.StatementAdapter.evaluate(StatementAdapter.java:36)
	at org.apache.lucene.util.TestRuleStoreClassName$1.evaluate(TestRuleStoreClassName.java:41)
	at com.carrotsearch.randomizedtesting.rules.NoShadowingOrOverridesOnMethodsRule$1.evaluate(NoShadowingOrOverridesOnMethodsRule.java:40)
	at com.carrotsearch.randomizedtesting.rules.NoShadowingOrOverridesOnMethodsRule$1.evaluate(NoShadowingOrOverridesOnMethodsRule.java:40)
	at com.carrotsearch.randomizedtesting.rules.StatementAdapter.evaluate(StatementAdapter.java:36)
	at com.carrotsearch.randomizedtesting.rules.StatementAdapter.evaluate(StatementAdapter.java:36)
	at com.carrotsearch.randomizedtesting.rules.StatementAdapter.evaluate(StatementAdapter.java:36)
	at org.apache.lucene.util.TestRuleAssertionsRequired$1.evaluate(TestRuleAssertionsRequired.java:53)
	at org.apache.lucene.util.TestRuleMarkFailure$1.evaluate(TestRuleMarkFailure.java:47)
	at org.apache.lucene.util.TestRuleIgnoreAfterMaxFailures$1.evaluate(TestRuleIgnoreAfterMaxFailures.java:64)
	at org.apache.lucene.util.TestRuleIgnoreTestSuites$1.evaluate(TestRuleIgnoreTestSuites.java:54)
	at com.carrotsearch.randomizedtesting.rules.StatementAdapter.evaluate(StatementAdapter.java:36)
	at com.carrotsearch.randomizedtesting.ThreadLeakControl$StatementRunner.run(ThreadLeakControl.java:368)
	at java.lang.Thread.run(Thread.java:748)


FAILED:  org.apache.solr.TestRandomFaceting.testRandomFaceting

Error Message:
Cannot use facet.mincount=0 on field score_f which is Points-based

Stack Trace:
org.apache.solr.common.SolrException: Cannot use facet.mincount=0 on field score_f which is Points-based
	at __randomizedtesting.SeedInfo.seed([88A7C010FF146B44:85CFE0C5AAEDA3FB]:0)
	at org.apache.solr.request.NumericFacets.getCountsSingleValue(NumericFacets.java:184)
	at org.apache.solr.request.NumericFacets.getCounts(NumericFacets.java:170)
	at org.apache.solr.request.SimpleFacets.getTermCounts(SimpleFacets.java:499)
	at org.apache.solr.request.SimpleFacets.getTermCounts(SimpleFacets.java:405)
	at org.apache.solr.request.SimpleFacets.lambda$getFacetFieldCounts$0(SimpleFacets.java:803)
	at java.util.concurrent.FutureTask.run(FutureTask.java:266)
	at org.apache.solr.request.SimpleFacets$3.execute(SimpleFacets.java:742)
	at org.apache.solr.request.SimpleFacets.getFacetFieldCounts(SimpleFacets.java:818)
	at org.apache.solr.handler.component.FacetComponent.getFacetCounts(FacetComponent.java:329)
	at org.apache.solr.handler.component.FacetComponent.process(FacetComponent.java:273)
	at org.apache.solr.handler.component.SearchHandler.handleRequestBody(SearchHandler.java:295)
	at org.apache.solr.handler.RequestHandlerBase.handleRequest(RequestHandlerBase.java:177)
	at org.apache.solr.core.SolrCore.execute(SolrCore.java:2473)
	at org.apache.solr.util.TestHarness.query(TestHarness.java:337)
	at org.apache.solr.util.TestHarness.query(TestHarness.java:319)
	at org.apache.solr.TestRandomFaceting.doFacetTests(TestRandomFaceting.java:288)
	at org.apache.solr.TestRandomFaceting.doFacetTests(TestRandomFaceting.java:177)
	at org.apache.solr.TestRandomFaceting.testRandomFaceting(TestRandomFaceting.java:160)
	at sun.reflect.NativeMethodAccessorImpl.invoke0(Native Method)
	at sun.reflect.NativeMethodAccessorImpl.invoke(NativeMethodAccessorImpl.java:62)
	at sun.reflect.DelegatingMethodAccessorImpl.invoke(DelegatingMethodAccessorImpl.java:43)
	at java.lang.reflect.Method.invoke(Method.java:498)
	at com.carrotsearch.randomizedtesting.RandomizedRunner.invoke(RandomizedRunner.java:1713)
	at com.carrotsearch.randomizedtesting.RandomizedRunner$8.evaluate(RandomizedRunner.java:907)
	at com.carrotsearch.randomizedtesting.RandomizedRunner$9.evaluate(RandomizedRunner.java:943)
	at com.carrotsearch.randomizedtesting.RandomizedRunner$10.evaluate(RandomizedRunner.java:957)
	at com.carrotsearch.randomizedtesting.rules.SystemPropertiesRestoreRule$1.evaluate(SystemPropertiesRestoreRule.java:57)
	at org.apache.lucene.util.TestRuleSetupTeardownChained$1.evaluate(TestRuleSetupTeardownChained.java:49)
	at org.apache.lucene.util.AbstractBeforeAfterRule$1.evaluate(AbstractBeforeAfterRule.java:45)
	at org.apache.lucene.util.TestRuleThreadAndTestName$1.evaluate(TestRuleThreadAndTestName.java:48)
	at org.apache.lucene.util.TestRuleIgnoreAfterMaxFailures$1.evaluate(TestRuleIgnoreAfterMaxFailures.java:64)
	at org.apache.lucene.util.TestRuleMarkFailure$1.evaluate(TestRuleMarkFailure.java:47)
	at com.carrotsearch.randomizedtesting.rules.StatementAdapter.evaluate(StatementAdapter.java:36)
	at com.carrotsearch.randomizedtesting.ThreadLeakControl$StatementRunner.run(ThreadLeakControl.java:368)
	at com.carrotsearch.randomizedtesting.ThreadLeakControl.forkTimeoutingTask(ThreadLeakControl.java:817)
	at com.carrotsearch.randomizedtesting.ThreadLeakControl$3.evaluate(ThreadLeakControl.java:468)
	at com.carrotsearch.randomizedtesting.RandomizedRunner.runSingleTest(RandomizedRunner.java:916)
	at com.carrotsearch.randomizedtesting.RandomizedRunner$5.evaluate(RandomizedRunner.java:802)
	at com.carrotsearch.randomizedtesting.RandomizedRunner$6.evaluate(RandomizedRunner.java:852)
	at com.carrotsearch.randomizedtesting.RandomizedRunner$7.evaluate(RandomizedRunner.java:863)
	at com.carrotsearch.randomizedtesting.rules.StatementAdapter.evaluate(StatementAdapter.java:36)
	at com.carrotsearch.randomizedtesting.rules.SystemPropertiesRestoreRule$1.evaluate(SystemPropertiesRestoreRule.java:57)
	at org.apache.lucene.util.AbstractBeforeAfterRule$1.evaluate(AbstractBeforeAfterRule.java:45)
	at com.carrotsearch.randomizedtesting.rules.StatementAdapter.evaluate(StatementAdapter.java:36)
	at org.apache.lucene.util.TestRuleStoreClassName$1.evaluate(TestRuleStoreClassName.java:41)
	at com.carrotsearch.randomizedtesting.rules.NoShadowingOrOverridesOnMethodsRule$1.evaluate(NoShadowingOrOverridesOnMethodsRule.java:40)
	at com.carrotsearch.randomizedtesting.rules.NoShadowingOrOverridesOnMethodsRule$1.evaluate(NoShadowingOrOverridesOnMethodsRule.java:40)
	at com.carrotsearch.randomizedtesting.rules.StatementAdapter.evaluate(StatementAdapter.java:36)
	at com.carrotsearch.randomizedtesting.rules.StatementAdapter.evaluate(StatementAdapter.java:36)
	at com.carrotsearch.randomizedtesting.rules.StatementAdapter.evaluate(StatementAdapter.java:36)
	at org.apache.lucene.util.TestRuleAssertionsRequired$1.evaluate(TestRuleAssertionsRequired.java:53)
	at org.apache.lucene.util.TestRuleMarkFailure$1.evaluate(TestRuleMarkFailure.java:47)
	at org.apache.lucene.util.TestRuleIgnoreAfterMaxFailures$1.evaluate(TestRuleIgnoreAfterMaxFailures.java:64)
	at org.apache.lucene.util.TestRuleIgnoreTestSuites$1.evaluate(TestRuleIgnoreTestSuites.java:54)
	at com.carrotsearch.randomizedtesting.rules.StatementAdapter.evaluate(StatementAdapter.java:36)
	at com.carrotsearch.randomizedtesting.ThreadLeakControl$StatementRunner.run(ThreadLeakControl.java:368)
	at java.lang.Thread.run(Thread.java:748)


FAILED:  org.apache.solr.cloud.autoscaling.AutoScalingHandlerTest.testReadApi

Error Message:


Stack Trace:
java.lang.AssertionError
	at __randomizedtesting.SeedInfo.seed([88A7C010FF146B44:DF8E3BA524E6895F]:0)
	at org.junit.Assert.fail(Assert.java:92)
	at org.junit.Assert.assertTrue(Assert.java:43)
	at org.junit.Assert.assertTrue(Assert.java:54)
	at org.apache.solr.cloud.autoscaling.AutoScalingHandlerTest.testReadApi(AutoScalingHandlerTest.java:270)
	at sun.reflect.NativeMethodAccessorImpl.invoke0(Native Method)
	at sun.reflect.NativeMethodAccessorImpl.invoke(NativeMethodAccessorImpl.java:62)
	at sun.reflect.DelegatingMethodAccessorImpl.invoke(DelegatingMethodAccessorImpl.java:43)
	at java.lang.reflect.Method.invoke(Method.java:498)
	at com.carrotsearch.randomizedtesting.RandomizedRunner.invoke(RandomizedRunner.java:1713)
	at com.carrotsearch.randomizedtesting.RandomizedRunner$8.evaluate(RandomizedRunner.java:907)
	at com.carrotsearch.randomizedtesting.RandomizedRunner$9.evaluate(RandomizedRunner.java:943)
	at com.carrotsearch.randomizedtesting.RandomizedRunner$10.evaluate(RandomizedRunner.java:957)
	at com.carrotsearch.randomizedtesting.rules.SystemPropertiesRestoreRule$1.evaluate(SystemPropertiesRestoreRule.java:57)
	at org.apache.lucene.util.TestRuleSetupTeardownChained$1.evaluate(TestRuleSetupTeardownChained.java:49)
	at org.apache.lucene.util.AbstractBeforeAfterRule$1.evaluate(AbstractBeforeAfterRule.java:45)
	at org.apache.lucene.util.TestRuleThreadAndTestName$1.evaluate(TestRuleThreadAndTestName.java:48)
	at org.apache.lucene.util.TestRuleIgnoreAfterMaxFailures$1.evaluate(TestRuleIgnoreAfterMaxFailures.java:64)
	at org.apache.lucene.util.TestRuleMarkFailure$1.evaluate(TestRuleMarkFailure.java:47)
	at com.carrotsearch.randomizedtesting.rules.StatementAdapter.evaluate(StatementAdapter.java:36)
	at com.carrotsearch.randomizedtesting.ThreadLeakControl$StatementRunner.run(ThreadLeakControl.java:368)
	at com.carrotsearch.randomizedtesting.ThreadLeakControl.forkTimeoutingTask(ThreadLeakControl.java:817)
	at com.carrotsearch.randomizedtesting.ThreadLeakControl$3.evaluate(ThreadLeakControl.java:468)
	at com.carrotsearch.randomizedtesting.RandomizedRunner.runSingleTest(RandomizedRunner.java:916)
	at com.carrotsearch.randomizedtesting.RandomizedRunner$5.evaluate(RandomizedRunner.java:802)
	at com.carrotsearch.randomizedtesting.RandomizedRunner$6.evaluate(RandomizedRunner.java:852)
	at com.carrotsearch.randomizedtesting.RandomizedRunner$7.evaluate(RandomizedRunner.java:863)
	at com.carrotsearch.randomizedtesting.rules.StatementAdapter.evaluate(StatementAdapter.java:36)
	at com.carrotsearch.randomizedtesting.rules.SystemPropertiesRestoreRule$1.evaluate(SystemPropertiesRestoreRule.java:57)
	at org.apache.lucene.util.AbstractBeforeAfterRule$1.evaluate(AbstractBeforeAfterRule.java:45)
	at com.carrotsearch.randomizedtesting.rules.StatementAdapter.evaluate(StatementAdapter.java:36)
	at org.apache.lucene.util.TestRuleStoreClassName$1.evaluate(TestRuleStoreClassName.java:41)
	at com.carrotsearch.randomizedtesting.rules.NoShadowingOrOverridesOnMethodsRule$1.evaluate(NoShadowingOrOverridesOnMethodsRule.java:40)
	at com.carrotsearch.randomizedtesting.rules.NoShadowingOrOverridesOnMethodsRule$1.evaluate(NoShadowingOrOverridesOnMethodsRule.java:40)
	at com.carrotsearch.randomizedtesting.rules.StatementAdapter.evaluate(StatementAdapter.java:36)
	at com.carrotsearch.randomizedtesting.rules.StatementAdapter.evaluate(StatementAdapter.java:36)
	at com.carrotsearch.randomizedtesting.rules.StatementAdapter.evaluate(StatementAdapter.java:36)
	at org.apache.lucene.util.TestRuleAssertionsRequired$1.evaluate(TestRuleAssertionsRequired.java:53)
	at org.apache.lucene.util.TestRuleMarkFailure$1.evaluate(TestRuleMarkFailure.java:47)
	at org.apache.lucene.util.TestRuleIgnoreAfterMaxFailures$1.evaluate(TestRuleIgnoreAfterMaxFailures.java:64)
	at org.apache.lucene.util.TestRuleIgnoreTestSuites$1.evaluate(TestRuleIgnoreTestSuites.java:54)
	at com.carrotsearch.randomizedtesting.rules.StatementAdapter.evaluate(StatementAdapter.java:36)
	at com.carrotsearch.randomizedtesting.ThreadLeakControl$StatementRunner.run(ThreadLeakControl.java:368)
	at java.lang.Thread.run(Thread.java:748)


FAILED:  org.apache.solr.handler.component.DistributedFacetPivotLargeTest.test

Error Message:
Error from server at http://127.0.0.1:59695/_ffa/x/collection1: Error from server at http://127.0.0.1:59693/_ffa/x/collection1: Cannot use facet.mincount=0 on field hiredate_dt which is Points-based

Stack Trace:
org.apache.solr.client.solrj.impl.HttpSolrClient$RemoteSolrException: Error from server at http://127.0.0.1:59695/_ffa/x/collection1: Error from server at http://127.0.0.1:59693/_ffa/x/collection1: Cannot use facet.mincount=0 on field hiredate_dt which is Points-based
	at __randomizedtesting.SeedInfo.seed([88A7C010FF146B44:F3FFCA51E806BC]:0)
	at org.apache.solr.client.solrj.impl.HttpSolrClient.executeMethod(HttpSolrClient.java:626)
	at org.apache.solr.client.solrj.impl.HttpSolrClient.request(HttpSolrClient.java:252)
	at org.apache.solr.client.solrj.impl.HttpSolrClient.request(HttpSolrClient.java:241)
	at org.apache.solr.client.solrj.SolrRequest.process(SolrRequest.java:178)
	at org.apache.solr.client.solrj.SolrClient.query(SolrClient.java:942)
	at org.apache.solr.client.solrj.SolrClient.query(SolrClient.java:957)
	at org.apache.solr.BaseDistributedSearchTestCase.queryServer(BaseDistributedSearchTestCase.java:557)
	at org.apache.solr.BaseDistributedSearchTestCase.query(BaseDistributedSearchTestCase.java:605)
	at org.apache.solr.BaseDistributedSearchTestCase.query(BaseDistributedSearchTestCase.java:587)
	at org.apache.solr.BaseDistributedSearchTestCase.query(BaseDistributedSearchTestCase.java:566)
	at org.apache.solr.handler.component.DistributedFacetPivotLargeTest.test(DistributedFacetPivotLargeTest.java:430)
	at sun.reflect.NativeMethodAccessorImpl.invoke0(Native Method)
	at sun.reflect.NativeMethodAccessorImpl.invoke(NativeMethodAccessorImpl.java:62)
	at sun.reflect.DelegatingMethodAccessorImpl.invoke(DelegatingMethodAccessorImpl.java:43)
	at java.lang.reflect.Method.invoke(Method.java:498)
	at com.carrotsearch.randomizedtesting.RandomizedRunner.invoke(RandomizedRunner.java:1713)
	at com.carrotsearch.randomizedtesting.RandomizedRunner$8.evaluate(RandomizedRunner.java:907)
	at com.carrotsearch.randomizedtesting.RandomizedRunner$9.evaluate(RandomizedRunner.java:943)
	at com.carrotsearch.randomizedtesting.RandomizedRunner$10.evaluate(RandomizedRunner.java:957)
	at org.apache.solr.BaseDistributedSearchTestCase$ShardsRepeatRule$ShardsFixedStatement.callStatement(BaseDistributedSearchTestCase.java:985)
	at org.apache.solr.BaseDistributedSearchTestCase$ShardsRepeatRule$ShardsStatement.evaluate(BaseDistributedSearchTestCase.java:960)
	at com.carrotsearch.randomizedtesting.rules.SystemPropertiesRestoreRule$1.evaluate(SystemPropertiesRestoreRule.java:57)
	at org.apache.lucene.util.TestRuleSetupTeardownChained$1.evaluate(TestRuleSetupTeardownChained.java:49)
	at org.apache.lucene.util.AbstractBeforeAfterRule$1.evaluate(AbstractBeforeAfterRule.java:45)
	at org.apache.lucene.util.TestRuleThreadAndTestName$1.evaluate(TestRuleThreadAndTestName.java:48)
	at org.apache.lucene.util.TestRuleIgnoreAfterMaxFailures$1.evaluate(TestRuleIgnoreAfterMaxFailures.java:64)
	at org.apache.lucene.util.TestRuleMarkFailure$1.evaluate(TestRuleMarkFailure.java:47)
	at com.carrotsearch.randomizedtesting.rules.StatementAdapter.evaluate(StatementAdapter.java:36)
	at com.carrotsearch.randomizedtesting.ThreadLeakControl$StatementRunner.run(ThreadLeakControl.java:368)
	at com.carrotsearch.randomizedtesting.ThreadLeakControl.forkTimeoutingTask(ThreadLeakControl.java:817)
	at com.carrotsearch.randomizedtesting.ThreadLeakControl$3.evaluate(ThreadLeakControl.java:468)
	at com.carrotsearch.randomizedtesting.RandomizedRunner.runSingleTest(RandomizedRunner.java:916)
	at com.carrotsearch.randomizedtesting.RandomizedRunner$5.evaluate(RandomizedRunner.java:802)
	at com.carrotsearch.randomizedtesting.RandomizedRunner$6.evaluate(RandomizedRunner.java:852)
	at com.carrotsearch.randomizedtesting.RandomizedRunner$7.evaluate(RandomizedRunner.java:863)
	at com.carrotsearch.randomizedtesting.rules.StatementAdapter.evaluate(StatementAdapter.java:36)
	at com.carrotsearch.randomizedtesting.rules.SystemPropertiesRestoreRule$1.evaluate(SystemPropertiesRestoreRule.java:57)
	at org.apache.lucene.util.AbstractBeforeAfterRule$1.evaluate(AbstractBeforeAfterRule.java:45)
	at com.carrotsearch.randomizedtesting.rules.StatementAdapter.evaluate(StatementAdapter.java:36)
	at org.apache.lucene.util.TestRuleStoreClassName$1.evaluate(TestRuleStoreClassName.java:41)
	at com.carrotsearch.randomizedtesting.rules.NoShadowingOrOverridesOnMethodsRule$1.evaluate(NoShadowingOrOverridesOnMethodsRule.java:40)
	at com.carrotsearch.randomizedtesting.rules.NoShadowingOrOverridesOnMethodsRule$1.evaluate(NoShadowingOrOverridesOnMethodsRule.java:40)
	at com.carrotsearch.randomizedtesting.rules.StatementAdapter.evaluate(StatementAdapter.java:36)
	at com.carrotsearch.randomizedtesting.rules.StatementAdapter.evaluate(StatementAdapter.java:36)
	at com.carrotsearch.randomizedtesting.rules.StatementAdapter.evaluate(StatementAdapter.java:36)
	at org.apache.lucene.util.TestRuleAssertionsRequired$1.evaluate(TestRuleAssertionsRequired.java:53)
	at org.apache.lucene.util.TestRuleMarkFailure$1.evaluate(TestRuleMarkFailure.java:47)
	at org.apache.lucene.util.TestRuleIgnoreAfterMaxFailures$1.evaluate(TestRuleIgnoreAfterMaxFailures.java:64)
	at org.apache.lucene.util.TestRuleIgnoreTestSuites$1.evaluate(TestRuleIgnoreTestSuites.java:54)
	at com.carrotsearch.randomizedtesting.rules.StatementAdapter.evaluate(StatementAdapter.java:36)
	at com.carrotsearch.randomizedtesting.ThreadLeakControl$StatementRunner.run(ThreadLeakControl.java:368)
	at java.lang.Thread.run(Thread.java:748)


FAILED:  org.apache.solr.request.TestWriterPerf.testPerf

Error Message:
Cannot use facet.mincount=0 on field f_i which is Points-based

Stack Trace:
org.apache.solr.common.SolrException: Cannot use facet.mincount=0 on field f_i which is Points-based
	at __randomizedtesting.SeedInfo.seed([88A7C010FF146B44:A9902197979A4075]:0)
	at org.apache.solr.request.NumericFacets.getCountsSingleValue(NumericFacets.java:184)
	at org.apache.solr.request.NumericFacets.getCounts(NumericFacets.java:170)
	at org.apache.solr.request.SimpleFacets.getTermCounts(SimpleFacets.java:499)
	at org.apache.solr.request.SimpleFacets.getTermCounts(SimpleFacets.java:405)
	at org.apache.solr.request.SimpleFacets.lambda$getFacetFieldCounts$0(SimpleFacets.java:803)
	at java.util.concurrent.FutureTask.run(FutureTask.java:266)
	at org.apache.solr.request.SimpleFacets$3.execute(SimpleFacets.java:742)
	at org.apache.solr.request.SimpleFacets.getFacetFieldCounts(SimpleFacets.java:818)
	at org.apache.solr.handler.component.FacetComponent.getFacetCounts(FacetComponent.java:329)
	at org.apache.solr.handler.component.FacetComponent.process(FacetComponent.java:273)
	at org.apache.solr.handler.component.SearchHandler.handleRequestBody(SearchHandler.java:295)
	at org.apache.solr.handler.RequestHandlerBase.handleRequest(RequestHandlerBase.java:177)
	at org.apache.solr.core.SolrCore.execute(SolrCore.java:2473)
	at org.apache.solr.request.TestWriterPerf.getResponse(TestWriterPerf.java:98)
	at org.apache.solr.request.TestWriterPerf.doPerf(TestWriterPerf.java:107)
	at org.apache.solr.request.TestWriterPerf.testPerf(TestWriterPerf.java:180)
	at sun.reflect.NativeMethodAccessorImpl.invoke0(Native Method)
	at sun.reflect.NativeMethodAccessorImpl.invoke(NativeMethodAccessorImpl.java:62)
	at sun.reflect.DelegatingMethodAccessorImpl.invoke(DelegatingMethodAccessorImpl.java:43)
	at java.lang.reflect.Method.invoke(Method.java:498)
	at com.carrotsearch.randomizedtesting.RandomizedRunner.invoke(RandomizedRunner.java:1713)
	at com.carrotsearch.randomizedtesting.RandomizedRunner$8.evaluate(RandomizedRunner.java:907)
	at com.carrotsearch.randomizedtesting.RandomizedRunner$9.evaluate(RandomizedRunner.java:943)
	at com.carrotsearch.randomizedtesting.RandomizedRunner$10.evaluate(RandomizedRunner.java:957)
	at com.carrotsearch.randomizedtesting.rules.SystemPropertiesRestoreRule$1.evaluate(SystemPropertiesRestoreRule.java:57)
	at org.apache.lucene.util.TestRuleSetupTeardownChained$1.evaluate(TestRuleSetupTeardownChained.java:49)
	at org.apache.lucene.util.AbstractBeforeAfterRule$1.evaluate(AbstractBeforeAfterRule.java:45)
	at org.apache.lucene.util.TestRuleThreadAndTestName$1.evaluate(TestRuleThreadAndTestName.java:48)
	at org.apache.lucene.util.TestRuleIgnoreAfterMaxFailures$1.evaluate(TestRuleIgnoreAfterMaxFailures.java:64)
	at org.apache.lucene.util.TestRuleMarkFailure$1.evaluate(TestRuleMarkFailure.java:47)
	at com.carrotsearch.randomizedtesting.rules.StatementAdapter.evaluate(StatementAdapter.java:36)
	at com.carrotsearch.randomizedtesting.ThreadLeakControl$StatementRunner.run(ThreadLeakControl.java:368)
	at com.carrotsearch.randomizedtesting.ThreadLeakControl.forkTimeoutingTask(ThreadLeakControl.java:817)
	at com.carrotsearch.randomizedtesting.ThreadLeakControl$3.evaluate(ThreadLeakControl.java:468)
	at com.carrotsearch.randomizedtesting.RandomizedRunner.runSingleTest(RandomizedRunner.java:916)
	at com.carrotsearch.randomizedtesting.RandomizedRunner$5.evaluate(RandomizedRunner.java:802)
	at com.carrotsearch.randomizedtesting.RandomizedRunner$6.evaluate(RandomizedRunner.java:852)
	at com.carrotsearch.randomizedtesting.RandomizedRunner$7.evaluate(RandomizedRunner.java:863)
	at com.carrotsearch.randomizedtesting.rules.StatementAdapter.evaluate(StatementAdapter.java:36)
	at com.carrotsearch.randomizedtesting.rules.SystemPropertiesRestoreRule$1.evaluate(SystemPropertiesRestoreRule.java:57)
	at org.apache.lucene.util.AbstractBeforeAfterRule$1.evaluate(AbstractBeforeAfterRule.java:45)
	at com.carrotsearch.randomizedtesting.rules.StatementAdapter.evaluate(StatementAdapter.java:36)
	at org.apache.lucene.util.TestRuleStoreClassName$1.evaluate(TestRuleStoreClassName.java:41)
	at com.carrotsearch.randomizedtesting.rules.NoShadowingOrOverridesOnMethodsRule$1.evaluate(NoShadowingOrOverridesOnMethodsRule.java:40)
	at com.carrotsearch.randomizedtesting.rules.NoShadowingOrOverridesOnMethodsRule$1.evaluate(NoShadowingOrOverridesOnMethodsRule.java:40)
	at com.carrotsearch.randomizedtesting.rules.StatementAdapter.evaluate(StatementAdapter.java:36)
	at com.carrotsearch.randomizedtesting.rules.StatementAdapter.evaluate(StatementAdapter.java:36)
	at com.carrotsearch.randomizedtesting.rules.StatementAdapter.evaluate(StatementAdapter.java:36)
	at org.apache.lucene.util.TestRuleAssertionsRequired$1.evaluate(TestRuleAssertionsRequired.java:53)
	at org.apache.lucene.util.TestRuleMarkFailure$1.evaluate(TestRuleMarkFailure.java:47)
	at org.apache.lucene.util.TestRuleIgnoreAfterMaxFailures$1.evaluate(TestRuleIgnoreAfterMaxFailures.java:64)
	at org.apache.lucene.util.TestRuleIgnoreTestSuites$1.evaluate(TestRuleIgnoreTestSuites.java:54)
	at com.carrotsearch.randomizedtesting.rules.StatementAdapter.evaluate(StatementAdapter.java:36)
	at com.carrotsearch.randomizedtesting.ThreadLeakControl$StatementRunner.run(ThreadLeakControl.java:368)
	at java.lang.Thread.run(Thread.java:748)


FAILED:  org.apache.solr.schema.TestPointFields.testIntPointFieldFacetField

Error Message:
Exception during query

Stack Trace:
java.lang.RuntimeException: Exception during query
	at __randomizedtesting.SeedInfo.seed([88A7C010FF146B44:BBA1C966ABB902DE]:0)
	at org.apache.solr.SolrTestCaseJ4.assertQ(SolrTestCaseJ4.java:886)
	at org.apache.solr.SolrTestCaseJ4.assertQ(SolrTestCaseJ4.java:846)
	at org.apache.solr.schema.TestPointFields.doTestPointFieldFacetField(TestPointFields.java:2407)
	at org.apache.solr.schema.TestPointFields.testIntPointFieldFacetField(TestPointFields.java:196)
	at sun.reflect.NativeMethodAccessorImpl.invoke0(Native Method)
	at sun.reflect.NativeMethodAccessorImpl.invoke(NativeMethodAccessorImpl.java:62)
	at sun.reflect.DelegatingMethodAccessorImpl.invoke(DelegatingMethodAccessorImpl.java:43)
	at java.lang.reflect.Method.invoke(Method.java:498)
	at com.carrotsearch.randomizedtesting.RandomizedRunner.invoke(RandomizedRunner.java:1713)
	at com.carrotsearch.randomizedtesting.RandomizedRunner$8.evaluate(RandomizedRunner.java:907)
	at com.carrotsearch.randomizedtesting.RandomizedRunner$9.evaluate(RandomizedRunner.java:943)
	at com.carrotsearch.randomizedtesting.RandomizedRunner$10.evaluate(RandomizedRunner.java:957)
	at com.carrotsearch.randomizedtesting.rules.SystemPropertiesRestoreRule$1.evaluate(SystemPropertiesRestoreRule.java:57)
	at org.apache.lucene.util.TestRuleSetupTeardownChained$1.evaluate(TestRuleSetupTeardownChained.java:49)
	at org.apache.lucene.util.AbstractBeforeAfterRule$1.evaluate(AbstractBeforeAfterRule.java:45)
	at org.apache.lucene.util.TestRuleThreadAndTestName$1.evaluate(TestRuleThreadAndTestName.java:48)
	at org.apache.lucene.util.TestRuleIgnoreAfterMaxFailures$1.evaluate(TestRuleIgnoreAfterMaxFailures.java:64)
	at org.apache.lucene.util.TestRuleMarkFailure$1.evaluate(TestRuleMarkFailure.java:47)
	at com.carrotsearch.randomizedtesting.rules.StatementAdapter.evaluate(StatementAdapter.java:36)
	at com.carrotsearch.randomizedtesting.ThreadLeakControl$StatementRunner.run(ThreadLeakControl.java:368)
	at com.carrotsearch.randomizedtesting.ThreadLeakControl.forkTimeoutingTask(ThreadLeakControl.java:817)
	at com.carrotsearch.randomizedtesting.ThreadLeakControl$3.evaluate(ThreadLeakControl.java:468)
	at com.carrotsearch.randomizedtesting.RandomizedRunner.runSingleTest(RandomizedRunner.java:916)
	at com.carrotsearch.randomizedtesting.RandomizedRunner$5.evaluate(RandomizedRunner.java:802)
	at com.carrotsearch.randomizedtesting.RandomizedRunner$6.evaluate(RandomizedRunner.java:852)
	at com.carrotsearch.randomizedtesting.RandomizedRunner$7.evaluate(RandomizedRunner.java:863)
	at com.carrotsearch.randomizedtesting.rules.StatementAdapter.evaluate(StatementAdapter.java:36)
	at com.carrotsearch.randomizedtesting.rules.SystemPropertiesRestoreRule$1.evaluate(SystemPropertiesRestoreRule.java:57)
	at org.apache.lucene.util.AbstractBeforeAfterRule$1.evaluate(AbstractBeforeAfterRule.java:45)
	at com.carrotsearch.randomizedtesting.rules.StatementAdapter.evaluate(StatementAdapter.java:36)
	at org.apache.lucene.util.TestRuleStoreClassName$1.evaluate(TestRuleStoreClassName.java:41)
	at com.carrotsearch.randomizedtesting.rules.NoShadowingOrOverridesOnMethodsRule$1.evaluate(NoShadowingOrOverridesOnMethodsRule.java:40)
	at com.carrotsearch.randomizedtesting.rules.NoShadowingOrOverridesOnMethodsRule$1.evaluate(NoShadowingOrOverridesOnMethodsRule.java:40)
	at com.carrotsearch.randomizedtesting.rules.StatementAdapter.evaluate(StatementAdapter.java:36)
	at com.carrotsearch.randomizedtesting.rules.StatementAdapter.evaluate(StatementAdapter.java:36)
	at com.carrotsearch.randomizedtesting.rules.StatementAdapter.evaluate(StatementAdapter.java:36)
	at org.apache.lucene.util.TestRuleAssertionsRequired$1.evaluate(TestRuleAssertionsRequired.java:53)
	at org.apache.lucene.util.TestRuleMarkFailure$1.evaluate(TestRuleMarkFailure.java:47)
	at org.apache.lucene.util.TestRuleIgnoreAfterMaxFailures$1.evaluate(TestRuleIgnoreAfterMaxFailures.java:64)
	at org.apache.lucene.util.TestRuleIgnoreTestSuites$1.evaluate(TestRuleIgnoreTestSuites.java:54)
	at com.carrotsearch.randomizedtesting.rules.StatementAdapter.evaluate(StatementAdapter.java:36)
	at com.carrotsearch.randomizedtesting.ThreadLeakControl$StatementRunner.run(ThreadLeakControl.java:368)
	at java.lang.Thread.run(Thread.java:748)
Caused by: org.apache.solr.common.SolrException: Cannot use facet.mincount=0 on field number_p_i_dv which is Points-based
	at org.apache.solr.request.NumericFacets.getCountsSingleValue(NumericFacets.java:184)
	at org.apache.solr.request.NumericFacets.getCounts(NumericFacets.java:170)
	at org.apache.solr.request.SimpleFacets.getTermCounts(SimpleFacets.java:499)
	at org.apache.solr.request.SimpleFacets.getTermCounts(SimpleFacets.java:405)
	at org.apache.solr.request.SimpleFacets.lambda$getFacetFieldCounts$0(SimpleFacets.java:803)
	at java.util.concurrent.FutureTask.run(FutureTask.java:266)
	at org.apache.solr.request.SimpleFacets$3.execute(SimpleFacets.java:742)
	at org.apache.solr.request.SimpleFacets.getFacetFieldCounts(SimpleFacets.java:818)
	at org.apache.solr.handler.component.FacetComponent.getFacetCounts(FacetComponent.java:329)
	at org.apache.solr.handler.component.FacetComponent.process(FacetComponent.java:273)
	at org.apache.solr.handler.component.SearchHandler.handleRequestBody(SearchHandler.java:295)
	at org.apache.solr.handler.RequestHandlerBase.handleRequest(RequestHandlerBase.java:177)
	at org.apache.solr.core.SolrCore.execute(SolrCore.java:2473)
	at org.apache.solr.util.TestHarness.query(TestHarness.java:337)
	at org.apache.solr.util.TestHarness.query(TestHarness.java:319)
	at org.apache.solr.SolrTestCaseJ4.assertQ(SolrTestCaseJ4.java:860)
	... 42 more


FAILED:  org.apache.solr.schema.TestPointFields.testLongPointFieldFacetField

Error Message:
Exception during query

Stack Trace:
java.lang.RuntimeException: Exception during query
	at __randomizedtesting.SeedInfo.seed([88A7C010FF146B44:597EC2FB69FFB645]:0)
	at org.apache.solr.SolrTestCaseJ4.assertQ(SolrTestCaseJ4.java:886)
	at org.apache.solr.SolrTestCaseJ4.assertQ(SolrTestCaseJ4.java:846)
	at org.apache.solr.schema.TestPointFields.doTestPointFieldFacetField(TestPointFields.java:2407)
	at org.apache.solr.schema.TestPointFields.testLongPointFieldFacetField(TestPointFields.java:1358)
	at sun.reflect.NativeMethodAccessorImpl.invoke0(Native Method)
	at sun.reflect.NativeMethodAccessorImpl.invoke(NativeMethodAccessorImpl.java:62)
	at sun.reflect.DelegatingMethodAccessorImpl.invoke(DelegatingMethodAccessorImpl.java:43)
	at java.lang.reflect.Method.invoke(Method.java:498)
	at com.carrotsearch.randomizedtesting.RandomizedRunner.invoke(RandomizedRunner.java:1713)
	at com.carrotsearch.randomizedtesting.RandomizedRunner$8.evaluate(RandomizedRunner.java:907)
	at com.carrotsearch.randomizedtesting.RandomizedRunner$9.evaluate(RandomizedRunner.java:943)
	at com.carrotsearch.randomizedtesting.RandomizedRunner$10.evaluate(RandomizedRunner.java:957)
	at com.carrotsearch.randomizedtesting.rules.SystemPropertiesRestoreRule$1.evaluate(SystemPropertiesRestoreRule.java:57)
	at org.apache.lucene.util.TestRuleSetupTeardownChained$1.evaluate(TestRuleSetupTeardownChained.java:49)
	at org.apache.lucene.util.AbstractBeforeAfterRule$1.evaluate(AbstractBeforeAfterRule.java:45)
	at org.apache.lucene.util.TestRuleThreadAndTestName$1.evaluate(TestRuleThreadAndTestName.java:48)
	at org.apache.lucene.util.TestRuleIgnoreAfterMaxFailures$1.evaluate(TestRuleIgnoreAfterMaxFailures.java:64)
	at org.apache.lucene.util.TestRuleMarkFailure$1.evaluate(TestRuleMarkFailure.java:47)
	at com.carrotsearch.randomizedtesting.rules.StatementAdapter.evaluate(StatementAdapter.java:36)
	at com.carrotsearch.randomizedtesting.ThreadLeakControl$StatementRunner.run(ThreadLeakControl.java:368)
	at com.carrotsearch.randomizedtesting.ThreadLeakControl.forkTimeoutingTask(ThreadLeakControl.java:817)
	at com.carrotsearch.randomizedtesting.ThreadLeakControl$3.evaluate(ThreadLeakControl.java:468)
	at com.carrotsearch.randomizedtesting.RandomizedRunner.runSingleTest(RandomizedRunner.java:916)
	at com.carrotsearch.randomizedtesting.RandomizedRunner$5.evaluate(RandomizedRunner.java:802)
	at com.carrotsearch.randomizedtesting.RandomizedRunner$6.evaluate(RandomizedRunner.java:852)
	at com.carrotsearch.randomizedtesting.RandomizedRunner$7.evaluate(RandomizedRunner.java:863)
	at com.carrotsearch.randomizedtesting.rules.StatementAdapter.evaluate(StatementAdapter.java:36)
	at com.carrotsearch.randomizedtesting.rules.SystemPropertiesRestoreRule$1.evaluate(SystemPropertiesRestoreRule.java:57)
	at org.apache.lucene.util.AbstractBeforeAfterRule$1.evaluate(AbstractBeforeAfterRule.java:45)
	at com.carrotsearch.randomizedtesting.rules.StatementAdapter.evaluate(StatementAdapter.java:36)
	at org.apache.lucene.util.TestRuleStoreClassName$1.evaluate(TestRuleStoreClassName.java:41)
	at com.carrotsearch.randomizedtesting.rules.NoShadowingOrOverridesOnMethodsRule$1.evaluate(NoShadowingOrOverridesOnMethodsRule.java:40)
	at com.carrotsearch.randomizedtesting.rules.NoShadowingOrOverridesOnMethodsRule$1.evaluate(NoShadowingOrOverridesOnMethodsRule.java:40)
	at com.carrotsearch.randomizedtesting.rules.StatementAdapter.evaluate(StatementAdapter.java:36)
	at com.carrotsearch.randomizedtesting.rules.StatementAdapter.evaluate(StatementAdapter.java:36)
	at com.carrotsearch.randomizedtesting.rules.StatementAdapter.evaluate(StatementAdapter.java:36)
	at org.apache.lucene.util.TestRuleAssertionsRequired$1.evaluate(TestRuleAssertionsRequired.java:53)
	at org.apache.lucene.util.TestRuleMarkFailure$1.evaluate(TestRuleMarkFailure.java:47)
	at org.apache.lucene.util.TestRuleIgnoreAfterMaxFailures$1.evaluate(TestRuleIgnoreAfterMaxFailures.java:64)
	at org.apache.lucene.util.TestRuleIgnoreTestSuites$1.evaluate(TestRuleIgnoreTestSuites.java:54)
	at com.carrotsearch.randomizedtesting.rules.StatementAdapter.evaluate(StatementAdapter.java:36)
	at com.carrotsearch.randomizedtesting.ThreadLeakControl$StatementRunner.run(ThreadLeakControl.java:368)
	at java.lang.Thread.run(Thread.java:748)
Caused by: org.apache.solr.common.SolrException: Cannot use facet.mincount=0 on field number_p_l_dv which is Points-based
	at org.apache.solr.request.NumericFacets.getCountsSingleValue(NumericFacets.java:184)
	at org.apache.solr.request.NumericFacets.getCounts(NumericFacets.java:170)
	at org.apache.solr.request.SimpleFacets.getTermCounts(SimpleFacets.java:499)
	at org.apache.solr.request.SimpleFacets.getTermCounts(SimpleFacets.java:405)
	at org.apache.solr.request.SimpleFacets.lambda$getFacetFieldCounts$0(SimpleFacets.java:803)
	at java.util.concurrent.FutureTask.run(FutureTask.java:266)
	at org.apache.solr.request.SimpleFacets$3.execute(SimpleFacets.java:742)
	at org.apache.solr.request.SimpleFacets.getFacetFieldCounts(SimpleFacets.java:818)
	at org.apache.solr.handler.component.FacetComponent.getFacetCounts(FacetComponent.java:329)
	at org.apache.solr.handler.component.FacetComponent.process(FacetComponent.java:273)
	at org.apache.solr.handler.component.SearchHandler.handleRequestBody(SearchHandler.java:295)
	at org.apache.solr.handler.RequestHandlerBase.handleRequest(RequestHandlerBase.java:177)
	at org.apache.solr.core.SolrCore.execute(SolrCore.java:2473)
	at org.apache.solr.util.TestHarness.query(TestHarness.java:337)
	at org.apache.solr.util.TestHarness.query(TestHarness.java:319)
	at org.apache.solr.SolrTestCaseJ4.assertQ(SolrTestCaseJ4.java:860)
	... 42 more


FAILED:  org.apache.solr.schema.TestPointFields.testFloatPointFieldFacetField

Error Message:
Exception during query

Stack Trace:
java.lang.RuntimeException: Exception during query
	at __randomizedtesting.SeedInfo.seed([88A7C010FF146B44:321E222FDCF8C304]:0)
	at org.apache.solr.SolrTestCaseJ4.assertQ(SolrTestCaseJ4.java:886)
	at org.apache.solr.SolrTestCaseJ4.assertQ(SolrTestCaseJ4.java:846)
	at org.apache.solr.schema.TestPointFields.doTestPointFieldFacetField(TestPointFields.java:2407)
	at org.apache.solr.schema.TestPointFields.testFloatPointFieldFacetField(TestPointFields.java:1003)
	at sun.reflect.NativeMethodAccessorImpl.invoke0(Native Method)
	at sun.reflect.NativeMethodAccessorImpl.invoke(NativeMethodAccessorImpl.java:62)
	at sun.reflect.DelegatingMethodAccessorImpl.invoke(DelegatingMethodAccessorImpl.java:43)
	at java.lang.reflect.Method.invoke(Method.java:498)
	at com.carrotsearch.randomizedtesting.RandomizedRunner.invoke(RandomizedRunner.java:1713)
	at com.carrotsearch.randomizedtesting.RandomizedRunner$8.evaluate(RandomizedRunner.java:907)
	at com.carrotsearch.randomizedtesting.RandomizedRunner$9.evaluate(RandomizedRunner.java:943)
	at com.carrotsearch.randomizedtesting.RandomizedRunner$10.evaluate(RandomizedRunner.java:957)
	at com.carrotsearch.randomizedtesting.rules.SystemPropertiesRestoreRule$1.evaluate(SystemPropertiesRestoreRule.java:57)
	at org.apache.lucene.util.TestRuleSetupTeardownChained$1.evaluate(TestRuleSetupTeardownChained.java:49)
	at org.apache.lucene.util.AbstractBeforeAfterRule$1.evaluate(AbstractBeforeAfterRule.java:45)
	at org.apache.lucene.util.TestRuleThreadAndTestName$1.evaluate(TestRuleThreadAndTestName.java:48)
	at org.apache.lucene.util.TestRuleIgnoreAfterMaxFailures$1.evaluate(TestRuleIgnoreAfterMaxFailures.java:64)
	at org.apache.lucene.util.TestRuleMarkFailure$1.evaluate(TestRuleMarkFailure.java:47)
	at com.carrotsearch.randomizedtesting.rules.StatementAdapter.evaluate(StatementAdapter.java:36)
	at com.carrotsearch.randomizedtesting.ThreadLeakControl$StatementRunner.run(ThreadLeakControl.java:368)
	at com.carrotsearch.randomizedtesting.ThreadLeakControl.forkTimeoutingTask(ThreadLeakControl.java:817)
	at com.carrotsearch.randomizedtesting.ThreadLeakControl$3.evaluate(ThreadLeakControl.java:468)
	at com.carrotsearch.randomizedtesting.RandomizedRunner.runSingleTest(RandomizedRunner.java:916)
	at com.carrotsearch.randomizedtesting.RandomizedRunner$5.evaluate(RandomizedRunner.java:802)
	at com.carrotsearch.randomizedtesting.RandomizedRunner$6.evaluate(RandomizedRunner.java:852)
	at com.carrotsearch.randomizedtesting.RandomizedRunner$7.evaluate(RandomizedRunner.java:863)
	at com.carrotsearch.randomizedtesting.rules.StatementAdapter.evaluate(StatementAdapter.java:36)
	at com.carrotsearch.randomizedtesting.rules.SystemPropertiesRestoreRule$1.evaluate(SystemPropertiesRestoreRule.java:57)
	at org.apache.lucene.util.AbstractBeforeAfterRule$1.evaluate(AbstractBeforeAfterRule.java:45)
	at com.carrotsearch.randomizedtesting.rules.StatementAdapter.evaluate(StatementAdapter.java:36)
	at org.apache.lucene.util.TestRuleStoreClassName$1.evaluate(TestRuleStoreClassName.java:41)
	at com.carrotsearch.randomizedtesting.rules.NoShadowingOrOverridesOnMethodsRule$1.evaluate(NoShadowingOrOverridesOnMethodsRule.java:40)
	at com.carrotsearch.randomizedtesting.rules.NoShadowingOrOverridesOnMethodsRule$1.evaluate(NoShadowingOrOverridesOnMethodsRule.java:40)
	at com.carrotsearch.randomizedtesting.rules.StatementAdapter.evaluate(StatementAdapter.java:36)
	at com.carrotsearch.randomizedtesting.rules.StatementAdapter.evaluate(StatementAdapter.java:36)
	at com.carrotsearch.randomizedtesting.rules.StatementAdapter.evaluate(StatementAdapter.java:36)
	at org.apache.lucene.util.TestRuleAssertionsRequired$1.evaluate(TestRuleAssertionsRequired.java:53)
	at org.apache.lucene.util.TestRuleMarkFailure$1.evaluate(TestRuleMarkFailure.java:47)
	at org.apache.lucene.util.TestRuleIgnoreAfterMaxFailures$1.evaluate(TestRuleIgnoreAfterMaxFailures.java:64)
	at org.apache.lucene.util.TestRuleIgnoreTestSuites$1.evaluate(TestRuleIgnoreTestSuites.java:54)
	at com.carrotsearch.randomizedtesting.rules.StatementAdapter.evaluate(StatementAdapter.java:36)
	at com.carrotsearch.randomizedtesting.ThreadLeakControl$StatementRunner.run(ThreadLeakControl.java:368)
	at java.lang.Thread.run(Thread.java:748)
Caused by: org.apache.solr.common.SolrException: Cannot use facet.mincount=0 on field number_p_f_dv which is Points-based
	at org.apache.solr.request.NumericFacets.getCountsSingleValue(NumericFacets.java:184)
	at org.apache.solr.request.NumericFacets.getCounts(NumericFacets.java:170)
	at org.apache.solr.request.SimpleFacets.getTermCounts(SimpleFacets.java:499)
	at org.apache.solr.request.SimpleFacets.getTermCounts(SimpleFacets.java:405)
	at org.apache.solr.request.SimpleFacets.lambda$getFacetFieldCounts$0(SimpleFacets.java:803)
	at java.util.concurrent.FutureTask.run(FutureTask.java:266)
	at org.apache.solr.request.SimpleFacets$3.execute(SimpleFacets.java:742)
	at org.apache.solr.request.SimpleFacets.getFacetFieldCounts(SimpleFacets.java:818)
	at org.apache.solr.handler.component.FacetComponent.getFacetCounts(FacetComponent.java:329)
	at org.apache.solr.handler.component.FacetComponent.process(FacetComponent.java:273)
	at org.apache.solr.handler.component.SearchHandler.handleRequestBody(SearchHandler.java:295)
	at org.apache.solr.handler.RequestHandlerBase.handleRequest(RequestHandlerBase.java:177)
	at org.apache.solr.core.SolrCore.execute(SolrCore.java:2473)
	at org.apache.solr.util.TestHarness.query(TestHarness.java:337)
	at org.apache.solr.util.TestHarness.query(TestHarness.java:319)
	at org.apache.solr.SolrTestCaseJ4.assertQ(SolrTestCaseJ4.java:860)
	... 42 more


FAILED:  org.apache.solr.schema.TestPointFields.testDatePointFieldMultiValuedFacetField

Error Message:
Exception during query

Stack Trace:
java.lang.RuntimeException: Exception during query
	at __randomizedtesting.SeedInfo.seed([88A7C010FF146B44:B9DAB764AE7A1212]:0)
	at org.apache.solr.SolrTestCaseJ4.assertQ(SolrTestCaseJ4.java:886)
	at org.apache.solr.SolrTestCaseJ4.assertQ(SolrTestCaseJ4.java:846)
	at org.apache.solr.schema.TestPointFields.doTestPointFieldMultiValuedFacetField(TestPointFields.java:2749)
	at org.apache.solr.schema.TestPointFields.testDatePointFieldMultiValuedFacetField(TestPointFields.java:1884)
	at sun.reflect.NativeMethodAccessorImpl.invoke0(Native Method)
	at sun.reflect.NativeMethodAccessorImpl.invoke(NativeMethodAccessorImpl.java:62)
	at sun.reflect.DelegatingMethodAccessorImpl.invoke(DelegatingMethodAccessorImpl.java:43)
	at java.lang.reflect.Method.invoke(Method.java:498)
	at com.carrotsearch.randomizedtesting.RandomizedRunner.invoke(RandomizedRunner.java:1713)
	at com.carrotsearch.randomizedtesting.RandomizedRunner$8.evaluate(RandomizedRunner.java:907)
	at com.carrotsearch.randomizedtesting.RandomizedRunner$9.evaluate(RandomizedRunner.java:943)
	at com.carrotsearch.randomizedtesting.RandomizedRunner$10.evaluate(RandomizedRunner.java:957)
	at com.carrotsearch.randomizedtesting.rules.SystemPropertiesRestoreRule$1.evaluate(SystemPropertiesRestoreRule.java:57)
	at org.apache.lucene.util.TestRuleSetupTeardownChained$1.evaluate(TestRuleSetupTeardownChained.java:49)
	at org.apache.lucene.util.AbstractBeforeAfterRule$1.evaluate(AbstractBeforeAfterRule.java:45)
	at org.apache.lucene.util.TestRuleThreadAndTestName$1.evaluate(TestRuleThreadAndTestName.java:48)
	at org.apache.lucene.util.TestRuleIgnoreAfterMaxFailures$1.evaluate(TestRuleIgnoreAfterMaxFailures.java:64)
	at org.apache.lucene.util.TestRuleMarkFailure$1.evaluate(TestRuleMarkFailure.java:47)
	at com.carrotsearch.randomizedtesting.rules.StatementAdapter.evaluate(StatementAdapter.java:36)
	at com.carrotsearch.randomizedtesting.ThreadLeakControl$StatementRunner.run(ThreadLeakControl.java:368)
	at com.carrotsearch.randomizedtesting.ThreadLeakControl.forkTimeoutingTask(ThreadLeakControl.java:817)
	at com.carrotsearch.randomizedtesting.ThreadLeakControl$3.evaluate(ThreadLeakControl.java:468)
	at com.carrotsearch.randomizedtesting.RandomizedRunner.runSingleTest(RandomizedRunner.java:916)
	at com.carrotsearch.randomizedtesting.RandomizedRunner$5.evaluate(RandomizedRunner.java:802)
	at com.carrotsearch.randomizedtesting.RandomizedRunner$6.evaluate(RandomizedRunner.java:852)
	at com.carrotsearch.randomizedtesting.RandomizedRunner$7.evaluate(RandomizedRunner.java:863)
	at com.carrotsearch.randomizedtesting.rules.StatementAdapter.evaluate(StatementAdapter.java:36)
	at com.carrotsearch.randomizedtesting.rules.SystemPropertiesRestoreRule$1.evaluate(SystemPropertiesRestoreRule.java:57)
	at org.apache.lucene.util.AbstractBeforeAfterRule$1.evaluate(AbstractBeforeAfterRule.java:45)
	at com.carrotsearch.randomizedtesting.rules.StatementAdapter.evaluate(StatementAdapter.java:36)
	at org.apache.lucene.util.TestRuleStoreClassName$1.evaluate(TestRuleStoreClassName.java:41)
	at com.carrotsearch.randomizedtesting.rules.NoShadowingOrOverridesOnMethodsRule$1.evaluate(NoShadowingOrOverridesOnMethodsRule.java:40)
	at com.carrotsearch.randomizedtesting.rules.NoShadowingOrOverridesOnMethodsRule$1.evaluate(NoShadowingOrOverridesOnMethodsRule.java:40)
	at com.carrotsearch.randomizedtesting.rules.StatementAdapter.evaluate(StatementAdapter.java:36)
	at com.carrotsearch.randomizedtesting.rules.StatementAdapter.evaluate(StatementAdapter.java:36)
	at com.carrotsearch.randomizedtesting.rules.StatementAdapter.evaluate(StatementAdapter.java:36)
	at org.apache.lucene.util.TestRuleAssertionsRequired$1.evaluate(TestRuleAssertionsRequired.java:53)
	at org.apache.lucene.util.TestRuleMarkFailure$1.evaluate(TestRuleMarkFailure.java:47)
	at org.apache.lucene.util.TestRuleIgnoreAfterMaxFailures$1.evaluate(TestRuleIgnoreAfterMaxFailures.java:64)
	at org.apache.lucene.util.TestRuleIgnoreTestSuites$1.evaluate(TestRuleIgnoreTestSuites.java:54)
	at com.carrotsearch.randomizedtesting.rules.StatementAdapter.evaluate(StatementAdapter.java:36)
	at com.carrotsearch.randomizedtesting.ThreadLeakControl$StatementRunner.run(ThreadLeakControl.java:368)
	at java.lang.Thread.run(Thread.java:748)
Caused by: org.apache.solr.common.SolrException: Cannot use facet.mincount=0 on field number_p_dt_mv_dv which is Points-based
	at org.apache.solr.request.NumericFacets.getCountsMultiValued(NumericFacets.java:425)
	at org.apache.solr.request.NumericFacets.getCounts(NumericFacets.java:168)
	at org.apache.solr.request.SimpleFacets.getTermCounts(SimpleFacets.java:499)
	at org.apache.solr.request.SimpleFacets.getTermCounts(SimpleFacets.java:405)
	at org.apache.solr.request.SimpleFacets.lambda$getFacetFieldCounts$0(SimpleFacets.java:803)
	at java.util.concurrent.FutureTask.run(FutureTask.java:266)
	at org.apache.solr.request.SimpleFacets$3.execute(SimpleFacets.java:742)
	at org.apache.solr.request.SimpleFacets.getFacetFieldCounts(SimpleFacets.java:818)
	at org.apache.solr.handler.component.FacetComponent.getFacetCounts(FacetComponent.java:329)
	at org.apache.solr.handler.component.FacetComponent.process(FacetComponent.java:273)
	at org.apache.solr.handler.component.SearchHandler.handleRequestBody(SearchHandler.java:295)
	at org.apache.solr.handler.RequestHandlerBase.handleRequest(RequestHandlerBase.java:177)
	at org.apache.solr.core.SolrCore.execute(SolrCore.java:2473)
	at org.apache.solr.util.TestHarness.query(TestHarness.java:337)
	at org.apache.solr.util.TestHarness.query(TestHarness.java:319)
	at org.apache.solr.SolrTestCaseJ4.assertQ(SolrTestCaseJ4.java:860)
	... 42 more


FAILED:  org.apache.solr.schema.TestPointFields.testLongPointFieldMultiValuedFacetField

Error Message:
Exception during query

Stack Trace:
java.lang.RuntimeException: Exception during query
	at __randomizedtesting.SeedInfo.seed([88A7C010FF146B44:3316E3FF88023E79]:0)
	at org.apache.solr.SolrTestCaseJ4.assertQ(SolrTestCaseJ4.java:886)
	at org.apache.solr.SolrTestCaseJ4.assertQ(SolrTestCaseJ4.java:846)
	at org.apache.solr.schema.TestPointFields.doTestPointFieldMultiValuedFacetField(TestPointFields.java:2749)
	at org.apache.solr.schema.TestPointFields.testLongPointFieldMultiValuedFacetField(TestPointFields.java:1480)
	at sun.reflect.NativeMethodAccessorImpl.invoke0(Native Method)
	at sun.reflect.NativeMethodAccessorImpl.invoke(NativeMethodAccessorImpl.java:62)
	at sun.reflect.DelegatingMethodAccessorImpl.invoke(DelegatingMethodAccessorImpl.java:43)
	at java.lang.reflect.Method.invoke(Method.java:498)
	at com.carrotsearch.randomizedtesting.RandomizedRunner.invoke(RandomizedRunner.java:1713)
	at com.carrotsearch.randomizedtesting.RandomizedRunner$8.evaluate(RandomizedRunner.java:907)
	at com.carrotsearch.randomizedtesting.RandomizedRunner$9.evaluate(RandomizedRunner.java:943)
	at com.carrotsearch.randomizedtesting.RandomizedRunner$10.evaluate(RandomizedRunner.java:957)
	at com.carrotsearch.randomizedtesting.rules.SystemPropertiesRestoreRule$1.evaluate(SystemPropertiesRestoreRule.java:57)
	at org.apache.lucene.util.TestRuleSetupTeardownChained$1.evaluate(TestRuleSetupTeardownChained.java:49)
	at org.apache.lucene.util.AbstractBeforeAfterRule$1.evaluate(AbstractBeforeAfterRule.java:45)
	at org.apache.lucene.util.TestRuleThreadAndTestName$1.evaluate(TestRuleThreadAndTestName.java:48)
	at org.apache.lucene.util.TestRuleIgnoreAfterMaxFailures$1.evaluate(TestRuleIgnoreAfterMaxFailures.java:64)
	at org.apache.lucene.util.TestRuleMarkFailure$1.evaluate(TestRuleMarkFailure.java:47)
	at com.carrotsearch.randomizedtesting.rules.StatementAdapter.evaluate(StatementAdapter.java:36)
	at com.carrotsearch.randomizedtesting.ThreadLeakControl$StatementRunner.run(ThreadLeakControl.java:368)
	at com.carrotsearch.randomizedtesting.ThreadLeakControl.forkTimeoutingTask(ThreadLeakControl.java:817)
	at com.carrotsearch.randomizedtesting.ThreadLeakControl$3.evaluate(ThreadLeakControl.java:468)
	at com.carrotsearch.randomizedtesting.RandomizedRunner.runSingleTest(RandomizedRunner.java:916)
	at com.carrotsearch.randomizedtesting.RandomizedRunner$5.evaluate(RandomizedRunner.java:802)
	at com.carrotsearch.randomizedtesting.RandomizedRunner$6.evaluate(RandomizedRunner.java:852)
	at com.carrotsearch.randomizedtesting.RandomizedRunner$7.evaluate(RandomizedRunner.java:863)
	at com.carrotsearch.randomizedtesting.rules.StatementAdapter.evaluate(StatementAdapter.java:36)
	at com.carrotsearch.randomizedtesting.rules.SystemPropertiesRestoreRule$1.evaluate(SystemPropertiesRestoreRule.java:57)
	at org.apache.lucene.util.AbstractBeforeAfterRule$1.evaluate(AbstractBeforeAfterRule.java:45)
	at com.carrotsearch.randomizedtesting.rules.StatementAdapter.evaluate(StatementAdapter.java:36)
	at org.apache.lucene.util.TestRuleStoreClassName$1.evaluate(TestRuleStoreClassName.java:41)
	at com.carrotsearch.randomizedtesting.rules.NoShadowingOrOverridesOnMethodsRule$1.evaluate(NoShadowingOrOverridesOnMethodsRule.java:40)
	at com.carrotsearch.randomizedtesting.rules.NoShadowingOrOverridesOnMethodsRule$1.evaluate(NoShadowingOrOverridesOnMethodsRule.java:40)
	at com.carrotsearch.randomizedtesting.rules.StatementAdapter.evaluate(StatementAdapter.java:36)
	at com.carrotsearch.randomizedtesting.rules.StatementAdapter.evaluate(StatementAdapter.java:36)
	at com.carrotsearch.randomizedtesting.rules.StatementAdapter.evaluate(StatementAdapter.java:36)
	at org.apache.lucene.util.TestRuleAssertionsRequired$1.evaluate(TestRuleAssertionsRequired.java:53)
	at org.apache.lucene.util.TestRuleMarkFailure$1.evaluate(TestRuleMarkFailure.java:47)
	at org.apache.lucene.util.TestRuleIgnoreAfterMaxFailures$1.evaluate(TestRuleIgnoreAfterMaxFailures.java:64)
	at org.apache.lucene.util.TestRuleIgnoreTestSuites$1.evaluate(TestRuleIgnoreTestSuites.java:54)
	at com.carrotsearch.randomizedtesting.rules.StatementAdapter.evaluate(StatementAdapter.java:36)
	at com.carrotsearch.randomizedtesting.ThreadLeakControl$StatementRunner.run(ThreadLeakControl.java:368)
	at java.lang.Thread.run(Thread.java:748)
Caused by: org.apache.solr.common.SolrException: Cannot use facet.mincount=0 on field number_p_l_mv_dv which is Points-based
	at org.apache.solr.request.NumericFacets.getCountsMultiValued(NumericFacets.java:425)
	at org.apache.solr.request.NumericFacets.getCounts(NumericFacets.java:168)
	at org.apache.solr.request.SimpleFacets.getTermCounts(SimpleFacets.java:499)
	at org.apache.solr.request.SimpleFacets.getTermCounts(SimpleFacets.java:405)
	at org.apache.solr.request.SimpleFacets.lambda$getFacetFieldCounts$0(SimpleFacets.java:803)
	at java.util.concurrent.FutureTask.run(FutureTask.java:266)
	at org.apache.solr.request.SimpleFacets$3.execute(SimpleFacets.java:742)
	at org.apache.solr.request.SimpleFacets.getFacetFieldCounts(SimpleFacets.java:818)
	at org.apache.solr.handler.component.FacetComponent.getFacetCounts(FacetComponent.java:329)
	at org.apache.solr.handler.component.FacetComponent.process(FacetComponent.java:273)
	at org.apache.solr.handler.component.SearchHandler.handleRequestBody(SearchHandler.java:295)
	at org.apache.solr.handler.RequestHandlerBase.handleRequest(RequestHandlerBase.java:177)
	at org.apache.solr.core.SolrCore.execute(SolrCore.java:2473)
	at org.apache.solr.util.TestHarness.query(TestHarness.java:337)
	at org.apache.solr.util.TestHarness.query(TestHarness.java:319)
	at org.apache.solr.SolrTestCaseJ4.assertQ(SolrTestCaseJ4.java:860)
	... 42 more


FAILED:  org.apache.solr.schema.TestPointFields.testDoublePointFieldFacetField

Error Message:
Exception during query

Stack Trace:
java.lang.RuntimeException: Exception during query
	at __randomizedtesting.SeedInfo.seed([88A7C010FF146B44:A1B4ED0F1EF4BBA]:0)
	at org.apache.solr.SolrTestCaseJ4.assertQ(SolrTestCaseJ4.java:886)
	at org.apache.solr.SolrTestCaseJ4.assertQ(SolrTestCaseJ4.java:846)
	at org.apache.solr.schema.TestPointFields.doTestPointFieldFacetField(TestPointFields.java:2407)
	at org.apache.solr.schema.TestPointFields.testDoublePointFieldFacetField(TestPointFields.java:597)
	at sun.reflect.NativeMethodAccessorImpl.invoke0(Native Method)
	at sun.reflect.NativeMethodAccessorImpl.invoke(NativeMethodAccessorImpl.java:62)
	at sun.reflect.DelegatingMethodAccessorImpl.invoke(DelegatingMethodAccessorImpl.java:43)
	at java.lang.reflect.Method.invoke(Method.java:498)
	at com.carrotsearch.randomizedtesting.RandomizedRunner.invoke(RandomizedRunner.java:1713)
	at com.carrotsearch.randomizedtesting.RandomizedRunner$8.evaluate(RandomizedRunner.java:907)
	at com.carrotsearch.randomizedtesting.RandomizedRunner$9.evaluate(RandomizedRunner.java:943)
	at com.carrotsearch.randomizedtesting.RandomizedRunner$10.evaluate(RandomizedRunner.java:957)
	at com.carrotsearch.randomizedtesting.rules.SystemPropertiesRestoreRule$1.evaluate(SystemPropertiesRestoreRule.java:57)
	at org.apache.lucene.util.TestRuleSetupTeardownChained$1.evaluate(TestRuleSetupTeardownChained.java:49)
	at org.apache.lucene.util.AbstractBeforeAfterRule$1.evaluate(AbstractBeforeAfterRule.java:45)
	at org.apache.lucene.util.TestRuleThreadAndTestName$1.evaluate(TestRuleThreadAndTestName.java:48)
	at org.apache.lucene.util.TestRuleIgnoreAfterMaxFailures$1.evaluate(TestRuleIgnoreAfterMaxFailures.java:64)
	at org.apache.lucene.util.TestRuleMarkFailure$1.evaluate(TestRuleMarkFailure.java:47)
	at com.carrotsearch.randomizedtesting.rules.StatementAdapter.evaluate(StatementAdapter.java:36)
	at com.carrotsearch.randomizedtesting.ThreadLeakControl$StatementRunner.run(ThreadLeakControl.java:368)
	at com.carrotsearch.randomizedtesting.ThreadLeakControl.forkTimeoutingTask(ThreadLeakControl.java:817)
	at com.carrotsearch.randomizedtesting.ThreadLeakControl$3.evaluate(ThreadLeakControl.java:468)
	at com.carrotsearch.randomizedtesting.RandomizedRunner.runSingleTest(RandomizedRunner.java:916)
	at com.carrotsearch.randomizedtesting.RandomizedRunner$5.evaluate(RandomizedRunner.java:802)
	at com.carrotsearch.randomizedtesting.RandomizedRunner$6.evaluate(RandomizedRunner.java:852)
	at com.carrotsearch.randomizedtesting.RandomizedRunner$7.evaluate(RandomizedRunner.java:863)
	at com.carrotsearch.randomizedtesting.rules.StatementAdapter.evaluate(StatementAdapter.java:36)
	at com.carrotsearch.randomizedtesting.rules.SystemPropertiesRestoreRule$1.evaluate(SystemPropertiesRestoreRule.java:57)
	at org.apache.lucene.util.AbstractBeforeAfterRule$1.evaluate(AbstractBeforeAfterRule.java:45)
	at com.carrotsearch.randomizedtesting.rules.StatementAdapter.evaluate(StatementAdapter.java:36)
	at org.apache.lucene.util.TestRuleStoreClassName$1.evaluate(TestRuleStoreClassName.java:41)
	at com.carrotsearch.randomizedtesting.rules.NoShadowingOrOverridesOnMethodsRule$1.evaluate(NoShadowingOrOverridesOnMethodsRule.java:40)
	at com.carrotsearch.randomizedtesting.rules.NoShadowingOrOverridesOnMethodsRule$1.evaluate(NoShadowingOrOverridesOnMethodsRule.java:40)
	at com.carrotsearch.randomizedtesting.rules.StatementAdapter.evaluate(StatementAdapter.java:36)
	at com.carrotsearch.randomizedtesting.rules.StatementAdapter.evaluate(StatementAdapter.java:36)
	at com.carrotsearch.randomizedtesting.rules.StatementAdapter.evaluate(StatementAdapter.java:36)
	at org.apache.lucene.util.TestRuleAssertionsRequired$1.evaluate(TestRuleAssertionsRequired.java:53)
	at org.apache.lucene.util.TestRuleMarkFailure$1.evaluate(TestRuleMarkFailure.java:47)
	at org.apache.lucene.util.TestRuleIgnoreAfterMaxFailures$1.evaluate(TestRuleIgnoreAfterMaxFailures.java:64)
	at org.apache.lucene.util.TestRuleIgnoreTestSuites$1.evaluate(TestRuleIgnoreTestSuites.java:54)
	at com.carrotsearch.randomizedtesting.rules.StatementAdapter.evaluate(StatementAdapter.java:36)
	at com.carrotsearch.randomizedtesting.ThreadLeakControl$StatementRunner.run(ThreadLeakControl.java:368)
	at java.lang.Thread.run(Thread.java:748)
Caused by: org.apache.solr.common.SolrException: Cannot use facet.mincount=0 on field number_p_d_dv which is Points-based
	at org.apache.solr.request.NumericFacets.getCountsSingleValue(NumericFacets.java:184)
	at org.apache.solr.request.NumericFacets.getCounts(NumericFacets.java:170)
	at org.apache.solr.request.SimpleFacets.getTermCounts(SimpleFacets.java:499)
	at org.apache.solr.request.SimpleFacets.getTermCounts(SimpleFacets.java:405)
	at org.apache.solr.request.SimpleFacets.lambda$getFacetFieldCounts$0(SimpleFacets.java:803)
	at java.util.concurrent.FutureTask.run(FutureTask.java:266)
	at org.apache.solr.request.SimpleFacets$3.execute(SimpleFacets.java:742)
	at org.apache.solr.request.SimpleFacets.getFacetFieldCounts(SimpleFacets.java:818)
	at org.apache.solr.handler.component.FacetComponent.getFacetCounts(FacetComponent.java:329)
	at org.apache.solr.handler.component.FacetComponent.process(FacetComponent.java:273)
	at org.apache.solr.handler.component.SearchHandler.handleRequestBody(SearchHandler.java:295)
	at org.apache.solr.handler.RequestHandlerBase.handleRequest(RequestHandlerBase.java:177)
	at org.apache.solr.core.SolrCore.execute(SolrCore.java:2473)
	at org.apache.solr.util.TestHarness.query(TestHarness.java:337)
	at org.apache.solr.util.TestHarness.query(TestHarness.java:319)
	at org.apache.solr.SolrTestCaseJ4.assertQ(SolrTestCaseJ4.java:860)
	... 42 more


FAILED:  org.apache.solr.schema.TestPointFields.testIntPointFieldMultiValuedFacetField

Error Message:
Exception during query

Stack Trace:
java.lang.RuntimeException: Exception during query
	at __randomizedtesting.SeedInfo.seed([88A7C010FF146B44:366696CFB5ED7B56]:0)
	at org.apache.solr.SolrTestCaseJ4.assertQ(SolrTestCaseJ4.java:886)
	at org.apache.solr.SolrTestCaseJ4.assertQ(SolrTestCaseJ4.java:846)
	at org.apache.solr.schema.TestPointFields.doTestPointFieldMultiValuedFacetField(TestPointFields.java:2749)
	at org.apache.solr.schema.TestPointFields.testIntPointFieldMultiValuedFacetField(TestPointFields.java:321)
	at sun.reflect.NativeMethodAccessorImpl.invoke0(Native Method)
	at sun.reflect.NativeMethodAccessorImpl.invoke(NativeMethodAccessorImpl.java:62)
	at sun.reflect.DelegatingMethodAccessorImpl.invoke(DelegatingMethodAccessorImpl.java:43)
	at java.lang.reflect.Method.invoke(Method.java:498)
	at com.carrotsearch.randomizedtesting.RandomizedRunner.invoke(RandomizedRunner.java:1713)
	at com.carrotsearch.randomizedtesting.RandomizedRunner$8.evaluate(RandomizedRunner.java:907)
	at com.carrotsearch.randomizedtesting.RandomizedRunner$9.evaluate(RandomizedRunner.java:943)
	at com.carrotsearch.randomizedtesting.RandomizedRunner$10.evaluate(RandomizedRunner.java:957)
	at com.carrotsearch.randomizedtesting.rules.SystemPropertiesRestoreRule$1.evaluate(SystemPropertiesRestoreRule.java:57)
	at org.apache.lucene.util.TestRuleSetupTeardownChained$1.evaluate(TestRuleSetupTeardownChained.java:49)
	at org.apache.lucene.util.AbstractBeforeAfterRule$1.evaluate(AbstractBeforeAfterRule.java:45)
	at org.apache.lucene.util.TestRuleThreadAndTestName$1.evaluate(TestRuleThreadAndTestName.java:48)
	at org.apache.lucene.util.TestRuleIgnoreAfterMaxFailures$1.evaluate(TestRuleIgnoreAfterMaxFailures.java:64)
	at org.apache.lucene.util.TestRuleMarkFailure$1.evaluate(TestRuleMarkFailure.java:47)
	at com.carrotsearch.randomizedtesting.rules.StatementAdapter.evaluate(StatementAdapter.java:36)
	at com.carrotsearch.randomizedtesting.ThreadLeakControl$StatementRunner.run(ThreadLeakControl.java:368)
	at com.carrotsearch.randomizedtesting.ThreadLeakControl.forkTimeoutingTask(ThreadLeakControl.java:817)
	at com.carrotsearch.randomizedtesting.ThreadLeakControl$3.evaluate(ThreadLeakControl.java:468)
	at com.carrotsearch.randomizedtesting.RandomizedRunner.runSingleTest(RandomizedRunner.java:916)
	at com.carrotsearch.randomizedtesting.RandomizedRunner$5.evaluate(RandomizedRunner.java:802)
	at com.carrotsearch.randomizedtesting.RandomizedRunner$6.evaluate(RandomizedRunner.java:852)
	at com.carrotsearch.randomizedtesting.RandomizedRunner$7.evaluate(RandomizedRunner.java:863)
	at com.carrotsearch.randomizedtesting.rules.StatementAdapter.evaluate(StatementAdapter.java:36)
	at com.carrotsearch.randomizedtesting.rules.SystemPropertiesRestoreRule$1.evaluate(SystemPropertiesRestoreRule.java:57)
	at org.apache.lucene.util.AbstractBeforeAfterRule$1.evaluate(AbstractBeforeAfterRule.java:45)
	at com.carrotsearch.randomizedtesting.rules.StatementAdapter.evaluate(StatementAdapter.java:36)
	at org.apache.lucene.util.TestRuleStoreClassName$1.evaluate(TestRuleStoreClassName.java:41)
	at com.carrotsearch.randomizedtesting.rules.NoShadowingOrOverridesOnMethodsRule$1.evaluate(NoShadowingOrOverridesOnMethodsRule.java:40)
	at com.carrotsearch.randomizedtesting.rules.NoShadowingOrOverridesOnMethodsRule$1.evaluate(NoShadowingOrOverridesOnMethodsRule.java:40)
	at com.carrotsearch.randomizedtesting.rules.StatementAdapter.evaluate(StatementAdapter.java:36)
	at com.carrotsearch.randomizedtesting.rules.StatementAdapter.evaluate(StatementAdapter.java:36)
	at com.carrotsearch.randomizedtesting.rules.StatementAdapter.evaluate(StatementAdapter.java:36)
	at org.apache.lucene.util.TestRuleAssertionsRequired$1.evaluate(TestRuleAssertionsRequired.java:53)
	at org.apache.lucene.util.TestRuleMarkFailure$1.evaluate(TestRuleMarkFailure.java:47)
	at org.apache.lucene.util.TestRuleIgnoreAfterMaxFailures$1.evaluate(TestRuleIgnoreAfterMaxFailures.java:64)
	at org.apache.lucene.util.TestRuleIgnoreTestSuites$1.evaluate(TestRuleIgnoreTestSuites.java:54)
	at com.carrotsearch.randomizedtesting.rules.StatementAdapter.evaluate(StatementAdapter.java:36)
	at com.carrotsearch.randomizedtesting.ThreadLeakControl$StatementRunner.run(ThreadLeakControl.java:368)
	at java.lang.Thread.run(Thread.java:748)
Caused by: org.apache.solr.common.SolrException: Cannot use facet.mincount=0 on field number_p_i_mv_dv which is Points-based
	at org.apache.solr.request.NumericFacets.getCountsMultiValued(NumericFacets.java:425)
	at org.apache.solr.request.NumericFacets.getCounts(NumericFacets.java:168)
	at org.apache.solr.request.SimpleFacets.getTermCounts(SimpleFacets.java:499)
	at org.apache.solr.request.SimpleFacets.getTermCounts(SimpleFacets.java:405)
	at org.apache.solr.request.SimpleFacets.lambda$getFacetFieldCounts$0(SimpleFacets.java:803)
	at java.util.concurrent.FutureTask.run(FutureTask.java:266)
	at org.apache.solr.request.SimpleFacets$3.execute(SimpleFacets.java:742)
	at org.apache.solr.request.SimpleFacets.getFacetFieldCounts(SimpleFacets.java:818)
	at org.apache.solr.handler.component.FacetComponent.getFacetCounts(FacetComponent.java:329)
	at org.apache.solr.handler.component.FacetComponent.process(FacetComponent.java:273)
	at org.apache.solr.handler.component.SearchHandler.handleRequestBody(SearchHandler.java:295)
	at org.apache.solr.handler.RequestHandlerBase.handleRequest(RequestHandlerBase.java:177)
	at org.apache.solr.core.SolrCore.execute(SolrCore.java:2473)
	at org.apache.solr.util.TestHarness.query(TestHarness.java:337)
	at org.apache.solr.util.TestHarness.query(TestHarness.java:319)
	at org.apache.solr.SolrTestCaseJ4.assertQ(SolrTestCaseJ4.java:860)
	... 42 more


FAILED:  org.apache.solr.schema.TestPointFields.testDatePointFieldFacetField

Error Message:
Exception during query

Stack Trace:
java.lang.RuntimeException: Exception during query
	at __randomizedtesting.SeedInfo.seed([88A7C010FF146B44:961D74B1E13D9E2D]:0)
	at org.apache.solr.SolrTestCaseJ4.assertQ(SolrTestCaseJ4.java:886)
	at org.apache.solr.SolrTestCaseJ4.assertQ(SolrTestCaseJ4.java:846)
	at org.apache.solr.schema.TestPointFields.doTestPointFieldFacetField(TestPointFields.java:2407)
	at org.apache.solr.schema.TestPointFields.testDatePointFieldFacetField(TestPointFields.java:1700)
	at sun.reflect.NativeMethodAccessorImpl.invoke0(Native Method)
	at sun.reflect.NativeMethodAccessorImpl.invoke(NativeMethodAccessorImpl.java:62)
	at sun.reflect.DelegatingMethodAccessorImpl.invoke(DelegatingMethodAccessorImpl.java:43)
	at java.lang.reflect.Method.invoke(Method.java:498)
	at com.carrotsearch.randomizedtesting.RandomizedRunner.invoke(RandomizedRunner.java:1713)
	at com.carrotsearch.randomizedtesting.RandomizedRunner$8.evaluate(RandomizedRunner.java:907)
	at com.carrotsearch.randomizedtesting.RandomizedRunner$9.evaluate(RandomizedRunner.java:943)
	at com.carrotsearch.randomizedtesting.RandomizedRunner$10.evaluate(RandomizedRunner.java:957)
	at com.carrotsearch.randomizedtesting.rules.SystemPropertiesRestoreRule$1.evaluate(SystemPropertiesRestoreRule.java:57)
	at org.apache.lucene.util.TestRuleSetupTeardownChained$1.evaluate(TestRuleSetupTeardownChained.java:49)
	at org.apache.lucene.util.AbstractBeforeAfterRule$1.evaluate(AbstractBeforeAfterRule.java:45)
	at org.apache.lucene.util.TestRuleThreadAndTestName$1.evaluate(TestRuleThreadAndTestName.java:48)
	at org.apache.lucene.util.TestRuleIgnoreAfterMaxFailures$1.evaluate(TestRuleIgnoreAfterMaxFailures.java:64)
	at org.apache.lucene.util.TestRuleMarkFailure$1.evaluate(TestRuleMarkFailure.java:47)
	at com.carrotsearch.randomizedtesting.rules.StatementAdapter.evaluate(StatementAdapter.java:36)
	at com.carrotsearch.randomizedtesting.ThreadLeakControl$StatementRunner.run(ThreadLeakControl.java:368)
	at com.carrotsearch.randomizedtesting.ThreadLeakControl.forkTimeoutingTask(ThreadLeakControl.java:817)
	at com.carrotsearch.randomizedtesting.ThreadLeakControl$3.evaluate(ThreadLeakControl.java:468)
	at com.carrotsearch.randomizedtesting.RandomizedRunner.runSingleTest(RandomizedRunner.java:916)
	at com.carrotsearch.randomizedtesting.RandomizedRunner$5.evaluate(RandomizedRunner.java:802)
	at com.carrotsearch.randomizedtesting.RandomizedRunner$6.evaluate(RandomizedRunner.java:852)
	at com.carrotsearch.randomizedtesting.RandomizedRunner$7.evaluate(RandomizedRunner.java:863)
	at com.carrotsearch.randomizedtesting.rules.StatementAdapter.evaluate(StatementAdapter.java:36)
	at com.carrotsearch.randomizedtesting.rules.SystemPropertiesRestoreRule$1.evaluate(SystemPropertiesRestoreRule.java:57)
	at org.apache.lucene.util.AbstractBeforeAfterRule$1.evaluate(AbstractBeforeAfterRule.java:45)
	at com.carrotsearch.randomizedtesting.rules.StatementAdapter.evaluate(StatementAdapter.java:36)
	at org.apache.lucene.util.TestRuleStoreClassName$1.evaluate(TestRuleStoreClassName.java:41)
	at com.carrotsearch.randomizedtesting.rules.NoShadowingOrOverridesOnMethodsRule$1.evaluate(NoShadowingOrOverridesOnMethodsRule.java:40)
	at com.carrotsearch.randomizedtesting.rules.NoShadowingOrOverridesOnMethodsRule$1.evaluate(NoShadowingOrOverridesOnMethodsRule.java:40)
	at com.carrotsearch.randomizedtesting.rules.StatementAdapter.evaluate(StatementAdapter.java:36)
	at com.carrotsearch.randomizedtesting.rules.StatementAdapter.evaluate(StatementAdapter.java:36)
	at com.carrotsearch.randomizedtesting.rules.StatementAdapter.evaluate(StatementAdapter.java:36)
	at org.apache.lucene.util.TestRuleAssertionsRequired$1.evaluate(TestRuleAssertionsRequired.java:53)
	at org.apache.lucene.util.TestRuleMarkFailure$1.evaluate(TestRuleMarkFailure.java:47)
	at org.apache.lucene.util.TestRuleIgnoreAfterMaxFailures$1.evaluate(TestRuleIgnoreAfterMaxFailures.java:64)
	at org.apache.lucene.util.TestRuleIgnoreTestSuites$1.evaluate(TestRuleIgnoreTestSuites.java:54)
	at com.carrotsearch.randomizedtesting.rules.StatementAdapter.evaluate(StatementAdapter.java:36)
	at com.carrotsearch.randomizedtesting.ThreadLeakControl$StatementRunner.run(ThreadLeakControl.java:368)
	at java.lang.Thread.run(Thread.java:748)
Caused by: org.apache.solr.common.SolrException: Cannot use facet.mincount=0 on field number_p_dt_dv which is Points-based
	at org.apache.solr.request.NumericFacets.getCountsSingleValue(NumericFacets.java:184)
	at org.apache.solr.request.NumericFacets.getCounts(NumericFacets.java:170)
	at org.apache.solr.request.SimpleFacets.getTermCounts(SimpleFacets.java:499)
	at org.apache.solr.request.SimpleFacets.getTermCounts(SimpleFacets.java:405)
	at org.apache.solr.request.SimpleFacets.lambda$getFacetFieldCounts$0(SimpleFacets.java:803)
	at java.util.concurrent.FutureTask.run(FutureTask.java:266)
	at org.apache.solr.request.SimpleFacets$3.execute(SimpleFacets.java:742)
	at org.apache.solr.request.SimpleFacets.getFacetFieldCounts(SimpleFacets.java:818)
	at org.apache.solr.handler.component.FacetComponent.getFacetCounts(FacetComponent.java:329)
	at org.apache.solr.handler.component.FacetComponent.process(FacetComponent.java:273)
	at org.apache.solr.handler.component.SearchHandler.handleRequestBody(SearchHandler.java:295)
	at org.apache.solr.handler.RequestHandlerBase.handleRequest(RequestHandlerBase.java:177)
	at org.apache.solr.core.SolrCore.execute(SolrCore.java:2473)
	at org.apache.solr.util.TestHarness.query(TestHarness.java:337)
	at org.apache.solr.util.TestHarness.query(TestHarness.java:319)
	at org.apache.solr.SolrTestCaseJ4.assertQ(SolrTestCaseJ4.java:860)
	... 42 more


FAILED:  org.apache.solr.schema.TestPointFields.testDoublePointFieldMultiValuedFacetField

Error Message:
Exception during query

Stack Trace:
java.lang.RuntimeException: Exception during query
	at __randomizedtesting.SeedInfo.seed([88A7C010FF146B44:943A6C67A7F9F585]:0)
	at org.apache.solr.SolrTestCaseJ4.assertQ(SolrTestCaseJ4.java:886)
	at org.apache.solr.SolrTestCaseJ4.assertQ(SolrTestCaseJ4.java:846)
	at org.apache.solr.schema.TestPointFields.doTestPointFieldMultiValuedFacetField(TestPointFields.java:2749)
	at org.apache.solr.schema.TestPointFields.testDoublePointFieldMultiValuedFacetField(TestPointFields.java:719)
	at sun.reflect.NativeMethodAccessorImpl.invoke0(Native Method)
	at sun.reflect.NativeMethodAccessorImpl.invoke(NativeMethodAccessorImpl.java:62)
	at sun.reflect.DelegatingMethodAccessorImpl.invoke(DelegatingMethodAccessorImpl.java:43)
	at java.lang.reflect.Method.invoke(Method.java:498)
	at com.carrotsearch.randomizedtesting.RandomizedRunner.invoke(RandomizedRunner.java:1713)
	at com.carrotsearch.randomizedtesting.RandomizedRunner$8.evaluate(RandomizedRunner.java:907)
	at com.carrotsearch.randomizedtesting.RandomizedRunner$9.evaluate(RandomizedRunner.java:943)
	at com.carrotsearch.randomizedtesting.RandomizedRunner$10.evaluate(RandomizedRunner.java:957)
	at com.carrotsearch.randomizedtesting.rules.SystemPropertiesRestoreRule$1.evaluate(SystemPropertiesRestoreRule.java:57)
	at org.apache.lucene.util.TestRuleSetupTeardownChained$1.evaluate(TestRuleSetupTeardownChained.java:49)
	at org.apache.lucene.util.AbstractBeforeAfterRule$1.evaluate(AbstractBeforeAfterRule.java:45)
	at org.apache.lucene.util.TestRuleThreadAndTestName$1.evaluate(TestRuleThreadAndTestName.java:48)
	at org.apache.lucene.util.TestRuleIgnoreAfterMaxFailures$1.evaluate(TestRuleIgnoreAfterMaxFailures.java:64)
	at org.apache.lucene.util.TestRuleMarkFailure$1.evaluate(TestRuleMarkFailure.java:47)
	at com.carrotsearch.randomizedtesting.rules.StatementAdapter.evaluate(StatementAdapter.java:36)
	at com.carrotsearch.randomizedtesting.ThreadLeakControl$StatementRunner.run(ThreadLeakControl.java:368)
	at com.carrotsearch.randomizedtesting.ThreadLeakControl.forkTimeoutingTask(ThreadLeakControl.java:817)
	at com.carrotsearch.randomizedtesting.ThreadLeakControl$3.evaluate(ThreadLeakControl.java:468)
	at com.carrotsearch.randomizedtesting.RandomizedRunner.runSingleTest(RandomizedRunner.java:916)
	at com.carrotsearch.randomizedtesting.RandomizedRunner$5.evaluate(RandomizedRunner.java:802)
	at com.carrotsearch.randomizedtesting.RandomizedRunner$6.evaluate(RandomizedRunner.java:852)
	at com.carrotsearch.randomizedtesting.RandomizedRunner$7.evaluate(RandomizedRunner.java:863)
	at com.carrotsearch.randomizedtesting.rules.StatementAdapter.evaluate(StatementAdapter.java:36)
	at com.carrotsearch.randomizedtesting.rules.SystemPropertiesRestoreRule$1.evaluate(SystemPropertiesRestoreRule.java:57)
	at org.apache.lucene.util.AbstractBeforeAfterRule$1.evaluate(AbstractBeforeAfterRule.java:45)
	at com.carrotsearch.randomizedtesting.rules.StatementAdapter.evaluate(StatementAdapter.java:36)
	at org.apache.lucene.util.TestRuleStoreClassName$1.evaluate(TestRuleStoreClassName.java:41)
	at com.carrotsearch.randomizedtesting.rules.NoShadowingOrOverridesOnMethodsRule$1.evaluate(NoShadowingOrOverridesOnMethodsRule.java:40)
	at com.carrotsearch.randomizedtesting.rules.NoShadowingOrOverridesOnMethodsRule$1.evaluate(NoShadowingOrOverridesOnMethodsRule.java:40)
	at com.carrotsearch.randomizedtesting.rules.StatementAdapter.evaluate(StatementAdapter.java:36)
	at com.carrotsearch.randomizedtesting.rules.StatementAdapter.evaluate(StatementAdapter.java:36)
	at com.carrotsearch.randomizedtesting.rules.StatementAdapter.evaluate(StatementAdapter.java:36)
	at org.apache.lucene.util.TestRuleAssertionsRequired$1.evaluate(TestRuleAssertionsRequired.java:53)
	at org.apache.lucene.util.TestRuleMarkFailure$1.evaluate(TestRuleMarkFailure.java:47)
	at org.apache.lucene.util.TestRuleIgnoreAfterMaxFailures$1.evaluate(TestRuleIgnoreAfterMaxFailures.java:64)
	at org.apache.lucene.util.TestRuleIgnoreTestSuites$1.evaluate(TestRuleIgnoreTestSuites.java:54)
	at com.carrotsearch.randomizedtesting.rules.StatementAdapter.evaluate(StatementAdapter.java:36)
	at com.carrotsearch.randomizedtesting.ThreadLeakControl$StatementRunner.run(ThreadLeakControl.java:368)
	at java.lang.Thread.run(Thread.java:748)
Caused by: org.apache.solr.common.SolrException: Cannot use facet.mincount=0 on field number_p_d_mv_dv which is Points-based
	at org.apache.solr.request.NumericFacets.getCountsMultiValued(NumericFacets.java:425)
	at org.apache.solr.request.NumericFacets.getCounts(NumericFacets.java:168)
	at org.apache.solr.request.SimpleFacets.getTermCounts(SimpleFacets.java:499)
	at org.apache.solr.request.SimpleFacets.getTermCounts(SimpleFacets.java:405)
	at org.apache.solr.request.SimpleFacets.lambda$getFacetFieldCounts$0(SimpleFacets.java:803)
	at java.util.concurrent.FutureTask.run(FutureTask.java:266)
	at org.apache.solr.request.SimpleFacets$3.execute(SimpleFacets.java:742)
	at org.apache.solr.request.SimpleFacets.getFacetFieldCounts(SimpleFacets.java:818)
	at org.apache.solr.handler.component.FacetComponent.getFacetCounts(FacetComponent.java:329)
	at org.apache.solr.handler.component.FacetComponent.process(FacetComponent.java:273)
	at org.apache.solr.handler.component.SearchHandler.handleRequestBody(SearchHandler.java:295)
	at org.apache.solr.handler.RequestHandlerBase.handleRequest(RequestHandlerBase.java:177)
	at org.apache.solr.core.SolrCore.execute(SolrCore.java:2473)
	at org.apache.solr.util.TestHarness.query(TestHarness.java:337)
	at org.apache.solr.util.TestHarness.query(TestHarness.java:319)
	at org.apache.solr.SolrTestCaseJ4.assertQ(SolrTestCaseJ4.java:860)
	... 42 more


FAILED:  org.apache.solr.schema.TestPointFields.testFloatPointFieldMultiValuedFacetField

Error Message:
Exception during query

Stack Trace:
java.lang.RuntimeException: Exception during query
	at __randomizedtesting.SeedInfo.seed([88A7C010FF146B44:79830C7D9FD83495]:0)
	at org.apache.solr.SolrTestCaseJ4.assertQ(SolrTestCaseJ4.java:886)
	at org.apache.solr.SolrTestCaseJ4.assertQ(SolrTestCaseJ4.java:846)
	at org.apache.solr.schema.TestPointFields.doTestPointFieldMultiValuedFacetField(TestPointFields.java:2749)
	at org.apache.solr.schema.TestPointFields.testFloatPointFieldMultiValuedFacetField(TestPointFields.java:1217)
	at sun.reflect.NativeMethodAccessorImpl.invoke0(Native Method)
	at sun.reflect.NativeMethodAccessorImpl.invoke(NativeMethodAccessorImpl.java:62)
	at sun.reflect.DelegatingMethodAccessorImpl.invoke(DelegatingMethodAccessorImpl.java:43)
	at java.lang.reflect.Method.invoke(Method.java:498)
	at com.carrotsearch.randomizedtesting.RandomizedRunner.invoke(RandomizedRunner.java:1713)
	at com.carrotsearch.randomizedtesting.RandomizedRunner$8.evaluate(RandomizedRunner.java:907)
	at com.carrotsearch.randomizedtesting.RandomizedRunner$9.evaluate(RandomizedRunner.java:943)
	at com.carrotsearch.randomizedtesting.RandomizedRunner$10.evaluate(RandomizedRunner.java:957)
	at com.carrotsearch.randomizedtesting.rules.SystemPropertiesRestoreRule$1.evaluate(SystemPropertiesRestoreRule.java:57)
	at org.apache.lucene.util.TestRuleSetupTeardownChained$1.evaluate(TestRuleSetupTeardownChained.java:49)
	at org.apache.lucene.util.AbstractBeforeAfterRule$1.evaluate(AbstractBeforeAfterRule.java:45)
	at org.apache.lucene.util.TestRuleThreadAndTestName$1.evaluate(TestRuleThreadAndTestName.java:48)
	at org.apache.lucene.util.TestRuleIgnoreAfterMaxFailures$1.evaluate(TestRuleIgnoreAfterMaxFailures.java:64)
	at org.apache.lucene.util.TestRuleMarkFailure$1.evaluate(TestRuleMarkFailure.java:47)
	at com.carrotsearch.randomizedtesting.rules.StatementAdapter.evaluate(StatementAdapter.java:36)
	at com.carrotsearch.randomizedtesting.ThreadLeakControl$StatementRunner.run(ThreadLeakControl.java:368)
	at com.carrotsearch.randomizedtesting.ThreadLeakControl.forkTimeoutingTask(ThreadLeakControl.java:817)
	at com.carrotsearch.randomizedtesting.ThreadLeakControl$3.evaluate(ThreadLeakControl.java:468)
	at com.carrotsearch.randomizedtesting.RandomizedRunner.runSingleTest(RandomizedRunner.java:916)
	at com.carrotsearch.randomizedtesting.RandomizedRunner$5.evaluate(RandomizedRunner.java:802)
	at com.carrotsearch.randomizedtesting.RandomizedRunner$6.evaluate(RandomizedRunner.java:852)
	at com.carrotsearch.randomizedtesting.RandomizedRunner$7.evaluate(RandomizedRunner.java:863)
	at com.carrotsearch.randomizedtesting.rules.StatementAdapter.evaluate(StatementAdapter.java:36)
	at com.carrotsearch.randomizedtesting.rules.SystemPropertiesRestoreRule$1.evaluate(SystemPropertiesRestoreRule.java:57)
	at org.apache.lucene.util.AbstractBeforeAfterRule$1.evaluate(AbstractBeforeAfterRule.java:45)
	at com.carrotsearch.randomizedtesting.rules.StatementAdapter.evaluate(StatementAdapter.java:36)
	at org.apache.lucene.util.TestRuleStoreClassName$1.evaluate(TestRuleStoreClassName.java:41)
	at com.carrotsearch.randomizedtesting.rules.NoShadowingOrOverridesOnMethodsRule$1.evaluate(NoShadowingOrOverridesOnMethodsRule.java:40)
	at com.carrotsearch.randomizedtesting.rules.NoShadowingOrOverridesOnMethodsRule$1.evaluate(NoShadowingOrOverridesOnMethodsRule.java:40)
	at com.carrotsearch.randomizedtesting.rules.StatementAdapter.evaluate(StatementAdapter.java:36)
	at com.carrotsearch.randomizedtesting.rules.StatementAdapter.evaluate(StatementAdapter.java:36)
	at com.carrotsearch.randomizedtesting.rules.StatementAdapter.evaluate(StatementAdapter.java:36)
	at org.apache.lucene.util.TestRuleAssertionsRequired$1.evaluate(TestRuleAssertionsRequired.java:53)
	at org.apache.lucene.util.TestRuleMarkFailure$1.evaluate(TestRuleMarkFailure.java:47)
	at org.apache.lucene.util.TestRuleIgnoreAfterMaxFailures$1.evaluate(TestRuleIgnoreAfterMaxFailures.java:64)
	at org.apache.lucene.util.TestRuleIgnoreTestSuites$1.evaluate(TestRuleIgnoreTestSuites.java:54)
	at com.carrotsearch.randomizedtesting.rules.StatementAdapter.evaluate(StatementAdapter.java:36)
	at com.carrotsearch.randomizedtesting.ThreadLeakControl$StatementRunner.run(ThreadLeakControl.java:368)
	at java.lang.Thread.run(Thread.java:748)
Caused by: org.apache.solr.common.SolrException: Cannot use facet.mincount=0 on field number_p_f_mv_dv which is Points-based
	at org.apache.solr.request.NumericFacets.getCountsMultiValued(NumericFacets.java:425)
	at org.apache.solr.request.NumericFacets.getCounts(NumericFacets.java:168)
	at org.apache.solr.request.SimpleFacets.getTermCounts(SimpleFacets.java:499)
	at org.apache.solr.request.SimpleFacets.getTermCounts(SimpleFacets.java:405)
	at org.apache.solr.request.SimpleFacets.lambda$getFacetFieldCounts$0(SimpleFacets.java:803)
	at java.util.concurrent.FutureTask.run(FutureTask.java:266)
	at org.apache.solr.request.SimpleFacets$3.execute(SimpleFacets.java:742)
	at org.apache.solr.request.SimpleFacets.getFacetFieldCounts(SimpleFacets.java:818)
	at org.apache.solr.handler.component.FacetComponent.getFacetCounts(FacetComponent.java:329)
	at org.apache.solr.handler.component.FacetComponent.process(FacetComponent.java:273)
	at org.apache.solr.handler.component.SearchHandler.handleRequestBody(SearchHandler.java:295)
	at org.apache.solr.handler.RequestHandlerBase.handleRequest(RequestHandlerBase.java:177)
	at org.apache.solr.core.SolrCore.execute(SolrCore.java:2473)
	at org.apache.solr.util.TestHarness.query(TestHarness.java:337)
	at org.apache.solr.util.TestHarness.query(TestHarness.java:319)
	at org.apache.solr.SolrTestCaseJ4.assertQ(SolrTestCaseJ4.java:860)
	... 42 more


FAILED:  org.apache.solr.client.solrj.SolrExampleBinaryTest.testExampleConfig

Error Message:
Error from server at http://127.0.0.1:57898/solr/collection1: Cannot use facet.mincount=0 on field price which is Points-based

Stack Trace:
org.apache.solr.client.solrj.impl.HttpSolrClient$RemoteSolrException: Error from server at http://127.0.0.1:57898/solr/collection1: 

[...truncated too long message...]

tion1]  webapp=null path=/select params={q=*:*&facet.pivot={!key%3Dpivot_key+stats%3Ds1}features,manu,cat&facet=true&facet.limit=1&stats=true&stats.field={!key%3Dfoo_price+tag%3Ds1}price&stats.field={!tag%3Ds1}popularity&facet.mincount=0&rows=0} hits=12 status=0 QTime=0
   [junit4]   2> 122142 INFO  (TEST-SolrExampleEmbeddedTest.testPivotFacetsStats-seed#[659DE9E6359014E1]) [    ] o.a.s.c.S.Request [collection1]  webapp=null path=/select params={q=*:*&facet.pivot={!key%3Dpivot_key+stats%3Ds1}features,manu,cat,inStock&facet=true&facet.limit=1&stats=true&stats.field={!key%3Dfoo_price+tag%3Ds1}price&stats.field={!tag%3Ds1}popularity&facet.mincount=0&rows=0} hits=12 status=0 QTime=0
   [junit4]   2> 122142 INFO  (TEST-SolrExampleEmbeddedTest.testPivotFacetsStats-seed#[659DE9E6359014E1]) [    ] o.a.s.SolrTestCaseJ4 ###Ending testPivotFacetsStats
   [junit4]   2> 122143 INFO  (SUITE-SolrExampleEmbeddedTest-seed#[659DE9E6359014E1]-worker) [    ] o.a.s.SolrTestCaseJ4 ###deleteCore
   [junit4]   2> 122143 INFO  (SUITE-SolrExampleEmbeddedTest-seed#[659DE9E6359014E1]-worker) [    ] o.a.s.c.CoreContainer Shutting down CoreContainer instance=1292800296
   [junit4]   2> 122143 INFO  (SUITE-SolrExampleEmbeddedTest-seed#[659DE9E6359014E1]-worker) [    ] o.a.s.m.SolrMetricManager Closing metric reporters for registry=solr.node, tag=null
   [junit4]   2> 122147 INFO  (SUITE-SolrExampleEmbeddedTest-seed#[659DE9E6359014E1]-worker) [    ] o.a.s.m.SolrMetricManager Closing metric reporters for registry=solr.jvm, tag=null
   [junit4]   2> 122154 INFO  (SUITE-SolrExampleEmbeddedTest-seed#[659DE9E6359014E1]-worker) [    ] o.a.s.m.SolrMetricManager Closing metric reporters for registry=solr.jetty, tag=null
   [junit4]   2> 122154 INFO  (SUITE-SolrExampleEmbeddedTest-seed#[659DE9E6359014E1]-worker) [    ] o.a.s.c.TransientSolrCoreCacheDefault Allocating transient cache for 2147483647 transient cores
   [junit4]   2> 122155 INFO  (coreCloseExecutor-653-thread-1) [    x:collection1] o.a.s.c.SolrCore [collection1]  CLOSING SolrCore org.apache.solr.core.SolrCore@10f82de8
   [junit4]   2> 122156 INFO  (coreCloseExecutor-653-thread-1) [    x:collection1] o.a.s.u.LoggingInfoStream [IW][coreCloseExecutor-653-thread-1]: now flush at close
   [junit4]   2> 122156 INFO  (coreCloseExecutor-653-thread-1) [    x:collection1] o.a.s.u.LoggingInfoStream [IW][coreCloseExecutor-653-thread-1]:   start flush: applyAllDeletes=true
   [junit4]   2> 122156 INFO  (coreCloseExecutor-653-thread-1) [    x:collection1] o.a.s.u.LoggingInfoStream [IW][coreCloseExecutor-653-thread-1]:   index before flush _1c(7.1.0):C12
   [junit4]   2> 122156 INFO  (coreCloseExecutor-653-thread-1) [    x:collection1] o.a.s.u.LoggingInfoStream [DW][coreCloseExecutor-653-thread-1]: startFullFlush
   [junit4]   2> 122156 INFO  (coreCloseExecutor-653-thread-1) [    x:collection1] o.a.s.u.LoggingInfoStream [DW][coreCloseExecutor-653-thread-1]: coreCloseExecutor-653-thread-1 finishFullFlush success=true
   [junit4]   2> 122156 INFO  (coreCloseExecutor-653-thread-1) [    x:collection1] o.a.s.u.LoggingInfoStream [IW][coreCloseExecutor-653-thread-1]: now apply all deletes for all segments buffered updates bytesUsed=0 reader pool bytesUsed=0
   [junit4]   2> 122156 INFO  (coreCloseExecutor-653-thread-1) [    x:collection1] o.a.s.u.LoggingInfoStream [BD][coreCloseExecutor-653-thread-1]: waitApply: no deletes to apply
   [junit4]   2> 122156 INFO  (coreCloseExecutor-653-thread-1) [    x:collection1] o.a.s.u.LoggingInfoStream [MS][coreCloseExecutor-653-thread-1]: updateMergeThreads ioThrottle=true targetMBPerSec=10240.0 MB/sec
   [junit4]   2> 122156 INFO  (coreCloseExecutor-653-thread-1) [    x:collection1] o.a.s.u.LoggingInfoStream [MS][coreCloseExecutor-653-thread-1]: now merge
   [junit4]   2> 122156 INFO  (coreCloseExecutor-653-thread-1) [    x:collection1] o.a.s.u.LoggingInfoStream [MS][coreCloseExecutor-653-thread-1]:   index: _1c(7.1.0):C12
   [junit4]   2> 122156 INFO  (coreCloseExecutor-653-thread-1) [    x:collection1] o.a.s.u.LoggingInfoStream [MS][coreCloseExecutor-653-thread-1]:   no more merges pending; now return
   [junit4]   2> 122156 INFO  (coreCloseExecutor-653-thread-1) [    x:collection1] o.a.s.u.LoggingInfoStream [IW][coreCloseExecutor-653-thread-1]: waitForMerges
   [junit4]   2> 122156 INFO  (coreCloseExecutor-653-thread-1) [    x:collection1] o.a.s.u.LoggingInfoStream [IW][coreCloseExecutor-653-thread-1]: waitForMerges done
   [junit4]   2> 122156 INFO  (coreCloseExecutor-653-thread-1) [    x:collection1] o.a.s.u.LoggingInfoStream [IW][coreCloseExecutor-653-thread-1]: commit: start
   [junit4]   2> 122156 INFO  (coreCloseExecutor-653-thread-1) [    x:collection1] o.a.s.u.LoggingInfoStream [IW][coreCloseExecutor-653-thread-1]: commit: enter lock
   [junit4]   2> 122156 INFO  (coreCloseExecutor-653-thread-1) [    x:collection1] o.a.s.u.LoggingInfoStream [IW][coreCloseExecutor-653-thread-1]: commit: now prepare
   [junit4]   2> 122156 INFO  (coreCloseExecutor-653-thread-1) [    x:collection1] o.a.s.u.LoggingInfoStream [IW][coreCloseExecutor-653-thread-1]: prepareCommit: flush
   [junit4]   2> 122156 INFO  (coreCloseExecutor-653-thread-1) [    x:collection1] o.a.s.u.LoggingInfoStream [IW][coreCloseExecutor-653-thread-1]:   index before flush _1c(7.1.0):C12
   [junit4]   2> 122156 INFO  (coreCloseExecutor-653-thread-1) [    x:collection1] o.a.s.u.LoggingInfoStream [DW][coreCloseExecutor-653-thread-1]: startFullFlush
   [junit4]   2> 122157 INFO  (coreCloseExecutor-653-thread-1) [    x:collection1] o.a.s.u.LoggingInfoStream [IW][coreCloseExecutor-653-thread-1]: now apply all deletes for all segments buffered updates bytesUsed=0 reader pool bytesUsed=0
   [junit4]   2> 122157 INFO  (coreCloseExecutor-653-thread-1) [    x:collection1] o.a.s.u.LoggingInfoStream [BD][coreCloseExecutor-653-thread-1]: waitApply: no deletes to apply
   [junit4]   2> 122157 INFO  (coreCloseExecutor-653-thread-1) [    x:collection1] o.a.s.u.LoggingInfoStream [DW][coreCloseExecutor-653-thread-1]: coreCloseExecutor-653-thread-1 finishFullFlush success=true
   [junit4]   2> 122157 INFO  (coreCloseExecutor-653-thread-1) [    x:collection1] o.a.s.u.LoggingInfoStream [IW][coreCloseExecutor-653-thread-1]: startCommit(): start
   [junit4]   2> 122157 INFO  (coreCloseExecutor-653-thread-1) [    x:collection1] o.a.s.u.LoggingInfoStream [IW][coreCloseExecutor-653-thread-1]:   skip startCommit(): no changes pending
   [junit4]   2> 122157 INFO  (coreCloseExecutor-653-thread-1) [    x:collection1] o.a.s.u.LoggingInfoStream [IW][coreCloseExecutor-653-thread-1]: commit: pendingCommit == null; skip
   [junit4]   2> 122157 INFO  (coreCloseExecutor-653-thread-1) [    x:collection1] o.a.s.u.LoggingInfoStream [IW][coreCloseExecutor-653-thread-1]: commit: took 0.2 msec
   [junit4]   2> 122157 INFO  (coreCloseExecutor-653-thread-1) [    x:collection1] o.a.s.u.LoggingInfoStream [IW][coreCloseExecutor-653-thread-1]: commit: done
   [junit4]   2> 122157 INFO  (coreCloseExecutor-653-thread-1) [    x:collection1] o.a.s.u.LoggingInfoStream [IW][coreCloseExecutor-653-thread-1]: rollback
   [junit4]   2> 122157 INFO  (coreCloseExecutor-653-thread-1) [    x:collection1] o.a.s.u.LoggingInfoStream [IW][coreCloseExecutor-653-thread-1]: all running merges have aborted
   [junit4]   2> 122157 INFO  (coreCloseExecutor-653-thread-1) [    x:collection1] o.a.s.u.LoggingInfoStream [IW][coreCloseExecutor-653-thread-1]: rollback: done finish merges
   [junit4]   2> 122157 INFO  (coreCloseExecutor-653-thread-1) [    x:collection1] o.a.s.u.LoggingInfoStream [DW][coreCloseExecutor-653-thread-1]: abort
   [junit4]   2> 122157 INFO  (coreCloseExecutor-653-thread-1) [    x:collection1] o.a.s.u.LoggingInfoStream [DW][coreCloseExecutor-653-thread-1]: done abort success=true
   [junit4]   2> 122157 INFO  (coreCloseExecutor-653-thread-1) [    x:collection1] o.a.s.u.LoggingInfoStream [IW][coreCloseExecutor-653-thread-1]: rollback: infos=_1c(7.1.0):C12
   [junit4]   2> 122157 INFO  (coreCloseExecutor-653-thread-1) [    x:collection1] o.a.s.u.LoggingInfoStream [IFD][coreCloseExecutor-653-thread-1]: now checkpoint "_1c(7.1.0):C12" [1 segments ; isCommit = false]
   [junit4]   2> 122157 INFO  (coreCloseExecutor-653-thread-1) [    x:collection1] o.a.s.u.LoggingInfoStream [IFD][coreCloseExecutor-653-thread-1]: 0 msec to checkpoint
   [junit4]   2> 122162 INFO  (coreCloseExecutor-653-thread-1) [    x:collection1] o.a.s.m.SolrMetricManager Closing metric reporters for registry=solr.core.collection1, tag=284700136
   [junit4]   2> NOTE: leaving temporary files on disk at: /Users/jenkins/workspace/Lucene-Solr-7.x-MacOSX/solr/build/solr-solrj/test/J1/temp/solr.client.solrj.embedded.SolrExampleEmbeddedTest_659DE9E6359014E1-001
   [junit4]   2> NOTE: test params are: codec=Asserting(Lucene70), sim=RandomSimilarity(queryNorm=true): {}, locale=mk, timezone=PST
   [junit4]   2> NOTE: Mac OS X 10.11.6 x86_64/Oracle Corporation 1.8.0_141 (64-bit)/cpus=3,threads=1,free=35634760,total=183246848
   [junit4]   2> NOTE: All tests run in this JVM: [SolrParamTest, AddEvaluatorTest, SchemaTest, TestRetryUtil, TestToleratedUpdateError, RoundEvaluatorTest, LargeVolumeEmbeddedTest, AnlysisResponseBaseTest, TangentEvaluatorTest, NoOpResponseParserTest, SolrQueryTest, ShardParamsTest, ConcatOperationTest, FloorEvaluatorTest, TestNamedListCodec, JdbcTest, TestCloudSolrClientConnections, CosineEvaluatorTest, TestFastInputStream, HttpSolrClientSSLAuthConPoolTest, CloudSolrClientMultiConstructorTest, SelectWithEvaluatorsTest, ArcTangentEvaluatorTest, SolrExampleBinaryTest, CompoundEvaluatorTest, SolrExampleStreamingBinaryTest, SquareRootEvaluatorTest, TestDelegationTokenResponse, ArcCosineEvaluatorTest, ContentStreamTest, StreamingTest, LessThanEvaluatorTest, GreaterThanEvaluatorTest, SolrExampleStreamingTest, SolrExampleXMLTest, SolrExampleJettyTest, SolrExampleEmbeddedTest]
   [junit4] Completed [54/135 (6!)] on J1 in 4.54s, 35 tests, 1 error <<< FAILURES!

[...truncated 42770 lines...]

Mime
View raw message