lucene-dev mailing list archives

Site index · List index
Message view « Date » · « Thread »
Top « Date » · « Thread »
From Policeman Jenkins Server <jenk...@thetaphi.de>
Subject [JENKINS] Lucene-Solr-master-Linux (64bit/jdk1.8.0_141) - Build # 20237 - Still Unstable!
Date Tue, 01 Aug 2017 04:42:55 GMT
Build: https://jenkins.thetaphi.de/job/Lucene-Solr-master-Linux/20237/
Java: 64bit/jdk1.8.0_141 -XX:+UseCompressedOops -XX:+UseParallelGC

24 tests failed.
FAILED:  org.apache.solr.cloud.TestAuthenticationFramework.testBasics

Error Message:
Error from server at https://127.0.0.1:44601/solr/testcollection_shard1_replica_n3: Expected mime type application/octet-stream but got text/html. <html> <head> <meta http-equiv="Content-Type" content="text/html;charset=ISO-8859-1"/> <title>Error 404 </title> </head> <body> <h2>HTTP ERROR: 404</h2> <p>Problem accessing /solr/testcollection_shard1_replica_n3/update. Reason: <pre>    Can not find: /solr/testcollection_shard1_replica_n3/update</pre></p> <hr /><a href="http://eclipse.org/jetty">Powered by Jetty:// 9.3.14.v20161028</a><hr/> </body> </html> 

Stack Trace:
org.apache.solr.client.solrj.impl.CloudSolrClient$RouteException: Error from server at https://127.0.0.1:44601/solr/testcollection_shard1_replica_n3: Expected mime type application/octet-stream but got text/html. <html>
<head>
<meta http-equiv="Content-Type" content="text/html;charset=ISO-8859-1"/>
<title>Error 404 </title>
</head>
<body>
<h2>HTTP ERROR: 404</h2>
<p>Problem accessing /solr/testcollection_shard1_replica_n3/update. Reason:
<pre>    Can not find: /solr/testcollection_shard1_replica_n3/update</pre></p>
<hr /><a href="http://eclipse.org/jetty">Powered by Jetty:// 9.3.14.v20161028</a><hr/>
</body>
</html>

	at __randomizedtesting.SeedInfo.seed([60E068C6B3D869D9:5D38C6EA8B3637A9]:0)
	at org.apache.solr.client.solrj.impl.CloudSolrClient.directUpdate(CloudSolrClient.java:539)
	at org.apache.solr.client.solrj.impl.CloudSolrClient.sendRequest(CloudSolrClient.java:993)
	at org.apache.solr.client.solrj.impl.CloudSolrClient.requestWithRetryOnStaleState(CloudSolrClient.java:862)
	at org.apache.solr.client.solrj.impl.CloudSolrClient.request(CloudSolrClient.java:793)
	at org.apache.solr.client.solrj.SolrRequest.process(SolrRequest.java:178)
	at org.apache.solr.client.solrj.request.UpdateRequest.commit(UpdateRequest.java:233)
	at org.apache.solr.cloud.TestAuthenticationFramework.collectionCreateSearchDeleteTwice(TestAuthenticationFramework.java:126)
	at org.apache.solr.cloud.TestAuthenticationFramework.testBasics(TestAuthenticationFramework.java:74)
	at sun.reflect.NativeMethodAccessorImpl.invoke0(Native Method)
	at sun.reflect.NativeMethodAccessorImpl.invoke(NativeMethodAccessorImpl.java:62)
	at sun.reflect.DelegatingMethodAccessorImpl.invoke(DelegatingMethodAccessorImpl.java:43)
	at java.lang.reflect.Method.invoke(Method.java:498)
	at com.carrotsearch.randomizedtesting.RandomizedRunner.invoke(RandomizedRunner.java:1713)
	at com.carrotsearch.randomizedtesting.RandomizedRunner$8.evaluate(RandomizedRunner.java:907)
	at com.carrotsearch.randomizedtesting.RandomizedRunner$9.evaluate(RandomizedRunner.java:943)
	at com.carrotsearch.randomizedtesting.RandomizedRunner$10.evaluate(RandomizedRunner.java:957)
	at com.carrotsearch.randomizedtesting.rules.SystemPropertiesRestoreRule$1.evaluate(SystemPropertiesRestoreRule.java:57)
	at org.apache.lucene.util.TestRuleSetupTeardownChained$1.evaluate(TestRuleSetupTeardownChained.java:49)
	at org.apache.lucene.util.AbstractBeforeAfterRule$1.evaluate(AbstractBeforeAfterRule.java:45)
	at org.apache.lucene.util.TestRuleThreadAndTestName$1.evaluate(TestRuleThreadAndTestName.java:48)
	at org.apache.lucene.util.TestRuleIgnoreAfterMaxFailures$1.evaluate(TestRuleIgnoreAfterMaxFailures.java:64)
	at org.apache.lucene.util.TestRuleMarkFailure$1.evaluate(TestRuleMarkFailure.java:47)
	at com.carrotsearch.randomizedtesting.rules.StatementAdapter.evaluate(StatementAdapter.java:36)
	at com.carrotsearch.randomizedtesting.ThreadLeakControl$StatementRunner.run(ThreadLeakControl.java:368)
	at com.carrotsearch.randomizedtesting.ThreadLeakControl.forkTimeoutingTask(ThreadLeakControl.java:817)
	at com.carrotsearch.randomizedtesting.ThreadLeakControl$3.evaluate(ThreadLeakControl.java:468)
	at com.carrotsearch.randomizedtesting.RandomizedRunner.runSingleTest(RandomizedRunner.java:916)
	at com.carrotsearch.randomizedtesting.RandomizedRunner$5.evaluate(RandomizedRunner.java:802)
	at com.carrotsearch.randomizedtesting.RandomizedRunner$6.evaluate(RandomizedRunner.java:852)
	at com.carrotsearch.randomizedtesting.RandomizedRunner$7.evaluate(RandomizedRunner.java:863)
	at com.carrotsearch.randomizedtesting.rules.StatementAdapter.evaluate(StatementAdapter.java:36)
	at com.carrotsearch.randomizedtesting.rules.SystemPropertiesRestoreRule$1.evaluate(SystemPropertiesRestoreRule.java:57)
	at org.apache.lucene.util.AbstractBeforeAfterRule$1.evaluate(AbstractBeforeAfterRule.java:45)
	at com.carrotsearch.randomizedtesting.rules.StatementAdapter.evaluate(StatementAdapter.java:36)
	at org.apache.lucene.util.TestRuleStoreClassName$1.evaluate(TestRuleStoreClassName.java:41)
	at com.carrotsearch.randomizedtesting.rules.NoShadowingOrOverridesOnMethodsRule$1.evaluate(NoShadowingOrOverridesOnMethodsRule.java:40)
	at com.carrotsearch.randomizedtesting.rules.NoShadowingOrOverridesOnMethodsRule$1.evaluate(NoShadowingOrOverridesOnMethodsRule.java:40)
	at com.carrotsearch.randomizedtesting.rules.StatementAdapter.evaluate(StatementAdapter.java:36)
	at com.carrotsearch.randomizedtesting.rules.StatementAdapter.evaluate(StatementAdapter.java:36)
	at com.carrotsearch.randomizedtesting.rules.StatementAdapter.evaluate(StatementAdapter.java:36)
	at org.apache.lucene.util.TestRuleAssertionsRequired$1.evaluate(TestRuleAssertionsRequired.java:53)
	at org.apache.lucene.util.TestRuleMarkFailure$1.evaluate(TestRuleMarkFailure.java:47)
	at org.apache.lucene.util.TestRuleIgnoreAfterMaxFailures$1.evaluate(TestRuleIgnoreAfterMaxFailures.java:64)
	at org.apache.lucene.util.TestRuleIgnoreTestSuites$1.evaluate(TestRuleIgnoreTestSuites.java:54)
	at com.carrotsearch.randomizedtesting.rules.StatementAdapter.evaluate(StatementAdapter.java:36)
	at com.carrotsearch.randomizedtesting.ThreadLeakControl$StatementRunner.run(ThreadLeakControl.java:368)
	at java.lang.Thread.run(Thread.java:748)
Caused by: org.apache.solr.client.solrj.impl.HttpSolrClient$RemoteSolrException: Error from server at https://127.0.0.1:44601/solr/testcollection_shard1_replica_n3: Expected mime type application/octet-stream but got text/html. <html>
<head>
<meta http-equiv="Content-Type" content="text/html;charset=ISO-8859-1"/>
<title>Error 404 </title>
</head>
<body>
<h2>HTTP ERROR: 404</h2>
<p>Problem accessing /solr/testcollection_shard1_replica_n3/update. Reason:
<pre>    Can not find: /solr/testcollection_shard1_replica_n3/update</pre></p>
<hr /><a href="http://eclipse.org/jetty">Powered by Jetty:// 9.3.14.v20161028</a><hr/>
</body>
</html>

	at org.apache.solr.client.solrj.impl.HttpSolrClient.executeMethod(HttpSolrClient.java:588)
	at org.apache.solr.client.solrj.impl.HttpSolrClient.request(HttpSolrClient.java:252)
	at org.apache.solr.client.solrj.impl.HttpSolrClient.request(HttpSolrClient.java:241)
	at org.apache.solr.client.solrj.impl.LBHttpSolrClient.doRequest(LBHttpSolrClient.java:483)
	at org.apache.solr.client.solrj.impl.LBHttpSolrClient.request(LBHttpSolrClient.java:413)
	at org.apache.solr.client.solrj.impl.CloudSolrClient.lambda$directUpdate$0(CloudSolrClient.java:516)
	at java.util.concurrent.FutureTask.run(FutureTask.java:266)
	at org.apache.solr.common.util.ExecutorUtil$MDCAwareThreadPoolExecutor.lambda$execute$0(ExecutorUtil.java:188)
	at java.util.concurrent.ThreadPoolExecutor.runWorker(ThreadPoolExecutor.java:1149)
	at java.util.concurrent.ThreadPoolExecutor$Worker.run(ThreadPoolExecutor.java:624)
	... 1 more


FAILED:  org.apache.solr.handler.component.DistributedFacetPivotLargeTest.test

Error Message:
Error from server at https://127.0.0.1:46465/x_s/k/collection1: Error from server at https://127.0.0.1:44349/x_s/k/collection1: Cannot use facet.mincount=0 on field hiredate_dt which is Points-based

Stack Trace:
org.apache.solr.client.solrj.impl.HttpSolrClient$RemoteSolrException: Error from server at https://127.0.0.1:46465/x_s/k/collection1: Error from server at https://127.0.0.1:44349/x_s/k/collection1: Cannot use facet.mincount=0 on field hiredate_dt which is Points-based
	at __randomizedtesting.SeedInfo.seed([60E068C6B3D869D9:E8B4571C1D240421]:0)
	at org.apache.solr.client.solrj.impl.HttpSolrClient.executeMethod(HttpSolrClient.java:626)
	at org.apache.solr.client.solrj.impl.HttpSolrClient.request(HttpSolrClient.java:252)
	at org.apache.solr.client.solrj.impl.HttpSolrClient.request(HttpSolrClient.java:241)
	at org.apache.solr.client.solrj.SolrRequest.process(SolrRequest.java:178)
	at org.apache.solr.client.solrj.SolrClient.query(SolrClient.java:942)
	at org.apache.solr.client.solrj.SolrClient.query(SolrClient.java:957)
	at org.apache.solr.BaseDistributedSearchTestCase.queryServer(BaseDistributedSearchTestCase.java:557)
	at org.apache.solr.BaseDistributedSearchTestCase.query(BaseDistributedSearchTestCase.java:605)
	at org.apache.solr.BaseDistributedSearchTestCase.query(BaseDistributedSearchTestCase.java:587)
	at org.apache.solr.BaseDistributedSearchTestCase.query(BaseDistributedSearchTestCase.java:566)
	at org.apache.solr.handler.component.DistributedFacetPivotLargeTest.test(DistributedFacetPivotLargeTest.java:430)
	at sun.reflect.NativeMethodAccessorImpl.invoke0(Native Method)
	at sun.reflect.NativeMethodAccessorImpl.invoke(NativeMethodAccessorImpl.java:62)
	at sun.reflect.DelegatingMethodAccessorImpl.invoke(DelegatingMethodAccessorImpl.java:43)
	at java.lang.reflect.Method.invoke(Method.java:498)
	at com.carrotsearch.randomizedtesting.RandomizedRunner.invoke(RandomizedRunner.java:1713)
	at com.carrotsearch.randomizedtesting.RandomizedRunner$8.evaluate(RandomizedRunner.java:907)
	at com.carrotsearch.randomizedtesting.RandomizedRunner$9.evaluate(RandomizedRunner.java:943)
	at com.carrotsearch.randomizedtesting.RandomizedRunner$10.evaluate(RandomizedRunner.java:957)
	at org.apache.solr.BaseDistributedSearchTestCase$ShardsRepeatRule$ShardsFixedStatement.callStatement(BaseDistributedSearchTestCase.java:985)
	at org.apache.solr.BaseDistributedSearchTestCase$ShardsRepeatRule$ShardsStatement.evaluate(BaseDistributedSearchTestCase.java:960)
	at com.carrotsearch.randomizedtesting.rules.SystemPropertiesRestoreRule$1.evaluate(SystemPropertiesRestoreRule.java:57)
	at org.apache.lucene.util.TestRuleSetupTeardownChained$1.evaluate(TestRuleSetupTeardownChained.java:49)
	at org.apache.lucene.util.AbstractBeforeAfterRule$1.evaluate(AbstractBeforeAfterRule.java:45)
	at org.apache.lucene.util.TestRuleThreadAndTestName$1.evaluate(TestRuleThreadAndTestName.java:48)
	at org.apache.lucene.util.TestRuleIgnoreAfterMaxFailures$1.evaluate(TestRuleIgnoreAfterMaxFailures.java:64)
	at org.apache.lucene.util.TestRuleMarkFailure$1.evaluate(TestRuleMarkFailure.java:47)
	at com.carrotsearch.randomizedtesting.rules.StatementAdapter.evaluate(StatementAdapter.java:36)
	at com.carrotsearch.randomizedtesting.ThreadLeakControl$StatementRunner.run(ThreadLeakControl.java:368)
	at com.carrotsearch.randomizedtesting.ThreadLeakControl.forkTimeoutingTask(ThreadLeakControl.java:817)
	at com.carrotsearch.randomizedtesting.ThreadLeakControl$3.evaluate(ThreadLeakControl.java:468)
	at com.carrotsearch.randomizedtesting.RandomizedRunner.runSingleTest(RandomizedRunner.java:916)
	at com.carrotsearch.randomizedtesting.RandomizedRunner$5.evaluate(RandomizedRunner.java:802)
	at com.carrotsearch.randomizedtesting.RandomizedRunner$6.evaluate(RandomizedRunner.java:852)
	at com.carrotsearch.randomizedtesting.RandomizedRunner$7.evaluate(RandomizedRunner.java:863)
	at com.carrotsearch.randomizedtesting.rules.StatementAdapter.evaluate(StatementAdapter.java:36)
	at com.carrotsearch.randomizedtesting.rules.SystemPropertiesRestoreRule$1.evaluate(SystemPropertiesRestoreRule.java:57)
	at org.apache.lucene.util.AbstractBeforeAfterRule$1.evaluate(AbstractBeforeAfterRule.java:45)
	at com.carrotsearch.randomizedtesting.rules.StatementAdapter.evaluate(StatementAdapter.java:36)
	at org.apache.lucene.util.TestRuleStoreClassName$1.evaluate(TestRuleStoreClassName.java:41)
	at com.carrotsearch.randomizedtesting.rules.NoShadowingOrOverridesOnMethodsRule$1.evaluate(NoShadowingOrOverridesOnMethodsRule.java:40)
	at com.carrotsearch.randomizedtesting.rules.NoShadowingOrOverridesOnMethodsRule$1.evaluate(NoShadowingOrOverridesOnMethodsRule.java:40)
	at com.carrotsearch.randomizedtesting.rules.StatementAdapter.evaluate(StatementAdapter.java:36)
	at com.carrotsearch.randomizedtesting.rules.StatementAdapter.evaluate(StatementAdapter.java:36)
	at com.carrotsearch.randomizedtesting.rules.StatementAdapter.evaluate(StatementAdapter.java:36)
	at org.apache.lucene.util.TestRuleAssertionsRequired$1.evaluate(TestRuleAssertionsRequired.java:53)
	at org.apache.lucene.util.TestRuleMarkFailure$1.evaluate(TestRuleMarkFailure.java:47)
	at org.apache.lucene.util.TestRuleIgnoreAfterMaxFailures$1.evaluate(TestRuleIgnoreAfterMaxFailures.java:64)
	at org.apache.lucene.util.TestRuleIgnoreTestSuites$1.evaluate(TestRuleIgnoreTestSuites.java:54)
	at com.carrotsearch.randomizedtesting.rules.StatementAdapter.evaluate(StatementAdapter.java:36)
	at com.carrotsearch.randomizedtesting.ThreadLeakControl$StatementRunner.run(ThreadLeakControl.java:368)
	at java.lang.Thread.run(Thread.java:748)


FAILED:  org.apache.solr.request.TestWriterPerf.testPerf

Error Message:
Cannot use facet.mincount=0 on field f_i which is Points-based

Stack Trace:
org.apache.solr.common.SolrException: Cannot use facet.mincount=0 on field f_i which is Points-based
	at __randomizedtesting.SeedInfo.seed([60E068C6B3D869D9:41D78941DB5642E8]:0)
	at org.apache.solr.request.NumericFacets.getCountsSingleValue(NumericFacets.java:184)
	at org.apache.solr.request.NumericFacets.getCounts(NumericFacets.java:170)
	at org.apache.solr.request.SimpleFacets.getTermCounts(SimpleFacets.java:499)
	at org.apache.solr.request.SimpleFacets.getTermCounts(SimpleFacets.java:405)
	at org.apache.solr.request.SimpleFacets.lambda$getFacetFieldCounts$0(SimpleFacets.java:803)
	at java.util.concurrent.FutureTask.run(FutureTask.java:266)
	at org.apache.solr.request.SimpleFacets$3.execute(SimpleFacets.java:742)
	at org.apache.solr.request.SimpleFacets.getFacetFieldCounts(SimpleFacets.java:818)
	at org.apache.solr.handler.component.FacetComponent.getFacetCounts(FacetComponent.java:329)
	at org.apache.solr.handler.component.FacetComponent.process(FacetComponent.java:273)
	at org.apache.solr.handler.component.SearchHandler.handleRequestBody(SearchHandler.java:295)
	at org.apache.solr.handler.RequestHandlerBase.handleRequest(RequestHandlerBase.java:177)
	at org.apache.solr.core.SolrCore.execute(SolrCore.java:2473)
	at org.apache.solr.request.TestWriterPerf.getResponse(TestWriterPerf.java:98)
	at org.apache.solr.request.TestWriterPerf.doPerf(TestWriterPerf.java:107)
	at org.apache.solr.request.TestWriterPerf.testPerf(TestWriterPerf.java:180)
	at sun.reflect.NativeMethodAccessorImpl.invoke0(Native Method)
	at sun.reflect.NativeMethodAccessorImpl.invoke(NativeMethodAccessorImpl.java:62)
	at sun.reflect.DelegatingMethodAccessorImpl.invoke(DelegatingMethodAccessorImpl.java:43)
	at java.lang.reflect.Method.invoke(Method.java:498)
	at com.carrotsearch.randomizedtesting.RandomizedRunner.invoke(RandomizedRunner.java:1713)
	at com.carrotsearch.randomizedtesting.RandomizedRunner$8.evaluate(RandomizedRunner.java:907)
	at com.carrotsearch.randomizedtesting.RandomizedRunner$9.evaluate(RandomizedRunner.java:943)
	at com.carrotsearch.randomizedtesting.RandomizedRunner$10.evaluate(RandomizedRunner.java:957)
	at com.carrotsearch.randomizedtesting.rules.SystemPropertiesRestoreRule$1.evaluate(SystemPropertiesRestoreRule.java:57)
	at org.apache.lucene.util.TestRuleSetupTeardownChained$1.evaluate(TestRuleSetupTeardownChained.java:49)
	at org.apache.lucene.util.AbstractBeforeAfterRule$1.evaluate(AbstractBeforeAfterRule.java:45)
	at org.apache.lucene.util.TestRuleThreadAndTestName$1.evaluate(TestRuleThreadAndTestName.java:48)
	at org.apache.lucene.util.TestRuleIgnoreAfterMaxFailures$1.evaluate(TestRuleIgnoreAfterMaxFailures.java:64)
	at org.apache.lucene.util.TestRuleMarkFailure$1.evaluate(TestRuleMarkFailure.java:47)
	at com.carrotsearch.randomizedtesting.rules.StatementAdapter.evaluate(StatementAdapter.java:36)
	at com.carrotsearch.randomizedtesting.ThreadLeakControl$StatementRunner.run(ThreadLeakControl.java:368)
	at com.carrotsearch.randomizedtesting.ThreadLeakControl.forkTimeoutingTask(ThreadLeakControl.java:817)
	at com.carrotsearch.randomizedtesting.ThreadLeakControl$3.evaluate(ThreadLeakControl.java:468)
	at com.carrotsearch.randomizedtesting.RandomizedRunner.runSingleTest(RandomizedRunner.java:916)
	at com.carrotsearch.randomizedtesting.RandomizedRunner$5.evaluate(RandomizedRunner.java:802)
	at com.carrotsearch.randomizedtesting.RandomizedRunner$6.evaluate(RandomizedRunner.java:852)
	at com.carrotsearch.randomizedtesting.RandomizedRunner$7.evaluate(RandomizedRunner.java:863)
	at com.carrotsearch.randomizedtesting.rules.StatementAdapter.evaluate(StatementAdapter.java:36)
	at com.carrotsearch.randomizedtesting.rules.SystemPropertiesRestoreRule$1.evaluate(SystemPropertiesRestoreRule.java:57)
	at org.apache.lucene.util.AbstractBeforeAfterRule$1.evaluate(AbstractBeforeAfterRule.java:45)
	at com.carrotsearch.randomizedtesting.rules.StatementAdapter.evaluate(StatementAdapter.java:36)
	at org.apache.lucene.util.TestRuleStoreClassName$1.evaluate(TestRuleStoreClassName.java:41)
	at com.carrotsearch.randomizedtesting.rules.NoShadowingOrOverridesOnMethodsRule$1.evaluate(NoShadowingOrOverridesOnMethodsRule.java:40)
	at com.carrotsearch.randomizedtesting.rules.NoShadowingOrOverridesOnMethodsRule$1.evaluate(NoShadowingOrOverridesOnMethodsRule.java:40)
	at com.carrotsearch.randomizedtesting.rules.StatementAdapter.evaluate(StatementAdapter.java:36)
	at com.carrotsearch.randomizedtesting.rules.StatementAdapter.evaluate(StatementAdapter.java:36)
	at com.carrotsearch.randomizedtesting.rules.StatementAdapter.evaluate(StatementAdapter.java:36)
	at org.apache.lucene.util.TestRuleAssertionsRequired$1.evaluate(TestRuleAssertionsRequired.java:53)
	at org.apache.lucene.util.TestRuleMarkFailure$1.evaluate(TestRuleMarkFailure.java:47)
	at org.apache.lucene.util.TestRuleIgnoreAfterMaxFailures$1.evaluate(TestRuleIgnoreAfterMaxFailures.java:64)
	at org.apache.lucene.util.TestRuleIgnoreTestSuites$1.evaluate(TestRuleIgnoreTestSuites.java:54)
	at com.carrotsearch.randomizedtesting.rules.StatementAdapter.evaluate(StatementAdapter.java:36)
	at com.carrotsearch.randomizedtesting.ThreadLeakControl$StatementRunner.run(ThreadLeakControl.java:368)
	at java.lang.Thread.run(Thread.java:748)


FAILED:  org.apache.solr.TestDistributedSearch.test

Error Message:
Error from server at http://127.0.0.1:33881//collection1: Cannot use facet.mincount=0 on field a_n_tdt which is Points-based

Stack Trace:
org.apache.solr.client.solrj.impl.HttpSolrClient$RemoteSolrException: Error from server at http://127.0.0.1:33881//collection1: Cannot use facet.mincount=0 on field a_n_tdt which is Points-based
	at __randomizedtesting.SeedInfo.seed([60E068C6B3D869D9:E8B4571C1D240421]:0)
	at org.apache.solr.client.solrj.impl.HttpSolrClient.executeMethod(HttpSolrClient.java:626)
	at org.apache.solr.client.solrj.impl.HttpSolrClient.request(HttpSolrClient.java:252)
	at org.apache.solr.client.solrj.impl.HttpSolrClient.request(HttpSolrClient.java:241)
	at org.apache.solr.client.solrj.SolrRequest.process(SolrRequest.java:178)
	at org.apache.solr.client.solrj.SolrClient.query(SolrClient.java:942)
	at org.apache.solr.client.solrj.SolrClient.query(SolrClient.java:957)
	at org.apache.solr.BaseDistributedSearchTestCase.query(BaseDistributedSearchTestCase.java:599)
	at org.apache.solr.BaseDistributedSearchTestCase.query(BaseDistributedSearchTestCase.java:587)
	at org.apache.solr.BaseDistributedSearchTestCase.query(BaseDistributedSearchTestCase.java:566)
	at org.apache.solr.TestDistributedSearch.test(TestDistributedSearch.java:241)
	at sun.reflect.NativeMethodAccessorImpl.invoke0(Native Method)
	at sun.reflect.NativeMethodAccessorImpl.invoke(NativeMethodAccessorImpl.java:62)
	at sun.reflect.DelegatingMethodAccessorImpl.invoke(DelegatingMethodAccessorImpl.java:43)
	at java.lang.reflect.Method.invoke(Method.java:498)
	at com.carrotsearch.randomizedtesting.RandomizedRunner.invoke(RandomizedRunner.java:1713)
	at com.carrotsearch.randomizedtesting.RandomizedRunner$8.evaluate(RandomizedRunner.java:907)
	at com.carrotsearch.randomizedtesting.RandomizedRunner$9.evaluate(RandomizedRunner.java:943)
	at com.carrotsearch.randomizedtesting.RandomizedRunner$10.evaluate(RandomizedRunner.java:957)
	at org.apache.solr.BaseDistributedSearchTestCase$ShardsRepeatRule$ShardsRepeatStatement.callStatement(BaseDistributedSearchTestCase.java:1011)
	at org.apache.solr.BaseDistributedSearchTestCase$ShardsRepeatRule$ShardsStatement.evaluate(BaseDistributedSearchTestCase.java:960)
	at com.carrotsearch.randomizedtesting.rules.SystemPropertiesRestoreRule$1.evaluate(SystemPropertiesRestoreRule.java:57)
	at org.apache.lucene.util.TestRuleSetupTeardownChained$1.evaluate(TestRuleSetupTeardownChained.java:49)
	at org.apache.lucene.util.AbstractBeforeAfterRule$1.evaluate(AbstractBeforeAfterRule.java:45)
	at org.apache.lucene.util.TestRuleThreadAndTestName$1.evaluate(TestRuleThreadAndTestName.java:48)
	at org.apache.lucene.util.TestRuleIgnoreAfterMaxFailures$1.evaluate(TestRuleIgnoreAfterMaxFailures.java:64)
	at org.apache.lucene.util.TestRuleMarkFailure$1.evaluate(TestRuleMarkFailure.java:47)
	at com.carrotsearch.randomizedtesting.rules.StatementAdapter.evaluate(StatementAdapter.java:36)
	at com.carrotsearch.randomizedtesting.ThreadLeakControl$StatementRunner.run(ThreadLeakControl.java:368)
	at com.carrotsearch.randomizedtesting.ThreadLeakControl.forkTimeoutingTask(ThreadLeakControl.java:817)
	at com.carrotsearch.randomizedtesting.ThreadLeakControl$3.evaluate(ThreadLeakControl.java:468)
	at com.carrotsearch.randomizedtesting.RandomizedRunner.runSingleTest(RandomizedRunner.java:916)
	at com.carrotsearch.randomizedtesting.RandomizedRunner$5.evaluate(RandomizedRunner.java:802)
	at com.carrotsearch.randomizedtesting.RandomizedRunner$6.evaluate(RandomizedRunner.java:852)
	at com.carrotsearch.randomizedtesting.RandomizedRunner$7.evaluate(RandomizedRunner.java:863)
	at com.carrotsearch.randomizedtesting.rules.StatementAdapter.evaluate(StatementAdapter.java:36)
	at com.carrotsearch.randomizedtesting.rules.SystemPropertiesRestoreRule$1.evaluate(SystemPropertiesRestoreRule.java:57)
	at org.apache.lucene.util.AbstractBeforeAfterRule$1.evaluate(AbstractBeforeAfterRule.java:45)
	at com.carrotsearch.randomizedtesting.rules.StatementAdapter.evaluate(StatementAdapter.java:36)
	at org.apache.lucene.util.TestRuleStoreClassName$1.evaluate(TestRuleStoreClassName.java:41)
	at com.carrotsearch.randomizedtesting.rules.NoShadowingOrOverridesOnMethodsRule$1.evaluate(NoShadowingOrOverridesOnMethodsRule.java:40)
	at com.carrotsearch.randomizedtesting.rules.NoShadowingOrOverridesOnMethodsRule$1.evaluate(NoShadowingOrOverridesOnMethodsRule.java:40)
	at com.carrotsearch.randomizedtesting.rules.StatementAdapter.evaluate(StatementAdapter.java:36)
	at com.carrotsearch.randomizedtesting.rules.StatementAdapter.evaluate(StatementAdapter.java:36)
	at com.carrotsearch.randomizedtesting.rules.StatementAdapter.evaluate(StatementAdapter.java:36)
	at org.apache.lucene.util.TestRuleAssertionsRequired$1.evaluate(TestRuleAssertionsRequired.java:53)
	at org.apache.lucene.util.TestRuleMarkFailure$1.evaluate(TestRuleMarkFailure.java:47)
	at org.apache.lucene.util.TestRuleIgnoreAfterMaxFailures$1.evaluate(TestRuleIgnoreAfterMaxFailures.java:64)
	at org.apache.lucene.util.TestRuleIgnoreTestSuites$1.evaluate(TestRuleIgnoreTestSuites.java:54)
	at com.carrotsearch.randomizedtesting.rules.StatementAdapter.evaluate(StatementAdapter.java:36)
	at com.carrotsearch.randomizedtesting.ThreadLeakControl$StatementRunner.run(ThreadLeakControl.java:368)
	at java.lang.Thread.run(Thread.java:748)


FAILED:  org.apache.solr.TestRandomFaceting.testRandomFaceting

Error Message:
Cannot use facet.mincount=0 on field score_f which is Points-based

Stack Trace:
org.apache.solr.common.SolrException: Cannot use facet.mincount=0 on field score_f which is Points-based
	at __randomizedtesting.SeedInfo.seed([60E068C6B3D869D9:6D884813E621A166]:0)
	at org.apache.solr.request.NumericFacets.getCountsSingleValue(NumericFacets.java:184)
	at org.apache.solr.request.NumericFacets.getCounts(NumericFacets.java:170)
	at org.apache.solr.request.SimpleFacets.getTermCounts(SimpleFacets.java:499)
	at org.apache.solr.request.SimpleFacets.getTermCounts(SimpleFacets.java:405)
	at org.apache.solr.request.SimpleFacets.lambda$getFacetFieldCounts$0(SimpleFacets.java:803)
	at java.util.concurrent.FutureTask.run(FutureTask.java:266)
	at org.apache.solr.request.SimpleFacets$3.execute(SimpleFacets.java:742)
	at org.apache.solr.request.SimpleFacets.getFacetFieldCounts(SimpleFacets.java:818)
	at org.apache.solr.handler.component.FacetComponent.getFacetCounts(FacetComponent.java:329)
	at org.apache.solr.handler.component.FacetComponent.process(FacetComponent.java:273)
	at org.apache.solr.handler.component.SearchHandler.handleRequestBody(SearchHandler.java:295)
	at org.apache.solr.handler.RequestHandlerBase.handleRequest(RequestHandlerBase.java:177)
	at org.apache.solr.core.SolrCore.execute(SolrCore.java:2473)
	at org.apache.solr.util.TestHarness.query(TestHarness.java:337)
	at org.apache.solr.util.TestHarness.query(TestHarness.java:319)
	at org.apache.solr.TestRandomFaceting.doFacetTests(TestRandomFaceting.java:288)
	at org.apache.solr.TestRandomFaceting.doFacetTests(TestRandomFaceting.java:177)
	at org.apache.solr.TestRandomFaceting.testRandomFaceting(TestRandomFaceting.java:160)
	at sun.reflect.NativeMethodAccessorImpl.invoke0(Native Method)
	at sun.reflect.NativeMethodAccessorImpl.invoke(NativeMethodAccessorImpl.java:62)
	at sun.reflect.DelegatingMethodAccessorImpl.invoke(DelegatingMethodAccessorImpl.java:43)
	at java.lang.reflect.Method.invoke(Method.java:498)
	at com.carrotsearch.randomizedtesting.RandomizedRunner.invoke(RandomizedRunner.java:1713)
	at com.carrotsearch.randomizedtesting.RandomizedRunner$8.evaluate(RandomizedRunner.java:907)
	at com.carrotsearch.randomizedtesting.RandomizedRunner$9.evaluate(RandomizedRunner.java:943)
	at com.carrotsearch.randomizedtesting.RandomizedRunner$10.evaluate(RandomizedRunner.java:957)
	at com.carrotsearch.randomizedtesting.rules.SystemPropertiesRestoreRule$1.evaluate(SystemPropertiesRestoreRule.java:57)
	at org.apache.lucene.util.TestRuleSetupTeardownChained$1.evaluate(TestRuleSetupTeardownChained.java:49)
	at org.apache.lucene.util.AbstractBeforeAfterRule$1.evaluate(AbstractBeforeAfterRule.java:45)
	at org.apache.lucene.util.TestRuleThreadAndTestName$1.evaluate(TestRuleThreadAndTestName.java:48)
	at org.apache.lucene.util.TestRuleIgnoreAfterMaxFailures$1.evaluate(TestRuleIgnoreAfterMaxFailures.java:64)
	at org.apache.lucene.util.TestRuleMarkFailure$1.evaluate(TestRuleMarkFailure.java:47)
	at com.carrotsearch.randomizedtesting.rules.StatementAdapter.evaluate(StatementAdapter.java:36)
	at com.carrotsearch.randomizedtesting.ThreadLeakControl$StatementRunner.run(ThreadLeakControl.java:368)
	at com.carrotsearch.randomizedtesting.ThreadLeakControl.forkTimeoutingTask(ThreadLeakControl.java:817)
	at com.carrotsearch.randomizedtesting.ThreadLeakControl$3.evaluate(ThreadLeakControl.java:468)
	at com.carrotsearch.randomizedtesting.RandomizedRunner.runSingleTest(RandomizedRunner.java:916)
	at com.carrotsearch.randomizedtesting.RandomizedRunner$5.evaluate(RandomizedRunner.java:802)
	at com.carrotsearch.randomizedtesting.RandomizedRunner$6.evaluate(RandomizedRunner.java:852)
	at com.carrotsearch.randomizedtesting.RandomizedRunner$7.evaluate(RandomizedRunner.java:863)
	at com.carrotsearch.randomizedtesting.rules.StatementAdapter.evaluate(StatementAdapter.java:36)
	at com.carrotsearch.randomizedtesting.rules.SystemPropertiesRestoreRule$1.evaluate(SystemPropertiesRestoreRule.java:57)
	at org.apache.lucene.util.AbstractBeforeAfterRule$1.evaluate(AbstractBeforeAfterRule.java:45)
	at com.carrotsearch.randomizedtesting.rules.StatementAdapter.evaluate(StatementAdapter.java:36)
	at org.apache.lucene.util.TestRuleStoreClassName$1.evaluate(TestRuleStoreClassName.java:41)
	at com.carrotsearch.randomizedtesting.rules.NoShadowingOrOverridesOnMethodsRule$1.evaluate(NoShadowingOrOverridesOnMethodsRule.java:40)
	at com.carrotsearch.randomizedtesting.rules.NoShadowingOrOverridesOnMethodsRule$1.evaluate(NoShadowingOrOverridesOnMethodsRule.java:40)
	at com.carrotsearch.randomizedtesting.rules.StatementAdapter.evaluate(StatementAdapter.java:36)
	at com.carrotsearch.randomizedtesting.rules.StatementAdapter.evaluate(StatementAdapter.java:36)
	at com.carrotsearch.randomizedtesting.rules.StatementAdapter.evaluate(StatementAdapter.java:36)
	at org.apache.lucene.util.TestRuleAssertionsRequired$1.evaluate(TestRuleAssertionsRequired.java:53)
	at org.apache.lucene.util.TestRuleMarkFailure$1.evaluate(TestRuleMarkFailure.java:47)
	at org.apache.lucene.util.TestRuleIgnoreAfterMaxFailures$1.evaluate(TestRuleIgnoreAfterMaxFailures.java:64)
	at org.apache.lucene.util.TestRuleIgnoreTestSuites$1.evaluate(TestRuleIgnoreTestSuites.java:54)
	at com.carrotsearch.randomizedtesting.rules.StatementAdapter.evaluate(StatementAdapter.java:36)
	at com.carrotsearch.randomizedtesting.ThreadLeakControl$StatementRunner.run(ThreadLeakControl.java:368)
	at java.lang.Thread.run(Thread.java:748)


FAILED:  org.apache.solr.client.solrj.SolrExampleBinaryTest.testExampleConfig

Error Message:
Error from server at http://127.0.0.1:41537/solr/collection1: Cannot use facet.mincount=0 on field price which is Points-based

Stack Trace:
org.apache.solr.client.solrj.impl.HttpSolrClient$RemoteSolrException: Error from server at http://127.0.0.1:41537/solr/collection1: Cannot use facet.mincount=0 on field price which is Points-based
	at __randomizedtesting.SeedInfo.seed([D58D418BC6B9D667:62A0551301BE30BE]:0)
	at org.apache.solr.client.solrj.impl.HttpSolrClient.executeMethod(HttpSolrClient.java:626)
	at org.apache.solr.client.solrj.impl.HttpSolrClient.request(HttpSolrClient.java:252)
	at org.apache.solr.client.solrj.impl.HttpSolrClient.request(HttpSolrClient.java:241)
	at org.apache.solr.client.solrj.SolrRequest.process(SolrRequest.java:178)
	at org.apache.solr.client.solrj.SolrClient.query(SolrClient.java:942)
	at org.apache.solr.client.solrj.SolrClient.query(SolrClient.java:957)
	at org.apache.solr.client.solrj.SolrExampleTests.testExampleConfig(SolrExampleTests.java:175)
	at sun.reflect.NativeMethodAccessorImpl.invoke0(Native Method)
	at sun.reflect.NativeMethodAccessorImpl.invoke(NativeMethodAccessorImpl.java:62)
	at sun.reflect.DelegatingMethodAccessorImpl.invoke(DelegatingMethodAccessorImpl.java:43)
	at java.lang.reflect.Method.invoke(Method.java:498)
	at com.carrotsearch.randomizedtesting.RandomizedRunner.invoke(RandomizedRunner.java:1713)
	at com.carrotsearch.randomizedtesting.RandomizedRunner$8.evaluate(RandomizedRunner.java:907)
	at com.carrotsearch.randomizedtesting.RandomizedRunner$9.evaluate(RandomizedRunner.java:943)
	at com.carrotsearch.randomizedtesting.RandomizedRunner$10.evaluate(RandomizedRunner.java:957)
	at com.carrotsearch.randomizedtesting.rules.SystemPropertiesRestoreRule$1.evaluate(SystemPropertiesRestoreRule.java:57)
	at org.apache.lucene.util.TestRuleSetupTeardownChained$1.evaluate(TestRuleSetupTeardownChained.java:49)
	at org.apache.lucene.util.AbstractBeforeAfterRule$1.evaluate(AbstractBeforeAfterRule.java:45)
	at org.apache.lucene.util.TestRuleThreadAndTestName$1.evaluate(TestRuleThreadAndTestName.java:48)
	at org.apache.lucene.util.TestRuleIgnoreAfterMaxFailures$1.evaluate(TestRuleIgnoreAfterMaxFailures.java:64)
	at org.apache.lucene.util.TestRuleMarkFailure$1.evaluate(TestRuleMarkFailure.java:47)
	at com.carrotsearch.randomizedtesting.rules.StatementAdapter.evaluate(StatementAdapter.java:36)
	at com.carrotsearch.randomizedtesting.ThreadLeakControl$StatementRunner.run(ThreadLeakControl.java:368)
	at com.carrotsearch.randomizedtesting.ThreadLeakControl.forkTimeoutingTask(ThreadLeakControl.java:817)
	at com.carrotsearch.randomizedtesting.ThreadLeakControl$3.evaluate(ThreadLeakControl.java:468)
	at com.carrotsearch.randomizedtesting.RandomizedRunner.runSingleTest(RandomizedRunner.java:916)
	at com.carrotsearch.randomizedtesting.RandomizedRunner$5.evaluate(RandomizedRunner.java:802)
	at com.carrotsearch.randomizedtesting.RandomizedRunner$6.evaluate(RandomizedRunner.java:852)
	at com.carrotsearch.randomizedtesting.RandomizedRunner$7.evaluate(RandomizedRunner.java:863)
	at com.carrotsearch.randomizedtesting.rules.StatementAdapter.evaluate(StatementAdapter.java:36)
	at com.carrotsearch.randomizedtesting.rules.SystemPropertiesRestoreRule$1.evaluate(SystemPropertiesRestoreRule.java:57)
	at org.apache.lucene.util.AbstractBeforeAfterRule$1.evaluate(AbstractBeforeAfterRule.java:45)
	at com.carrotsearch.randomizedtesting.rules.StatementAdapter.evaluate(StatementAdapter.java:36)
	at org.apache.lucene.util.TestRuleStoreClassName$1.evaluate(TestRuleStoreClassName.java:41)
	at com.carrotsearch.randomizedtesting.rules.NoShadowingOrOverridesOnMethodsRule$1.evaluate(NoShadowingOrOverridesOnMethodsRule.java:40)
	at com.carrotsearch.randomizedtesting.rules.NoShadowingOrOverridesOnMethodsRule$1.evaluate(NoShadowingOrOverridesOnMethodsRule.java:40)
	at com.carrotsearch.randomizedtesting.rules.StatementAdapter.evaluate(StatementAdapter.java:36)
	at com.carrotsearch.randomizedtesting.rules.StatementAdapter.evaluate(StatementAdapter.java:36)
	at com.carrotsearch.randomizedtesting.rules.StatementAdapter.evaluate(StatementAdapter.java:36)
	at org.apache.lucene.util.TestRuleAssertionsRequired$1.evaluate(TestRuleAssertionsRequired.java:53)
	at org.apache.lucene.util.TestRuleMarkFailure$1.evaluate(TestRuleMarkFailure.java:47)
	at org.apache.lucene.util.TestRuleIgnoreAfterMaxFailures$1.evaluate(TestRuleIgnoreAfterMaxFailures.java:64)
	at org.apache.lucene.util.TestRuleIgnoreTestSuites$1.evaluate(TestRuleIgnoreTestSuites.java:54)
	at com.carrotsearch.randomizedtesting.rules.StatementAdapter.evaluate(StatementAdapter.java:36)
	at com.carrotsearch.randomizedtesting.ThreadLeakControl$StatementRunner.run(ThreadLeakControl.java:368)
	at java.lang.Thread.run(Thread.java:748)


FAILED:  org.apache.solr.client.solrj.SolrExampleXMLTest.testExampleConfig

Error Message:
Error from server at http://127.0.0.1:46285/solr/collection1: Cannot use facet.mincount=0 on field price which is Points-based

Stack Trace:
org.apache.solr.client.solrj.impl.HttpSolrClient$RemoteSolrException: Error from server at http://127.0.0.1:46285/solr/collection1: Cannot use facet.mincount=0 on field price which is Points-based
	at __randomizedtesting.SeedInfo.seed([D58D418BC6B9D667:62A0551301BE30BE]:0)
	at org.apache.solr.client.solrj.impl.HttpSolrClient.executeMethod(HttpSolrClient.java:626)
	at org.apache.solr.client.solrj.impl.HttpSolrClient.request(HttpSolrClient.java:252)
	at org.apache.solr.client.solrj.impl.HttpSolrClient.request(HttpSolrClient.java:241)
	at org.apache.solr.client.solrj.SolrRequest.process(SolrRequest.java:178)
	at org.apache.solr.client.solrj.SolrClient.query(SolrClient.java:942)
	at org.apache.solr.client.solrj.SolrClient.query(SolrClient.java:957)
	at org.apache.solr.client.solrj.SolrExampleTests.testExampleConfig(SolrExampleTests.java:175)
	at sun.reflect.NativeMethodAccessorImpl.invoke0(Native Method)
	at sun.reflect.NativeMethodAccessorImpl.invoke(NativeMethodAccessorImpl.java:62)
	at sun.reflect.DelegatingMethodAccessorImpl.invoke(DelegatingMethodAccessorImpl.java:43)
	at java.lang.reflect.Method.invoke(Method.java:498)
	at com.carrotsearch.randomizedtesting.RandomizedRunner.invoke(RandomizedRunner.java:1713)
	at com.carrotsearch.randomizedtesting.RandomizedRunner$8.evaluate(RandomizedRunner.java:907)
	at com.carrotsearch.randomizedtesting.RandomizedRunner$9.evaluate(RandomizedRunner.java:943)
	at com.carrotsearch.randomizedtesting.RandomizedRunner$10.evaluate(RandomizedRunner.java:957)
	at com.carrotsearch.randomizedtesting.rules.SystemPropertiesRestoreRule$1.evaluate(SystemPropertiesRestoreRule.java:57)
	at org.apache.lucene.util.TestRuleSetupTeardownChained$1.evaluate(TestRuleSetupTeardownChained.java:49)
	at org.apache.lucene.util.AbstractBeforeAfterRule$1.evaluate(AbstractBeforeAfterRule.java:45)
	at org.apache.lucene.util.TestRuleThreadAndTestName$1.evaluate(TestRuleThreadAndTestName.java:48)
	at org.apache.lucene.util.TestRuleIgnoreAfterMaxFailures$1.evaluate(TestRuleIgnoreAfterMaxFailures.java:64)
	at org.apache.lucene.util.TestRuleMarkFailure$1.evaluate(TestRuleMarkFailure.java:47)
	at com.carrotsearch.randomizedtesting.rules.StatementAdapter.evaluate(StatementAdapter.java:36)
	at com.carrotsearch.randomizedtesting.ThreadLeakControl$StatementRunner.run(ThreadLeakControl.java:368)
	at com.carrotsearch.randomizedtesting.ThreadLeakControl.forkTimeoutingTask(ThreadLeakControl.java:817)
	at com.carrotsearch.randomizedtesting.ThreadLeakControl$3.evaluate(ThreadLeakControl.java:468)
	at com.carrotsearch.randomizedtesting.RandomizedRunner.runSingleTest(RandomizedRunner.java:916)
	at com.carrotsearch.randomizedtesting.RandomizedRunner$5.evaluate(RandomizedRunner.java:802)
	at com.carrotsearch.randomizedtesting.RandomizedRunner$6.evaluate(RandomizedRunner.java:852)
	at com.carrotsearch.randomizedtesting.RandomizedRunner$7.evaluate(RandomizedRunner.java:863)
	at com.carrotsearch.randomizedtesting.rules.StatementAdapter.evaluate(StatementAdapter.java:36)
	at com.carrotsearch.randomizedtesting.rules.SystemPropertiesRestoreRule$1.evaluate(SystemPropertiesRestoreRule.java:57)
	at org.apache.lucene.util.AbstractBeforeAfterRule$1.evaluate(AbstractBeforeAfterRule.java:45)
	at com.carrotsearch.randomizedtesting.rules.StatementAdapter.evaluate(StatementAdapter.java:36)
	at org.apache.lucene.util.TestRuleStoreClassName$1.evaluate(TestRuleStoreClassName.java:41)
	at com.carrotsearch.randomizedtesting.rules.NoShadowingOrOverridesOnMethodsRule$1.evaluate(NoShadowingOrOverridesOnMethodsRule.java:40)
	at com.carrotsearch.randomizedtesting.rules.NoShadowingOrOverridesOnMethodsRule$1.evaluate(NoShadowingOrOverridesOnMethodsRule.java:40)
	at com.carrotsearch.randomizedtesting.rules.StatementAdapter.evaluate(StatementAdapter.java:36)
	at com.carrotsearch.randomizedtesting.rules.StatementAdapter.evaluate(StatementAdapter.java:36)
	at com.carrotsearch.randomizedtesting.rules.StatementAdapter.evaluate(StatementAdapter.java:36)
	at org.apache.lucene.util.TestRuleAssertionsRequired$1.evaluate(TestRuleAssertionsRequired.java:53)
	at org.apache.lucene.util.TestRuleMarkFailure$1.evaluate(TestRuleMarkFailure.java:47)
	at org.apache.lucene.util.TestRuleIgnoreAfterMaxFailures$1.evaluate(TestRuleIgnoreAfterMaxFailures.java:64)
	at org.apache.lucene.util.TestRuleIgnoreTestSuites$1.evaluate(TestRuleIgnoreTestSuites.java:54)
	at com.carrotsearch.randomizedtesting.rules.StatementAdapter.evaluate(StatementAdapter.java:36)
	at com.carrotsearch.randomizedtesting.ThreadLeakControl$StatementRunner.run(ThreadLeakControl.java:368)
	at java.lang.Thread.run(Thread.java:748)


FAILED:  org.apache.solr.client.solrj.embedded.SolrExampleEmbeddedTest.testExampleConfig

Error Message:
Cannot use facet.mincount=0 on field price which is Points-based

Stack Trace:
org.apache.solr.common.SolrException: Cannot use facet.mincount=0 on field price which is Points-based
	at __randomizedtesting.SeedInfo.seed([D58D418BC6B9D667:62A0551301BE30BE]:0)
	at org.apache.solr.request.NumericFacets.getCountsSingleValue(NumericFacets.java:184)
	at org.apache.solr.request.NumericFacets.getCounts(NumericFacets.java:170)
	at org.apache.solr.request.SimpleFacets.getTermCounts(SimpleFacets.java:499)
	at org.apache.solr.request.SimpleFacets.getTermCounts(SimpleFacets.java:405)
	at org.apache.solr.request.SimpleFacets.lambda$getFacetFieldCounts$0(SimpleFacets.java:803)
	at java.util.concurrent.FutureTask.run(FutureTask.java:266)
	at org.apache.solr.request.SimpleFacets$3.execute(SimpleFacets.java:742)
	at org.apache.solr.request.SimpleFacets.getFacetFieldCounts(SimpleFacets.java:818)
	at org.apache.solr.handler.component.FacetComponent.getFacetCounts(FacetComponent.java:329)
	at org.apache.solr.handler.component.FacetComponent.process(FacetComponent.java:273)
	at org.apache.solr.handler.component.SearchHandler.handleRequestBody(SearchHandler.java:295)
	at org.apache.solr.handler.RequestHandlerBase.handleRequest(RequestHandlerBase.java:177)
	at org.apache.solr.core.SolrCore.execute(SolrCore.java:2473)
	at org.apache.solr.client.solrj.embedded.EmbeddedSolrServer.request(EmbeddedSolrServer.java:179)
	at org.apache.solr.client.solrj.SolrRequest.process(SolrRequest.java:178)
	at org.apache.solr.client.solrj.SolrClient.query(SolrClient.java:942)
	at org.apache.solr.client.solrj.SolrClient.query(SolrClient.java:957)
	at org.apache.solr.client.solrj.SolrExampleTests.testExampleConfig(SolrExampleTests.java:175)
	at sun.reflect.NativeMethodAccessorImpl.invoke0(Native Method)
	at sun.reflect.NativeMethodAccessorImpl.invoke(NativeMethodAccessorImpl.java:62)
	at sun.reflect.DelegatingMethodAccessorImpl.invoke(DelegatingMethodAccessorImpl.java:43)
	at java.lang.reflect.Method.invoke(Method.java:498)
	at com.carrotsearch.randomizedtesting.RandomizedRunner.invoke(RandomizedRunner.java:1713)
	at com.carrotsearch.randomizedtesting.RandomizedRunner$8.evaluate(RandomizedRunner.java:907)
	at com.carrotsearch.randomizedtesting.RandomizedRunner$9.evaluate(RandomizedRunner.java:943)
	at com.carrotsearch.randomizedtesting.RandomizedRunner$10.evaluate(RandomizedRunner.java:957)
	at com.carrotsearch.randomizedtesting.rules.SystemPropertiesRestoreRule$1.evaluate(SystemPropertiesRestoreRule.java:57)
	at org.apache.lucene.util.TestRuleSetupTeardownChained$1.evaluate(TestRuleSetupTeardownChained.java:49)
	at org.apache.lucene.util.AbstractBeforeAfterRule$1.evaluate(AbstractBeforeAfterRule.java:45)
	at org.apache.lucene.util.TestRuleThreadAndTestName$1.evaluate(TestRuleThreadAndTestName.java:48)
	at org.apache.lucene.util.TestRuleIgnoreAfterMaxFailures$1.evaluate(TestRuleIgnoreAfterMaxFailures.java:64)
	at org.apache.lucene.util.TestRuleMarkFailure$1.evaluate(TestRuleMarkFailure.java:47)
	at com.carrotsearch.randomizedtesting.rules.StatementAdapter.evaluate(StatementAdapter.java:36)
	at com.carrotsearch.randomizedtesting.ThreadLeakControl$StatementRunner.run(ThreadLeakControl.java:368)
	at com.carrotsearch.randomizedtesting.ThreadLeakControl.forkTimeoutingTask(ThreadLeakControl.java:817)
	at com.carrotsearch.randomizedtesting.ThreadLeakControl$3.evaluate(ThreadLeakControl.java:468)
	at com.carrotsearch.randomizedtesting.RandomizedRunner.runSingleTest(RandomizedRunner.java:916)
	at com.carrotsearch.randomizedtesting.RandomizedRunner$5.evaluate(RandomizedRunner.java:802)
	at com.carrotsearch.randomizedtesting.RandomizedRunner$6.evaluate(RandomizedRunner.java:852)
	at com.carrotsearch.randomizedtesting.RandomizedRunner$7.evaluate(RandomizedRunner.java:863)
	at com.carrotsearch.randomizedtesting.rules.StatementAdapter.evaluate(StatementAdapter.java:36)
	at com.carrotsearch.randomizedtesting.rules.SystemPropertiesRestoreRule$1.evaluate(SystemPropertiesRestoreRule.java:57)
	at org.apache.lucene.util.AbstractBeforeAfterRule$1.evaluate(AbstractBeforeAfterRule.java:45)
	at com.carrotsearch.randomizedtesting.rules.StatementAdapter.evaluate(StatementAdapter.java:36)
	at org.apache.lucene.util.TestRuleStoreClassName$1.evaluate(TestRuleStoreClassName.java:41)
	at com.carrotsearch.randomizedtesting.rules.NoShadowingOrOverridesOnMethodsRule$1.evaluate(NoShadowingOrOverridesOnMethodsRule.java:40)
	at com.carrotsearch.randomizedtesting.rules.NoShadowingOrOverridesOnMethodsRule$1.evaluate(NoShadowingOrOverridesOnMethodsRule.java:40)
	at com.carrotsearch.randomizedtesting.rules.StatementAdapter.evaluate(StatementAdapter.java:36)
	at com.carrotsearch.randomizedtesting.rules.StatementAdapter.evaluate(StatementAdapter.java:36)
	at com.carrotsearch.randomizedtesting.rules.StatementAdapter.evaluate(StatementAdapter.java:36)
	at org.apache.lucene.util.TestRuleAssertionsRequired$1.evaluate(TestRuleAssertionsRequired.java:53)
	at org.apache.lucene.util.TestRuleMarkFailure$1.evaluate(TestRuleMarkFailure.java:47)
	at org.apache.lucene.util.TestRuleIgnoreAfterMaxFailures$1.evaluate(TestRuleIgnoreAfterMaxFailures.java:64)
	at org.apache.lucene.util.TestRuleIgnoreTestSuites$1.evaluate(TestRuleIgnoreTestSuites.java:54)
	at com.carrotsearch.randomizedtesting.rules.StatementAdapter.evaluate(StatementAdapter.java:36)
	at com.carrotsearch.randomizedtesting.ThreadLeakControl$StatementRunner.run(ThreadLeakControl.java:368)
	at java.lang.Thread.run(Thread.java:748)


FAILED:  org.apache.solr.client.solrj.embedded.SolrExampleJettyTest.testExampleConfig

Error Message:
Error from server at http://127.0.0.1:35143/solr/collection1: Cannot use facet.mincount=0 on field price which is Points-based

Stack Trace:
org.apache.solr.client.solrj.impl.HttpSolrClient$RemoteSolrException: Error from server at http://127.0.0.1:35143/solr/collection1: Cannot use facet.mincount=0 on field price which is Points-based
	at __randomizedtesting.SeedInfo.seed([D58D418BC6B9D667:62A0551301BE30BE]:0)
	at org.apache.solr.client.solrj.impl.HttpSolrClient.executeMethod(HttpSolrClient.java:626)
	at org.apache.solr.client.solrj.impl.HttpSolrClient.request(HttpSolrClient.java:252)
	at org.apache.solr.client.solrj.impl.HttpSolrClient.request(HttpSolrClient.java:241)
	at org.apache.solr.client.solrj.SolrRequest.process(SolrRequest.java:178)
	at org.apache.solr.client.solrj.SolrClient.query(SolrClient.java:942)
	at org.apache.solr.client.solrj.SolrClient.query(SolrClient.java:957)
	at org.apache.solr.client.solrj.SolrExampleTests.testExampleConfig(SolrExampleTests.java:175)
	at sun.reflect.NativeMethodAccessorImpl.invoke0(Native Method)
	at sun.reflect.NativeMethodAccessorImpl.invoke(NativeMethodAccessorImpl.java:62)
	at sun.reflect.DelegatingMethodAccessorImpl.invoke(DelegatingMethodAccessorImpl.java:43)
	at java.lang.reflect.Method.invoke(Method.java:498)
	at com.carrotsearch.randomizedtesting.RandomizedRunner.invoke(RandomizedRunner.java:1713)
	at com.carrotsearch.randomizedtesting.RandomizedRunner$8.evaluate(RandomizedRunner.java:907)
	at com.carrotsearch.randomizedtesting.RandomizedRunner$9.evaluate(RandomizedRunner.java:943)
	at com.carrotsearch.randomizedtesting.RandomizedRunner$10.evaluate(RandomizedRunner.java:957)
	at com.carrotsearch.randomizedtesting.rules.SystemPropertiesRestoreRule$1.evaluate(SystemPropertiesRestoreRule.java:57)
	at org.apache.lucene.util.TestRuleSetupTeardownChained$1.evaluate(TestRuleSetupTeardownChained.java:49)
	at org.apache.lucene.util.AbstractBeforeAfterRule$1.evaluate(AbstractBeforeAfterRule.java:45)
	at org.apache.lucene.util.TestRuleThreadAndTestName$1.evaluate(TestRuleThreadAndTestName.java:48)
	at org.apache.lucene.util.TestRuleIgnoreAfterMaxFailures$1.evaluate(TestRuleIgnoreAfterMaxFailures.java:64)
	at org.apache.lucene.util.TestRuleMarkFailure$1.evaluate(TestRuleMarkFailure.java:47)
	at com.carrotsearch.randomizedtesting.rules.StatementAdapter.evaluate(StatementAdapter.java:36)
	at com.carrotsearch.randomizedtesting.ThreadLeakControl$StatementRunner.run(ThreadLeakControl.java:368)
	at com.carrotsearch.randomizedtesting.ThreadLeakControl.forkTimeoutingTask(ThreadLeakControl.java:817)
	at com.carrotsearch.randomizedtesting.ThreadLeakControl$3.evaluate(ThreadLeakControl.java:468)
	at com.carrotsearch.randomizedtesting.RandomizedRunner.runSingleTest(RandomizedRunner.java:916)
	at com.carrotsearch.randomizedtesting.RandomizedRunner$5.evaluate(RandomizedRunner.java:802)
	at com.carrotsearch.randomizedtesting.RandomizedRunner$6.evaluate(RandomizedRunner.java:852)
	at com.carrotsearch.randomizedtesting.RandomizedRunner$7.evaluate(RandomizedRunner.java:863)
	at com.carrotsearch.randomizedtesting.rules.StatementAdapter.evaluate(StatementAdapter.java:36)
	at com.carrotsearch.randomizedtesting.rules.SystemPropertiesRestoreRule$1.evaluate(SystemPropertiesRestoreRule.java:57)
	at org.apache.lucene.util.AbstractBeforeAfterRule$1.evaluate(AbstractBeforeAfterRule.java:45)
	at com.carrotsearch.randomizedtesting.rules.StatementAdapter.evaluate(StatementAdapter.java:36)
	at org.apache.lucene.util.TestRuleStoreClassName$1.evaluate(TestRuleStoreClassName.java:41)
	at com.carrotsearch.randomizedtesting.rules.NoShadowingOrOverridesOnMethodsRule$1.evaluate(NoShadowingOrOverridesOnMethodsRule.java:40)
	at com.carrotsearch.randomizedtesting.rules.NoShadowingOrOverridesOnMethodsRule$1.evaluate(NoShadowingOrOverridesOnMethodsRule.java:40)
	at com.carrotsearch.randomizedtesting.rules.StatementAdapter.evaluate(StatementAdapter.java:36)
	at com.carrotsearch.randomizedtesting.rules.StatementAdapter.evaluate(StatementAdapter.java:36)
	at com.carrotsearch.randomizedtesting.rules.StatementAdapter.evaluate(StatementAdapter.java:36)
	at org.apache.lucene.util.TestRuleAssertionsRequired$1.evaluate(TestRuleAssertionsRequired.java:53)
	at org.apache.lucene.util.TestRuleMarkFailure$1.evaluate(TestRuleMarkFailure.java:47)
	at org.apache.lucene.util.TestRuleIgnoreAfterMaxFailures$1.evaluate(TestRuleIgnoreAfterMaxFailures.java:64)
	at org.apache.lucene.util.TestRuleIgnoreTestSuites$1.evaluate(TestRuleIgnoreTestSuites.java:54)
	at com.carrotsearch.randomizedtesting.rules.StatementAdapter.evaluate(StatementAdapter.java:36)
	at com.carrotsearch.randomizedtesting.ThreadLeakControl$StatementRunner.run(ThreadLeakControl.java:368)
	at java.lang.Thread.run(Thread.java:748)


FAILED:  org.apache.solr.client.solrj.embedded.SolrExampleStreamingBinaryTest.testExampleConfig

Error Message:
Error from server at http://127.0.0.1:45195/solr/collection1: Cannot use facet.mincount=0 on field price which is Points-based

Stack Trace:
org.apache.solr.client.solrj.impl.HttpSolrClient$RemoteSolrException: Error from server at http://127.0.0.1:45195/solr/collection1: Cannot use facet.mincount=0 on field price which is Points-based
	at __randomizedtesting.SeedInfo.seed([D58D418BC6B9D667:62A0551301BE30BE]:0)
	at org.apache.solr.client.solrj.impl.HttpSolrClient.executeMethod(HttpSolrClient.java:626)
	at org.apache.solr.client.solrj.impl.HttpSolrClient.request(HttpSolrClient.java:252)
	at org.apache.solr.client.solrj.impl.HttpSolrClient.request(HttpSolrClient.java:241)
	at org.apache.solr.client.solrj.impl.ConcurrentUpdateSolrClient.request(ConcurrentUpdateSolrClient.java:478)
	at org.apache.solr.client.solrj.SolrRequest.process(SolrRequest.java:178)
	at org.apache.solr.client.solrj.SolrClient.query(SolrClient.java:942)
	at org.apache.solr.client.solrj.SolrClient.query(SolrClient.java:957)
	at org.apache.solr.client.solrj.SolrExampleTests.testExampleConfig(SolrExampleTests.java:175)
	at sun.reflect.NativeMethodAccessorImpl.invoke0(Native Method)
	at sun.reflect.NativeMethodAccessorImpl.invoke(NativeMethodAccessorImpl.java:62)
	at sun.reflect.DelegatingMethodAccessorImpl.invoke(DelegatingMethodAccessorImpl.java:43)
	at java.lang.reflect.Method.invoke(Method.java:498)
	at com.carrotsearch.randomizedtesting.RandomizedRunner.invoke(RandomizedRunner.java:1713)
	at com.carrotsearch.randomizedtesting.RandomizedRunner$8.evaluate(RandomizedRunner.java:907)
	at com.carrotsearch.randomizedtesting.RandomizedRunner$9.evaluate(RandomizedRunner.java:943)
	at com.carrotsearch.randomizedtesting.RandomizedRunner$10.evaluate(RandomizedRunner.java:957)
	at com.carrotsearch.randomizedtesting.rules.SystemPropertiesRestoreRule$1.evaluate(SystemPropertiesRestoreRule.java:57)
	at org.apache.lucene.util.TestRuleSetupTeardownChained$1.evaluate(TestRuleSetupTeardownChained.java:49)
	at org.apache.lucene.util.AbstractBeforeAfterRule$1.evaluate(AbstractBeforeAfterRule.java:45)
	at org.apache.lucene.util.TestRuleThreadAndTestName$1.evaluate(TestRuleThreadAndTestName.java:48)
	at org.apache.lucene.util.TestRuleIgnoreAfterMaxFailures$1.evaluate(TestRuleIgnoreAfterMaxFailures.java:64)
	at org.apache.lucene.util.TestRuleMarkFailure$1.evaluate(TestRuleMarkFailure.java:47)
	at com.carrotsearch.randomizedtesting.rules.StatementAdapter.evaluate(StatementAdapter.java:36)
	at com.carrotsearch.randomizedtesting.ThreadLeakControl$StatementRunner.run(ThreadLeakControl.java:368)
	at com.carrotsearch.randomizedtesting.ThreadLeakControl.forkTimeoutingTask(ThreadLeakControl.java:817)
	at com.carrotsearch.randomizedtesting.ThreadLeakControl$3.evaluate(ThreadLeakControl.java:468)
	at com.carrotsearch.randomizedtesting.RandomizedRunner.runSingleTest(RandomizedRunner.java:916)
	at com.carrotsearch.randomizedtesting.RandomizedRunner$5.evaluate(RandomizedRunner.java:802)
	at com.carrotsearch.randomizedtesting.RandomizedRunner$6.evaluate(RandomizedRunner.java:852)
	at com.carrotsearch.randomizedtesting.RandomizedRunner$7.evaluate(RandomizedRunner.java:863)
	at com.carrotsearch.randomizedtesting.rules.StatementAdapter.evaluate(StatementAdapter.java:36)
	at com.carrotsearch.randomizedtesting.rules.SystemPropertiesRestoreRule$1.evaluate(SystemPropertiesRestoreRule.java:57)
	at org.apache.lucene.util.AbstractBeforeAfterRule$1.evaluate(AbstractBeforeAfterRule.java:45)
	at com.carrotsearch.randomizedtesting.rules.StatementAdapter.evaluate(StatementAdapter.java:36)
	at org.apache.lucene.util.TestRuleStoreClassName$1.evaluate(TestRuleStoreClassName.java:41)
	at com.carrotsearch.randomizedtesting.rules.NoShadowingOrOverridesOnMethodsRule$1.evaluate(NoShadowingOrOverridesOnMethodsRule.java:40)
	at com.carrotsearch.randomizedtesting.rules.NoShadowingOrOverridesOnMethodsRule$1.evaluate(NoShadowingOrOverridesOnMethodsRule.java:40)
	at com.carrotsearch.randomizedtesting.rules.StatementAdapter.evaluate(StatementAdapter.java:36)
	at com.carrotsearch.randomizedtesting.rules.StatementAdapter.evaluate(StatementAdapter.java:36)
	at com.carrotsearch.randomizedtesting.rules.StatementAdapter.evaluate(StatementAdapter.java:36)
	at org.apache.lucene.util.TestRuleAssertionsRequired$1.evaluate(TestRuleAssertionsRequired.java:53)
	at org.apache.lucene.util.TestRuleMarkFailure$1.evaluate(TestRuleMarkFailure.java:47)
	at org.apache.lucene.util.TestRuleIgnoreAfterMaxFailures$1.evaluate(TestRuleIgnoreAfterMaxFailures.java:64)
	at org.apache.lucene.util.TestRuleIgnoreTestSuites$1.evaluate(TestRuleIgnoreTestSuites.java:54)
	at com.carrotsearch.randomizedtesting.rules.StatementAdapter.evaluate(StatementAdapter.java:36)
	at com.carrotsearch.randomizedtesting.ThreadLeakControl$StatementRunner.run(ThreadLeakControl.java:368)
	at java.lang.Thread.run(Thread.java:748)


FAILED:  org.apache.solr.client.solrj.embedded.SolrExampleStreamingTest.testExampleConfig

Error Message:
Error from server at http://127.0.0.1:39643/solr/collection1: Cannot use facet.mincount=0 on field price which is Points-based

Stack Trace:
org.apache.solr.client.solrj.impl.HttpSolrClient$RemoteSolrException: Error from server at http://127.0.0.1:39643/solr/collection1: Cannot use facet.mincount=0 on field price which is Points-based
	at __randomizedtesting.SeedInfo.seed([D58D418BC6B9D667:62A0551301BE30BE]:0)
	at org.apache.solr.client.solrj.impl.HttpSolrClient.executeMethod(HttpSolrClient.java:626)
	at org.apache.solr.client.solrj.impl.HttpSolrClient.request(HttpSolrClient.java:252)
	at org.apache.solr.client.solrj.impl.HttpSolrClient.request(HttpSolrClient.java:241)
	at org.apache.solr.client.solrj.impl.ConcurrentUpdateSolrClient.request(ConcurrentUpdateSolrClient.java:478)
	at org.apache.solr.client.solrj.SolrRequest.process(SolrRequest.java:178)
	at org.apache.solr.client.solrj.SolrClient.query(SolrClient.java:942)
	at org.apache.solr.client.solrj.SolrClient.query(SolrClient.java:957)
	at org.apache.solr.client.solrj.SolrExampleTests.testExampleConfig(SolrExampleTests.java:175)
	at sun.reflect.NativeMethodAccessorImpl.invoke0(Native Method)
	at sun.reflect.NativeMethodAccessorImpl.invoke(NativeMethodAccessorImpl.java:62)
	at sun.reflect.DelegatingMethodAccessorImpl.invoke(DelegatingMethodAccessorImpl.java:43)
	at java.lang.reflect.Method.invoke(Method.java:498)
	at com.carrotsearch.randomizedtesting.RandomizedRunner.invoke(RandomizedRunner.java:1713)
	at com.carrotsearch.randomizedtesting.RandomizedRunner$8.evaluate(RandomizedRunner.java:907)
	at com.carrotsearch.randomizedtesting.RandomizedRunner$9.evaluate(RandomizedRunner.java:943)
	at com.carrotsearch.randomizedtesting.RandomizedRunner$10.evaluate(RandomizedRunner.java:957)
	at com.carrotsearch.randomizedtesting.rules.SystemPropertiesRestoreRule$1.evaluate(SystemPropertiesRestoreRule.java:57)
	at org.apache.lucene.util.TestRuleSetupTeardownChained$1.evaluate(TestRuleSetupTeardownChained.java:49)
	at org.apache.lucene.util.AbstractBeforeAfterRule$1.evaluate(AbstractBeforeAfterRule.java:45)
	at org.apache.lucene.util.TestRuleThreadAndTestName$1.evaluate(TestRuleThreadAndTestName.java:48)
	at org.apache.lucene.util.TestRuleIgnoreAfterMaxFailures$1.evaluate(TestRuleIgnoreAfterMaxFailures.java:64)
	at org.apache.lucene.util.TestRuleMarkFailure$1.evaluate(TestRuleMarkFailure.java:47)
	at com.carrotsearch.randomizedtesting.rules.StatementAdapter.evaluate(StatementAdapter.java:36)
	at com.carrotsearch.randomizedtesting.ThreadLeakControl$StatementRunner.run(ThreadLeakControl.java:368)
	at com.carrotsearch.randomizedtesting.ThreadLeakControl.forkTimeoutingTask(ThreadLeakControl.java:817)
	at com.carrotsearch.randomizedtesting.ThreadLeakControl$3.evaluate(ThreadLeakControl.java:468)
	at com.carrotsearch.randomizedtesting.RandomizedRunner.runSingleTest(RandomizedRunner.java:916)
	at com.carrotsearch.randomizedtesting.RandomizedRunner$5.evaluate(RandomizedRunner.java:802)
	at com.carrotsearch.randomizedtesting.RandomizedRunner$6.evaluate(RandomizedRunner.java:852)
	at com.carrotsearch.randomizedtesting.RandomizedRunner$7.evaluate(RandomizedRunner.java:863)
	at com.carrotsearch.randomizedtesting.rules.StatementAdapter.evaluate(StatementAdapter.java:36)
	at com.carrotsearch.randomizedtesting.rules.SystemPropertiesRestoreRule$1.evaluate(SystemPropertiesRestoreRule.java:57)
	at org.apache.lucene.util.AbstractBeforeAfterRule$1.evaluate(AbstractBeforeAfterRule.java:45)
	at com.carrotsearch.randomizedtesting.rules.StatementAdapter.evaluate(StatementAdapter.java:36)
	at org.apache.lucene.util.TestRuleStoreClassName$1.evaluate(TestRuleStoreClassName.java:41)
	at com.carrotsearch.randomizedtesting.rules.NoShadowingOrOverridesOnMethodsRule$1.evaluate(NoShadowingOrOverridesOnMethodsRule.java:40)
	at com.carrotsearch.randomizedtesting.rules.NoShadowingOrOverridesOnMethodsRule$1.evaluate(NoShadowingOrOverridesOnMethodsRule.java:40)
	at com.carrotsearch.randomizedtesting.rules.StatementAdapter.evaluate(StatementAdapter.java:36)
	at com.carrotsearch.randomizedtesting.rules.StatementAdapter.evaluate(StatementAdapter.java:36)
	at com.carrotsearch.randomizedtesting.rules.StatementAdapter.evaluate(StatementAdapter.java:36)
	at org.apache.lucene.util.TestRuleAssertionsRequired$1.evaluate(TestRuleAssertionsRequired.java:53)
	at org.apache.lucene.util.TestRuleMarkFailure$1.evaluate(TestRuleMarkFailure.java:47)
	at org.apache.lucene.util.TestRuleIgnoreAfterMaxFailures$1.evaluate(TestRuleIgnoreAfterMaxFailures.java:64)
	at org.apache.lucene.util.TestRuleIgnoreTestSuites$1.evaluate(TestRuleIgnoreTestSuites.java:54)
	at com.carrotsearch.randomizedtesting.rules.StatementAdapter.evaluate(StatementAdapter.java:36)
	at com.carrotsearch.randomizedtesting.ThreadLeakControl$StatementRunner.run(ThreadLeakControl.java:368)
	at java.lang.Thread.run(Thread.java:748)


FAILED:  org.apache.solr.request.TestFaceting.testFacetSortWithMinCount

Error Message:
Exception during query

Stack Trace:
java.lang.RuntimeException: Exception during query
	at __randomizedtesting.SeedInfo.seed([60E068C6B3D869D9:EBEB6751181F431F]:0)
	at org.apache.solr.SolrTestCaseJ4.assertQ(SolrTestCaseJ4.java:886)
	at org.apache.solr.SolrTestCaseJ4.assertQ(SolrTestCaseJ4.java:846)
	at org.apache.solr.request.TestFaceting.testFacetSortWithMinCount(TestFaceting.java:312)
	at sun.reflect.NativeMethodAccessorImpl.invoke0(Native Method)
	at sun.reflect.NativeMethodAccessorImpl.invoke(NativeMethodAccessorImpl.java:62)
	at sun.reflect.DelegatingMethodAccessorImpl.invoke(DelegatingMethodAccessorImpl.java:43)
	at java.lang.reflect.Method.invoke(Method.java:498)
	at com.carrotsearch.randomizedtesting.RandomizedRunner.invoke(RandomizedRunner.java:1713)
	at com.carrotsearch.randomizedtesting.RandomizedRunner$8.evaluate(RandomizedRunner.java:907)
	at com.carrotsearch.randomizedtesting.RandomizedRunner$9.evaluate(RandomizedRunner.java:943)
	at com.carrotsearch.randomizedtesting.RandomizedRunner$10.evaluate(RandomizedRunner.java:957)
	at com.carrotsearch.randomizedtesting.rules.SystemPropertiesRestoreRule$1.evaluate(SystemPropertiesRestoreRule.java:57)
	at org.apache.lucene.util.TestRuleSetupTeardownChained$1.evaluate(TestRuleSetupTeardownChained.java:49)
	at org.apache.lucene.util.AbstractBeforeAfterRule$1.evaluate(AbstractBeforeAfterRule.java:45)
	at org.apache.lucene.util.TestRuleThreadAndTestName$1.evaluate(TestRuleThreadAndTestName.java:48)
	at org.apache.lucene.util.TestRuleIgnoreAfterMaxFailures$1.evaluate(TestRuleIgnoreAfterMaxFailures.java:64)
	at org.apache.lucene.util.TestRuleMarkFailure$1.evaluate(TestRuleMarkFailure.java:47)
	at com.carrotsearch.randomizedtesting.rules.StatementAdapter.evaluate(StatementAdapter.java:36)
	at com.carrotsearch.randomizedtesting.ThreadLeakControl$StatementRunner.run(ThreadLeakControl.java:368)
	at com.carrotsearch.randomizedtesting.ThreadLeakControl.forkTimeoutingTask(ThreadLeakControl.java:817)
	at com.carrotsearch.randomizedtesting.ThreadLeakControl$3.evaluate(ThreadLeakControl.java:468)
	at com.carrotsearch.randomizedtesting.RandomizedRunner.runSingleTest(RandomizedRunner.java:916)
	at com.carrotsearch.randomizedtesting.RandomizedRunner$5.evaluate(RandomizedRunner.java:802)
	at com.carrotsearch.randomizedtesting.RandomizedRunner$6.evaluate(RandomizedRunner.java:852)
	at com.carrotsearch.randomizedtesting.RandomizedRunner$7.evaluate(RandomizedRunner.java:863)
	at com.carrotsearch.randomizedtesting.rules.StatementAdapter.evaluate(StatementAdapter.java:36)
	at com.carrotsearch.randomizedtesting.rules.SystemPropertiesRestoreRule$1.evaluate(SystemPropertiesRestoreRule.java:57)
	at org.apache.lucene.util.AbstractBeforeAfterRule$1.evaluate(AbstractBeforeAfterRule.java:45)
	at com.carrotsearch.randomizedtesting.rules.StatementAdapter.evaluate(StatementAdapter.java:36)
	at org.apache.lucene.util.TestRuleStoreClassName$1.evaluate(TestRuleStoreClassName.java:41)
	at com.carrotsearch.randomizedtesting.rules.NoShadowingOrOverridesOnMethodsRule$1.evaluate(NoShadowingOrOverridesOnMethodsRule.java:40)
	at com.carrotsearch.randomizedtesting.rules.NoShadowingOrOverridesOnMethodsRule$1.evaluate(NoShadowingOrOverridesOnMethodsRule.java:40)
	at com.carrotsearch.randomizedtesting.rules.StatementAdapter.evaluate(StatementAdapter.java:36)
	at com.carrotsearch.randomizedtesting.rules.StatementAdapter.evaluate(StatementAdapter.java:36)
	at com.carrotsearch.randomizedtesting.rules.StatementAdapter.evaluate(StatementAdapter.java:36)
	at org.apache.lucene.util.TestRuleAssertionsRequired$1.evaluate(TestRuleAssertionsRequired.java:53)
	at org.apache.lucene.util.TestRuleMarkFailure$1.evaluate(TestRuleMarkFailure.java:47)
	at org.apache.lucene.util.TestRuleIgnoreAfterMaxFailures$1.evaluate(TestRuleIgnoreAfterMaxFailures.java:64)
	at org.apache.lucene.util.TestRuleIgnoreTestSuites$1.evaluate(TestRuleIgnoreTestSuites.java:54)
	at com.carrotsearch.randomizedtesting.rules.StatementAdapter.evaluate(StatementAdapter.java:36)
	at com.carrotsearch.randomizedtesting.ThreadLeakControl$StatementRunner.run(ThreadLeakControl.java:368)
	at java.lang.Thread.run(Thread.java:748)
Caused by: org.apache.solr.common.SolrException: Cannot use facet.mincount=0 on field f_td which is Points-based
	at org.apache.solr.request.NumericFacets.getCountsSingleValue(NumericFacets.java:184)
	at org.apache.solr.request.NumericFacets.getCounts(NumericFacets.java:170)
	at org.apache.solr.request.SimpleFacets.getTermCounts(SimpleFacets.java:499)
	at org.apache.solr.request.SimpleFacets.getTermCounts(SimpleFacets.java:405)
	at org.apache.solr.request.SimpleFacets.lambda$getFacetFieldCounts$0(SimpleFacets.java:803)
	at java.util.concurrent.FutureTask.run(FutureTask.java:266)
	at org.apache.solr.request.SimpleFacets$3.execute(SimpleFacets.java:742)
	at org.apache.solr.request.SimpleFacets.getFacetFieldCounts(SimpleFacets.java:818)
	at org.apache.solr.handler.component.FacetComponent.getFacetCounts(FacetComponent.java:329)
	at org.apache.solr.handler.component.FacetComponent.process(FacetComponent.java:273)
	at org.apache.solr.handler.component.SearchHandler.handleRequestBody(SearchHandler.java:295)
	at org.apache.solr.handler.RequestHandlerBase.handleRequest(RequestHandlerBase.java:177)
	at org.apache.solr.core.SolrCore.execute(SolrCore.java:2473)
	at org.apache.solr.util.TestHarness.query(TestHarness.java:337)
	at org.apache.solr.util.TestHarness.query(TestHarness.java:319)
	at org.apache.solr.SolrTestCaseJ4.assertQ(SolrTestCaseJ4.java:860)
	... 41 more


FAILED:  org.apache.solr.schema.DocValuesMultiTest.testDocValuesFacetingSimple

Error Message:
Exception during query

Stack Trace:
java.lang.RuntimeException: Exception during query
	at __randomizedtesting.SeedInfo.seed([60E068C6B3D869D9:4B91ED242A15680D]:0)
	at org.apache.solr.SolrTestCaseJ4.assertQ(SolrTestCaseJ4.java:886)
	at org.apache.solr.SolrTestCaseJ4.assertQ(SolrTestCaseJ4.java:846)
	at org.apache.solr.schema.DocValuesMultiTest.testDocValuesFacetingSimple(DocValuesMultiTest.java:292)
	at sun.reflect.NativeMethodAccessorImpl.invoke0(Native Method)
	at sun.reflect.NativeMethodAccessorImpl.invoke(NativeMethodAccessorImpl.java:62)
	at sun.reflect.DelegatingMethodAccessorImpl.invoke(DelegatingMethodAccessorImpl.java:43)
	at java.lang.reflect.Method.invoke(Method.java:498)
	at com.carrotsearch.randomizedtesting.RandomizedRunner.invoke(RandomizedRunner.java:1713)
	at com.carrotsearch.randomizedtesting.RandomizedRunner$8.evaluate(RandomizedRunner.java:907)
	at com.carrotsearch.randomizedtesting.RandomizedRunner$9.evaluate(RandomizedRunner.java:943)
	at com.carrotsearch.randomizedtesting.RandomizedRunner$10.evaluate(RandomizedRunner.java:957)
	at com.carrotsearch.randomizedtesting.rules.SystemPropertiesRestoreRule$1.evaluate(SystemPropertiesRestoreRule.java:57)
	at org.apache.lucene.util.TestRuleSetupTeardownChained$1.evaluate(TestRuleSetupTeardownChained.java:49)
	at org.apache.lucene.util.AbstractBeforeAfterRule$1.evaluate(AbstractBeforeAfterRule.java:45)
	at org.apache.lucene.util.TestRuleThreadAndTestName$1.evaluate(TestRuleThreadAndTestName.java:48)
	at org.apache.lucene.util.TestRuleIgnoreAfterMaxFailures$1.evaluate(TestRuleIgnoreAfterMaxFailures.java:64)
	at org.apache.lucene.util.TestRuleMarkFailure$1.evaluate(TestRuleMarkFailure.java:47)
	at com.carrotsearch.randomizedtesting.rules.StatementAdapter.evaluate(StatementAdapter.java:36)
	at com.carrotsearch.randomizedtesting.ThreadLeakControl$StatementRunner.run(ThreadLeakControl.java:368)
	at com.carrotsearch.randomizedtesting.ThreadLeakControl.forkTimeoutingTask(ThreadLeakControl.java:817)
	at com.carrotsearch.randomizedtesting.ThreadLeakControl$3.evaluate(ThreadLeakControl.java:468)
	at com.carrotsearch.randomizedtesting.RandomizedRunner.runSingleTest(RandomizedRunner.java:916)
	at com.carrotsearch.randomizedtesting.RandomizedRunner$5.evaluate(RandomizedRunner.java:802)
	at com.carrotsearch.randomizedtesting.RandomizedRunner$6.evaluate(RandomizedRunner.java:852)
	at com.carrotsearch.randomizedtesting.RandomizedRunner$7.evaluate(RandomizedRunner.java:863)
	at com.carrotsearch.randomizedtesting.rules.StatementAdapter.evaluate(StatementAdapter.java:36)
	at com.carrotsearch.randomizedtesting.rules.SystemPropertiesRestoreRule$1.evaluate(SystemPropertiesRestoreRule.java:57)
	at org.apache.lucene.util.AbstractBeforeAfterRule$1.evaluate(AbstractBeforeAfterRule.java:45)
	at com.carrotsearch.randomizedtesting.rules.StatementAdapter.evaluate(StatementAdapter.java:36)
	at org.apache.lucene.util.TestRuleStoreClassName$1.evaluate(TestRuleStoreClassName.java:41)
	at com.carrotsearch.randomizedtesting.rules.NoShadowingOrOverridesOnMethodsRule$1.evaluate(NoShadowingOrOverridesOnMethodsRule.java:40)
	at com.carrotsearch.randomizedtesting.rules.NoShadowingOrOverridesOnMethodsRule$1.evaluate(NoShadowingOrOverridesOnMethodsRule.java:40)
	at com.carrotsearch.randomizedtesting.rules.StatementAdapter.evaluate(StatementAdapter.java:36)
	at com.carrotsearch.randomizedtesting.rules.StatementAdapter.evaluate(StatementAdapter.java:36)
	at com.carrotsearch.randomizedtesting.rules.StatementAdapter.evaluate(StatementAdapter.java:36)
	at org.apache.lucene.util.TestRuleAssertionsRequired$1.evaluate(TestRuleAssertionsRequired.java:53)
	at org.apache.lucene.util.TestRuleMarkFailure$1.evaluate(TestRuleMarkFailure.java:47)
	at org.apache.lucene.util.TestRuleIgnoreAfterMaxFailures$1.evaluate(TestRuleIgnoreAfterMaxFailures.java:64)
	at org.apache.lucene.util.TestRuleIgnoreTestSuites$1.evaluate(TestRuleIgnoreTestSuites.java:54)
	at com.carrotsearch.randomizedtesting.rules.StatementAdapter.evaluate(StatementAdapter.java:36)
	at com.carrotsearch.randomizedtesting.ThreadLeakControl$StatementRunner.run(ThreadLeakControl.java:368)
	at java.lang.Thread.run(Thread.java:748)
Caused by: org.apache.solr.common.SolrException: Cannot use facet.mincount=0 on field longdv which is Points-based
	at org.apache.solr.request.NumericFacets.getCountsMultiValued(NumericFacets.java:425)
	at org.apache.solr.request.NumericFacets.getCounts(NumericFacets.java:168)
	at org.apache.solr.request.SimpleFacets.getTermCounts(SimpleFacets.java:499)
	at org.apache.solr.request.SimpleFacets.getTermCounts(SimpleFacets.java:405)
	at org.apache.solr.request.SimpleFacets.lambda$getFacetFieldCounts$0(SimpleFacets.java:803)
	at java.util.concurrent.FutureTask.run(FutureTask.java:266)
	at org.apache.solr.request.SimpleFacets$3.execute(SimpleFacets.java:742)
	at org.apache.solr.request.SimpleFacets.getFacetFieldCounts(SimpleFacets.java:818)
	at org.apache.solr.handler.component.FacetComponent.getFacetCounts(FacetComponent.java:329)
	at org.apache.solr.handler.component.FacetComponent.process(FacetComponent.java:273)
	at org.apache.solr.handler.component.SearchHandler.handleRequestBody(SearchHandler.java:295)
	at org.apache.solr.handler.RequestHandlerBase.handleRequest(RequestHandlerBase.java:177)
	at org.apache.solr.core.SolrCore.execute(SolrCore.java:2473)
	at org.apache.solr.util.TestHarness.query(TestHarness.java:337)
	at org.apache.solr.util.TestHarness.query(TestHarness.java:319)
	at org.apache.solr.SolrTestCaseJ4.assertQ(SolrTestCaseJ4.java:860)
	... 41 more


FAILED:  org.apache.solr.schema.DocValuesTest.testDocValuesFaceting

Error Message:
Exception during query

Stack Trace:
java.lang.RuntimeException: Exception during query
	at __randomizedtesting.SeedInfo.seed([60E068C6B3D869D9:FAFF2F985840F961]:0)
	at org.apache.solr.SolrTestCaseJ4.assertQ(SolrTestCaseJ4.java:886)
	at org.apache.solr.SolrTestCaseJ4.assertQ(SolrTestCaseJ4.java:846)
	at org.apache.solr.schema.DocValuesTest.testDocValuesFaceting(DocValuesTest.java:250)
	at sun.reflect.NativeMethodAccessorImpl.invoke0(Native Method)
	at sun.reflect.NativeMethodAccessorImpl.invoke(NativeMethodAccessorImpl.java:62)
	at sun.reflect.DelegatingMethodAccessorImpl.invoke(DelegatingMethodAccessorImpl.java:43)
	at java.lang.reflect.Method.invoke(Method.java:498)
	at com.carrotsearch.randomizedtesting.RandomizedRunner.invoke(RandomizedRunner.java:1713)
	at com.carrotsearch.randomizedtesting.RandomizedRunner$8.evaluate(RandomizedRunner.java:907)
	at com.carrotsearch.randomizedtesting.RandomizedRunner$9.evaluate(RandomizedRunner.java:943)
	at com.carrotsearch.randomizedtesting.RandomizedRunner$10.evaluate(RandomizedRunner.java:957)
	at com.carrotsearch.randomizedtesting.rules.SystemPropertiesRestoreRule$1.evaluate(SystemPropertiesRestoreRule.java:57)
	at org.apache.lucene.util.TestRuleSetupTeardownChained$1.evaluate(TestRuleSetupTeardownChained.java:49)
	at org.apache.lucene.util.AbstractBeforeAfterRule$1.evaluate(AbstractBeforeAfterRule.java:45)
	at org.apache.lucene.util.TestRuleThreadAndTestName$1.evaluate(TestRuleThreadAndTestName.java:48)
	at org.apache.lucene.util.TestRuleIgnoreAfterMaxFailures$1.evaluate(TestRuleIgnoreAfterMaxFailures.java:64)
	at org.apache.lucene.util.TestRuleMarkFailure$1.evaluate(TestRuleMarkFailure.java:47)
	at com.carrotsearch.randomizedtesting.rules.StatementAdapter.evaluate(StatementAdapter.java:36)
	at com.carrotsearch.randomizedtesting.ThreadLeakControl$StatementRunner.run(ThreadLeakControl.java:368)
	at com.carrotsearch.randomizedtesting.ThreadLeakControl.forkTimeoutingTask(ThreadLeakControl.java:817)
	at com.carrotsearch.randomizedtesting.ThreadLeakControl$3.evaluate(ThreadLeakControl.java:468)
	at com.carrotsearch.randomizedtesting.RandomizedRunner.runSingleTest(RandomizedRunner.java:916)
	at com.carrotsearch.randomizedtesting.RandomizedRunner$5.evaluate(RandomizedRunner.java:802)
	at com.carrotsearch.randomizedtesting.RandomizedRunner$6.evaluate(RandomizedRunner.java:852)
	at com.carrotsearch.randomizedtesting.RandomizedRunner$7.evaluate(RandomizedRunner.java:863)
	at com.carrotsearch.randomizedtesting.rules.StatementAdapter.evaluate(StatementAdapter.java:36)
	at com.carrotsearch.randomizedtesting.rules.SystemPropertiesRestoreRule$1.evaluate(SystemPropertiesRestoreRule.java:57)
	at org.apache.lucene.util.AbstractBeforeAfterRule$1.evaluate(AbstractBeforeAfterRule.java:45)
	at com.carrotsearch.randomizedtesting.rules.StatementAdapter.evaluate(StatementAdapter.java:36)
	at org.apache.lucene.util.TestRuleStoreClassName$1.evaluate(TestRuleStoreClassName.java:41)
	at com.carrotsearch.randomizedtesting.rules.NoShadowingOrOverridesOnMethodsRule$1.evaluate(NoShadowingOrOverridesOnMethodsRule.java:40)
	at com.carrotsearch.randomizedtesting.rules.NoShadowingOrOverridesOnMethodsRule$1.evaluate(NoShadowingOrOverridesOnMethodsRule.java:40)
	at com.carrotsearch.randomizedtesting.rules.StatementAdapter.evaluate(StatementAdapter.java:36)
	at com.carrotsearch.randomizedtesting.rules.StatementAdapter.evaluate(StatementAdapter.java:36)
	at com.carrotsearch.randomizedtesting.rules.StatementAdapter.evaluate(StatementAdapter.java:36)
	at org.apache.lucene.util.TestRuleAssertionsRequired$1.evaluate(TestRuleAssertionsRequired.java:53)
	at org.apache.lucene.util.TestRuleMarkFailure$1.evaluate(TestRuleMarkFailure.java:47)
	at org.apache.lucene.util.TestRuleIgnoreAfterMaxFailures$1.evaluate(TestRuleIgnoreAfterMaxFailures.java:64)
	at org.apache.lucene.util.TestRuleIgnoreTestSuites$1.evaluate(TestRuleIgnoreTestSuites.java:54)
	at com.carrotsearch.randomizedtesting.rules.StatementAdapter.evaluate(StatementAdapter.java:36)
	at com.carrotsearch.randomizedtesting.ThreadLeakControl$StatementRunner.run(ThreadLeakControl.java:368)
	at java.lang.Thread.run(Thread.java:748)
Caused by: org.apache.solr.common.SolrException: Cannot use facet.mincount=0 on field longdv which is Points-based
	at org.apache.solr.request.NumericFacets.getCountsSingleValue(NumericFacets.java:184)
	at org.apache.solr.request.NumericFacets.getCounts(NumericFacets.java:170)
	at org.apache.solr.request.SimpleFacets.getTermCounts(SimpleFacets.java:499)
	at org.apache.solr.request.SimpleFacets.getTermCounts(SimpleFacets.java:405)
	at org.apache.solr.request.SimpleFacets.lambda$getFacetFieldCounts$0(SimpleFacets.java:803)
	at java.util.concurrent.FutureTask.run(FutureTask.java:266)
	at org.apache.solr.request.SimpleFacets$3.execute(SimpleFacets.java:742)
	at org.apache.solr.request.SimpleFacets.getFacetFieldCounts(SimpleFacets.java:818)
	at org.apache.solr.handler.component.FacetComponent.getFacetCounts(FacetComponent.java:329)
	at org.apache.solr.handler.component.FacetComponent.process(FacetComponent.java:273)
	at org.apache.solr.handler.component.SearchHandler.handleRequestBody(SearchHandler.java:295)
	at org.apache.solr.handler.RequestHandlerBase.handleRequest(RequestHandlerBase.java:177)
	at org.apache.solr.core.SolrCore.execute(SolrCore.java:2473)
	at org.apache.solr.util.TestHarness.query(TestHarness.java:337)
	at org.apache.solr.util.TestHarness.query(TestHarness.java:319)
	at org.apache.solr.SolrTestCaseJ4.assertQ(SolrTestCaseJ4.java:860)
	... 41 more


FAILED:  org.apache.solr.schema.TestPointFields.testIntPointFieldMultiValuedFacetField

Error Message:
Exception during query

Stack Trace:
java.lang.RuntimeException: Exception during query
	at __randomizedtesting.SeedInfo.seed([60E068C6B3D869D9:DE213E19F92179CB]:0)
	at org.apache.solr.SolrTestCaseJ4.assertQ(SolrTestCaseJ4.java:886)
	at org.apache.solr.SolrTestCaseJ4.assertQ(SolrTestCaseJ4.java:846)
	at org.apache.solr.schema.TestPointFields.doTestPointFieldMultiValuedFacetField(TestPointFields.java:2749)
	at org.apache.solr.schema.TestPointFields.testIntPointFieldMultiValuedFacetField(TestPointFields.java:321)
	at sun.reflect.NativeMethodAccessorImpl.invoke0(Native Method)
	at sun.reflect.NativeMethodAccessorImpl.invoke(NativeMethodAccessorImpl.java:62)
	at sun.reflect.DelegatingMethodAccessorImpl.invoke(DelegatingMethodAccessorImpl.java:43)
	at java.lang.reflect.Method.invoke(Method.java:498)
	at com.carrotsearch.randomizedtesting.RandomizedRunner.invoke(RandomizedRunner.java:1713)
	at com.carrotsearch.randomizedtesting.RandomizedRunner$8.evaluate(RandomizedRunner.java:907)
	at com.carrotsearch.randomizedtesting.RandomizedRunner$9.evaluate(RandomizedRunner.java:943)
	at com.carrotsearch.randomizedtesting.RandomizedRunner$10.evaluate(RandomizedRunner.java:957)
	at com.carrotsearch.randomizedtesting.rules.SystemPropertiesRestoreRule$1.evaluate(SystemPropertiesRestoreRule.java:57)
	at org.apache.lucene.util.TestRuleSetupTeardownChained$1.evaluate(TestRuleSetupTeardownChained.java:49)
	at org.apache.lucene.util.AbstractBeforeAfterRule$1.evaluate(AbstractBeforeAfterRule.java:45)
	at org.apache.lucene.util.TestRuleThreadAndTestName$1.evaluate(TestRuleThreadAndTestName.java:48)
	at org.apache.lucene.util.TestRuleIgnoreAfterMaxFailures$1.evaluate(TestRuleIgnoreAfterMaxFailures.java:64)
	at org.apache.lucene.util.TestRuleMarkFailure$1.evaluate(TestRuleMarkFailure.java:47)
	at com.carrotsearch.randomizedtesting.rules.StatementAdapter.evaluate(StatementAdapter.java:36)
	at com.carrotsearch.randomizedtesting.ThreadLeakControl$StatementRunner.run(ThreadLeakControl.java:368)
	at com.carrotsearch.randomizedtesting.ThreadLeakControl.forkTimeoutingTask(ThreadLeakControl.java:817)
	at com.carrotsearch.randomizedtesting.ThreadLeakControl$3.evaluate(ThreadLeakControl.java:468)
	at com.carrotsearch.randomizedtesting.RandomizedRunner.runSingleTest(RandomizedRunner.java:916)
	at com.carrotsearch.randomizedtesting.RandomizedRunner$5.evaluate(RandomizedRunner.java:802)
	at com.carrotsearch.randomizedtesting.RandomizedRunner$6.evaluate(RandomizedRunner.java:852)
	at com.carrotsearch.randomizedtesting.RandomizedRunner$7.evaluate(RandomizedRunner.java:863)
	at com.carrotsearch.randomizedtesting.rules.StatementAdapter.evaluate(StatementAdapter.java:36)
	at com.carrotsearch.randomizedtesting.rules.SystemPropertiesRestoreRule$1.evaluate(SystemPropertiesRestoreRule.java:57)
	at org.apache.lucene.util.AbstractBeforeAfterRule$1.evaluate(AbstractBeforeAfterRule.java:45)
	at com.carrotsearch.randomizedtesting.rules.StatementAdapter.evaluate(StatementAdapter.java:36)
	at org.apache.lucene.util.TestRuleStoreClassName$1.evaluate(TestRuleStoreClassName.java:41)
	at com.carrotsearch.randomizedtesting.rules.NoShadowingOrOverridesOnMethodsRule$1.evaluate(NoShadowingOrOverridesOnMethodsRule.java:40)
	at com.carrotsearch.randomizedtesting.rules.NoShadowingOrOverridesOnMethodsRule$1.evaluate(NoShadowingOrOverridesOnMethodsRule.java:40)
	at com.carrotsearch.randomizedtesting.rules.StatementAdapter.evaluate(StatementAdapter.java:36)
	at com.carrotsearch.randomizedtesting.rules.StatementAdapter.evaluate(StatementAdapter.java:36)
	at com.carrotsearch.randomizedtesting.rules.StatementAdapter.evaluate(StatementAdapter.java:36)
	at org.apache.lucene.util.TestRuleAssertionsRequired$1.evaluate(TestRuleAssertionsRequired.java:53)
	at org.apache.lucene.util.TestRuleMarkFailure$1.evaluate(TestRuleMarkFailure.java:47)
	at org.apache.lucene.util.TestRuleIgnoreAfterMaxFailures$1.evaluate(TestRuleIgnoreAfterMaxFailures.java:64)
	at org.apache.lucene.util.TestRuleIgnoreTestSuites$1.evaluate(TestRuleIgnoreTestSuites.java:54)
	at com.carrotsearch.randomizedtesting.rules.StatementAdapter.evaluate(StatementAdapter.java:36)
	at com.carrotsearch.randomizedtesting.ThreadLeakControl$StatementRunner.run(ThreadLeakControl.java:368)
	at java.lang.Thread.run(Thread.java:748)
Caused by: org.apache.solr.common.SolrException: Cannot use facet.mincount=0 on field number_p_i_mv_dv which is Points-based
	at org.apache.solr.request.NumericFacets.getCountsMultiValued(NumericFacets.java:425)
	at org.apache.solr.request.NumericFacets.getCounts(NumericFacets.java:168)
	at org.apache.solr.request.SimpleFacets.getTermCounts(SimpleFacets.java:499)
	at org.apache.solr.request.SimpleFacets.getTermCounts(SimpleFacets.java:405)
	at org.apache.solr.request.SimpleFacets.lambda$getFacetFieldCounts$0(SimpleFacets.java:803)
	at java.util.concurrent.FutureTask.run(FutureTask.java:266)
	at org.apache.solr.request.SimpleFacets$3.execute(SimpleFacets.java:742)
	at org.apache.solr.request.SimpleFacets.getFacetFieldCounts(SimpleFacets.java:818)
	at org.apache.solr.handler.component.FacetComponent.getFacetCounts(FacetComponent.java:329)
	at org.apache.solr.handler.component.FacetComponent.process(FacetComponent.java:273)
	at org.apache.solr.handler.component.SearchHandler.handleRequestBody(SearchHandler.java:295)
	at org.apache.solr.handler.RequestHandlerBase.handleRequest(RequestHandlerBase.java:177)
	at org.apache.solr.core.SolrCore.execute(SolrCore.java:2473)
	at org.apache.solr.util.TestHarness.query(TestHarness.java:337)
	at org.apache.solr.util.TestHarness.query(TestHarness.java:319)
	at org.apache.solr.SolrTestCaseJ4.assertQ(SolrTestCaseJ4.java:860)
	... 42 more


FAILED:  org.apache.solr.schema.TestPointFields.testIntPointFieldFacetField

Error Message:
Exception during query

Stack Trace:
java.lang.RuntimeException: Exception during query
	at __randomizedtesting.SeedInfo.seed([60E068C6B3D869D9:53E661B0E7750043]:0)
	at org.apache.solr.SolrTestCaseJ4.assertQ(SolrTestCaseJ4.java:886)
	at org.apache.solr.SolrTestCaseJ4.assertQ(SolrTestCaseJ4.java:846)
	at org.apache.solr.schema.TestPointFields.doTestPointFieldFacetField(TestPointFields.java:2407)
	at org.apache.solr.schema.TestPointFields.testIntPointFieldFacetField(TestPointFields.java:196)
	at sun.reflect.NativeMethodAccessorImpl.invoke0(Native Method)
	at sun.reflect.NativeMethodAccessorImpl.invoke(NativeMethodAccessorImpl.java:62)
	at sun.reflect.DelegatingMethodAccessorImpl.invoke(DelegatingMethodAccessorImpl.java:43)
	at java.lang.reflect.Method.invoke(Method.java:498)
	at com.carrotsearch.randomizedtesting.RandomizedRunner.invoke(RandomizedRunner.java:1713)
	at com.carrotsearch.randomizedtesting.RandomizedRunner$8.evaluate(RandomizedRunner.java:907)
	at com.carrotsearch.randomizedtesting.RandomizedRunner$9.evaluate(RandomizedRunner.java:943)
	at com.carrotsearch.randomizedtesting.RandomizedRunner$10.evaluate(RandomizedRunner.java:957)
	at com.carrotsearch.randomizedtesting.rules.SystemPropertiesRestoreRule$1.evaluate(SystemPropertiesRestoreRule.java:57)
	at org.apache.lucene.util.TestRuleSetupTeardownChained$1.evaluate(TestRuleSetupTeardownChained.java:49)
	at org.apache.lucene.util.AbstractBeforeAfterRule$1.evaluate(AbstractBeforeAfterRule.java:45)
	at org.apache.lucene.util.TestRuleThreadAndTestName$1.evaluate(TestRuleThreadAndTestName.java:48)
	at org.apache.lucene.util.TestRuleIgnoreAfterMaxFailures$1.evaluate(TestRuleIgnoreAfterMaxFailures.java:64)
	at org.apache.lucene.util.TestRuleMarkFailure$1.evaluate(TestRuleMarkFailure.java:47)
	at com.carrotsearch.randomizedtesting.rules.StatementAdapter.evaluate(StatementAdapter.java:36)
	at com.carrotsearch.randomizedtesting.ThreadLeakControl$StatementRunner.run(ThreadLeakControl.java:368)
	at com.carrotsearch.randomizedtesting.ThreadLeakControl.forkTimeoutingTask(ThreadLeakControl.java:817)
	at com.carrotsearch.randomizedtesting.ThreadLeakControl$3.evaluate(ThreadLeakControl.java:468)
	at com.carrotsearch.randomizedtesting.RandomizedRunner.runSingleTest(RandomizedRunner.java:916)
	at com.carrotsearch.randomizedtesting.RandomizedRunner$5.evaluate(RandomizedRunner.java:802)
	at com.carrotsearch.randomizedtesting.RandomizedRunner$6.evaluate(RandomizedRunner.java:852)
	at com.carrotsearch.randomizedtesting.RandomizedRunner$7.evaluate(RandomizedRunner.java:863)
	at com.carrotsearch.randomizedtesting.rules.StatementAdapter.evaluate(StatementAdapter.java:36)
	at com.carrotsearch.randomizedtesting.rules.SystemPropertiesRestoreRule$1.evaluate(SystemPropertiesRestoreRule.java:57)
	at org.apache.lucene.util.AbstractBeforeAfterRule$1.evaluate(AbstractBeforeAfterRule.java:45)
	at com.carrotsearch.randomizedtesting.rules.StatementAdapter.evaluate(StatementAdapter.java:36)
	at org.apache.lucene.util.TestRuleStoreClassName$1.evaluate(TestRuleStoreClassName.java:41)
	at com.carrotsearch.randomizedtesting.rules.NoShadowingOrOverridesOnMethodsRule$1.evaluate(NoShadowingOrOverridesOnMethodsRule.java:40)
	at com.carrotsearch.randomizedtesting.rules.NoShadowingOrOverridesOnMethodsRule$1.evaluate(NoShadowingOrOverridesOnMethodsRule.java:40)
	at com.carrotsearch.randomizedtesting.rules.StatementAdapter.evaluate(StatementAdapter.java:36)
	at com.carrotsearch.randomizedtesting.rules.StatementAdapter.evaluate(StatementAdapter.java:36)
	at com.carrotsearch.randomizedtesting.rules.StatementAdapter.evaluate(StatementAdapter.java:36)
	at org.apache.lucene.util.TestRuleAssertionsRequired$1.evaluate(TestRuleAssertionsRequired.java:53)
	at org.apache.lucene.util.TestRuleMarkFailure$1.evaluate(TestRuleMarkFailure.java:47)
	at org.apache.lucene.util.TestRuleIgnoreAfterMaxFailures$1.evaluate(TestRuleIgnoreAfterMaxFailures.java:64)
	at org.apache.lucene.util.TestRuleIgnoreTestSuites$1.evaluate(TestRuleIgnoreTestSuites.java:54)
	at com.carrotsearch.randomizedtesting.rules.StatementAdapter.evaluate(StatementAdapter.java:36)
	at com.carrotsearch.randomizedtesting.ThreadLeakControl$StatementRunner.run(ThreadLeakControl.java:368)
	at java.lang.Thread.run(Thread.java:748)
Caused by: org.apache.solr.common.SolrException: Cannot use facet.mincount=0 on field number_p_i_dv which is Points-based
	at org.apache.solr.request.NumericFacets.getCountsSingleValue(NumericFacets.java:184)
	at org.apache.solr.request.NumericFacets.getCounts(NumericFacets.java:170)
	at org.apache.solr.request.SimpleFacets.getTermCounts(SimpleFacets.java:499)
	at org.apache.solr.request.SimpleFacets.getTermCounts(SimpleFacets.java:405)
	at org.apache.solr.request.SimpleFacets.lambda$getFacetFieldCounts$0(SimpleFacets.java:803)
	at java.util.concurrent.FutureTask.run(FutureTask.java:266)
	at org.apache.solr.request.SimpleFacets$3.execute(SimpleFacets.java:742)
	at org.apache.solr.request.SimpleFacets.getFacetFieldCounts(SimpleFacets.java:818)
	at org.apache.solr.handler.component.FacetComponent.getFacetCounts(FacetComponent.java:329)
	at org.apache.solr.handler.component.FacetComponent.process(FacetComponent.java:273)
	at org.apache.solr.handler.component.SearchHandler.handleRequestBody(SearchHandler.java:295)
	at org.apache.solr.handler.RequestHandlerBase.handleRequest(RequestHandlerBase.java:177)
	at org.apache.solr.core.SolrCore.execute(SolrCore.java:2473)
	at org.apache.solr.util.TestHarness.query(TestHarness.java:337)
	at org.apache.solr.util.TestHarness.query(TestHarness.java:319)
	at org.apache.solr.SolrTestCaseJ4.assertQ(SolrTestCaseJ4.java:860)
	... 42 more


FAILED:  org.apache.solr.schema.TestPointFields.testFloatPointFieldFacetField

Error Message:
Exception during query

Stack Trace:
java.lang.RuntimeException: Exception during query
	at __randomizedtesting.SeedInfo.seed([60E068C6B3D869D9:DA598AF99034C199]:0)
	at org.apache.solr.SolrTestCaseJ4.assertQ(SolrTestCaseJ4.java:886)
	at org.apache.solr.SolrTestCaseJ4.assertQ(SolrTestCaseJ4.java:846)
	at org.apache.solr.schema.TestPointFields.doTestPointFieldFacetField(TestPointFields.java:2407)
	at org.apache.solr.schema.TestPointFields.testFloatPointFieldFacetField(TestPointFields.java:1003)
	at sun.reflect.NativeMethodAccessorImpl.invoke0(Native Method)
	at sun.reflect.NativeMethodAccessorImpl.invoke(NativeMethodAccessorImpl.java:62)
	at sun.reflect.DelegatingMethodAccessorImpl.invoke(DelegatingMethodAccessorImpl.java:43)
	at java.lang.reflect.Method.invoke(Method.java:498)
	at com.carrotsearch.randomizedtesting.RandomizedRunner.invoke(RandomizedRunner.java:1713)
	at com.carrotsearch.randomizedtesting.RandomizedRunner$8.evaluate(RandomizedRunner.java:907)
	at com.carrotsearch.randomizedtesting.RandomizedRunner$9.evaluate(RandomizedRunner.java:943)
	at com.carrotsearch.randomizedtesting.RandomizedRunner$10.evaluate(RandomizedRunner.java:957)
	at com.carrotsearch.randomizedtesting.rules.SystemPropertiesRestoreRule$1.evaluate(SystemPropertiesRestoreRule.java:57)
	at org.apache.lucene.util.TestRuleSetupTeardownChained$1.evaluate(TestRuleSetupTeardownChained.java:49)
	at org.apache.lucene.util.AbstractBeforeAfterRule$1.evaluate(AbstractBeforeAfterRule.java:45)
	at org.apache.lucene.util.TestRuleThreadAndTestName$1.evaluate(TestRuleThreadAndTestName.java:48)
	at org.apache.lucene.util.TestRuleIgnoreAfterMaxFailures$1.evaluate(TestRuleIgnoreAfterMaxFailures.java:64)
	at org.apache.lucene.util.TestRuleMarkFailure$1.evaluate(TestRuleMarkFailure.java:47)
	at com.

[...truncated too long message...]

i(8.0.0):C17)))}
   [junit4]   2> 48852 INFO  (searcherExecutor-216-thread-1) [    ] o.a.s.u.LoggingInfoStream [IFD][searcherExecutor-216-thread-1]: delete [_1h.fnm, _1h.si, _1h.fdt, _1h_Lucene70_0.dvd, _1h_Lucene50_0.doc, _1h_Lucene50_0.tim, _1h.fdx, _1h_Lucene70_0.dvm, _1h_Lucene50_0.tip]
   [junit4]   2> 48852 INFO  (searcherExecutor-216-thread-1) [    ] o.a.s.u.LoggingInfoStream [IW][searcherExecutor-216-thread-1]: decRefDeleter for NRT reader version=346 segments=_1h(8.0.0):C9
   [junit4]   2> 48852 INFO  (TEST-SolrExampleEmbeddedTest.testUnicode-seed#[D58D418BC6B9D667]) [    ] o.a.s.u.DirectUpdateHandler2 end_commit_flush
   [junit4]   2> 48852 INFO  (TEST-SolrExampleEmbeddedTest.testUnicode-seed#[D58D418BC6B9D667]) [    ] o.a.s.u.p.LogUpdateProcessorFactory [collection1]  webapp=null path=/update params={commit=true&softCommit=false&waitSearcher=true}{commit=} 0 5
   [junit4]   2> 48852 INFO  (TEST-SolrExampleEmbeddedTest.testUnicode-seed#[D58D418BC6B9D667]) [    ] o.a.s.c.S.Request [collection1]  webapp=null path=/select params={q=*:*&rows=17} hits=17 status=0 QTime=0
   [junit4]   2> 48853 INFO  (TEST-SolrExampleEmbeddedTest.testUnicode-seed#[D58D418BC6B9D667]) [    ] o.a.s.SolrTestCaseJ4 ###Ending testUnicode
   [junit4]   2> 48853 INFO  (SUITE-SolrExampleEmbeddedTest-seed#[D58D418BC6B9D667]-worker) [    ] o.a.s.SolrTestCaseJ4 ###deleteCore
   [junit4]   2> 48853 INFO  (SUITE-SolrExampleEmbeddedTest-seed#[D58D418BC6B9D667]-worker) [    ] o.a.s.c.CoreContainer Shutting down CoreContainer instance=50448545
   [junit4]   2> 48853 INFO  (SUITE-SolrExampleEmbeddedTest-seed#[D58D418BC6B9D667]-worker) [    ] o.a.s.m.SolrMetricManager Closing metric reporters for registry=solr.node, tag=null
   [junit4]   2> 48854 INFO  (SUITE-SolrExampleEmbeddedTest-seed#[D58D418BC6B9D667]-worker) [    ] o.a.s.m.SolrMetricManager Closing metric reporters for registry=solr.jvm, tag=null
   [junit4]   2> 48855 INFO  (SUITE-SolrExampleEmbeddedTest-seed#[D58D418BC6B9D667]-worker) [    ] o.a.s.m.SolrMetricManager Closing metric reporters for registry=solr.jetty, tag=null
   [junit4]   2> 48855 INFO  (SUITE-SolrExampleEmbeddedTest-seed#[D58D418BC6B9D667]-worker) [    ] o.a.s.c.TransientSolrCoreCacheDefault Allocating transient cache for 2147483647 transient cores
   [junit4]   2> 48856 INFO  (coreCloseExecutor-221-thread-1) [    x:collection1] o.a.s.c.SolrCore [collection1]  CLOSING SolrCore org.apache.solr.core.SolrCore@2f8df750
   [junit4]   2> 48857 INFO  (coreCloseExecutor-221-thread-1) [    x:collection1] o.a.s.u.LoggingInfoStream [IW][coreCloseExecutor-221-thread-1]: now flush at close
   [junit4]   2> 48857 INFO  (coreCloseExecutor-221-thread-1) [    x:collection1] o.a.s.u.LoggingInfoStream [IW][coreCloseExecutor-221-thread-1]:   start flush: applyAllDeletes=true
   [junit4]   2> 48857 INFO  (coreCloseExecutor-221-thread-1) [    x:collection1] o.a.s.u.LoggingInfoStream [IW][coreCloseExecutor-221-thread-1]:   index before flush _1i(8.0.0):C17
   [junit4]   2> 48857 INFO  (coreCloseExecutor-221-thread-1) [    x:collection1] o.a.s.u.LoggingInfoStream [DW][coreCloseExecutor-221-thread-1]: startFullFlush
   [junit4]   2> 48857 INFO  (coreCloseExecutor-221-thread-1) [    x:collection1] o.a.s.u.LoggingInfoStream [DW][coreCloseExecutor-221-thread-1]: coreCloseExecutor-221-thread-1 finishFullFlush success=true
   [junit4]   2> 48857 INFO  (coreCloseExecutor-221-thread-1) [    x:collection1] o.a.s.u.LoggingInfoStream [IW][coreCloseExecutor-221-thread-1]: now apply all deletes for all segments buffered updates bytesUsed=0 reader pool bytesUsed=0
   [junit4]   2> 48857 INFO  (coreCloseExecutor-221-thread-1) [    x:collection1] o.a.s.u.LoggingInfoStream [BD][coreCloseExecutor-221-thread-1]: waitApply: no deletes to apply
   [junit4]   2> 48857 INFO  (coreCloseExecutor-221-thread-1) [    x:collection1] o.a.s.u.LoggingInfoStream [MS][coreCloseExecutor-221-thread-1]: updateMergeThreads ioThrottle=true targetMBPerSec=10240.0 MB/sec
   [junit4]   2> 48857 INFO  (coreCloseExecutor-221-thread-1) [    x:collection1] o.a.s.u.LoggingInfoStream [MS][coreCloseExecutor-221-thread-1]: now merge
   [junit4]   2> 48857 INFO  (coreCloseExecutor-221-thread-1) [    x:collection1] o.a.s.u.LoggingInfoStream [MS][coreCloseExecutor-221-thread-1]:   index: _1i(8.0.0):C17
   [junit4]   2> 48857 INFO  (coreCloseExecutor-221-thread-1) [    x:collection1] o.a.s.u.LoggingInfoStream [MS][coreCloseExecutor-221-thread-1]:   no more merges pending; now return
   [junit4]   2> 48857 INFO  (coreCloseExecutor-221-thread-1) [    x:collection1] o.a.s.u.LoggingInfoStream [IW][coreCloseExecutor-221-thread-1]: waitForMerges
   [junit4]   2> 48857 INFO  (coreCloseExecutor-221-thread-1) [    x:collection1] o.a.s.u.LoggingInfoStream [IW][coreCloseExecutor-221-thread-1]: waitForMerges done
   [junit4]   2> 48857 INFO  (coreCloseExecutor-221-thread-1) [    x:collection1] o.a.s.u.LoggingInfoStream [IW][coreCloseExecutor-221-thread-1]: commit: start
   [junit4]   2> 48857 INFO  (coreCloseExecutor-221-thread-1) [    x:collection1] o.a.s.u.LoggingInfoStream [IW][coreCloseExecutor-221-thread-1]: commit: enter lock
   [junit4]   2> 48857 INFO  (coreCloseExecutor-221-thread-1) [    x:collection1] o.a.s.u.LoggingInfoStream [IW][coreCloseExecutor-221-thread-1]: commit: now prepare
   [junit4]   2> 48857 INFO  (coreCloseExecutor-221-thread-1) [    x:collection1] o.a.s.u.LoggingInfoStream [IW][coreCloseExecutor-221-thread-1]: prepareCommit: flush
   [junit4]   2> 48857 INFO  (coreCloseExecutor-221-thread-1) [    x:collection1] o.a.s.u.LoggingInfoStream [IW][coreCloseExecutor-221-thread-1]:   index before flush _1i(8.0.0):C17
   [junit4]   2> 48857 INFO  (coreCloseExecutor-221-thread-1) [    x:collection1] o.a.s.u.LoggingInfoStream [DW][coreCloseExecutor-221-thread-1]: startFullFlush
   [junit4]   2> 48857 INFO  (coreCloseExecutor-221-thread-1) [    x:collection1] o.a.s.u.LoggingInfoStream [IW][coreCloseExecutor-221-thread-1]: now apply all deletes for all segments buffered updates bytesUsed=0 reader pool bytesUsed=0
   [junit4]   2> 48857 INFO  (coreCloseExecutor-221-thread-1) [    x:collection1] o.a.s.u.LoggingInfoStream [BD][coreCloseExecutor-221-thread-1]: waitApply: no deletes to apply
   [junit4]   2> 48857 INFO  (coreCloseExecutor-221-thread-1) [    x:collection1] o.a.s.u.LoggingInfoStream [DW][coreCloseExecutor-221-thread-1]: coreCloseExecutor-221-thread-1 finishFullFlush success=true
   [junit4]   2> 48857 INFO  (coreCloseExecutor-221-thread-1) [    x:collection1] o.a.s.u.LoggingInfoStream [IW][coreCloseExecutor-221-thread-1]: startCommit(): start
   [junit4]   2> 48857 INFO  (coreCloseExecutor-221-thread-1) [    x:collection1] o.a.s.u.LoggingInfoStream [IW][coreCloseExecutor-221-thread-1]:   skip startCommit(): no changes pending
   [junit4]   2> 48857 INFO  (coreCloseExecutor-221-thread-1) [    x:collection1] o.a.s.u.LoggingInfoStream [IW][coreCloseExecutor-221-thread-1]: commit: pendingCommit == null; skip
   [junit4]   2> 48857 INFO  (coreCloseExecutor-221-thread-1) [    x:collection1] o.a.s.u.LoggingInfoStream [IW][coreCloseExecutor-221-thread-1]: commit: took 0.3 msec
   [junit4]   2> 48857 INFO  (coreCloseExecutor-221-thread-1) [    x:collection1] o.a.s.u.LoggingInfoStream [IW][coreCloseExecutor-221-thread-1]: commit: done
   [junit4]   2> 48857 INFO  (coreCloseExecutor-221-thread-1) [    x:collection1] o.a.s.u.LoggingInfoStream [IW][coreCloseExecutor-221-thread-1]: rollback
   [junit4]   2> 48857 INFO  (coreCloseExecutor-221-thread-1) [    x:collection1] o.a.s.u.LoggingInfoStream [IW][coreCloseExecutor-221-thread-1]: all running merges have aborted
   [junit4]   2> 48857 INFO  (coreCloseExecutor-221-thread-1) [    x:collection1] o.a.s.u.LoggingInfoStream [IW][coreCloseExecutor-221-thread-1]: rollback: done finish merges
   [junit4]   2> 48857 INFO  (coreCloseExecutor-221-thread-1) [    x:collection1] o.a.s.u.LoggingInfoStream [DW][coreCloseExecutor-221-thread-1]: abort
   [junit4]   2> 48857 INFO  (coreCloseExecutor-221-thread-1) [    x:collection1] o.a.s.u.LoggingInfoStream [DW][coreCloseExecutor-221-thread-1]: done abort success=true
   [junit4]   2> 48857 INFO  (coreCloseExecutor-221-thread-1) [    x:collection1] o.a.s.u.LoggingInfoStream [IW][coreCloseExecutor-221-thread-1]: rollback: infos=_1i(8.0.0):C17
   [junit4]   2> 48857 INFO  (coreCloseExecutor-221-thread-1) [    x:collection1] o.a.s.u.LoggingInfoStream [IFD][coreCloseExecutor-221-thread-1]: now checkpoint "_1i(8.0.0):C17" [1 segments ; isCommit = false]
   [junit4]   2> 48857 INFO  (coreCloseExecutor-221-thread-1) [    x:collection1] o.a.s.u.LoggingInfoStream [IFD][coreCloseExecutor-221-thread-1]: 0 msec to checkpoint
   [junit4]   2> 48858 INFO  (coreCloseExecutor-221-thread-1) [    x:collection1] o.a.s.m.SolrMetricManager Closing metric reporters for registry=solr.core.collection1, tag=797833040
   [junit4]   2> NOTE: leaving temporary files on disk at: /home/jenkins/workspace/Lucene-Solr-master-Linux/solr/build/solr-solrj/test/J1/temp/solr.client.solrj.embedded.SolrExampleEmbeddedTest_D58D418BC6B9D667-001
   [junit4]   2> NOTE: test params are: codec=Asserting(Lucene70): {}, docValues:{}, maxPointsInLeafNode=1041, maxMBSortInHeap=6.222151034713772, sim=RandomSimilarity(queryNorm=true): {}, locale=et-EE, timezone=America/Anchorage
   [junit4]   2> NOTE: Linux 4.10.0-27-generic amd64/Oracle Corporation 1.8.0_141 (64-bit)/cpus=8,threads=1,free=260549920,total=496500736
   [junit4]   2> NOTE: All tests run in this JVM: [FieldEvaluatorTest, TestPathTrie, CloudSolrClientTest, ShardParamsTest, LBHttpSolrClientBuilderTest, SineEvaluatorTest, MergeIndexesEmbeddedTest, StreamExpressionToExplanationTest, GreaterThanEvaluatorTest, HyperbolicTangentEvaluatorTest, SolrExampleStreamingBinaryTest, QueryResponseTest, CloudSolrClientBuilderTest, AddEvaluatorTest, HttpSolrClientBuilderTest, SolrExampleEmbeddedTest]
   [junit4] Completed [81/135 (6!)] on J1 in 4.86s, 35 tests, 1 error <<< FAILURES!

[...truncated 42590 lines...]

Mime
View raw message