lucene-dev mailing list archives

Site index · List index
Message view « Date » · « Thread »
Top « Date » · « Thread »
From Apache Jenkins Server <jenk...@builds.apache.org>
Subject [JENKINS] Lucene-Solr-SmokeRelease-7.x - Build # 23 - Still Failing
Date Mon, 07 Aug 2017 00:49:37 GMT
Build: https://builds.apache.org/job/Lucene-Solr-SmokeRelease-7.x/23/

No tests ran.

Build Log:
[...truncated 25714 lines...]
prepare-release-no-sign:
    [mkdir] Created dir: /x1/jenkins/jenkins-slave/workspace/Lucene-Solr-SmokeRelease-7.x/lucene/build/smokeTestRelease/dist
     [copy] Copying 476 files to /x1/jenkins/jenkins-slave/workspace/Lucene-Solr-SmokeRelease-7.x/lucene/build/smokeTestRelease/dist/lucene
     [copy] Copying 215 files to /x1/jenkins/jenkins-slave/workspace/Lucene-Solr-SmokeRelease-7.x/lucene/build/smokeTestRelease/dist/solr
   [smoker] Java 1.8 JAVA_HOME=/home/jenkins/tools/java/latest1.8
   [smoker] NOTE: output encoding is UTF-8
   [smoker] 
   [smoker] Load release URL "file:/x1/jenkins/jenkins-slave/workspace/Lucene-Solr-SmokeRelease-7.x/lucene/build/smokeTestRelease/dist/"...
   [smoker] 
   [smoker] Test Lucene...
   [smoker]   test basics...
   [smoker]   get KEYS
   [smoker]     0.2 MB in 0.01 sec (28.5 MB/sec)
   [smoker]   check changes HTML...
   [smoker]   download lucene-7.1.0-src.tgz...
   [smoker]     29.5 MB in 0.03 sec (861.2 MB/sec)
   [smoker]     verify md5/sha1 digests
   [smoker]   download lucene-7.1.0.tgz...
   [smoker]     69.0 MB in 0.08 sec (903.1 MB/sec)
   [smoker]     verify md5/sha1 digests
   [smoker]   download lucene-7.1.0.zip...
   [smoker]     79.4 MB in 0.09 sec (871.2 MB/sec)
   [smoker]     verify md5/sha1 digests
   [smoker]   unpack lucene-7.1.0.tgz...
   [smoker]     verify JAR metadata/identity/no javax.* or java.* classes...
   [smoker]     test demo with 1.8...
   [smoker]       got 6169 hits for query "lucene"
   [smoker]     checkindex with 1.8...
   [smoker]     check Lucene's javadoc JAR
   [smoker]   unpack lucene-7.1.0.zip...
   [smoker]     verify JAR metadata/identity/no javax.* or java.* classes...
   [smoker]     test demo with 1.8...
   [smoker]       got 6169 hits for query "lucene"
   [smoker]     checkindex with 1.8...
   [smoker]     check Lucene's javadoc JAR
   [smoker]   unpack lucene-7.1.0-src.tgz...
   [smoker]     make sure no JARs/WARs in src dist...
   [smoker]     run "ant validate"
   [smoker]     run tests w/ Java 8 and testArgs='-Dtests.slow=false'...
   [smoker] 
   [smoker] command "export JAVA_HOME="/home/jenkins/tools/java/latest1.8" PATH="/home/jenkins/tools/java/latest1.8/bin:$PATH" JAVACMD="/home/jenkins/tools/java/latest1.8/bin/java"; ant clean test -Dtests.slow=false" failed:
   [smoker] Buildfile: /x1/jenkins/jenkins-slave/workspace/Lucene-Solr-SmokeRelease-7.x/lucene/build/smokeTestRelease/tmp/unpack/lucene-7.1.0/build.xml
   [smoker] 
   [smoker] clean:
   [smoker]    [delete] Deleting directory /x1/jenkins/jenkins-slave/workspace/Lucene-Solr-SmokeRelease-7.x/lucene/build/smokeTestRelease/tmp/unpack/lucene-7.1.0/build
   [smoker] 
   [smoker] ivy-availability-check:
   [smoker] 
   [smoker] ivy-fail:
   [smoker] 
   [smoker] ivy-configure:
   [smoker] [ivy:configure] :: Apache Ivy 2.3.0 - 20130110142753 :: http://ant.apache.org/ivy/ ::
   [smoker] [ivy:configure] :: loading settings :: file = /x1/jenkins/jenkins-slave/workspace/Lucene-Solr-SmokeRelease-7.x/lucene/build/smokeTestRelease/tmp/unpack/lucene-7.1.0/top-level-ivy-settings.xml
   [smoker] 
   [smoker] -clover.load:
   [smoker] 
   [smoker] resolve-groovy:
   [smoker] [ivy:cachepath] :: resolving dependencies :: org.codehaus.groovy#groovy-all-caller;working
   [smoker] [ivy:cachepath] 	confs: [default]
   [smoker] [ivy:cachepath] 	found org.codehaus.groovy#groovy-all;2.4.8 in public
   [smoker] [ivy:cachepath] :: resolution report :: resolve 157ms :: artifacts dl 3ms
   [smoker] 	---------------------------------------------------------------------
   [smoker] 	|                  |            modules            ||   artifacts   |
   [smoker] 	|       conf       | number| search|dwnlded|evicted|| number|dwnlded|
   [smoker] 	---------------------------------------------------------------------
   [smoker] 	|      default     |   1   |   0   |   0   |   0   ||   1   |   0   |
   [smoker] 	---------------------------------------------------------------------
   [smoker] 
   [smoker] -init-totals:
   [smoker] 
   [smoker] test-core:
   [smoker] 
   [smoker] -clover.disable:
   [smoker] 
   [smoker] ivy-availability-check:
   [smoker] 
   [smoker] ivy-fail:
   [smoker] 
   [smoker] ivy-configure:
   [smoker] [ivy:configure] :: loading settings :: file = /x1/jenkins/jenkins-slave/workspace/Lucene-Solr-SmokeRelease-7.x/lucene/build/smokeTestRelease/tmp/unpack/lucene-7.1.0/top-level-ivy-settings.xml
   [smoker] 
   [smoker] -clover.load:
   [smoker] 
   [smoker] -clover.classpath:
   [smoker] 
   [smoker] -clover.setup:
   [smoker] 
   [smoker] clover:
   [smoker] 
   [smoker] -check-git-state:
   [smoker] 
   [smoker] -git-cleanroot:
   [smoker] 
   [smoker] -copy-git-state:
   [smoker] 
   [smoker] git-autoclean:
   [smoker] 
   [smoker] resolve:
   [smoker] 
   [smoker] init:
   [smoker] 
   [smoker] compile-core:
   [smoker]     [mkdir] Created dir: /x1/jenkins/jenkins-slave/workspace/Lucene-Solr-SmokeRelease-7.x/lucene/build/smokeTestRelease/tmp/unpack/lucene-7.1.0/build/core/classes/java
   [smoker]     [javac] Compiling 823 source files to /x1/jenkins/jenkins-slave/workspace/Lucene-Solr-SmokeRelease-7.x/lucene/build/smokeTestRelease/tmp/unpack/lucene-7.1.0/build/core/classes/java
   [smoker]     [javac] Note: Some input files use or override a deprecated API.
   [smoker]     [javac] Note: Recompile with -Xlint:deprecation for details.
   [smoker]     [javac] Creating empty /x1/jenkins/jenkins-slave/workspace/Lucene-Solr-SmokeRelease-7.x/lucene/build/smokeTestRelease/tmp/unpack/lucene-7.1.0/build/core/classes/java/org/apache/lucene/util/graph/package-info.class
   [smoker]     [javac] Creating empty /x1/jenkins/jenkins-slave/workspace/Lucene-Solr-SmokeRelease-7.x/lucene/build/smokeTestRelease/tmp/unpack/lucene-7.1.0/build/core/classes/java/org/apache/lucene/document/package-info.class
   [smoker]     [javac] Creating empty /x1/jenkins/jenkins-slave/workspace/Lucene-Solr-SmokeRelease-7.x/lucene/build/smokeTestRelease/tmp/unpack/lucene-7.1.0/build/core/classes/java/org/apache/lucene/package-info.class
   [smoker]     [javac] Creating empty /x1/jenkins/jenkins-slave/workspace/Lucene-Solr-SmokeRelease-7.x/lucene/build/smokeTestRelease/tmp/unpack/lucene-7.1.0/build/core/classes/java/org/apache/lucene/util/bkd/package-info.class
   [smoker]     [javac] Creating empty /x1/jenkins/jenkins-slave/workspace/Lucene-Solr-SmokeRelease-7.x/lucene/build/smokeTestRelease/tmp/unpack/lucene-7.1.0/build/core/classes/java/org/apache/lucene/codecs/compressing/package-info.class
   [smoker]     [javac] Creating empty /x1/jenkins/jenkins-slave/workspace/Lucene-Solr-SmokeRelease-7.x/lucene/build/smokeTestRelease/tmp/unpack/lucene-7.1.0/build/core/classes/java/org/apache/lucene/codecs/lucene60/package-info.class
   [smoker]     [javac] Creating empty /x1/jenkins/jenkins-slave/workspace/Lucene-Solr-SmokeRelease-7.x/lucene/build/smokeTestRelease/tmp/unpack/lucene-7.1.0/build/core/classes/java/org/apache/lucene/codecs/package-info.class
   [smoker]     [javac] Creating empty /x1/jenkins/jenkins-slave/workspace/Lucene-Solr-SmokeRelease-7.x/lucene/build/smokeTestRelease/tmp/unpack/lucene-7.1.0/build/core/classes/java/org/apache/lucene/util/package-info.class
   [smoker]     [javac] Creating empty /x1/jenkins/jenkins-slave/workspace/Lucene-Solr-SmokeRelease-7.x/lucene/build/smokeTestRelease/tmp/unpack/lucene-7.1.0/build/core/classes/java/org/apache/lucene/index/package-info.class
   [smoker]     [javac] Creating empty /x1/jenkins/jenkins-slave/workspace/Lucene-Solr-SmokeRelease-7.x/lucene/build/smokeTestRelease/tmp/unpack/lucene-7.1.0/build/core/classes/java/org/apache/lucene/util/fst/package-info.class
   [smoker]     [javac] Creating empty /x1/jenkins/jenkins-slave/workspace/Lucene-Solr-SmokeRelease-7.x/lucene/build/smokeTestRelease/tmp/unpack/lucene-7.1.0/build/core/classes/java/org/apache/lucene/analysis/tokenattributes/package-info.class
   [smoker]     [javac] Creating empty /x1/jenkins/jenkins-slave/workspace/Lucene-Solr-SmokeRelease-7.x/lucene/build/smokeTestRelease/tmp/unpack/lucene-7.1.0/build/core/classes/java/org/apache/lucene/search/package-info.class
   [smoker]     [javac] Creating empty /x1/jenkins/jenkins-slave/workspace/Lucene-Solr-SmokeRelease-7.x/lucene/build/smokeTestRelease/tmp/unpack/lucene-7.1.0/build/core/classes/java/org/apache/lucene/codecs/lucene62/package-info.class
   [smoker]     [javac] Creating empty /x1/jenkins/jenkins-slave/workspace/Lucene-Solr-SmokeRelease-7.x/lucene/build/smokeTestRelease/tmp/unpack/lucene-7.1.0/build/core/classes/java/org/apache/lucene/util/packed/package-info.class
   [smoker]     [javac] Creating empty /x1/jenkins/jenkins-slave/workspace/Lucene-Solr-SmokeRelease-7.x/lucene/build/smokeTestRelease/tmp/unpack/lucene-7.1.0/build/core/classes/java/org/apache/lucene/util/mutable/package-info.class
   [smoker]     [javac] Creating empty /x1/jenkins/jenkins-slave/workspace/Lucene-Solr-SmokeRelease-7.x/lucene/build/smokeTestRelease/tmp/unpack/lucene-7.1.0/build/core/classes/java/org/apache/lucene/codecs/lucene70/package-info.class
   [smoker]     [javac] Creating empty /x1/jenkins/jenkins-slave/workspace/Lucene-Solr-SmokeRelease-7.x/lucene/build/smokeTestRelease/tmp/unpack/lucene-7.1.0/build/core/classes/java/org/apache/lucene/codecs/perfield/package-info.class
   [smoker]     [javac] Creating empty /x1/jenkins/jenkins-slave/workspace/Lucene-Solr-SmokeRelease-7.x/lucene/build/smokeTestRelease/tmp/unpack/lucene-7.1.0/build/core/classes/java/org/apache/lucene/analysis/package-info.class
   [smoker]     [javac] Creating empty /x1/jenkins/jenkins-slave/workspace/Lucene-Solr-SmokeRelease-7.x/lucene/build/smokeTestRelease/tmp/unpack/lucene-7.1.0/build/core/classes/java/org/apache/lucene/analysis/standard/package-info.class
   [smoker]     [javac] Creating empty /x1/jenkins/jenkins-slave/workspace/Lucene-Solr-SmokeRelease-7.x/lucene/build/smokeTestRelease/tmp/unpack/lucene-7.1.0/build/core/classes/java/org/apache/lucene/store/package-info.class
   [smoker]     [javac] Creating empty /x1/jenkins/jenkins-slave/workspace/Lucene-Solr-SmokeRelease-7.x/lucene/build/smokeTestRelease/tmp/unpack/lucene-7.1.0/build/core/classes/java/org/apache/lucene/codecs/blocktree/package-info.class
   [smoker]     [javac] Creating empty /x1/jenkins/jenkins-slave/workspace/Lucene-Solr-SmokeRelease-7.x/lucene/build/smokeTestRelease/tmp/unpack/lucene-7.1.0/build/core/classes/java/org/apache/lucene/search/spans/package-info.class
   [smoker]     [javac] Creating empty /x1/jenkins/jenkins-slave/workspace/Lucene-Solr-SmokeRelease-7.x/lucene/build/smokeTestRelease/tmp/unpack/lucene-7.1.0/build/core/classes/java/org/apache/lucene/search/similarities/package-info.class
   [smoker]     [javac] Creating empty /x1/jenkins/jenkins-slave/workspace/Lucene-Solr-SmokeRelease-7.x/lucene/build/smokeTestRelease/tmp/unpack/lucene-7.1.0/build/core/classes/java/org/apache/lucene/util/automaton/package-info.class
   [smoker]     [javac] Creating empty /x1/jenkins/jenkins-slave/workspace/Lucene-Solr-SmokeRelease-7.x/lucene/build/smokeTestRelease/tmp/unpack/lucene-7.1.0/build/core/classes/java/org/apache/lucene/codecs/lucene50/package-info.class
   [smoker]     [javac] Creating empty /x1/jenkins/jenkins-slave/workspace/Lucene-Solr-SmokeRelease-7.x/lucene/build/smokeTestRelease/tmp/unpack/lucene-7.1.0/build/core/classes/java/org/apache/lucene/geo/package-info.class
   [smoker]      [copy] Copying 3 files to /x1/jenkins/jenkins-slave/workspace/Lucene-Solr-SmokeRelease-7.x/lucene/build/smokeTestRelease/tmp/unpack/lucene-7.1.0/build/core/classes/java
   [smoker] 
   [smoker] compile-test-framework:
   [smoker] 
   [smoker] -check-git-state:
   [smoker] 
   [smoker] -git-cleanroot:
   [smoker] 
   [smoker] -copy-git-state:
   [smoker] 
   [smoker] git-autoclean:
   [smoker] 
   [smoker] ivy-availability-check:
   [smoker] 
   [smoker] ivy-fail:
   [smoker] 
   [smoker] ivy-configure:
   [smoker] [ivy:configure] :: loading settings :: file = /x1/jenkins/jenkins-slave/workspace/Lucene-Solr-SmokeRelease-7.x/lucene/build/smokeTestRelease/tmp/unpack/lucene-7.1.0/top-level-ivy-settings.xml
   [smoker] 
   [smoker] resolve:
   [smoker] 
   [smoker] init:
   [smoker] 
   [smoker] compile-lucene-core:
   [smoker] 
   [smoker] -check-git-state:
   [smoker] 
   [smoker] -git-cleanroot:
   [smoker] 
   [smoker] -copy-git-state:
   [smoker] 
   [smoker] git-autoclean:
   [smoker] 
   [smoker] ivy-availability-check:
   [smoker] 
   [smoker] ivy-fail:
   [smoker] 
   [smoker] ivy-configure:
   [smoker] [ivy:configure] :: loading settings :: file = /x1/jenkins/jenkins-slave/workspace/Lucene-Solr-SmokeRelease-7.x/lucene/build/smokeTestRelease/tmp/unpack/lucene-7.1.0/top-level-ivy-settings.xml
   [smoker] 
   [smoker] resolve:
   [smoker] 
   [smoker] init:
   [smoker] 
   [smoker] -clover.disable:
   [smoker] 
   [smoker] -clover.load:
   [smoker] 
   [smoker] -clover.classpath:
   [smoker] 
   [smoker] -clover.setup:
   [smoker] 
   [smoker] clover:
   [smoker] 
   [smoker] compile-core:
   [smoker] 
   [smoker] compile-codecs:
   [smoker] 
   [smoker] -check-git-state:
   [smoker] 
   [smoker] -git-cleanroot:
   [smoker] 
   [smoker] -copy-git-state:
   [smoker] 
   [smoker] git-autoclean:
   [smoker] 
   [smoker] ivy-availability-check:
   [smoker] 
   [smoker] ivy-fail:
   [smoker] 
   [smoker] ivy-configure:
   [smoker] [ivy:configure] :: loading settings :: file = /x1/jenkins/jenkins-slave/workspace/Lucene-Solr-SmokeRelease-7.x/lucene/build/smokeTestRelease/tmp/unpack/lucene-7.1.0/top-level-ivy-settings.xml
   [smoker] 
   [smoker] resolve:
   [smoker] 
   [smoker] common.init:
   [smoker] 
   [smoker] compile-lucene-core:
   [smoker] 
   [smoker] init:
   [smoker] 
   [smoker] -clover.disable:
   [smoker] 
   [smoker] -clover.load:
   [smoker] 
   [smoker] -clover.classpath:
   [smoker] 
   [smoker] -clover.setup:
   [smoker] 
   [smoker] clover:
   [smoker] 
   [smoker] compile-core:
   [smoker]     [mkdir] Created dir: /x1/jenkins/jenkins-slave/workspace/Lucene-Solr-SmokeRelease-7.x/lucene/build/smokeTestRelease/tmp/unpack/lucene-7.1.0/build/codecs/classes/java
   [smoker]     [javac] Compiling 67 source files to /x1/jenkins/jenkins-slave/workspace/Lucene-Solr-SmokeRelease-7.x/lucene/build/smokeTestRelease/tmp/unpack/lucene-7.1.0/build/codecs/classes/java
   [smoker]     [javac] Note: Some input files use or override a deprecated API.
   [smoker]     [javac] Note: Recompile with -Xlint:deprecation for details.
   [smoker]     [javac] Creating empty /x1/jenkins/jenkins-slave/workspace/Lucene-Solr-SmokeRelease-7.x/lucene/build/smokeTestRelease/tmp/unpack/lucene-7.1.0/build/codecs/classes/java/org/apache/lucene/codecs/bloom/package-info.class
   [smoker]     [javac] Creating empty /x1/jenkins/jenkins-slave/workspace/Lucene-Solr-SmokeRelease-7.x/lucene/build/smokeTestRelease/tmp/unpack/lucene-7.1.0/build/codecs/classes/java/org/apache/lucene/codecs/memory/package-info.class
   [smoker]     [javac] Creating empty /x1/jenkins/jenkins-slave/workspace/Lucene-Solr-SmokeRelease-7.x/lucene/build/smokeTestRelease/tmp/unpack/lucene-7.1.0/build/codecs/classes/java/org/apache/lucene/codecs/simpletext/package-info.class
   [smoker]     [javac] Creating empty /x1/jenkins/jenkins-slave/workspace/Lucene-Solr-SmokeRelease-7.x/lucene/build/smokeTestRelease/tmp/unpack/lucene-7.1.0/build/codecs/classes/java/org/apache/lucene/codecs/blockterms/package-info.class
   [smoker]     [javac] Creating empty /x1/jenkins/jenkins-slave/workspace/Lucene-Solr-SmokeRelease-7.x/lucene/build/smokeTestRelease/tmp/unpack/lucene-7.1.0/build/codecs/classes/java/org/apache/lucene/codecs/blocktreeords/package-info.class
   [smoker]      [copy] Copying 3 files to /x1/jenkins/jenkins-slave/workspace/Lucene-Solr-SmokeRelease-7.x/lucene/build/smokeTestRelease/tmp/unpack/lucene-7.1.0/build/codecs/classes/java
   [smoker] 
   [smoker] -clover.disable:
   [smoker] 
   [smoker] -clover.load:
   [smoker] 
   [smoker] -clover.classpath:
   [smoker] 
   [smoker] -clover.setup:
   [smoker] 
   [smoker] clover:
   [smoker] 
   [smoker] common.compile-core:
   [smoker]     [mkdir] Created dir: /x1/jenkins/jenkins-slave/workspace/Lucene-Solr-SmokeRelease-7.x/lucene/build/smokeTestRelease/tmp/unpack/lucene-7.1.0/build/test-framework/classes/java
   [smoker]     [javac] Compiling 188 source files to /x1/jenkins/jenkins-slave/workspace/Lucene-Solr-SmokeRelease-7.x/lucene/build/smokeTestRelease/tmp/unpack/lucene-7.1.0/build/test-framework/classes/java
   [smoker]     [javac] Note: Some input files use or override a deprecated API.
   [smoker]     [javac] Note: Recompile with -Xlint:deprecation for details.
   [smoker]     [javac] Creating empty /x1/jenkins/jenkins-slave/workspace/Lucene-Solr-SmokeRelease-7.x/lucene/build/smokeTestRelease/tmp/unpack/lucene-7.1.0/build/test-framework/classes/java/org/apache/lucene/codecs/asserting/package-info.class
   [smoker]     [javac] Creating empty /x1/jenkins/jenkins-slave/workspace/Lucene-Solr-SmokeRelease-7.x/lucene/build/smokeTestRelease/tmp/unpack/lucene-7.1.0/build/test-framework/classes/java/org/apache/lucene/codecs/ramonly/package-info.class
   [smoker]     [javac] Creating empty /x1/jenkins/jenkins-slave/workspace/Lucene-Solr-SmokeRelease-7.x/lucene/build/smokeTestRelease/tmp/unpack/lucene-7.1.0/build/test-framework/classes/java/org/apache/lucene/mockfile/package-info.class
   [smoker]     [javac] Creating empty /x1/jenkins/jenkins-slave/workspace/Lucene-Solr-SmokeRelease-7.x/lucene/build/smokeTestRelease/tmp/unpack/lucene-7.1.0/build/test-framework/classes/java/org/apache/lucene/codecs/cheapbastard/package-info.class
   [smoker]     [javac] Creating empty /x1/jenkins/jenkins-slave/workspace/Lucene-Solr-SmokeRelease-7.x/lucene/build/smokeTestRelease/tmp/unpack/lucene-7.1.0/build/test-framework/classes/java/org/apache/lucene/codecs/mockrandom/package-info.class
   [smoker]     [javac] Creating empty /x1/jenkins/jenkins-slave/workspace/Lucene-Solr-SmokeRelease-7.x/lucene/build/smokeTestRelease/tmp/unpack/lucene-7.1.0/build/test-framework/classes/java/org/apache/lucene/codecs/cranky/package-info.class
   [smoker]     [javac] Creating empty /x1/jenkins/jenkins-slave/workspace/Lucene-Solr-SmokeRelease-7.x/lucene/build/smokeTestRelease/tmp/unpack/lucene-7.1.0/build/test-framework/classes/java/org/apache/lucene/codecs/compressing/dummy/package-info.class
   [smoker]      [copy] Copying 4 files to /x1/jenkins/jenkins-slave/workspace/Lucene-Solr-SmokeRelease-7.x/lucene/build/smokeTestRelease/tmp/unpack/lucene-7.1.0/build/test-framework/classes/java
   [smoker] 
   [smoker] compile-core:
   [smoker] 
   [smoker] compile-test:
   [smoker]     [mkdir] Created dir: /x1/jenkins/jenkins-slave/workspace/Lucene-Solr-SmokeRelease-7.x/lucene/build/smokeTestRelease/tmp/unpack/lucene-7.1.0/build/core/classes/test
   [smoker]     [javac] Compiling 461 source files to /x1/jenkins/jenkins-slave/workspace/Lucene-Solr-SmokeRelease-7.x/lucene/build/smokeTestRelease/tmp/unpack/lucene-7.1.0/build/core/classes/test
   [smoker]     [javac] Note: Some input files use or override a deprecated API.
   [smoker]     [javac] Note: Recompile with -Xlint:deprecation for details.
   [smoker]      [copy] Copying 3 files to /x1/jenkins/jenkins-slave/workspace/Lucene-Solr-SmokeRelease-7.x/lucene/build/smokeTestRelease/tmp/unpack/lucene-7.1.0/build/core/classes/test
   [smoker] 
   [smoker] install-junit4-taskdef:
   [smoker] 
   [smoker] validate:
   [smoker] 
   [smoker] resolve-groovy:
   [smoker] 
   [smoker] -init-totals:
   [smoker] 
   [smoker] -test:
   [smoker]     [mkdir] Created dir: /x1/jenkins/jenkins-slave/workspace/Lucene-Solr-SmokeRelease-7.x/lucene/build/smokeTestRelease/tmp/unpack/lucene-7.1.0/build/core/test
   [smoker]     [mkdir] Created dir: /x1/jenkins/jenkins-slave/workspace/Lucene-Solr-SmokeRelease-7.x/lucene/build/smokeTestRelease/tmp/unpack/lucene-7.1.0/build/core/test/temp
   [smoker]     [mkdir] Created dir: /x1/jenkins/jenkins-slave/workspace/Lucene-Solr-SmokeRelease-7.x/lucene/build/smokeTestRelease/tmp/unpack/.caches/test-stats/core
   [smoker]    [junit4] <JUnit4> says aloha! Master seed: 6742EE6A19825FA1
   [smoker]    [junit4] Executing 454 suites with 3 JVMs.
   [smoker]    [junit4] 
   [smoker]    [junit4] Started J0 PID(3431@localhost).
   [smoker]    [junit4] Started J2 PID(3432@localhost).
   [smoker]    [junit4] Started J1 PID(3433@localhost).
   [smoker]    [junit4] Suite: org.apache.lucene.index.TestPayloadsOnVectors
   [smoker]    [junit4] Completed [1/454] on J2 in 3.12s, 3 tests
   [smoker]    [junit4] 
   [smoker]    [junit4] Suite: org.apache.lucene.search.TestSubScorerFreqs
   [smoker]    [junit4] Completed [2/454] on J2 in 1.22s, 3 tests
   [smoker]    [junit4] 
   [smoker]    [junit4] Suite: org.apache.lucene.search.TestConjunctions
   [smoker]    [junit4] Completed [3/454] on J2 in 0.37s, 1 test
   [smoker]    [junit4] 
   [smoker]    [junit4] Suite: org.apache.lucene.index.TestOmitNorms
   [smoker]    [junit4] Completed [4/454] on J0 in 8.08s, 5 tests
   [smoker]    [junit4] 
   [smoker]    [junit4] Suite: org.apache.lucene.search.TestReqExclBulkScorer
   [smoker]    [junit4] Completed [5/454] on J0 in 0.26s, 1 test
   [smoker]    [junit4] 
   [smoker]    [junit4] Suite: org.apache.lucene.index.TestUpgradeIndexMergePolicy
   [smoker]    [junit4] Completed [6/454] on J0 in 0.18s, 1 test
   [smoker]    [junit4] 
   [smoker]    [junit4] Suite: org.apache.lucene.index.TestIndexingSequenceNumbers
   [smoker]    [junit4] IGNOR/A 0.02s J0 | TestIndexingSequenceNumbers.testStressConcurrentAddAndDeleteAndCommit
   [smoker]    [junit4]    > Assumption #1: 'slow' test group is disabled (@Slow())
   [smoker]    [junit4] IGNOR/A 0.00s J0 | TestIndexingSequenceNumbers.testStressUpdateSameID
   [smoker]    [junit4]    > Assumption #1: 'slow' test group is disabled (@Slow())
   [smoker]    [junit4] IGNOR/A 0.00s J0 | TestIndexingSequenceNumbers.testStressConcurrentDocValuesUpdatesCommit
   [smoker]    [junit4]    > Assumption #1: 'slow' test group is disabled (@Slow())
   [smoker]    [junit4] IGNOR/A 0.00s J0 | TestIndexingSequenceNumbers.testStressConcurrentCommit
   [smoker]    [junit4]    > Assumption #1: 'slow' test group is disabled (@Slow())
   [smoker]    [junit4] Completed [7/454] on J0 in 0.39s, 8 tests, 4 skipped
   [smoker]    [junit4] 
   [smoker]    [junit4] Suite: org.apache.lucene.search.TestLongRangeFieldQueries
   [smoker]    [junit4] IGNOR/A 0.01s J2 | TestLongRangeFieldQueries.testRandomBig
   [smoker]    [junit4]    > Assumption #1: 'nightly' test group is disabled (@Nightly())
   [smoker]    [junit4] Completed [8/454] on J2 in 17.18s, 5 tests, 1 skipped
   [smoker]    [junit4] 
   [smoker]    [junit4] Suite: org.apache.lucene.search.TestLRUQueryCache
   [smoker]    [junit4] Completed [9/454] on J1 in 25.11s, 20 tests
   [smoker]    [junit4] 
   [smoker]    [junit4] Suite: org.apache.lucene.index.TestDocInverterPerFieldErrorInfo
   [smoker]    [junit4] Completed [10/454] on J1 in 0.23s, 2 tests
   [smoker]    [junit4] 
   [smoker]    [junit4] Suite: org.apache.lucene.util.TestRecyclingIntBlockAllocator
   [smoker]    [junit4] Completed [11/454] on J1 in 0.20s, 3 tests
   [smoker]    [junit4] 
   [smoker]    [junit4] Suite: org.apache.lucene.index.TestSumDocFreq
   [smoker]    [junit4] Completed [12/454] on J1 in 1.40s, 1 test
   [smoker]    [junit4] 
   [smoker]    [junit4] Suite: org.apache.lucene.geo.TestGeoUtils
   [smoker]    [junit4] Completed [13/454] on J0 in 18.73s, 7 tests
   [smoker]    [junit4] 
   [smoker]    [junit4] Suite: org.apache.lucene.TestMergeSchedulerExternal
   [smoker]    [junit4] Completed [14/454] on J1 in 1.71s, 2 tests
   [smoker]    [junit4] 
   [smoker]    [junit4] Suite: org.apache.lucene.index.TestOmitPositions
   [smoker]    [junit4] Completed [15/454] on J1 in 0.72s, 4 tests
   [smoker]    [junit4] 
   [smoker]    [junit4] Suite: org.apache.lucene.store.TestRAMDirectory
   [smoker]    [junit4] IGNOR/A 0.02s J1 | TestRAMDirectory.testPendingDeletions
   [smoker]    [junit4]    > Assumption #1: we can only install VirusCheckingFS on an FSDirectory
   [smoker]    [junit4] IGNOR/A 0.00s J1 | TestRAMDirectory.testFsyncDoesntCreateNewFiles
   [smoker]    [junit4]    > Assumption #1: test only works for FSDirectory subclasses
   [smoker]    [junit4] Completed [16/454] on J1 in 1.99s, 46 tests, 2 skipped
   [smoker]    [junit4] 
   [smoker]    [junit4] Suite: org.apache.lucene.search.TestMatchNoDocsQuery
   [smoker]    [junit4] Completed [17/454] on J1 in 0.12s, 3 tests
   [smoker]    [junit4] 
   [smoker]    [junit4] Suite: org.apache.lucene.search.TestAutomatonQuery
   [smoker]    [junit4] Completed [18/454] on J0 in 9.84s, 8 tests
   [smoker]    [junit4] 
   [smoker]    [junit4] Suite: org.apache.lucene.index.Test2BTerms
   [smoker]    [junit4] IGNOR/A 0.00s J0 | Test2BTerms.test2BTerms
   [smoker]    [junit4]    > Assumption #1: 'monster' test group is disabled (@Monster(value=very slow, use 5g minimum heap))
   [smoker]    [junit4] Completed [19/454] on J0 in 0.03s, 1 test, 1 skipped
   [smoker]    [junit4] 
   [smoker]    [junit4] Suite: org.apache.lucene.codecs.lucene70.TestLucene70NormsFormat
   [smoker]    [junit4] IGNOR/A 0.00s J2 | TestLucene70NormsFormat.testNCommonBig
   [smoker]    [junit4]    > Assumption #1: 'nightly' test group is disabled (@Nightly())
   [smoker]    [junit4] IGNOR/A 0.00s J2 | TestLucene70NormsFormat.testMergeStability
   [smoker]    [junit4]    > Assumption #1: The MockRandom PF randomizes content on the fly, so we can't check it
   [smoker]    [junit4] IGNOR/A 0.00s J2 | TestLucene70NormsFormat.testRamBytesUsed
   [smoker]    [junit4]    > Assumption #1: 'slow' test group is disabled (@Slow())
   [smoker]    [junit4] IGNOR/A 0.00s J2 | TestLucene70NormsFormat.testSparseNCommonBig
   [smoker]    [junit4]    > Assumption #1: 'nightly' test group is disabled (@Nightly())
   [smoker]    [junit4] Completed [20/454] on J2 in 31.69s, 29 tests, 4 skipped
   [smoker]    [junit4] 
   [smoker]    [junit4] Suite: org.apache.lucene.search.TestShardSearching
   [smoker]    [junit4] Completed [21/454] on J2 in 10.62s, 1 test
   [smoker]    [junit4] 
   [smoker]    [junit4] Suite: org.apache.lucene.index.TestIndexWriterExceptions
   [smoker]    [junit4] IGNOR/A 0.01s J0 | TestIndexWriterExceptions.testTooManyTokens
   [smoker]    [junit4]    > Assumption #1: 'nightly' test group is disabled (@Nightly())
   [smoker]    [junit4] Completed [22/454] on J0 in 27.86s, 34 tests, 1 skipped
   [smoker]    [junit4] 
   [smoker]    [junit4] Suite: org.apache.lucene.analysis.TestCharFilter
   [smoker]    [junit4] Completed [23/454] on J0 in 0.07s, 4 tests
   [smoker]    [junit4] 
   [smoker]    [junit4] Suite: org.apache.lucene.search.TestConstantScoreQuery
   [smoker]    [junit4] Completed [24/454] on J0 in 0.25s, 5 tests
   [smoker]    [junit4] 
   [smoker]    [junit4] Suite: org.apache.lucene.search.TestWildcardRandom
   [smoker]    [junit4] Completed [25/454] on J0 in 0.70s, 1 test
   [smoker]    [junit4] 
   [smoker]    [junit4] Suite: org.apache.lucene.util.bkd.TestMutablePointsReaderUtils
   [smoker]    [junit4] Completed [26/454] on J2 in 3.77s, 3 tests
   [smoker]    [junit4] 
   [smoker]    [junit4] Suite: org.apache.lucene.util.TestStringHelper
   [smoker]    [junit4] Completed [27/454] on J2 in 0.10s, 7 tests
   [smoker]    [junit4] 
   [smoker]    [junit4] Suite: org.apache.lucene.search.TestBoolean2ScorerSupplier
   [smoker]    [junit4] Completed [28/454] on J2 in 0.38s, 10 tests
   [smoker]    [junit4] 
   [smoker]    [junit4] Suite: org.apache.lucene.index.TestReadOnlyIndex
   [smoker]    [junit4] Completed [30/454] on J2 in 0.51s, 1 test
   [smoker]    [junit4] 
   [smoker]    [junit4] Suite: org.apache.lucene.search.TestPointQueries
   [smoker]    [junit4] IGNOR/A 0.00s J1 | TestPointQueries.testRandomLongsBig
   [smoker]    [junit4]    > Assumption #1: 'nightly' test group is disabled (@Nightly())
   [smoker]    [junit4] IGNOR/A 0.00s J1 | TestPointQueries.testRandomBinaryBig
   [smoker]    [junit4]    > Assumption #1: 'nightly' test group is disabled (@Nightly())
   [smoker]    [junit4] Completed [31/454] on J1 in 37.74s, 49 tests, 2 skipped
   [smoker]    [junit4] 
   [smoker]    [junit4] Suite: org.apache.lucene.index.TestSegmentTermEnum
   [smoker]    [junit4] Completed [32/454] on J2 in 0.35s, 2 tests
   [smoker]    [junit4] 
   [smoker]    [junit4] Suite: org.apache.lucene.analysis.TestStopFilter
   [smoker]    [junit4] Completed [33/454] on J2 in 0.13s, 4 tests
   [smoker]    [junit4] 
   [smoker]    [junit4] Suite: org.apache.lucene.index.TestTransactions
   [smoker]    [junit4] Completed [34/454] on J1 in 1.21s, 1 test
   [smoker]    [junit4] 
   [smoker]    [junit4] Suite: org.apache.lucene.util.packed.TestDirectPacked
   [smoker]    [junit4] Completed [35/454] on J0 in 4.03s, 4 tests
   [smoker]    [junit4] 
   [smoker]    [junit4] Suite: org.apache.lucene.search.TestEarlyTermination
   [smoker]    [junit4] Completed [36/454] on J0 in 0.14s, 1 test
   [smoker]    [junit4] 
   [smoker]    [junit4] Suite: org.apache.lucene.index.Test4GBStoredFields
   [smoker]    [junit4] IGNOR/A 0.00s J0 | Test4GBStoredFields.test
   [smoker]    [junit4]    > Assumption #1: 'nightly' test group is disabled (@Nightly())
   [smoker]    [junit4] Completed [37/454] on J0 in 0.02s, 1 test, 1 skipped
   [smoker]    [junit4] 
   [smoker]    [junit4] Suite: org.apache.lucene.index.TestAllFilesHaveCodecHeader
   [smoker]    [junit4] Completed [38/454] on J2 in 1.33s, 1 test
   [smoker]    [junit4] 
   [smoker]    [junit4] Suite: org.apache.lucene.search.TestPositionIncrement
   [smoker]    [junit4] Completed [39/454] on J1 in 0.71s, 2 tests
   [smoker]    [junit4] 
   [smoker]    [junit4] Suite: org.apache.lucene.index.TestSizeBoundedForceMerge
   [smoker]    [junit4] Completed [40/454] on J1 in 0.21s, 11 tests
   [smoker]    [junit4] 
   [smoker]    [junit4] Suite: org.apache.lucene.index.TestIndexWriterOnJRECrash
   [smoker]    [junit4] IGNOR/A 0.00s J1 | TestIndexWriterOnJRECrash.testNRTThreads
   [smoker]    [junit4]    > Assumption #1: 'nightly' test group is disabled (@Nightly())
   [smoker]    [junit4] Completed [41/454] on J1 in 0.00s, 1 test, 1 skipped
   [smoker]    [junit4] 
   [smoker]    [junit4] Suite: org.apache.lucene.search.TestTopDocsMerge
   [smoker]    [junit4] Completed [42/454] on J2 in 1.56s, 4 tests
   [smoker]    [junit4] 
   [smoker]    [junit4] Suite: org.apache.lucene.index.TestIndexInput
   [smoker]    [junit4] Completed [43/454] on J0 in 3.04s, 2 tests
   [smoker]    [junit4] 
   [smoker]    [junit4] Suite: org.apache.lucene.util.TestSmallFloat
   [smoker]    [junit4] Completed [44/454] on J0 in 0.33s, 4 tests
   [smoker]    [junit4] 
   [smoker]    [junit4] Suite: org.apache.lucene.search.TestSortRescorer
   [smoker]    [junit4] Completed [45/454] on J2 in 2.11s, 2 tests
   [smoker]    [junit4] 
   [smoker]    [junit4] Suite: org.apache.lucene.analysis.tokenattributes.TestCharTermAttributeImpl
   [smoker]    [junit4] Completed [46/454] on J2 in 0.91s, 12 tests
   [smoker]    [junit4] 
   [smoker]    [junit4] Suite: org.apache.lucene.util.automaton.TestCompiledAutomaton
   [smoker]    [junit4] Completed [47/454] on J2 in 1.01s, 6 tests
   [smoker]    [junit4] 
   [smoker]    [junit4] Suite: org.apache.lucene.index.Test2BSortedDocValuesOrds
   [smoker]    [junit4] IGNOR/A 0.00s J2 | Test2BSortedDocValuesOrds.test2BOrds
   [smoker]    [junit4]    > Assumption #1: 'monster' test group is disabled (@Monster(value=Takes ~ 6 hours if the heap is 5gb))
   [smoker]    [junit4] Completed [48/454] on J2 in 0.03s, 1 test, 1 skipped
   [smoker]    [junit4] 
   [smoker]    [junit4] Suite: org.apache.lucene.util.automaton.TestLevenshteinAutomata
   [smoker]    [junit4] Completed [49/454] on J1 in 6.47s, 4 tests
   [smoker]    [junit4] 
   [smoker]    [junit4] Suite: org.apache.lucene.index.TestDeletionPolicy
   [smoker]    [junit4] Completed [50/454] on J0 in 4.74s, 6 tests
   [smoker]    [junit4] 
   [smoker]    [junit4] Suite: org.apache.lucene.index.TestForTooMuchCloning
   [smoker]    [junit4] Completed [51/454] on J1 in 0.43s, 1 test
   [smoker]    [junit4] 
   [smoker]    [junit4] Suite: org.apache.lucene.util.fst.TestFSTs
   [smoker]    [junit4] IGNOR/A 0.00s J1 | TestFSTs.testBigSet
   [smoker]    [junit4]    > Assumption #1: 'nightly' test group is disabled (@Nightly())
   [smoker]    [junit4] IGNOR/A 0.00s J1 | TestFSTs.testNonFinalStopNode
   [smoker]    [junit4]    > Assumption #1: 'slow' test group is disabled (@Slow())
   [smoker]    [junit4] IGNOR/A 0.00s J1 | TestFSTs.testPrimaryKeys
   [smoker]    [junit4]    > Assumption #1: 'slow' test group is disabled (@Slow())
   [smoker]    [junit4] IGNOR/A 0.00s J1 | TestFSTs.testInternalFinalState
   [smoker]    [junit4]    > Assumption #1: 'slow' test group is disabled (@Slow())
   [smoker]    [junit4] IGNOR/A 0.00s J1 | TestFSTs.testShortestPaths
   [smoker]    [junit4]    > Assumption #1: 'slow' test group is disabled (@Slow())
   [smoker]    [junit4] IGNOR/A 0.00s J1 | TestFSTs.testSimple
   [smoker]    [junit4]    > Assumption #1: 'slow' test group is disabled (@Slow())
   [smoker]    [junit4] IGNOR/A 0.00s J1 | TestFSTs.testLargeOutputsOnArrayArcs
   [smoker]    [junit4]    > Assumption #1: 'slow' test group is disabled (@Slow())
   [smoker]    [junit4] IGNOR/A 0.00s J1 | TestFSTs.testDuplicateFSAString
   [smoker]    [junit4]    > Assumption #1: 'slow' test group is disabled (@Slow())
   [smoker]    [junit4] IGNOR/A 0.00s J1 | TestFSTs.testShortestPathsWFST
   [smoker]    [junit4]    > Assumption #1: 'slow' test group is disabled (@Slow())
   [smoker]    [junit4] IGNOR/A 0.00s J1 | TestFSTs.testFinalOutputOnEndState
   [smoker]    [junit4]    > Assumption #1: 'slow' test group is disabled (@Slow())
   [smoker]    [junit4] IGNOR/A 0.00s J1 | TestFSTs.testShortestPathsWFSTRandom
   [smoker]    [junit4]    > Assumption #1: 'slow' test group is disabled (@Slow())
   [smoker]    [junit4] IGNOR/A 0.00s J1 | TestFSTs.testBasicFSA
   [smoker]    [junit4]    > Assumption #1: 'slow' test group is disabled (@Slow())
   [smoker]    [junit4] IGNOR/A 0.00s J1 | TestFSTs.testShortestPathsRandom
   [smoker]    [junit4]    > Assumption #1: 'slow' test group is disabled (@Slow())
   [smoker]    [junit4] IGNOR/A 0.00s J1 | TestFSTs.testExpandedCloseToRoot
   [smoker]    [junit4]    > Assumption #1: 'slow' test group is disabled (@Slow())
   [smoker]    [junit4] IGNOR/A 0.00s J1 | TestFSTs.testRejectNoLimits
   [smoker]    [junit4]    > Assumption #1: 'slow' test group is disabled (@Slow())
   [smoker]    [junit4] IGNOR/A 0.00s J1 | TestFSTs.testRandomTermLookup
   [smoker]    [junit4]    > Assumption #1: 'slow' test group is disabled (@Slow())
   [smoker]    [junit4] IGNOR/A 0.00s J1 | TestFSTs.testRealTerms
   [smoker]    [junit4]    > Assumption #1: 'slow' test group is disabled (@Slow())
   [smoker]    [junit4] IGNOR/A 0.00s J1 | TestFSTs.testSingleString
   [smoker]    [junit4]    > Assumption #1: 'slow' test group is disabled (@Slow())
   [smoker]    [junit4] IGNOR/A 0.00s J1 | TestFSTs.testRandomWords
   [smoker]    [junit4]    > Assumption #1: 'slow' test group is disabled (@Slow())
   [smoker]    [junit4] IGNOR/A 0.00s J1 | TestFSTs.testIllegallyModifyRootArc
   [smoker]    [junit4]    > Assumption #1: 'slow' test group is disabled (@Slow())
   [smoker]    [junit4] Completed [52/454] on J1 in 0.04s, 20 tests, 20 skipped
   [smoker]    [junit4] 
   [smoker]    [junit4] Suite: org.apache.lucene.index.TestForceMergeForever
   [smoker]    [junit4] Completed [53/454] on J0 in 2.44s, 1 test
   [smoker]    [junit4] 
   [smoker]    [junit4] Suite: org.apache.lucene.index.TestNRTThreads
   [smoker]    [junit4] Completed [54/454] on J2 in 7.93s, 1 test
   [smoker]    [junit4] 
   [smoker]    [junit4] Suite: org.apache.lucene.analysis.tokenattributes.TestPackedTokenAttributeImpl
   [smoker]    [junit4] Completed [55/454] on J2 in 0.08s, 4 tests
   [smoker]    [junit4] 
   [smoker]    [junit4] Suite: org.apache.lucene.search.TestBoolean2
   [smoker]    [junit4] Completed [56/454] on J0 in 9.38s, 10 tests
   [smoker]    [junit4] 
   [smoker]    [junit4] Suite: org.apache.lucene.util.graph.TestGraphTokenStreamFiniteStrings
   [smoker]    [junit4] Completed [57/454] on J0 in 0.36s, 12 tests
   [smoker]    [junit4] 
   [smoker]    [junit4] Suite: org.apache.lucene.index.TestCrashCausesCorruptIndex
   [smoker]    [junit4] Completed [58/454] on J0 in 0.25s, 1 test
   [smoker]    [junit4] 
   [smoker]    [junit4] Suite: org.apache.lucene.util.TestArrayUtil
   [smoker]    [junit4] Completed [59/454] on J2 in 8.34s, 14 tests
   [smoker]    [junit4] 
   [smoker]    [junit4] Suite: org.apache.lucene.index.TestBagOfPostings
   [smoker]    [junit4] Completed [60/454] on J2 in 4.42s, 1 test
   [smoker]    [junit4] 
   [smoker]    [junit4] Suite: org.apache.lucene.index.TestSameTokenSamePosition
   [smoker]    [junit4] Completed [61/454] on J2 in 0.14s, 2 tests
   [smoker]    [junit4] 
   [smoker]    [junit4] Suite: org.apache.lucene.search.TestComplexExplanationsOfNonMatches
   [smoker]    [junit4] Completed [62/454] on J2 in 0.44s, 21 tests
   [smoker]    [junit4] 
   [smoker]    [junit4] Suite: org.apache.lucene.search.similarities.TestSimilarityBase
   [smoker]    [junit4] Completed [63/454] on J2 in 1.19s, 31 tests
   [smoker]    [junit4] 
   [smoker]    [junit4] Suite: org.apache.lucene.util.TestRollingBuffer
   [smoker]    [junit4] Completed [64/454] on J2 in 0.84s, 1 test
   [smoker]    [junit4] 
   [smoker]    [junit4] Suite: org.apache.lucene.util.TestFixedLengthBytesRefArray
   [smoker]    [junit4] Completed [65/454] on J2 in 0.17s, 2 tests
   [smoker]    [junit4] 
   [smoker]    [junit4] Suite: org.apache.lucene.index.TestNoMergePolicy
   [smoker]    [junit4] Completed [66/454] on J2 in 0.12s, 4 tests
   [smoker]    [junit4] 
   [smoker]    [junit4] Suite: org.apache.lucene.codecs.perfield.TestPerFieldPostingsFormat
   [smoker]    [junit4] IGNOR/A 0.00s J0 | TestPerFieldPostingsFormat.testPostingsEnumReuse
   [smoker]    [junit4]    > Assumption #1: The MockRandom PF randomizes content on the fly, so we can't check it
   [smoker]    [junit4] IGNOR/A 0.00s J0 | TestPerFieldPostingsFormat.testRamBytesUsed
   [smoker]    [junit4]    > Assumption #1: 'slow' test group is disabled (@Slow())
   [smoker]    [junit4] IGNOR/A 0.00s J0 | TestPerFieldPostingsFormat.testMergeStability
   [smoker]    [junit4]    > Assumption #1: The MockRandom PF randomizes content on the fly, so we can't check it
   [smoker]    [junit4] Completed [67/454] on J0 in 10.32s, 25 tests, 3 skipped
   [smoker]    [junit4] 
   [smoker]    [junit4] Suite: org.apache.lucene.search.spans.TestSpanNotQuery
   [smoker]    [junit4] Completed [68/454] on J0 in 0.12s, 3 tests
   [smoker]    [junit4] 
   [smoker]    [junit4] Suite: org.apache.lucene.util.TestFixedBitSet
   [smoker]    [junit4] Completed [69/454] on J2 in 7.95s, 19 tests
   [smoker]    [junit4] 
   [smoker]    [junit4] Suite: org.apache.lucene.index.TestMultiTermsEnum
   [smoker]    [junit4] Completed [70/454] on J2 in 0.10s, 1 test
   [smoker]    [junit4] 
   [smoker]    [junit4] Suite: org.apache.lucene.search.spans.TestSpanBoostQuery
   [smoker]    [junit4] Completed [71/454] on J2 in 0.04s, 2 tests
   [smoker]    [junit4] 
   [smoker]    [junit4] Suite: org.apache.lucene.analysis.TestCharacterUtils
   [smoker]    [junit4] Completed [72/454] on J2 in 0.07s, 4 tests
   [smoker]    [junit4] 
   [smoker]    [junit4] Suite: org.apache.lucene.search.TestMultiThreadTermVectors
   [smoker]    [junit4] Completed [73/454] on J0 in 7.27s, 1 test
   [smoker]    [junit4] 
   [smoker]    [junit4] Suite: org.apache.lucene.index.TestStressIndexing
   [smoker]    [junit4] Completed [74/454] on J0 in 2.58s, 1 test
   [smoker]    [junit4] 
   [smoker]    [junit4] Suite: org.apache.lucene.index.TestConsistentFieldNumbers
   [smoker]    [junit4] Completed [75/454] on J2 in 4.08s, 4 tests
   [smoker]    [junit4] 
   [smoker]    [junit4] Suite: org.apache.lucene.index.TestSegmentMerger
   [smoker]    [junit4] Completed [76/454] on J0 in 2.56s, 3 tests
   [smoker]    [junit4] 
   [smoker]    [junit4] Suite: org.apache.lucene.index.TestIndexWriterDelete
   [smoker]    [junit4] IGNOR/A 0.00s J1 | TestIndexWriterDelete.testApplyDeletesOnFlush
   [smoker]    [junit4]    > Assumption #1: 'nightly' test group is disabled (@Nightly())
   [smoker]    [junit4] Completed [77/454] on J1 in 41.21s, 25 tests, 2 skipped
   [smoker]    [junit4] 
   [smoker]    [junit4] Suite: org.apache.lucene.search.TestBooleanMinShouldMatch
   [smoker]    [junit4] Completed [78/454] on J0 in 6.57s, 17 tests
   [smoker]    [junit4] 
   [smoker]    [junit4] Suite: org.apache.lucene.search.TestMatchAllDocsQuery
   [smoker]    [junit4] Completed [79/454] on J0 in 0.26s, 2 tests
   [smoker]    [junit4] 
   [smoker]    [junit4] Suite: org.apache.lucene.search.TestMinShouldMatch2
   [smoker]    [junit4] Completed [80/454] on J2 in 8.38s, 6 tests
   [smoker]    [junit4] 
   [smoker]    [junit4] Suite: org.apache.lucene.search.spans.TestSpansEnum
   [smoker]    [junit4] Completed [81/454] on J0 in 0.33s, 7 tests
   [smoker]    [junit4] 
   [smoker]    [junit4] Suite: org.apache.lucene.util.TestVersion
   [smoker]    [junit4] Completed [82/454] on J2 in 0.12s, 11 tests
   [smoker]    [junit4] 
   [smoker]    [junit4] Suite: org.apache.lucene.util.automaton.TestDeterminizeLexicon
   [smoker]    [junit4] Completed [83/454] on J0 in 3.63s, 1 test
   [smoker]    [junit4] 
   [smoker]    [junit4] Suite: org.apache.lucene.index.TestTerm
   [smoker]    [junit4] Completed [84/454] on J0 in 0.09s, 1 test
   [smoker]    [junit4] 
   [smoker]    [junit4] Suite: org.apache.lucene.index.TestNoDeletionPolicy
   [smoker]    [junit4] Completed [85/454] on J0 in 0.26s, 4 tests
   [smoker]    [junit4] 
   [smoker]    [junit4] Suite: org.apache.lucene.util.automaton.TestAutomaton
   [smoker]    [junit4] Completed [86/454] on J2 in 7.28s, 56 tests
   [smoker]    [junit4] 
   [smoker]    [junit4] Suite: org.apache.lucene.search.spans.TestSpanTermQuery
   [smoker]    [junit4] Completed [87/454] on J2 in 0.13s, 2 tests
   [smoker]    [junit4] 
   [smoker]    [junit4] Suite: org.apache.lucene.search.TestTermRangeQuery
   [smoker]    [junit4] Completed [88/454] on J2 in 0.39s, 7 tests
   [smoker]    [junit4] 
   [smoker]    [junit4] Suite: org.apache.lucene.store.TestNIOFSDirectory
   [smoker]    [junit4] Completed [89/454] on J2 in 1.54s, 42 tests
   [smoker]    [junit4] 
   [smoker]    [junit4] Suite: org.apache.lucene.util.automaton.TestUTF32ToUTF8
   [smoker]    [junit4] Completed [90/454] on J0 in 9.26s, 6 tests
   [smoker]    [junit4] 
   [smoker]    [junit4] Suite: org.apache.lucene.index.TestConcurrentMergeScheduler
   [smoker]    [junit4] Completed [91/454] on J1 in 14.99s, 16 tests
   [smoker]    [junit4] 
   [smoker]    [junit4] Suite: org.apache.lucene.search.similarities.TestClassicSimilarity
   [smoker]    [junit4] Completed [92/454] on J0 in 0.47s, 12 tests
   [smoker]    [junit4] 
   [smoker]    [junit4] Suite: org.apache.lucene.index.TestFlex
   [smoker]    [junit4] Completed [93/454] on J0 in 1.26s, 2 tests
   [smoker]    [junit4] 
   [smoker]    [junit4] Suite: org.apache.lucene.index.TestMultiDocValues
   [smoker]    [junit4] Completed [94/454] on J1 in 1.43s, 7 tests
   [smoker]    [junit4] 
   [smoker]    [junit4] Suite: org.apache.lucene.search.similarities.TestBM25Similarity
   [smoker]    [junit4] Completed [95/454] on J1 in 0.14s, 3 tests
   [smoker]    [junit4] 
   [smoker]    [junit4] Suite: org.apache.lucene.util.TestNotDocIdSet
   [smoker]    [junit4] Completed [96/454] on J1 in 2.55s, 6 tests
   [smoker]    [junit4] 
   [smoker]    [junit4] Suite: org.apache.lucene.index.TestPostingsOffsets
   [smoker]    [junit4] Completed [97/454] on J0 in 3.65s, 13 tests
   [smoker]    [junit4] 
   [smoker]    [junit4] Suite: org.apache.lucene.index.TestMergeRateLimiter
   [smoker]    [junit4] Completed [98/454] on J0 in 0.03s, 1 test
   [smoker]    [junit4] 
   [smoker]    [junit4] Suite: org.apache.lucene.util.TestCollectionUtil
   [smoker]    [junit4] Completed [99/454] on J2 in 10.12s, 4 tests
   [smoker]    [junit4] 
   [smoker]    [junit4] Suite: org.apache.lucene.index.TestLogMergePolicy
   [smoker]    [junit4] Completed [100/454] on J2 in 0.16s, 2 tests
   [smoker]    [junit4] 
   [smoker]    [junit4] Suite: org.apache.lucene.util.TestCharsRefBuilder
   [smoker]    [junit4] Completed [101/454] on J2 in 0.03s, 2 tests
   [smoker]    [junit4] 
   [smoker]    [junit4] Suite: org.apache.lucene.codecs.lucene70.TestLucene70SegmentInfoFormat
   [smoker]    [junit4] Completed [102/454] on J0 in 1.32s, 16 tests
   [smoker]    [junit4] 
   [smoker]    [junit4] Suite: org.apache.lucene.search.TestSameScoresWithThreads
   [smoker]    [junit4] Completed [103/454] on J1 in 2.47s, 1 test
   [smoker]    [junit4] 
   [smoker]    [junit4] Suite: org.apache.lucene.search.TestMultiPhraseQuery
   [smoker]    [junit4] Completed [104/454] on J0 in 0.42s, 16 tests, 1 skipped
   [smoker]    [junit4] 
   [smoker]    [junit4] Suite: org.apache.lucene.index.TestDocCount
   [smoker]    [junit4] Completed [105/454] on J0 in 0.25s, 1 test
   [smoker]    [junit4] 
   [smoker]    [junit4] Suite: org.apache.lucene.index.TestSwappedIndexFiles
   [smoker]    [junit4] Completed [106/454] on J1 in 0.34s, 1 test
   [smoker]    [junit4] 
   [smoker]    [junit4] Suite: org.apache.lucene.search.spans.TestSpanCollection
   [smoker]    [junit4] Completed [107/454] on J0 in 0.18s, 3 tests
   [smoker]    [junit4] 
   [smoker]    [junit4] Suite: org.apache.lucene.index.TestStressIndexing2
   [smoker]    [junit4] Completed [108/454] on J2 in 2.03s, 3 tests
   [smoker]    [junit4] 
   [smoker]    [junit4] Suite: org.apache.lucene.TestSearchForDuplicates
   [smoker]    [junit4] Completed [109/454] on J2 in 0.28s, 1 test
   [smoker]    [junit4] 
   [smoker]    [junit4] Suite: org.apache.lucene.util.TestByteBlockPool
   [smoker]    [junit4] Completed [110/454] on J2 in 0.13s, 2 tests
   [smoker]    [junit4] 
   [smoker]    [junit4] Suite: org.apache.lucene.TestAssertions
   [smoker]    [junit4] Completed [111/454] on J2 in 0.08s, 1 test
   [smoker]    [junit4] 
   [smoker]    [junit4] Suite: org.apache.lucene.util.TestStringMSBRadixSorter
   [smoker]    [junit4] Completed [112/454] on J0 in 6.09s, 7 tests
   [smoker]    [junit4] 
   [smoker]    [junit4] Suite: org.apache.lucene.codecs.compressing.TestFastDecompressionMode
   [smoker]    [junit4] Completed [113/454] on J1 in 6.52s, 11 tests
   [smoker]    [junit4] 
   [smoker]    [junit4] Suite: org.apache.lucene.index.TestIndexWriterMaxDocs
   [smoker]    [junit4] IGNOR/A 0.00s J2 | TestIndexWriterMaxDocs.testExactlyAtTrueLimit
   [smoker]    [junit4]    > Assumption #1: 'monster' test group is disabled (@Monster(value=takes over two hours))
   [smoker]    [junit4] Completed [114/454] on J2 in 6.98s, 21 tests, 1 skipped
   [smoker]    [junit4] 
   [smoker]    [junit4] Suite: org.apache.lucene.util.TestIntArrayDocIdSet
   [smoker]    [junit4] Completed [115/454] on J2 in 1.85s, 5 tests
   [smoker]    [junit4] 
   [smoker]    [junit4] Suite: org.apache.lucene.util.TestSentinelIntSet
   [smoker]    [junit4] Completed [116/454] on J2 in 0.30s, 2 tests
   [smoker]    [junit4] 
   [smoker]    [junit4] Suite: org.apache.lucene.store.TestFilterDirectory
   [smoker]    [junit4] IGNOR/A 0.01s J2 | TestFilterDirectory.testPendingDeletions
   [smoker]    [junit4]    > Assumption #1: we can only install VirusCheckingFS on an FSDirectory
   [smoker]    [junit4] IGNOR/A 0.00s J2 | TestFilterDirectory.testFsyncDoesntCreateNewFiles
   [smoker]    [junit4]    > Assumption #1: test only works for FSDirectory subclasses
   [smoker]    [junit4] Completed [117/454] on J2 in 0.89s, 44 tests, 2 skipped
   [smoker]    [junit4] 
   [smoker]    [junit4] Suite: org.apache.lucene.search.TestLongValuesSource
   [smoker]    [junit4] Completed [118/454] on J0 in 6.36s, 4 tests
   [smoker]    [junit4] 
   [smoker]    [junit4] Suite: org.apache.lucene.index.TestNewestSegment
   [smoker]    [junit4] Completed [119/454] on J0 in 0.05s, 1 test
   [smoker]    [junit4] 
   [smoker]    [junit4] Suite: org.apache.lucene.store.TestHugeRamFile
   [smoker]    [junit4] Completed [120/454] on J2 in 3.62s, 1 test
   [smoker]    [junit4] 
   [smoker]    [junit4] Suite: org.apache.lucene.codecs.lucene50.TestBlockPostingsFormat2
   [smoker]    [junit4] Completed [121/454] on J0 in 4.87s, 4 tests
   [smoker]    [junit4] 
   [smoker]    [junit4] Suite: org.apache.lucene.index.TestMultiFields
   [smoker]    [junit4] Completed [122/454] on J2 in 4.28s, 3 tests
   [smoker]    [junit4] 
   [smoker]    [junit4] Suite: org.apache.lucene.index.TestIndexWriterLockRelease
   [smoker]    [junit4] Completed [123/454] on J2 in 0.06s, 1 test
   [smoker]    [junit4] 
   [smoker]    [junit4] Suite: org.apache.lucene.index.TestIndexableField
   [smoker]    [junit4] Completed [124/454] on J0 in 2.15s, 2 tests
   [smoker]    [junit4] 
   [smoker]    [junit4] Suite: org.apache.lucene.util.TestIOUtils
   [smoker]    [junit4] Completed [125/454] on J2 in 0.77s, 18 tests
   [smoker]    [junit4] 
   [smoker]    [junit4] Suite: org.apache.lucene.search.TestSearchAfter
   [smoker]    [junit4] Completed [126/454] on J0 in 0.97s, 1 test
   [smoker]    [junit4] 
   [smoker]    [junit4] Suite: org.apache.lucene.util.TestWeakIdentityMap
   [smoker]    [junit4] Completed [127/454] on J1 in 15.34s, 2 tests
   [smoker]    [junit4] 
   [smoker]    [junit4] Suite: org.apache.lucene.search.TestPrefixInBooleanQuery
   [smoker]    [junit4] Completed [128/454] on J1 in 1.91s, 4 tests
   [smoker]    [junit4] 
   [smoker]    [junit4] Suite: org.apache.lucene.search.TestMultiTermConstantScore
   [smoker]    [junit4] Completed [129/454] on J1 in 0.87s, 7 tests
   [smoker]    [junit4] 
   [smoker]    [junit4] Suite: org.apache.lucene.index.TestDuelingCodecs
   [smoker]    [junit4] IGNOR/A 0.00s J1 | TestDuelingCodecs.testEquals
   [smoker]    [junit4]    > Assumption #1: 'slow' test group is disabled (@Slow())
   [smoker]    [junit4] IGNOR/A 0.00s J1 | TestDuelingCodecs.testCrazyReaderEquals
   [smoker]    [junit4]    > Assumption #1: 'slow' test group is disabled (@Slow())
   [smoker]    [junit4] Completed [130/454] on J1 in 0.01s, 2 tests, 2 skipped
   [smoker]    [junit4] 
   [smoker]    [junit4] Suite: org.apache.lucene.index.TestRollback
   [smoker]    [junit4] Completed [131/454] on J1 in 0.08s, 1 test
   [smoker]    [junit4] 
   [smoker]    [junit4] Suite: org.apache.lucene.analysis.TestToken
   [smoker]    [junit4] Completed [132/454] on J1 in 0.04s, 5 tests
   [smoker]    [junit4] 
   [smoker]    [junit4] Suite: org.apache.lucene.search.TestFuzzyQuery
   [smoker]    [junit4] Completed [133/454] on J0 in 6.57s, 11 tests
   [smoker]    [junit4] 
   [smoker]    [junit4] Suite: org.apache.lucene.codecs.lucene50.TestBlockPostingsFormat3
   [smoker]    [junit4] Completed [134/454] on J1 in 3.78s, 1 test
   [smoker]    [junit4] 
   [smoker]    [junit4] Suite: org.apache.lucene.search.spans.TestSpanFirstQuery
   [smoker]    [junit4] Completed [135/454] on J1 in 0.10s, 1 test
   [smoker]    [junit4] 
   [smoker]    [junit4] Suite: org.apache.lucene.util.TestTimSorter
   [smoker]    [junit4] Completed [136/454] on J1 in 0.25s, 9 tests
   [smoker]    [junit4] 
   [smoker]    [junit4] Suite: org.apache.lucene.index.TestOmitTf
   [smoker]    [junit4] Completed [137/454] on J1 in 1.15s, 6 tests
   [smoker]    [junit4] 
   [smoker]    [junit4] Suite: org.apache.lucene.search.TestWildcard
   [smoker]    [junit4] Completed [138/454] on J1 in 0.23s, 8 tests
   [smoker]    [junit4] 
   [smoker]    [junit4] Suite: org.apache.lucene.index.TestBagOfPositions
   [smoker]    [junit4] Completed [139/454] on J0 in 5.98s, 1 test
   [smoker]    [junit4] 
   [smoker]    [junit4] Suite: org.apache.lucene.index.TestUniqueTermCount
   [smoker]    [junit4] Completed [140/454] on J0 in 0.16s, 1 test
   [smoker]    [junit4] 
   [smoker]    [junit4] Suite: org.apache.lucene.search.TestSimilarityProvider
   [smoker]    [junit4] Completed [141/454] on J0 in 0.15s, 1 test
   [smoker]    [junit4] 
   [smoker]    [junit4] Suite: org.apache.lucene.index.TestBinaryTerms
   [smoker]    [junit4] Completed [142/454] on J0 in 0.15s, 2 tests
   [smoker]    [junit4] 
   [smoker]    [junit4] Suite: org.apache.lucene.search.TestNGramPhraseQuery
   [smoker]    [junit4] Completed [143/454] on J0 in 0.04s, 1 test
   [smoker]    [junit4] 
   [smoker]    [junit4] Suite: org.apache.lucene.search.TestCachingCollector
   [smoker]    [junit4] Completed [144/454] on J0 in 0.06s, 4 tests
   [smoker]    [junit4] 
   [smoker]    [junit4] Suite: org.apache.lucene.search.TestBooleanOr
   [smoker]    [junit4] Completed [145/454] on J1 in 3.94s, 7 tests
   [smoker]    [junit4] 
   [smoker]    [junit4] Suite: org.apache.lucene.index.TestDuelingCodecsAtNight
   [smoker]    [junit4] IGNOR/A 0.00s J1 | TestDuelingCodecsAtNight.testEquals
   [smoker]    [junit4]    > Assumption #1: 'nightly' test group is disabled (@Nightly())
   [smoker]    [junit4] IGNOR/A 0.00s J1 | TestDuelingCodecsAtNight.testBigEquals
   [smoker]    [junit4]    > Assumption #1: 'nightly' test group is disabled (@Nightly())
   [smoker]    [junit4] IGNOR/A 0.00s J1 | TestDuelingCodecsAtNight.testCrazyReaderEquals
   [smoker]    [junit4]    > Assumption #1: 'nightly' test group is disabled (@Nightly())
   [smoker]    [junit4] Completed [146/454] on J1 in 0.02s, 3 tests, 3 skipped
   [smoker]    [junit4] 
   [smoker]    [junit4] Suite: org.apache.lucene.search.TestPhrasePrefixQuery
   [smoker]    [junit4] Completed [147/454] on J1 in 0.09s, 1 test
   [smoker]    [junit4] 
   [smoker]    [junit4] Suite: org.apache.lucene.index.TestIndexWriterOnVMError
   [smoker]    [junit4] IGNOR/A 0.00s J0 | TestIndexWriterOnVMError.testCheckpoint
   [smoker]    [junit4]    > Assumption #1: 'nightly' test group is disabled (@Nightly())
   [smoker]    [junit4] Completed [148/454] on J0 in 0.85s, 3 tests, 1 skipped
   [smoker]    [junit4] 
   [smoker]    [junit4] Suite: org.apache.lucene.util.TestInPlaceMergeSorter
   [smoker]    [junit4] Completed [149/454] on J1 in 0.52s, 9 tests
   [smoker]    [junit4] 
   [smoker]    [junit4] Suite: org.apache.lucene.util.TestRoaringDocIdSet
   [smoker]    [junit4] Completed [150/454] on J0 in 1.56s, 5 tests
   [smoker]    [junit4] 
   [smoker]    [junit4] Suite: org.apache.lucene.index.TestCustomNorms
   [smoker]    [junit4] Completed [151/454] on J1 in 2.28s, 1 test
   [smoker]    [junit4] 
   [smoker]    [junit4] Suite: org.apache.lucene.store.TestByteArrayDataInput
   [smoker]    [junit4] Completed [152/454] on J1 in 0.06s, 1 test
   [smoker]    [junit4] 
   [smoker]    [junit4] Suite: org.apache.lucene.util.TestDocIdSetBuilder
   [smoker]    [junit4] Completed [153/454] on J0 in 2.06s, 7 tests
   [smoker]    [junit4] 
   [smoker]    [junit4] Suite: org.apache.lucene.index.TestFilterCodecReader
   [smoker]    [junit4] Completed [154/454] on J0 in 0.03s, 1 test
   [smoker]    [junit4] 
   [smoker]    [junit4] Suite: org.apache.lucene.search.TestBooleanRewrites
   [smoker]    [junit4] Completed [155/454] on J0 in 1.03s, 10 tests
   [smoker]    [junit4] 
   [smoker]    [junit4] Suite: org.apache.lucene.index.TestCheckIndex
   [smoker]    [junit4] Completed [156/454] on J1 in 2.01s, 4 tests
   [smoker]    [junit4] 
   [smoker]    [junit4] Suite: org.apache.lucene.search.spans.TestSpanContainQuery
   [smoker]    [junit4] Completed [157/454] on J1 in 0.19s, 4 tests
   [smoker]    [junit4] 
   [smoker]    [junit4] Suite: org.apache.lucene.search.TestRegexpRandom
   [smoker]    [junit4] Completed [158/454] on J0 in 0.62s, 1 test
   [smoker]    [junit4] 
   [smoker]    [junit4] Suite: org.apache.lucene.index.TestDocIDMerger
   [smoker]    [junit4] Completed [159/454] on J0 in 0.12s, 2 tests
   [smoker]    [junit4] 
   [smoker]    [junit4] Suite: org.apache.lucene.util.TestSparseFixedBitDocIdSet
   [smoker]    [junit4] Completed [160/454] on J0 in 0.92s, 5 tests
   [smoker]    [junit4] 
   [smoker]    [junit4] Suite: org.apache.lucene.search.spans.TestFieldMaskingSpanQuery
   [smoker]    [junit4] IGNOR/A 0.01s J0 | TestFieldMaskingSpanQuery.testSpans2
   [smoker]    [junit4]    > Assumption #1: Broken scoring: LUCENE-3723
   [smoker]    [junit4] IGNOR/A 0.00s J0 | TestFieldMaskingSpanQuery.testSimple2
   [smoker]    [junit4]    > Assumption #1: Broken scoring: LUCENE-3723
   [smoker]    [junit4] Completed [161/454] on J0 in 0.61s, 11 tests, 2 skipped
   [smoker]    [junit4] 
   [smoker]    [junit4] Suite: org.apache.lucene.geo.TestPolygon2D
   [smoker]    [junit4] Completed [162/454] on J2 in 22.99s, 10 tests
   [smoker]    [junit4] 
   [smoker]    [junit4] Suite: org.apache.lucene.index.TestIntBlockPool
   [smoker]    [junit4] Completed [163/454] on J0 in 1.92s, 2 tests
   [smoker]    [junit4] 
   [smoker]    [junit4] Suite: org.apache.lucene.util.TestUnicodeUtil
   [smoker]    [junit4] Completed [164/454] on J0 in 1.02s, 5 tests
   [smoker]    [junit4] 
   [smoker]    [junit4] Suite: org.apache.lucene.util.TestNamedSPILoader
   [smoker]    [junit4] Completed [165/454] on J0 in 0.05s, 3 tests
   [smoker]    [junit4] 
   [smoker]    [junit4] Suite: org.apache.lucene.index.Test2BPoints
   [smoker]    [junit4] IGNOR/A 0.00s J0 | Test2BPoints.test2D
   [smoker]    [junit4]    > Assumption #1: 'monster' test group is disabled (@Monster(value=takes at least 4 hours and consumes many GB of temp disk space))
   [smoker]    [junit4] IGNOR/A 0.00s J0 | Test2BPoints.test1D
   [smoker]    [junit4]    > Assumption #1: 'monster' test group is disabled (@Monster(value=takes at least 4 hours and consumes many GB of temp disk space))
   [smoker]    [junit4] Completed [166/454] on J0 in 0.03s, 2 tests, 2 skipped
   [smoker]    [junit4] 
   [smoker]    [junit4] Suite: org.apache.lucene.index.TestDocsAndPositions
   [smoker]    [junit4] Completed [167/454] on J0 in 0.92s, 6 tests
   [smoker]    [junit4] 
   [smoker]    [junit4] Suite: org.apache.lucene.search.spans.TestSpanMultiTermQueryWrapper
   [smoker]    [junit4] Completed [168/454] on J0 in 0.41s, 9 tests
   [smoker]    [junit4] 
   [smoker]    [junit4] Suite: org.apache.lucene.analysis.TestWordlistLoader
   [smoker]    [junit4] Completed [169/454] on J0 in 0.04s, 3 tests
   [smoker]    [junit4] 
   [smoker]    [junit4] Suite: org.apache.lucene.analysis.tokenattributes.TestSimpleAttributeImpl
   [smoker]    [junit4] Completed [170/454] on J0 in 0.04s, 1 test
   [smoker]    [junit4] 
   [smoker]    [junit4] Suite: org.apache.lucene.analysis.TestCharArrayMap
   [smoker]    [junit4] Completed [171/454] on J0 in 0.26s, 4 tests
   [smoker]    [junit4] 
   [smoker]    [junit4] Suite: org.apache.lucene.index.TestIndexWriterUnicode
   [smoker]    [junit4] Completed [172/454] on J1 in 7.65s, 5 tests
   [smoker]    [junit4] 
   [smoker]    [junit4] Suite: org.apache.lucene.index.TestCrash
   [smoker]    [junit4] Completed [173/454] on J1 in 1.13s, 5 tests
   [smoker]    [junit4] 
   [smoker]    [junit4] Suite: org.apache.lucene.search.TestComplexExplanations
   [smoker]    [junit4] Completed [174/454] on J1 in 2.79s, 21 tests
   [smoker]    [junit4] 
   [smoker]    [junit4] Suite: org.apache.lucene.codecs.lucene50.TestLucene50StoredFieldsFormatHighCompression
   [smoker]    [junit4] IGNOR/A 0.00s J2 | TestLucene50StoredFieldsFormatHighCompression.testBigDocuments
   [smoker]    [junit4]    > Assumption #1: 'nightly' test group is disabled (@Nightly())
   [smoker]    [junit4] IGNOR/A 0.00s J2 | TestLucene50StoredFieldsFormatHighCompression.testRamBytesUsed
   [smoker]    [junit4]    > Assumption #1: 'slow' test group is disabled (@Slow())
   [smoker]    [junit4] Completed [175/454] on J2 in 13.66s, 19 tests, 2 skipped
   [smoker]    [junit4] 
   [smoker]    [junit4] Suite: org.apache.lucene.search.TestSloppyPhraseQuery2
   [smoker]    [junit4] Completed [176/454] on J2 in 3.96s, 9 tests
   [smoker]    [junit4] 
   [smoker]    [junit4] Suite: org.apache.lucene.store.TestGrowableByteArrayDataOutput
   [smoker]    [junit4] Completed [177/454] on J0 in 18.84s, 2 tests
   [smoker]    [junit4] 
   [smoker]    [junit4] Suite: org.apache.lucene.search.TestNot
   [smoker]    [junit4] Completed [178/454] on J0 in 0.11s, 1 test
   [smoker]    [junit4] 
   [smoker]    [junit4] Suite: org.apache.lucene.search.similarities.TestAxiomaticSimilarity
   [smoker]    [junit4] Completed [179/454] on J0 in 0.07s, 3 tests
   [smoker]    [junit4] 
   [smoker]    [junit4] Suite: org.apache.lucene.search.spans.TestSpanSearchEquivalence
   [smoker]    [junit4] Completed [180/454] on J2 in 6.49s, 33 tests
   [smoker]    [junit4] 
   [smoker]    [junit4] Suite: org.apache.lucene.search.TestControlledRealTimeReopenThread
   [smoker]    [junit4] IGNOR/A 0.00s J0 | TestControlledRealTimeReopenThread.testCRTReopen
   [smoker]    [junit4]    > Assumption #1: 'awaitsfix' test group is disabled (@AwaitsFix(bugUrl=https://issues.apache.org/jira/browse/LUCENE-5737))
   [smoker]    [junit4] Completed [181/454] on J0 in 3.30s, 6 tests, 1 skipped
   [smoker]    [junit4] 
   [smoker]    [junit4] Suite: org.apache.lucene.index.TestDirectoryReader
   [smoker]    [junit4] Completed [182/454] on J2 in 2.46s, 24 tests
   [smoker]    [junit4] 
   [smoker]    [junit4] Suite: org.apache.lucene.search.MultiCollectorTest
   [smoker]    [junit4] Completed [183/454] on J2 in 0.07s, 4 tests
   [smoker]    [junit4] 
   [smoker]    [junit4] Suite: org.apache.lucene.search.TestFieldCacheRewriteMethod
   [smoker]    [junit4] Completed [184/454] on J2 in 4.18s, 2 tests
   [smoker]    [junit4] 
   [smoker]    [junit4] Suite: org.apache.lucene.index.Test2BNumericDocValues
   [smoker]    [junit4] IGNOR/A 0.00s J2 | Test2BNumericDocValues.testNumerics
   [smoker]    [junit4]    > Assumption #1: 'monster' test group is disabled (@Monster(value=takes ~ 2 hours if the heap is 5gb))
   [smoker]    [junit4] Completed [185/454] on J2 in 0.01s, 1 test, 1 skipped
   [smoker]    [junit4] 
   [smoker]    [junit4] Suite: org.apache.lucene.index.TestIndexWriter
   [smoker]    [junit4] Completed [186/454] on J0 in 10.11s, 72 tests, 1 skipped
   [smoker]    [junit4] 
   [smoker]    [junit4] Suite: org.apache.lucene.store.TestMultiMMap
   [smoker]    [junit4] Completed [187/454] on J2 in 7.59s, 54 tests
   [smoker]    [junit4] 
   [smoker]    [junit4] Suite: org.apache.lucene.search.TestTopDocsCollector
   [smoker]    [junit4] Completed [188/454] on J2 in 0.34s, 8 tests
   [smoker]    [junit4] 
   [smoker]    [junit4] Suite: org.apache.lucene.index.TestIndexWriterOnDiskFull
   [smoker]    [junit4] Completed [189/454] on J2 in 1.28s, 4 tests
   [smoker]    [junit4] 
   [smoker]    [junit4] Suite: org.apache.lucene.util.TestLSBRadixSorter
   [smoker]    [junit4] Completed [190/454] on J2 in 0.25s, 6 tests
   [smoker]    [junit4] 
   [smoker]    [junit4] Suite: org.apache.lucene.index.TestIndexWriterReader
   [smoker]    [junit4] IGNOR/A 0.00s J0 | TestIndexWriterReader.testAddIndexesAndDoDeletesThreads
   [smoker]    [junit4]    > Assumption #1: 'slow' test group is disabled (@Slow())
   [smoker]    [junit4] IGNOR/A 0.00s J0 | TestIndexWriterReader.testDuringAddIndexes
   [smoker]    [junit4]    > Assumption #1: 'nightly' test group is disabled (@Nightly())
   [smoker]    [junit4] Completed [191/454] on J0 in 7.10s, 23 tests, 2 skipped
   [smoker]    [junit4] 
   [smoker]    [junit4] Suite: org.apache.lucene.index.TestRollingUpdates
   [smoker]    [junit4] Completed [192/454] on J2 in 3.31s, 2 tests
   [smoker]    [junit4] 
   [smoker]    [junit4] Suite: org.apache.lucene.index.TestIndexWriterMerging
   [smoker]    [junit4] IGNOR/A 0.00s J0 | TestIndexWriterMerging.testNoWaitClose
   [smoker]    [junit4]    > Assumption #1: 'slow' test group is disabled (@Slow())
   [smoker]    [junit4] Completed [193/454] on J0 in 3.28s, 6 tests, 1 skipped
   [smoker]    [junit4] 
   [smoker]    [junit4] Suite: org.apache.lucene.util.fst.TestBytesStore
   [smoker]    [junit4] Completed [194/454] on J0 in 1.46s, 1 test
   [smoker]    [junit4] 
   [smoker]    [junit4] Suite: org.apache.lucene.util.TestSloppyMath
   [smoker]    [junit4] Completed [195/454] on J2 in 5.51s, 8 tests
   [smoker]    [junit4] 
   [smoker]    [junit4] Suite: org.apache.lucene.index.TestTermVectors
   [smoker]    [junit4] Completed [196/454] on J2 in 0.94s, 3 tests
   [smoker]    [junit4] 
   [smoker]    [junit4] Suite: org.apache.lucene.search.TestSortedSetSortField
   [smoker]    [junit4] Completed [197/454] on J2 in 0.20s, 7 tests
   [smoker]    [junit4] 
   [smoker]    [junit4] Suite: org.apache.lucene.index.Test2BBinaryDocValues
   [smoker]    [junit4] IGNOR/A 0.00s J2 | Test2BBinaryDocValues.testVariableBinary
   [smoker]    [junit4]    > Assumption #1: 'monster' test group is disabled (@Monster(value=takes ~ 6 hours if the heap is 5gb))
   [smoker]    [junit4] IGNOR/A 0.00s J2 | Test2BBinaryDocValues.testFixedBinary
   [smoker]    [junit4]    > Assumption #1: 'monster' test group is disabled (@Monster(value=takes ~ 6 hours if the heap is 5gb))
   [smoker]    [junit4] Completed [198/454] on J2 in 0.00s, 2 tests, 2 skipped
   [smoker]    [junit4] 
   [smoker]    [junit4] Suite: org.apache.lucene.index.TestLongPostings
   [smoker]    [junit4] Completed [199/454] on J2 in 9.11s, 2 tests
   [smoker]    [junit4] 
   [smoker]    [junit4] Suite: org.apache.lucene.search.TestDateSort
   [smoker]    [junit4] Completed [200/454] on J2 in 0.21s, 1 test
   [smoker]    [junit4] 
   [smoker]    [junit4] Suite: org.apache.lucene.index.TestIndexCommit
   [smoker]    [junit4] Completed [201/454] on J2 in 0.08s, 1 test
   [smoker]    [junit4] 
   [smoker]    [junit4] Suite: org.apache.lucene.util.TestRadixSelector
   [smoker]    [junit4] Completed [202/454] on J2 in 1.71s, 2 tests
   [smoker]    [junit4] 
   [smoker]    [junit4] Suite: org.apache.lucene.util.packed.TestPackedInts
   [smoker]    [junit4] IGNOR/A 0.01s J0 | TestPackedInts.testBlockReaderOverflow
   [smoker]    [junit4]    > Assumption #1: 'nightly' test group is disabled (@Nightly())
   [smoker]    [junit4] Completed [203/454] on J0 in 15.67s, 28 tests, 3 skipped
   [smoker]    [junit4] 
   [smoker]    [junit4] Suite: org.apache.lucene.index.TestIndexWriterWithThreads
   [smoker]    [junit4] IGNOR/A 0.00s J0 | TestIndexWriterWithThreads.testIOExceptionDuringWriteSegmentOnlyOnce
   [smoker]    [junit4]    > Assumption #1: 'slow' test group is disabled (@Slow())
   [smoker]    [junit4] IGNOR/A 0.00s J0 | TestIndexWriterWithThreads.testIOExceptionDuringAbortWithThreadsOnlyOnce
   [smoker]    [junit4]    > Assumption #1: 'slow' test group is disabled (@Slow())
   [smoker]    [junit4] IGNOR/A 0.00s J0 | TestIndexWriterWithThreads.testRollbackAndCommitWithThreads
   [smoker]    [junit4]    > Assumption #1: 'slow' test group is disabled (@Slow())
   [smoker]    [junit4] IGNOR/A 0.00s J0 | TestIndexWriterWithThreads.testCloseWithThreads
   [smoker]    [junit4]    > Assumption #1: 'slow' test group is disabled (@Slow())
   [smoker]    [junit4] IGNOR/A 0.00s J0 | TestIndexWriterWithThreads.testIOExceptionDuringAbort
   [smoker]    [junit4]    > Assumption #1: 'slow' test group is disabled (@Slow())
   [smoker]    [junit4] IGNOR/A 0.00s J0 | TestIndexWriterWithThreads.testIOExceptionDuringAbortWithThreads
   [smoker]    [junit4]    > Assumption #1: 'slow' test group is disabled (@Slow())
   [smoker]    [junit4] IGNOR/A 0.00s J0 | TestIndexWriterWithThreads.testIOExceptionDuringAbortOnlyOnce
   [smoker]    [junit4]    > Assumption #1: 'slow' test group is disabled (@Slow())
   [smoker]    [junit4] IGNOR/A 0.00s J0 | TestIndexWriterWithThreads.testOpenTwoIndexWritersOnDifferentThreads
   [smoker]    [junit4]    > Assumption #1: 'slow' test group is disabled (@Slow())
   [smoker]    [junit4] IGNOR/A 0.00s J0 | TestIndexWriterWithThreads.testIOExceptionDuringWriteSegment
   [smoker]    [junit4]    > Assumption #1: 'slow' test group is disabled (@Slow())
   [smoker]    [junit4] IGNOR/A 0.00s J0 | TestIndexWriterWithThreads.testIOExceptionDuringWriteSegmentWithThreads
   [smoker]    [junit4]    > Assumption #1: 'slow' test group is disabled (@Slow())
   [smoker]    [junit4] IGNOR/A 0.00s J0 | TestIndexWriterWithThreads.testIOExceptionDuringWriteSegmentWithThreadsOnlyOnce
   [smoker]    [junit4]    > Assumption #1: 'slow' test group is disabled (@Slow())
   [smoker]    [junit4] IGNOR/A 0.00s J0 | TestIndexWriterWithThreads.testImmediateDiskFullWithThreads
   [smoker]    [junit4]    > Assumption #1: 'slow' test group is disabled (@Slow())
   [smoker]    [junit4] Completed [204/454] on J0 in 0.02s, 12 tests, 12 skipped
   [smoker]    [junit4] 
   [smoker]    [junit4] Suite: org.apache.lucene.index.TestIndexWriterMergePolicy
   [smoker]    [junit4] Completed [205/454] on J2 in 6.80s, 7 tests
   [smoker]    [junit4] 
   [smoker]    [junit4] Suite: org.apache.lucene.search.spans.TestBasics
   [smoker]    [junit4] Completed [206/454] on J2 in 5.67s, 26 tests
   [smoker]    [junit4] 
   [smoker]    [junit4] Suite: org.apache.lucene.analysis.TestGraphTokenizers
   [smoker]    [junit4] Completed [207/454] on J0 in 12.80s, 23 tests
   [smoker]    [junit4] 
   [smoker]    [junit4] Suite: org.apache.lucene.index.TestFlushByRamOrCountsPolicy
   [smoker]    [junit4] Completed [208/454] on J2 in 5.12s, 5 tests
   [smoker]    [junit4] 
   [smoker]    [junit4] Suite: org.apache.lucene.search.TestSloppyPhraseQuery
   [smoker]    [junit4] Completed [209/454] on J0 in 2.61s, 9 tests
   [smoker]    [junit4] 
   [smoker]    [junit4] Suite: org.apache.lucene.index.TestPersistentSnapshotDeletionPolicy
   [smoker]    [junit4] Completed [210/454] on J2 in 2.22s, 13 tests
   [smoker]    [junit4] 
   [smoker]    [junit4] Suite: org.apache.lucene.index.TestNorms
   [smoker]    [junit4] IGNOR/A 0.00s J2 | TestNorms.testMaxByteNorms
   [smoker]    [junit4]    > Assumption #1: 'slow' test group is disabled (@Slow())
   [smoker]    [junit4] IGNOR/A 0.00s J2 | TestNorms.testEmptyValueVsNoValue
   [smoker]    [junit4]    > Assumption #1: 'slow' test group is disabled (@Slow())
   [smoker]    [junit4] Completed [211/454] on J2 in 0.02s, 2 tests, 2 skipped
   [smoker]    [junit4] 
   [smoker]    [junit4] Suite: org.apache.lucene.index.TestStressAdvance
   [smoker]    [junit4] Completed [212/454] on J0 in 6.01s, 1 test
   [smoker]    [junit4] 
   [smoker]    [junit4] Suite: org.apache.lucene.index.TestIndexWriterCommit
   [smoker]    [junit4] Completed [213/454] on J0 in 3.31s, 14 tests
   [smoker]    [junit4] 
   [smoker]    [junit4] Suite: org.apache.lucene.index.TestDirectoryReaderReopen
   [smoker]    [junit4] Completed [214/454] on J0 in 2.59s, 14 tests
   [smoker]    [junit4] 
   [smoker]    [junit4] Suite: org.apache.lucene.codecs.perfield.TestPerFieldDocValuesFormat
   [smoker]    [junit4] IGNOR/A 0.00s J1 | TestPerFieldDocValuesFormat.testThreads2
   [smoker]    [junit4]    > Assumption #1: 'slow' test group is disabled (@Slow())
   [smoker]    [junit4] IGNOR/A 0.00s J1 | TestPerFieldDocValuesFormat.testRamBytesUsed
   [smoker]    [junit4]    > Assumption #1: 'slow' test group is disabled (@Slow())
   [smoker]    [junit4] IGNOR/A 0.00s J1 | TestPerFieldDocValuesFormat.testThreads3
   [smoker]    [junit4]    > Assumption #1: 'slow' test group is disabled (@Slow())
   [smoker]    [junit4] Completed [215/454] on J1 in 86.65s, 110 tests, 3 skipped
   [smoker]    [junit4] 
   [smoker]    [junit4] Suite: org.apache.lucene.search.TestTimeLimitingCollector
   [smoker]    [junit4] Completed [216/454] on J0 in 6.01s, 7 tests
   [smoker]    [junit4] 
   [smoker]    [junit4] Suite: org.apache.lucene.search.TestSearchWithThreads
   [smoker]    [junit4] Completed [217/454] on J0 in 8.50s, 1 test
   [smoker]    [junit4] 
   [smoker]    [junit4] Suite: org.apache.lucene.codecs.compressing.TestHighCompressionMode
   [smoker]    [junit4] Completed [218/454] on J0 in 2.72s, 7 tests
   [smoker]    [junit4] 
   [smoker]    [junit4] Suite: org.apache.lucene.analysis.standard.TestStandardAnalyzer
   [smoker]    [junit4] IGNOR/A 0.00s J2 | TestStandardAnalyzer.testLargePartiallyMatchingToken
   [smoker]    [junit4]    > Assumption #1: 'slow' test group is disabled (@Slow())
   [smoker]    [junit4] Completed [219/454] on J2 in 32.02s, 36 tests, 1 skipped
   [smoker]    [junit4] 
   [smoker]    [junit4] Suite: org.apache.lucene.index.TestDocumentsWriterStallControl
   [smoker]    [junit4] Completed [220/454] on J0 in 4.43s, 3 tests
   [smoker]    [junit4] 
   [smoker]    [junit4] Suite: org.apache.lucene.index.TestNeverDelete
   [smoker]    [junit4] Completed [221/454] on J0 in 3.56s, 1 test
   [smoker]    [junit4] 
   [smoker]    [junit4] Suite: org.apache.lucene.index.TestSnapshotDeletionPolicy
   [smoker]    [junit4] Completed [222/454] on J0 in 1.87s, 7 tests
   [smoker]    [junit4] 
   [smoker]    [junit4] Suite: org.apache.lucene.index.TestNRTReaderWithThreads
   [smoker]    [junit4] Completed [223/454] on J0 in 1.82s, 1 test
   [smoker]    [junit4] 
   [smoker]    [junit4] Suite: org.apache.lucene.util.automaton.TestMinimize
   [smoker]    [junit4] Completed [224/454] on J2 in 8.21s, 3 tests
   [smoker]    [junit4] 
   [smoker]    [junit4] Suite: org.apache.lucene.index.TestIndexWriterForceMerge
   [smoker]    [junit4] Completed [225/454] on J2 in 4.13s, 4 tests
   [smoker]    [junit4] 
   [smoker]    [junit4] Suite: org.apache.lucene.index.TestTieredMergePolicy
   [smoker]    [junit4] Completed [226/454] on J0 in 9.37s, 6 tests
   [smoker]    [junit4] 
   [smoker]    [junit4] Suite: org.apache.lucene.index.TestByteSlices
   [smoker]    [junit4] Completed [227/454] on J2 in 5.03s, 1 test
   [smoker]    [junit4] 
   [smoker]    [junit4] Suite: org.apache.lucene.store.TestBufferedIndexInput
   [smoker]    [junit4] Completed [228/454] on J0 in 0.57s, 4 tests
   [smoker]    [junit4] 
   [smoker]    [junit4] Suite: org.apache.lucene.search.TestSimpleExplanations
   [smoker]    [junit4] Completed [229/454] on J0 in 4.27s, 70 tests
   [smoker]    [junit4] 
   [smoker]    [junit4] Suite: org.apache.lucene.store.TestLockFactory
   [smoker]    [junit4] Completed [230/454] on J0 in 0.09s, 2 tests
   [smoker]    [junit4] 
   [smoker]    [junit4] Suite: org.apache.lucene.search.TestPhraseQuery
   [smoker]    [junit4] Completed [231/454] on J0 in 2.62s, 21 tests
   [smoker]    [junit4] 
   [smoker]    [junit4] Suite: org.apache.lucene.index.TestTermsEnum
   [smoker]    [junit4] IGNOR/A 0.00s J2 | TestTermsEnum.testVaryingTermsPerSegment
   [smoker]    [junit4]    > Assumption #1: 'slow' test group is disabled (@Slow())
   [smoker]    [junit4] Completed [232/454] on J2 in 10.18s, 13 tests, 1 skipped
   [smoker]    [junit4] 
   [smoker]    [junit4] Suite: org.apache.lucene.search.TestRegexpRandom2
   [smoker]    [junit4] Completed [233/454] on J0 in 5.03s, 1 test
   [smoker]    [junit4] 
   [smoker]    [junit4] Suite: org.apache.lucene.index.TestSegmentReader
   [smoker]    [junit4] Completed [234/454] on J0 in 1.13s, 7 tests
   [smoker]    [junit4] 
   [smoker]    [junit4] Suite: org.apache.lucene.index.TestParallelCompositeReader
   [smoker]    [junit4] Completed [235/454] on J0 in 0.44s, 11 tests
   [smoker]    [junit4] 
   [smoker]    [junit4] Suite: org.apache.lucene.store.TestNRTCachingDirectory
   [smoker]    [junit4] IGNOR/A 0.00s J2 | TestNRTCachingDirectory.testPendingDeletions
   [smoker]    [junit4]    > Assumption #1: we can only install VirusCheckingFS on an FSDirectory
   [smoker]    [junit4] IGNOR/A 0.00s J2 | TestNRTCachingDirectory.testFsyncDoesntCreateNewFiles
   [smoker]    [junit4]    > Assumption #1: test only works for FSDirectory subclasses
   [smoker]    [junit4] Completed [236/454] on J2 in 5.33s, 44 tests, 2 skipped
   [smoker]    [junit4] 
   [smoker]    [junit4] Suite: org.apache.lucene.util.TestPagedBytes
   [smoker]    [junit4] Completed [237/454] on J2 in 6.49s, 4 tests, 1 skipped
   [smoker]    [junit4] 
   [smoker]    [junit4] Suite: org.apache.lucene.index.TestSegmentTermDocs
   [smoker]    [junit4] Completed [238/454] on J2 in 0.93s, 4 tests
   [smoker]    [junit4] 
   [smoker]    [junit4] Suite: org.apache.lucene.index.TestIndexWriterNRTIsCurrent
   [smoker]    [junit4] Completed [239/454] on J0 in 8.67s, 1 test
   [smoker]    [junit4] 
   [smoker]    [junit4] Suite: org.apache.lucene.search.TestSort
   [smoker]    [junit4] Completed [240/454] on J0 in 0.32s, 25 tests
   [smoker]    [junit4] 
   [smoker]    [junit4] Suite: org.apache.lucene.codecs.perfield.TestPerFieldPostingsFormat2
   [smoker]    [junit4] Completed [241/454] on J2 in 0.90s, 6 tests
   [smoker]    [junit4] 
   [smoker]    [junit4] Suite: org.apache.lucene.index.TestFieldsReader
   [smoker]    [junit4] Completed [242/454] on J0 in 0.99s, 2 tests
   [smoker]    [junit4] 
   [smoker]    [junit4] Suite: org.apache.lucene.search.TestSimpleSearchEquivalence
   [smoker]    [junit4] Completed [243/454] on J2 in 1.10s, 17 tests
   [smoker]    [junit4] 
   [smoker]    [junit4] Suite: org.apache.lucene.index.TestDocValuesIndexing
   [smoker]    [junit4] Completed [244/454] on J2 in 0.86s, 34 tests
   [smoker]    [junit4] 
   [smoker]    [junit4] Suite: org.apache.lucene.index.Test2BDocs
   [smoker]    [junit4] IGNOR/A 0.00s J2 | Test2BDocs.test2BDocs
   [smoker]    [junit4]    > Assumption #1: 'monster' test group is disabled (@Monster(value=Takes ~30min))
   [smoker]    [junit4] Completed [245/454] on J2 in 0.01s, 1 test, 1 skipped
   [smoker]    [junit4] 
   [smoker]    [junit4] Suite: org.apache.lucene.search.TestCustomSearcherSort
   [smoker]    [junit4] Completed [246/454] on J0 in 2.68s, 2 tests
   [smoker]    [junit4] 
   [smoker]    [junit4] Suite: org.apache.lucene.search.spans.TestSpans
   [smoker]    [junit4] Completed [247/454] on J2 in 0.97s, 26 tests
   [smoker]    [junit4] 
   [smoker]    [junit4] Suite: org.apache.lucene.index.TestTransactionRollback
   [smoker]    [junit4] Completed [248/454] on J2 in 0.94s, 2 tests
   [smoker]    [junit4] 
   [smoker]    [junit4] Suite: org.apache.lucene.index.TestMixedCodecs
   [smoker]    [junit4] Completed [249/454] on J0 in 1.77s, 1 test
   [smoker]    [junit4] 
   [smoker]    [junit4] Suite: org.apache.lucene.search.spans.TestSpanExplanations
   [smoker]    [junit4] Completed [250/454] on J2 in 0.83s, 30 tests
   [smoker]    [junit4] 
   [smoker]    [junit4] Suite: org.apache.lucene.index.TestLazyProxSkipping
   [smoker]    [junit4] Completed [251/454] on J2 in 0.44s, 2 tests
   [smoker]    [junit4] 
   [smoker]    [junit4] Suite: org.apache.lucene.codecs.compressing.TestFastCompressionMode
   [smoker]    [junit4] Completed [252/454] on J0 in 2.57s, 11 tests
   [smoker]    [junit4] 
   [smoker]    [junit4] Suite: org.apache.lucene.util.automaton.TestDeterminism
   [smoker]    [junit4] Completed [253/454] on J2 in 1.64s, 2 tests
   [smoker]    [junit4] 
   [smoker]    [junit4] Suite: org.apache.lucene.index.TestTermVectorsWriter
   [smoker]    [junit4] Completed [254/454] on J0 in 0.53s, 15 tests
   [smoker]    [junit4] 
   [smoker]    [junit4] Suite: org.apache.lucene.index.TestParallelLeafReader
   [smoker]    [junit4] Completed [255/454] on J0 in 0.58s, 9 tests
   [smoker]    [junit4] 
   [smoker]    [junit4] Suite: org.apache.lucene.index.TestCodecs
   [smoker]    [junit4] Completed [256/454] on J2 in 1.31s, 3 tests
   [smoker]    [junit4] 
   [smoker]    [junit4] Suite: org.apache.lucene.index.TestThreadedForceMerge
   [smoker]    [junit4] Completed [257/454] on J2 in 1.32s, 1 test
   [smoker]    [junit4] 
   [smoker]    [junit4] Suite: org.apache.lucene.util.TestBytesRefHash
   [smoker]    [junit4] Completed [258/454] on J0 in 3.09s, 8 tests
   [smoker]    [junit4] 
   [smoker]    [junit4] Suite: org.apache.lucene.index.TestStressNRT
   [smoker]    [junit4] Completed [259/454] on J2 in 2.23s, 1 test
   [smoker]    [junit4] 
   [smoker]    [junit4] Suite: org.apache.lucene.search.TestDisjunctionMaxQuery
   [smoker]    [junit4] Completed [260/454] on J0 in 1.51s, 13 tests
   [smoker]    [junit4] 
   [smoker]    [junit4] Suite: org.apache.lucene.search.spans.TestNearSpansOrdered
   [smoker]    [junit4] Completed [261/454] on J2 in 0.72s, 19 tests
   [smoker]    [junit4] 
   [smoker]    [junit4] Suite: org.apache.lucene.index.TestDocumentsWriterDeleteQueue
   [smoker]    [junit4] Completed [262/454] on J0 in 0.42s, 5 tests
   [smoker]    [junit4] 
   [smoker]    [junit4] Suite: org.apache.lucene.index.TestDocumentWriter
   [smoker]    [junit4] Completed [263/454] on J2 in 0.43s, 6 tests
   [smoker]    [junit4] 
   [smoker]    [junit4] Suite: org.apache.lucene.search.TestLiveFieldValues
   [smoker]    [junit4] Completed [264/454] on J2 in 1.39s, 1 test
   [smoker]    [junit4] 
   [smoker]    [junit4] Suite: org.apache.lucene.index.TestPayloads
   [smoker]    [junit4] Completed [265/454] on J2 in 0.45s, 7 tests
   [smoker]    [junit4] 
   [smoker]    [junit4] Suite: org.apache.lucene.index.TestDoc
   [smoker]    [junit4] Completed [266/454] on J2 in 0.30s, 1 test
   [smoker]    [junit4] 
   [smoker]    [junit4] Suite: org.apache.lucene.search.similarities.TestSimilarity2
   [smoker]    [junit4] Completed [267/454] on J2 in 0.43s, 8 tests
   [smoker]    [junit4] 
   [smoker]    [junit4] Suite: org.apache.lucene.TestExternalCodecs
   [smoker]    [junit4] Completed [268/454] on J2 in 0.43s, 1 test
   [smoker]    [junit4] 
   [smoker]    [junit4] Suite: org.apache.lucene.search.TestSimpleExplanationsOfNonMatches
   [smoker]    [junit4] Completed [269/454] on J2 in 0.15s, 70 tests
   [smoker]    [junit4] 
   [smoker]    [junit4] Suite: org.apache.lucene.search.TestRegexpQuery
   [smoker]    [junit4] Completed [270/454] on J2 in 0.19s, 7 tests
   [smoker]    [junit4] 
   [smoker]    [junit4] Suite: org.apache.lucene.index.TestPerSegmentDeletes
   [smoker]    [junit4] Completed [271/454] on J2 in 0.03s, 1 test
   [smoker]    [junit4] 
   [smoker]    [junit4] Suite: org.apache.lucene.search.TestSortRandom
   [smoker]    [junit4] Completed [272/454] on J2 in 1.02s, 2 tests
   [smoker]    [junit4] 
   [smoker]    [junit4] Suite: org.apache.lucene.search.TestScorerPerf
   [smoker]    [junit4] Completed [273/454] on J0 in 6.07s, 1 test
   [smoker]    [junit4] 
   [smoker]    [junit4] Suite: org.apache.lucene.index.TestParallelReaderEmptyIndex
   [smoker]    [junit4] Completed [274/454] on J0 in 0.07s, 2 tests
   [smoker]    [junit4] 
   [smoker]    [junit4] Suite: org.apache.lucene.index.TestPrefixCodedTerms
   [smoker]    [junit4] Completed [275/454] on J2 in 0.32s, 3 tests
   [smoker]    [junit4] 
   [smoker]    [junit4] Suite: org.apache.lucene.document.TestDocument
   [smoker]    [junit4] Completed [276/454] on J0 in 0.13s, 12 tests
   [smoker]    [junit4] 
   [smoker]    [junit4] Suite: org.apache.lucene.index.TestMaxTermFrequency
   [smoker]    [junit4] Completed [277/454] on J2 in 0.31s, 1 test
   [smoker]    [junit4] 
   [smoker]    [junit4] Suite: org.apache.lucene.search.TestTermScorer
   [smoker]    [junit4] Completed [278/454] on J0 in 0.11s, 4 tests
   [smoker]    [junit4] 
   [smoker]    [junit4] Suite: org.apache.lucene.search.TestTopFieldCollector
   [smoker]    [junit4] Completed [279/454] on J2 in 0.19s, 7 tests
   [smoker]    [junit4] 
   [smoker]    [junit4] Suite: org.apache.lucene.search.TestDocValuesScoring
   [smoker]    [junit4] Completed [280/454] on J2 in 0.03s, 1 test
   [smoker]    [junit4] 
   [smoker]    [junit4] Suite: org.apache.lucene.search.TestPrefixRandom
   [smoker]    [junit4] Completed [281/454] on J2 in 1.02s, 1 test
   [smoker]    [junit4] 
   [smoker]    [junit4] Suite: org.apache.lucene.store.TestFileSwitchDirectory
   [smoker]    [junit4] IGNOR/A 0.01s J0 | TestFileSwitchDirectory.testFsyncDoesntCreateNewFiles
   [smoker]    [junit4]    > Assumption #1: test only works for FSDirectory subclasses
   [smoker]    [junit4] IGNOR/A 0.01s J0 | TestFileSwitchDirectory.testPendingDeletions
   [smoker]    [junit4]    > Assumption #1: we can only install VirusCheckingFS on an FSDirectory
   [smoker]    [junit4] Completed [282/454] on J0 in 2.66s, 43 tests, 2 skipped
   [smoker]    [junit4] 
   [smoker]    [junit4] Suite: org.apache.lucene.index.TestMultiLevelSkipList
   [smoker]    [junit4] Completed [283/454] on J0 in 0.80s, 1 test
   [smoker]    [junit4] 
   [smoker]    [junit4] Suite: org.apache.lucene.search.TestBooleanQueryVisitSubscorers
   [smoker]    [junit4] Completed [284/454] on J0 in 0.28s, 7 tests
   [smoker]    [junit4] 
   [smoker]    [junit4] Suite: org.apache.lucene.index.TestIndexFileDeleter
   [smoker]    [junit4] Completed [285/454] on J0 in 0.86s, 10 tests
   [smoker]    [junit4] 
   [smoker]    [junit4] Suite: org.apache.lucene.store.TestDirectory
   [smoker]    [junit4] IGNOR/A 0.00s J2 | TestDirectory.testListAll
   [smoker]    [junit4]    > Assumption #1: this test does not expect extra files
   [smoker]    [junit4] Completed [286/454] on J2 in 3.80s, 4 tests, 1 skipped
   [smoker]    [junit4] 
   [smoker]    [junit4] Suite: org.apache.lucene.search.TestElevationComparator
   [smoker]    [junit4] Completed [287/454] on J2 in 0.20s, 1 test
   [smoker]    [junit4] 
   [smoker]    [junit4] Suite: org.apache.lucene.index.TestIndexWriterConfig
   [smoker]    [junit4] Completed [288/454] on J2 in 0.13s, 8 tests
   [smoker]    [junit4] 
   [smoker]    [junit4] Suite: org.apache.lucene.search.TestMultiTermQueryRewrites
   [smoker]    [junit4] Completed [289/454] on J2 in 0.11s, 3 tests
   [smoker]    [junit4] 
   [smoker]    [junit4] Suite: org.apache.lucene.document.TestField
   [smoker]    [junit4] Completed [290/454] on J2 in 0.17s, 23 tests
   [smoker]    [junit4] 
   [smoker]    [junit4] Suite: org.apache.lucene.search.TestSimilarity
   [smoker]    [junit4] Completed [291/454] on J2 in 0.07s, 1 test
   [smoker]    [junit4] 
   [smoker]    [junit4] Suite: org.apache.lucene.util.TestVirtualMethod
   [smoker]    [junit4] Completed [292/454] on J2 in 0.06s, 2 tests
   [smoker]    [junit4] 
   [smoker]    [junit4] Suite: org.apache.lucene.util.TestSetOnce
   [smoker]    [junit4] Completed [293/454] on J2 in 0.13s, 4 tests
   [smoker]    [junit4] 
   [smoker]    [junit4] Suite: org.apache.lucene.index.TestFilterLeafReader
   [smoker]    [junit4] Completed [294/454] on J2 in 0.09s, 3 tests
   [smoker]    [junit4] 
   [smoker]    [junit4] Suite: org.apache.lucene.TestSearch
   [smoker]    [junit4] Completed [295/454] on J2 in 0.11s, 2 tests
   [smoker]    [junit4] 
   [smoker]    [junit4] Suite: org.apache.lucene.analysis.TestCachingTokenFilter
   [smoker]    [junit4] Completed [296/454] on J2 in 0.07s, 2 tests
   [smoker]    [junit4] 
   [smoker]    [junit4] Suite: org.apache.lucene.document.TestDateTools
   [smoker]    [junit4] Completed [297/454] on J2 in 0.05s, 5 tests
   [smoker]    [junit4] 
   [smoker]    [junit4] Suite: org.apache.lucene.util.TestCharsRef
   [smoker]    [junit4] Completed [298/454] on J2 in 0.07s, 5 tests
   [smoker]    [junit4] 
   [smoker]    [junit4] Suite: org.apache.lucene.util.TestPriorityQueue
   [smoker]    [junit4] Completed [299/454] on J2 in 0.77s, 9 tests
   [smoker]    [junit4] 
   [smoker]    [junit4] Suite: org.apache.lucene.search.TestPrefixQuery
   [smoker]    [junit4] Completed [300/454] on J0 in 4.78s, 3 tests
   [smoker]    [junit4] 
   [smoker]    [junit4] Suite: org.apache.lucene.index.Test2BPostings
   [smoker]    [junit4] IGNOR/A 0.00s J2 | Test2BPostings.test
   [smoker]    [junit4]    > Assumption #1: 'nightly' test group is disabled (@Nightly())
   [smoker]    [junit4] Completed [301/454] on J2 in 0.01s, 1 test, 1 skipped
   [smoker]    [junit4] 
   [smoker]    [junit4] Suite: org.apache.lucene.document.TestBinaryDocument
   [smoker]    [junit4] Completed [302/454] on J0 in 0.05s, 1 test
   [smoker]    [junit4] 
   [smoker]    [junit4] Suite: org.apache.lucene.util.TestAttributeSource
   [smoker]    [junit4] Completed [303/454] on J2 in 0.06s, 7 tests
   [smoker]    [junit4] 
   [smoker]    [junit4] Suite: org.apache.lucene.search.TestTotalHitCountCollector
   [smoker]    [junit4] Completed [304/454] on J0 in 0.04s, 1 test
   [smoker]    [junit4] 
   [smoker]    [junit4] Suite: org.apache.lucene.util.TestRecyclingByteBlockAllocator
   [smoker]    [junit4] Completed [305/454] on J2 in 0.09s, 3 tests
   [smoker]    [junit4] 
   [smoker]    [junit4] Suite: org.apache.lucene.util.TestRamUsageEstimator
   [smoker]    [junit4] IGNOR/A 0.00s J2 | TestRamUsageEstimator.testPrintValues
   [smoker]    [junit4]    > Assumption #1: Specify -Dtests.verbose=true to print constants of RamUsageEstimator.
   [smoker]    [junit4] Completed [306/454] on J2 in 0.04s, 5 tests, 1 skipped
   [smoker]    [junit4] 
   [smoker]    [junit4] Suite: org.apache.lucene.index.TestIsCurrent
   [smoker]    [junit4] Completed [307/454] on J2 in 0.05s, 2 tests
   [smoker]    [junit4] 
   [smoker]    [junit4] Suite: org.apache.lucene.util.TestBytesRef
   [smoker]    [junit4] Completed [308/454] on J2 in 0.05s, 3 tests
   [smoker]    [junit4] 
   [smoker]    [junit4] Suite: org.apache.lucene.TestDemo
   [smoker]    [junit4] Completed [309/454] on J2 in 0.05s, 1 test
   [smoker]    [junit4] 
   [smoker]    [junit4] Suite: org.apache.lucene.index.TestTwoPhaseCommitTool
   [smoker]    [junit4] Completed [310/454] on J2 in 0.03s, 3 tests
   [smoker]    [junit4] 
   [smoker]    [junit4] Suite: org.apache.lucene.index.TestCodecHoldsOpenFiles
   [smoker]    [junit4] Completed [311/454] on J2 in 0.13s, 1 test
   [smoker]    [junit4] 
   [smoker]    [junit4] Suite: org.apache.lucene.index.TestReaderClosed
   [smoker]    [junit4] Completed [312/454] on J2 in 0.10s, 2 tests
   [smoker]    [

[...truncated too long message...]

Recurse(Operations.java:1306)
   [smoker]    [junit4]    > 	at org.apache.lucene.util.automaton.Operations.topoSortStates(Operations.java:1275)
   [smoker]    [junit4]    > 	at org.apache.lucene.search.suggest.analyzing.AnalyzingSuggester.replaceSep(AnalyzingSuggester.java:292)
   [smoker]    [junit4]    > 	at org.apache.lucene.search.suggest.analyzing.AnalyzingSuggester.toAutomaton(AnalyzingSuggester.java:852)
   [smoker]    [junit4]    > 	at org.apache.lucene.search.suggest.analyzing.AnalyzingSuggester.build(AnalyzingSuggester.java:428)
   [smoker]    [junit4]    > 	at org.apache.lucene.search.suggest.analyzing.AnalyzingSuggesterTest.testRandomRealisticKeys(AnalyzingSuggesterTest.java:196)
   [smoker]    [junit4]   2> NOTE: leaving temporary files on disk at: /x1/jenkins/jenkins-slave/workspace/Lucene-Solr-SmokeRelease-7.x/lucene/build/smokeTestRelease/tmp/unpack/lucene-7.1.0/build/suggest/test/J2/temp/lucene.search.suggest.analyzing.AnalyzingSuggesterTest_6AF4E77067952F9D-001
   [smoker]    [junit4]   2> NOTE: test params are: codec=FastCompressingStoredFields(storedFieldsFormat=CompressingStoredFieldsFormat(compressionMode=FAST, chunkSize=10, maxDocsPerChunk=1023, blockSize=9), termVectorsFormat=CompressingTermVectorsFormat(compressionMode=FAST, chunkSize=10, blockSize=9)), sim=RandomSimilarity(queryNorm=true): {}, locale=de-CH, timezone=America/Indianapolis
   [smoker]    [junit4]   2> NOTE: Linux 3.13.0-88-generic amd64/Oracle Corporation 1.8.0_144 (64-bit)/cpus=4,threads=1,free=233711624,total=339214336
   [smoker]    [junit4]   2> NOTE: All tests run in this JVM: [TestRegexCompletionQuery, TestLevenshteinDistance, TestContextSuggestField, BlendedInfixSuggesterTest, WFSTCompletionTest, TestSpellChecker, AnalyzingSuggesterTest]
   [smoker]    [junit4] Completed [11/32 (1!)] on J2 in 8.78s, 22 tests, 1 error <<< FAILURES!
   [smoker]    [junit4] 
   [smoker]    [junit4] Suite: org.apache.lucene.search.spell.TestWordBreakSpellChecker
   [smoker]    [junit4] Completed [12/32 (1!)] on J1 in 2.24s, 3 tests
   [smoker]    [junit4] 
   [smoker]    [junit4] Suite: org.apache.lucene.search.suggest.document.TestSuggestField
   [smoker]    [junit4] Completed [13/32 (1!)] on J0 in 25.74s, 20 tests
   [smoker]    [junit4] 
   [smoker]    [junit4] Suite: org.apache.lucene.search.suggest.DocumentValueSourceDictionaryTest
   [smoker]    [junit4] Completed [14/32 (1!)] on J1 in 2.89s, 12 tests
   [smoker]    [junit4] 
   [smoker]    [junit4] Suite: org.apache.lucene.search.suggest.fst.FSTCompletionTest
   [smoker]    [junit4] Completed [15/32 (1!)] on J2 in 4.66s, 12 tests
   [smoker]    [junit4] 
   [smoker]    [junit4] Suite: org.apache.lucene.search.spell.TestDirectSpellChecker
   [smoker]    [junit4] Completed [16/32 (1!)] on J1 in 0.35s, 6 tests
   [smoker]    [junit4] 
   [smoker]    [junit4] Suite: org.apache.lucene.search.suggest.PersistenceTest
   [smoker]    [junit4] Completed [17/32 (1!)] on J2 in 0.24s, 3 tests
   [smoker]    [junit4] 
   [smoker]    [junit4] Suite: org.apache.lucene.search.suggest.TestHighFrequencyDictionary
   [smoker]    [junit4] Completed [18/32 (1!)] on J1 in 0.05s, 1 test
   [smoker]    [junit4] 
   [smoker]    [junit4] Suite: org.apache.lucene.search.suggest.FileDictionaryTest
   [smoker]    [junit4] Completed [19/32 (1!)] on J1 in 0.23s, 5 tests
   [smoker]    [junit4] 
   [smoker]    [junit4] Suite: org.apache.lucene.search.suggest.TestInputIterator
   [smoker]    [junit4] Completed [20/32 (1!)] on J0 in 6.03s, 2 tests
   [smoker]    [junit4] 
   [smoker]    [junit4] Suite: org.apache.lucene.search.spell.TestLuceneDictionary
   [smoker]    [junit4] Completed [21/32 (1!)] on J0 in 0.96s, 6 tests
   [smoker]    [junit4] 
   [smoker]    [junit4] Suite: org.apache.lucene.search.spell.TestNGramDistance
   [smoker]    [junit4] Completed [22/32 (1!)] on J0 in 0.13s, 4 tests
   [smoker]    [junit4] 
   [smoker]    [junit4] Suite: org.apache.lucene.search.spell.TestJaroWinklerDistance
   [smoker]    [junit4] Completed [23/32 (1!)] on J0 in 0.13s, 1 test
   [smoker]    [junit4] 
   [smoker]    [junit4] Suite: org.apache.lucene.search.suggest.analyzing.TestFreeTextSuggester
   [smoker]    [junit4] Completed [24/32 (1!)] on J0 in 1.68s, 10 tests, 1 skipped
   [smoker]    [junit4] 
   [smoker]    [junit4] Suite: org.apache.lucene.search.suggest.DocumentDictionaryTest
   [smoker]    [junit4] Completed [25/32 (1!)] on J2 in 7.75s, 7 tests
   [smoker]    [junit4] 
   [smoker]    [junit4] Suite: org.apache.lucene.search.suggest.analyzing.TestSuggestStopFilter
   [smoker]    [junit4] Completed [26/32 (1!)] on J2 in 0.11s, 6 tests
   [smoker]    [junit4] 
   [smoker]    [junit4] Suite: org.apache.lucene.search.suggest.analyzing.TestSuggestStopFilterFactory
   [smoker]    [junit4] Completed [27/32 (1!)] on J0 in 0.56s, 3 tests
   [smoker]    [junit4] 
   [smoker]    [junit4] Suite: org.apache.lucene.search.suggest.document.CompletionTokenStreamTest
   [smoker]    [junit4] Completed [28/32 (1!)] on J2 in 0.27s, 6 tests
   [smoker]    [junit4] 
   [smoker]    [junit4] Suite: org.apache.lucene.search.suggest.document.TestFuzzyCompletionQuery
   [smoker]    [junit4] Completed [29/32 (1!)] on J2 in 0.27s, 3 tests
   [smoker]    [junit4] 
   [smoker]    [junit4] Suite: org.apache.lucene.search.suggest.document.TestContextQuery
   [smoker]    [junit4] Completed [30/32 (1!)] on J0 in 1.84s, 14 tests
   [smoker]    [junit4] 
   [smoker]    [junit4] Suite: org.apache.lucene.search.suggest.document.TestPrefixCompletionQuery
   [smoker]    [junit4] Completed [31/32 (1!)] on J2 in 1.31s, 7 tests
   [smoker]    [junit4] 
   [smoker]    [junit4] Suite: org.apache.lucene.search.suggest.analyzing.AnalyzingInfixSuggesterTest
   [smoker]    [junit4] Completed [32/32 (1!)] on J1 in 27.37s, 22 tests
   [smoker]    [junit4] 
   [smoker]    [junit4] 
   [smoker]    [junit4] Tests with failures [seed: 6AF4E77067952F9D]:
   [smoker]    [junit4]   - org.apache.lucene.search.suggest.analyzing.AnalyzingSuggesterTest.testRandomRealisticKeys
   [smoker]    [junit4] 
   [smoker]    [junit4] 
   [smoker]    [junit4] JVM J0:     0.83 ..    41.73 =    40.90s
   [smoker]    [junit4] JVM J1:     0.85 ..    58.72 =    57.87s
   [smoker]    [junit4] JVM J2:     0.83 ..    41.73 =    40.90s
   [smoker]    [junit4] Execution time total: 58 seconds
   [smoker]    [junit4] Tests summary: 32 suites (1 ignored), 221 tests, 1 error, 1 ignored
   [smoker] 
   [smoker] BUILD FAILED
   [smoker] /x1/jenkins/jenkins-slave/workspace/Lucene-Solr-SmokeRelease-7.x/lucene/build/smokeTestRelease/tmp/unpack/lucene-7.1.0/build.xml:482: The following error occurred while executing this line:
   [smoker] /x1/jenkins/jenkins-slave/workspace/Lucene-Solr-SmokeRelease-7.x/lucene/build/smokeTestRelease/tmp/unpack/lucene-7.1.0/common-build.xml:2182: The following error occurred while executing this line:
   [smoker] /x1/jenkins/jenkins-slave/workspace/Lucene-Solr-SmokeRelease-7.x/lucene/build/smokeTestRelease/tmp/unpack/lucene-7.1.0/module-build.xml:58: The following error occurred while executing this line:
   [smoker] /x1/jenkins/jenkins-slave/workspace/Lucene-Solr-SmokeRelease-7.x/lucene/build/smokeTestRelease/tmp/unpack/lucene-7.1.0/common-build.xml:1458: The following error occurred while executing this line:
   [smoker] /x1/jenkins/jenkins-slave/workspace/Lucene-Solr-SmokeRelease-7.x/lucene/build/smokeTestRelease/tmp/unpack/lucene-7.1.0/common-build.xml:985: There were test failures: 32 suites (1 ignored), 221 tests, 1 error, 1 ignored [seed: 6AF4E77067952F9D]
   [smoker] 
   [smoker] Total time: 31 minutes 14 seconds
   [smoker] 
   [smoker] 
   [smoker] Traceback (most recent call last):
   [smoker]   File "/x1/jenkins/jenkins-slave/workspace/Lucene-Solr-SmokeRelease-7.x/dev-tools/scripts/smokeTestRelease.py", line 1484, in <module>
   [smoker]     main()
   [smoker]   File "/x1/jenkins/jenkins-slave/workspace/Lucene-Solr-SmokeRelease-7.x/dev-tools/scripts/smokeTestRelease.py", line 1428, in main
   [smoker]     smokeTest(c.java, c.url, c.revision, c.version, c.tmp_dir, c.is_signed, ' '.join(c.test_args))
   [smoker]   File "/x1/jenkins/jenkins-slave/workspace/Lucene-Solr-SmokeRelease-7.x/dev-tools/scripts/smokeTestRelease.py", line 1466, in smokeTest
   [smoker]     unpackAndVerify(java, 'lucene', tmpDir, 'lucene-%s-src.tgz' % version, gitRevision, version, testArgs, baseURL)
   [smoker]   File "/x1/jenkins/jenkins-slave/workspace/Lucene-Solr-SmokeRelease-7.x/dev-tools/scripts/smokeTestRelease.py", line 622, in unpackAndVerify
   [smoker]     verifyUnpacked(java, project, artifact, unpackPath, gitRevision, version, testArgs, tmpDir, baseURL)
   [smoker]   File "/x1/jenkins/jenkins-slave/workspace/Lucene-Solr-SmokeRelease-7.x/dev-tools/scripts/smokeTestRelease.py", line 721, in verifyUnpacked
   [smoker]     java.run_java8('ant clean test %s' % testArgs, '%s/test.log' % unpackPath)
   [smoker]   File "/x1/jenkins/jenkins-slave/workspace/Lucene-Solr-SmokeRelease-7.x/dev-tools/scripts/smokeTestRelease.py", line 1233, in run_java
   [smoker]     run('%s; %s' % (cmd_prefix, cmd), logfile)
   [smoker]   File "/x1/jenkins/jenkins-slave/workspace/Lucene-Solr-SmokeRelease-7.x/dev-tools/scripts/smokeTestRelease.py", line 547, in run
   [smoker]     raise RuntimeError('command "%s" failed; see log file %s' % (command, logPath))
   [smoker] RuntimeError: command "export JAVA_HOME="/home/jenkins/tools/java/latest1.8" PATH="/home/jenkins/tools/java/latest1.8/bin:$PATH" JAVACMD="/home/jenkins/tools/java/latest1.8/bin/java"; ant clean test -Dtests.slow=false" failed; see log file /x1/jenkins/jenkins-slave/workspace/Lucene-Solr-SmokeRelease-7.x/lucene/build/smokeTestRelease/tmp/unpack/lucene-7.1.0/test.log

BUILD FAILED
/x1/jenkins/jenkins-slave/workspace/Lucene-Solr-SmokeRelease-7.x/build.xml:606: exec returned: 1

Total time: 42 minutes 28 seconds
Build step 'Invoke Ant' marked build as failure
Email was triggered for: Failure - Any
Sending email for trigger: Failure - Any

Mime
View raw message