lucene-dev mailing list archives

Site index · List index
Message view « Date » · « Thread »
Top « Date » · « Thread »
From Policeman Jenkins Server <jenk...@thetaphi.de>
Subject [JENKINS] Lucene-Solr-7.x-Solaris (64bit/jdk1.8.0) - Build # 106 - Still Unstable!
Date Fri, 11 Aug 2017 16:27:28 GMT
Build: https://jenkins.thetaphi.de/job/Lucene-Solr-7.x-Solaris/106/
Java: 64bit/jdk1.8.0 -XX:-UseCompressedOops -XX:+UseConcMarkSweepGC

1 tests failed.
FAILED:  org.apache.solr.cloud.LeaderElectionContextKeyTest.test

Error Message:


Stack Trace:
java.lang.AssertionError
	at __randomizedtesting.SeedInfo.seed([93519F5EC49B1438:1B05A0846A6779C0]:0)
	at org.junit.Assert.fail(Assert.java:92)
	at org.junit.Assert.assertTrue(Assert.java:43)
	at org.junit.Assert.assertTrue(Assert.java:54)
	at org.apache.solr.cloud.LeaderElectionContextKeyTest.test(LeaderElectionContextKeyTest.java:88)
	at sun.reflect.NativeMethodAccessorImpl.invoke0(Native Method)
	at sun.reflect.NativeMethodAccessorImpl.invoke(NativeMethodAccessorImpl.java:62)
	at sun.reflect.DelegatingMethodAccessorImpl.invoke(DelegatingMethodAccessorImpl.java:43)
	at java.lang.reflect.Method.invoke(Method.java:498)
	at com.carrotsearch.randomizedtesting.RandomizedRunner.invoke(RandomizedRunner.java:1713)
	at com.carrotsearch.randomizedtesting.RandomizedRunner$8.evaluate(RandomizedRunner.java:907)
	at com.carrotsearch.randomizedtesting.RandomizedRunner$9.evaluate(RandomizedRunner.java:943)
	at com.carrotsearch.randomizedtesting.RandomizedRunner$10.evaluate(RandomizedRunner.java:957)
	at com.carrotsearch.randomizedtesting.rules.SystemPropertiesRestoreRule$1.evaluate(SystemPropertiesRestoreRule.java:57)
	at org.apache.lucene.util.TestRuleSetupTeardownChained$1.evaluate(TestRuleSetupTeardownChained.java:49)
	at org.apache.lucene.util.AbstractBeforeAfterRule$1.evaluate(AbstractBeforeAfterRule.java:45)
	at org.apache.lucene.util.TestRuleThreadAndTestName$1.evaluate(TestRuleThreadAndTestName.java:48)
	at org.apache.lucene.util.TestRuleIgnoreAfterMaxFailures$1.evaluate(TestRuleIgnoreAfterMaxFailures.java:64)
	at org.apache.lucene.util.TestRuleMarkFailure$1.evaluate(TestRuleMarkFailure.java:47)
	at com.carrotsearch.randomizedtesting.rules.StatementAdapter.evaluate(StatementAdapter.java:36)
	at com.carrotsearch.randomizedtesting.ThreadLeakControl$StatementRunner.run(ThreadLeakControl.java:368)
	at com.carrotsearch.randomizedtesting.ThreadLeakControl.forkTimeoutingTask(ThreadLeakControl.java:817)
	at com.carrotsearch.randomizedtesting.ThreadLeakControl$3.evaluate(ThreadLeakControl.java:468)
	at com.carrotsearch.randomizedtesting.RandomizedRunner.runSingleTest(RandomizedRunner.java:916)
	at com.carrotsearch.randomizedtesting.RandomizedRunner$5.evaluate(RandomizedRunner.java:802)
	at com.carrotsearch.randomizedtesting.RandomizedRunner$6.evaluate(RandomizedRunner.java:852)
	at com.carrotsearch.randomizedtesting.RandomizedRunner$7.evaluate(RandomizedRunner.java:863)
	at com.carrotsearch.randomizedtesting.rules.StatementAdapter.evaluate(StatementAdapter.java:36)
	at com.carrotsearch.randomizedtesting.rules.SystemPropertiesRestoreRule$1.evaluate(SystemPropertiesRestoreRule.java:57)
	at org.apache.lucene.util.AbstractBeforeAfterRule$1.evaluate(AbstractBeforeAfterRule.java:45)
	at com.carrotsearch.randomizedtesting.rules.StatementAdapter.evaluate(StatementAdapter.java:36)
	at org.apache.lucene.util.TestRuleStoreClassName$1.evaluate(TestRuleStoreClassName.java:41)
	at com.carrotsearch.randomizedtesting.rules.NoShadowingOrOverridesOnMethodsRule$1.evaluate(NoShadowingOrOverridesOnMethodsRule.java:40)
	at com.carrotsearch.randomizedtesting.rules.NoShadowingOrOverridesOnMethodsRule$1.evaluate(NoShadowingOrOverridesOnMethodsRule.java:40)
	at com.carrotsearch.randomizedtesting.rules.StatementAdapter.evaluate(StatementAdapter.java:36)
	at com.carrotsearch.randomizedtesting.rules.StatementAdapter.evaluate(StatementAdapter.java:36)
	at com.carrotsearch.randomizedtesting.rules.StatementAdapter.evaluate(StatementAdapter.java:36)
	at org.apache.lucene.util.TestRuleAssertionsRequired$1.evaluate(TestRuleAssertionsRequired.java:53)
	at org.apache.lucene.util.TestRuleMarkFailure$1.evaluate(TestRuleMarkFailure.java:47)
	at org.apache.lucene.util.TestRuleIgnoreAfterMaxFailures$1.evaluate(TestRuleIgnoreAfterMaxFailures.java:64)
	at org.apache.lucene.util.TestRuleIgnoreTestSuites$1.evaluate(TestRuleIgnoreTestSuites.java:54)
	at com.carrotsearch.randomizedtesting.rules.StatementAdapter.evaluate(StatementAdapter.java:36)
	at com.carrotsearch.randomizedtesting.ThreadLeakControl$StatementRunner.run(ThreadLeakControl.java:368)
	at java.lang.Thread.run(Thread.java:748)




Build Log:
[...truncated 10968 lines...]
   [junit4] Suite: org.apache.solr.cloud.LeaderElectionContextKeyTest
   [junit4]   2> Creating dataDir: /export/home/jenkins/workspace/Lucene-Solr-7.x-Solaris/solr/build/solr-core/test/J1/temp/solr.cloud.LeaderElectionContextKeyTest_93519F5EC49B1438-001/init-core-data-001
   [junit4]   2> 468405 WARN  (SUITE-LeaderElectionContextKeyTest-seed#[93519F5EC49B1438]-worker) [    ] o.a.s.SolrTestCaseJ4 startTrackingSearchers: numOpens=4 numCloses=4
   [junit4]   2> 468405 INFO  (SUITE-LeaderElectionContextKeyTest-seed#[93519F5EC49B1438]-worker) [    ] o.a.s.SolrTestCaseJ4 Using PointFields (NUMERIC_POINTS_SYSPROP=true) w/NUMERIC_DOCVALUES_SYSPROP=false
   [junit4]   2> 468407 INFO  (SUITE-LeaderElectionContextKeyTest-seed#[93519F5EC49B1438]-worker) [    ] o.a.s.SolrTestCaseJ4 Randomized ssl (false) and clientAuth (false) via: @org.apache.solr.util.RandomizeSSL(reason=, value=NaN, ssl=NaN, clientAuth=NaN)
   [junit4]   2> 468407 INFO  (SUITE-LeaderElectionContextKeyTest-seed#[93519F5EC49B1438]-worker) [    ] o.a.s.SolrTestCaseJ4 SecureRandom sanity checks: test.solr.allowed.securerandom=null & java.security.egd=file:/dev/./urandom
   [junit4]   2> 468407 INFO  (SUITE-LeaderElectionContextKeyTest-seed#[93519F5EC49B1438]-worker) [    ] o.a.s.c.MiniSolrCloudCluster Starting cluster of 1 servers in /export/home/jenkins/workspace/Lucene-Solr-7.x-Solaris/solr/build/solr-core/test/J1/temp/solr.cloud.LeaderElectionContextKeyTest_93519F5EC49B1438-001/tempDir-001
   [junit4]   2> 468408 INFO  (SUITE-LeaderElectionContextKeyTest-seed#[93519F5EC49B1438]-worker) [    ] o.a.s.c.ZkTestServer STARTING ZK TEST SERVER
   [junit4]   2> 468408 INFO  (Thread-719) [    ] o.a.s.c.ZkTestServer client port:0.0.0.0/0.0.0.0:0
   [junit4]   2> 468408 INFO  (Thread-719) [    ] o.a.s.c.ZkTestServer Starting server
   [junit4]   2> 468409 ERROR (Thread-719) [    ] o.a.z.s.ZooKeeperServer ZKShutdownHandler is not registered, so ZooKeeper server won't take any action on ERROR or SHUTDOWN server state changes
   [junit4]   2> 468508 INFO  (SUITE-LeaderElectionContextKeyTest-seed#[93519F5EC49B1438]-worker) [    ] o.a.s.c.ZkTestServer start zk server on port:59845
   [junit4]   2> 468516 INFO  (jetty-launcher-384-thread-1) [    ] o.e.j.s.Server jetty-9.3.14.v20161028
   [junit4]   2> 468519 INFO  (jetty-launcher-384-thread-1) [    ] o.e.j.s.h.ContextHandler Started o.e.j.s.ServletContextHandler@537afc3a{/solr,null,AVAILABLE}
   [junit4]   2> 468520 INFO  (jetty-launcher-384-thread-1) [    ] o.e.j.s.AbstractConnector Started ServerConnector@56dc17ea{HTTP/1.1,[http/1.1]}{127.0.0.1:48134}
   [junit4]   2> 468520 INFO  (jetty-launcher-384-thread-1) [    ] o.e.j.s.Server Started @471597ms
   [junit4]   2> 468520 INFO  (jetty-launcher-384-thread-1) [    ] o.a.s.c.s.e.JettySolrRunner Jetty properties: {hostContext=/solr, hostPort=48134}
   [junit4]   2> 468520 ERROR (jetty-launcher-384-thread-1) [    ] o.a.s.s.StartupLoggingUtils Missing Java Option solr.log.dir. Logging may be missing or incomplete.
   [junit4]   2> 468520 INFO  (jetty-launcher-384-thread-1) [    ] o.a.s.s.SolrDispatchFilter  ___      _       Welcome to Apache Solr? version 7.1.0
   [junit4]   2> 468520 INFO  (jetty-launcher-384-thread-1) [    ] o.a.s.s.SolrDispatchFilter / __| ___| |_ _   Starting in cloud mode on port null
   [junit4]   2> 468520 INFO  (jetty-launcher-384-thread-1) [    ] o.a.s.s.SolrDispatchFilter \__ \/ _ \ | '_|  Install dir: null, Default config dir: null
   [junit4]   2> 468520 INFO  (jetty-launcher-384-thread-1) [    ] o.a.s.s.SolrDispatchFilter |___/\___/_|_|    Start time: 2017-08-11T15:10:40.272Z
   [junit4]   2> 468542 INFO  (jetty-launcher-384-thread-1) [    ] o.a.s.s.SolrDispatchFilter solr.xml found in ZooKeeper. Loading...
   [junit4]   2> 468563 INFO  (jetty-launcher-384-thread-1) [    ] o.a.s.c.ZkContainer Zookeeper client=127.0.0.1:59845/solr
   [junit4]   2> 468698 WARN  (NIOServerCxn.Factory:0.0.0.0/0.0.0.0:0) [    ] o.a.z.s.NIOServerCnxn caught end of stream exception
   [junit4]   2> EndOfStreamException: Unable to read additional data from client sessionid 0x15dd1d8ea210002, likely client has closed socket
   [junit4]   2> 	at org.apache.zookeeper.server.NIOServerCnxn.doIO(NIOServerCnxn.java:239)
   [junit4]   2> 	at org.apache.zookeeper.server.NIOServerCnxnFactory.run(NIOServerCnxnFactory.java:203)
   [junit4]   2> 	at java.lang.Thread.run(Thread.java:748)
   [junit4]   2> 469030 INFO  (jetty-launcher-384-thread-1) [n:127.0.0.1:48134_solr    ] o.a.s.c.Overseer Overseer (id=null) closing
   [junit4]   2> 469031 INFO  (jetty-launcher-384-thread-1) [n:127.0.0.1:48134_solr    ] o.a.s.c.OverseerElectionContext I am going to be the leader 127.0.0.1:48134_solr
   [junit4]   2> 469033 INFO  (jetty-launcher-384-thread-1) [n:127.0.0.1:48134_solr    ] o.a.s.c.Overseer Overseer (id=98465496443191299-127.0.0.1:48134_solr-n_0000000000) starting
   [junit4]   2> 469070 INFO  (jetty-launcher-384-thread-1) [n:127.0.0.1:48134_solr    ] o.a.s.c.ZkController Register node as live in ZooKeeper:/live_nodes/127.0.0.1:48134_solr
   [junit4]   2> 469073 INFO  (zkCallback-391-thread-1-processing-n:127.0.0.1:48134_solr) [n:127.0.0.1:48134_solr    ] o.a.s.c.c.ZkStateReader Updated live nodes from ZooKeeper... (0) -> (1)
   [junit4]   2> 469209 INFO  (jetty-launcher-384-thread-1) [n:127.0.0.1:48134_solr    ] o.a.s.m.r.SolrJmxReporter JMX monitoring for 'solr_48134.solr.node' (registry 'solr.node') enabled at server: com.sun.jmx.mbeanserver.JmxMBeanServer@2df557b5
   [junit4]   2> 469213 INFO  (jetty-launcher-384-thread-1) [n:127.0.0.1:48134_solr    ] o.a.s.m.r.SolrJmxReporter JMX monitoring for 'solr_48134.solr.jvm' (registry 'solr.jvm') enabled at server: com.sun.jmx.mbeanserver.JmxMBeanServer@2df557b5
   [junit4]   2> 469213 INFO  (jetty-launcher-384-thread-1) [n:127.0.0.1:48134_solr    ] o.a.s.m.r.SolrJmxReporter JMX monitoring for 'solr_48134.solr.jetty' (registry 'solr.jetty') enabled at server: com.sun.jmx.mbeanserver.JmxMBeanServer@2df557b5
   [junit4]   2> 469222 INFO  (jetty-launcher-384-thread-1) [n:127.0.0.1:48134_solr    ] o.a.s.c.CorePropertiesLocator Found 0 core definitions underneath /export/home/jenkins/workspace/Lucene-Solr-7.x-Solaris/solr/build/solr-core/test/J1/temp/solr.cloud.LeaderElectionContextKeyTest_93519F5EC49B1438-001/tempDir-001/node1/.
   [junit4]   2> 469261 INFO  (SUITE-LeaderElectionContextKeyTest-seed#[93519F5EC49B1438]-worker) [    ] o.a.s.c.c.ZkStateReader Updated live nodes from ZooKeeper... (0) -> (1)
   [junit4]   2> 469264 INFO  (SUITE-LeaderElectionContextKeyTest-seed#[93519F5EC49B1438]-worker) [    ] o.a.s.c.s.i.ZkClientClusterStateProvider Cluster at 127.0.0.1:59845/solr ready
   [junit4]   2> 469277 INFO  (qtp1831633487-2795) [n:127.0.0.1:48134_solr    ] o.a.s.h.a.CollectionsHandler Invoked Collection Action :create with params replicationFactor=1&collection.configName=config&maxShardsPerNode=1000&name=testCollection1&nrtReplicas=1&action=CREATE&numShards=2&wt=javabin&version=2 and sendToOCPQueue=true
   [junit4]   2> 469293 INFO  (OverseerThreadFactory-1313-thread-1-processing-n:127.0.0.1:48134_solr) [n:127.0.0.1:48134_solr    ] o.a.s.c.CreateCollectionCmd Create collection testCollection1
   [junit4]   2> 469492 INFO  (OverseerStateUpdate-98465496443191299-127.0.0.1:48134_solr-n_0000000000) [n:127.0.0.1:48134_solr    ] o.a.s.c.o.SliceMutator createReplica() {
   [junit4]   2>   "operation":"ADDREPLICA",
   [junit4]   2>   "collection":"testCollection1",
   [junit4]   2>   "shard":"shard1",
   [junit4]   2>   "core":"testCollection1_shard1_replica_n1",
   [junit4]   2>   "state":"down",
   [junit4]   2>   "base_url":"http://127.0.0.1:48134/solr",
   [junit4]   2>   "type":"NRT"} 
   [junit4]   2> 469514 INFO  (OverseerStateUpdate-98465496443191299-127.0.0.1:48134_solr-n_0000000000) [n:127.0.0.1:48134_solr    ] o.a.s.c.o.SliceMutator createReplica() {
   [junit4]   2>   "operation":"ADDREPLICA",
   [junit4]   2>   "collection":"testCollection1",
   [junit4]   2>   "shard":"shard2",
   [junit4]   2>   "core":"testCollection1_shard2_replica_n2",
   [junit4]   2>   "state":"down",
   [junit4]   2>   "base_url":"http://127.0.0.1:48134/solr",
   [junit4]   2>   "type":"NRT"} 
   [junit4]   2> 469724 INFO  (qtp1831633487-2794) [n:127.0.0.1:48134_solr    ] o.a.s.h.a.CoreAdminOperation core create command qt=/admin/cores&coreNodeName=core_node3&collection.configName=config&newCollection=true&name=testCollection1_shard1_replica_n1&action=CREATE&numShards=2&collection=testCollection1&shard=shard1&wt=javabin&version=2&replicaType=NRT
   [junit4]   2> 469724 INFO  (qtp1831633487-2792) [n:127.0.0.1:48134_solr    ] o.a.s.h.a.CoreAdminOperation core create command qt=/admin/cores&coreNodeName=core_node4&collection.configName=config&newCollection=true&name=testCollection1_shard2_replica_n2&action=CREATE&numShards=2&collection=testCollection1&shard=shard2&wt=javabin&version=2&replicaType=NRT
   [junit4]   2> 469725 INFO  (qtp1831633487-2792) [n:127.0.0.1:48134_solr    ] o.a.s.c.TransientSolrCoreCacheDefault Allocating transient cache for 2147483647 transient cores
   [junit4]   2> 469884 INFO  (zkCallback-391-thread-2-processing-n:127.0.0.1:48134_solr) [n:127.0.0.1:48134_solr    ] o.a.s.c.c.ZkStateReader A cluster state change: [WatchedEvent state:SyncConnected type:NodeDataChanged path:/collections/testCollection1/state.json] for collection [testCollection1] has occurred - updating... (live nodes size: [1])
   [junit4]   2> 469884 INFO  (zkCallback-391-thread-1-processing-n:127.0.0.1:48134_solr) [n:127.0.0.1:48134_solr    ] o.a.s.c.c.ZkStateReader A cluster state change: [WatchedEvent state:SyncConnected type:NodeDataChanged path:/collections/testCollection1/state.json] for collection [testCollection1] has occurred - updating... (live nodes size: [1])
   [junit4]   2> 470797 INFO  (qtp1831633487-2794) [n:127.0.0.1:48134_solr c:testCollection1 s:shard1 r:core_node3 x:testCollection1_shard1_replica_n1] o.a.s.c.SolrConfig Using Lucene MatchVersion: 7.1.0
   [junit4]   2> 470816 INFO  (qtp1831633487-2792) [n:127.0.0.1:48134_solr c:testCollection1 s:shard2 r:core_node4 x:testCollection1_shard2_replica_n2] o.a.s.c.SolrConfig Using Lucene MatchVersion: 7.1.0
   [junit4]   2> 470848 INFO  (qtp1831633487-2794) [n:127.0.0.1:48134_solr c:testCollection1 s:shard1 r:core_node3 x:testCollection1_shard1_replica_n1] o.a.s.s.IndexSchema [testCollection1_shard1_replica_n1] Schema name=minimal
   [junit4]   2> 470884 INFO  (qtp1831633487-2794) [n:127.0.0.1:48134_solr c:testCollection1 s:shard1 r:core_node3 x:testCollection1_shard1_replica_n1] o.a.s.s.IndexSchema Loaded schema minimal/1.1 with uniqueid field id
   [junit4]   2> 470884 INFO  (qtp1831633487-2794) [n:127.0.0.1:48134_solr c:testCollection1 s:shard1 r:core_node3 x:testCollection1_shard1_replica_n1] o.a.s.c.CoreContainer Creating SolrCore 'testCollection1_shard1_replica_n1' using configuration from collection testCollection1, trusted=true
   [junit4]   2> 470887 INFO  (qtp1831633487-2792) [n:127.0.0.1:48134_solr c:testCollection1 s:shard2 r:core_node4 x:testCollection1_shard2_replica_n2] o.a.s.s.IndexSchema [testCollection1_shard2_replica_n2] Schema name=minimal
   [junit4]   2> 470889 INFO  (qtp1831633487-2792) [n:127.0.0.1:48134_solr c:testCollection1 s:shard2 r:core_node4 x:testCollection1_shard2_replica_n2] o.a.s.s.IndexSchema Loaded schema minimal/1.1 with uniqueid field id
   [junit4]   2> 470889 INFO  (qtp1831633487-2792) [n:127.0.0.1:48134_solr c:testCollection1 s:shard2 r:core_node4 x:testCollection1_shard2_replica_n2] o.a.s.c.CoreContainer Creating SolrCore 'testCollection1_shard2_replica_n2' using configuration from collection testCollection1, trusted=true
   [junit4]   2> 470898 INFO  (qtp1831633487-2794) [n:127.0.0.1:48134_solr c:testCollection1 s:shard1 r:core_node3 x:testCollection1_shard1_replica_n1] o.a.s.m.r.SolrJmxReporter JMX monitoring for 'solr_48134.solr.core.testCollection1.shard1.replica_n1' (registry 'solr.core.testCollection1.shard1.replica_n1') enabled at server: com.sun.jmx.mbeanserver.JmxMBeanServer@2df557b5
   [junit4]   2> 470898 INFO  (qtp1831633487-2794) [n:127.0.0.1:48134_solr c:testCollection1 s:shard1 r:core_node3 x:testCollection1_shard1_replica_n1] o.a.s.c.SolrCore solr.RecoveryStrategy.Builder
   [junit4]   2> 470899 INFO  (qtp1831633487-2794) [n:127.0.0.1:48134_solr c:testCollection1 s:shard1 r:core_node3 x:testCollection1_shard1_replica_n1] o.a.s.c.SolrCore [[testCollection1_shard1_replica_n1] ] Opening new SolrCore at [/export/home/jenkins/workspace/Lucene-Solr-7.x-Solaris/solr/build/solr-core/test/J1/temp/solr.cloud.LeaderElectionContextKeyTest_93519F5EC49B1438-001/tempDir-001/node1/testCollection1_shard1_replica_n1], dataDir=[/export/home/jenkins/workspace/Lucene-Solr-7.x-Solaris/solr/build/solr-core/test/J1/temp/solr.cloud.LeaderElectionContextKeyTest_93519F5EC49B1438-001/tempDir-001/node1/./testCollection1_shard1_replica_n1/data/]
   [junit4]   2> 470938 INFO  (qtp1831633487-2792) [n:127.0.0.1:48134_solr c:testCollection1 s:shard2 r:core_node4 x:testCollection1_shard2_replica_n2] o.a.s.m.r.SolrJmxReporter JMX monitoring for 'solr_48134.solr.core.testCollection1.shard2.replica_n2' (registry 'solr.core.testCollection1.shard2.replica_n2') enabled at server: com.sun.jmx.mbeanserver.JmxMBeanServer@2df557b5
   [junit4]   2> 470939 INFO  (qtp1831633487-2792) [n:127.0.0.1:48134_solr c:testCollection1 s:shard2 r:core_node4 x:testCollection1_shard2_replica_n2] o.a.s.c.SolrCore solr.RecoveryStrategy.Builder
   [junit4]   2> 470939 INFO  (qtp1831633487-2792) [n:127.0.0.1:48134_solr c:testCollection1 s:shard2 r:core_node4 x:testCollection1_shard2_replica_n2] o.a.s.c.SolrCore [[testCollection1_shard2_replica_n2] ] Opening new SolrCore at [/export/home/jenkins/workspace/Lucene-Solr-7.x-Solaris/solr/build/solr-core/test/J1/temp/solr.cloud.LeaderElectionContextKeyTest_93519F5EC49B1438-001/tempDir-001/node1/testCollection1_shard2_replica_n2], dataDir=[/export/home/jenkins/workspace/Lucene-Solr-7.x-Solaris/solr/build/solr-core/test/J1/temp/solr.cloud.LeaderElectionContextKeyTest_93519F5EC49B1438-001/tempDir-001/node1/./testCollection1_shard2_replica_n2/data/]
   [junit4]   2> 471069 INFO  (qtp1831633487-2792) [n:127.0.0.1:48134_solr c:testCollection1 s:shard2 r:core_node4 x:testCollection1_shard2_replica_n2] o.a.s.u.UpdateHandler Using UpdateLog implementation: org.apache.solr.update.UpdateLog
   [junit4]   2> 471069 INFO  (qtp1831633487-2792) [n:127.0.0.1:48134_solr c:testCollection1 s:shard2 r:core_node4 x:testCollection1_shard2_replica_n2] o.a.s.u.UpdateLog Initializing UpdateLog: dataDir=null defaultSyncLevel=FLUSH numRecordsToKeep=100 maxNumLogsToKeep=10 numVersionBuckets=65536
   [junit4]   2> 471111 INFO  (qtp1831633487-2792) [n:127.0.0.1:48134_solr c:testCollection1 s:shard2 r:core_node4 x:testCollection1_shard2_replica_n2] o.a.s.u.CommitTracker Hard AutoCommit: disabled
   [junit4]   2> 471111 INFO  (qtp1831633487-2792) [n:127.0.0.1:48134_solr c:testCollection1 s:shard2 r:core_node4 x:testCollection1_shard2_replica_n2] o.a.s.u.CommitTracker Soft AutoCommit: disabled
   [junit4]   2> 471112 INFO  (qtp1831633487-2792) [n:127.0.0.1:48134_solr c:testCollection1 s:shard2 r:core_node4 x:testCollection1_shard2_replica_n2] o.a.s.s.SolrIndexSearcher Opening [Searcher@220d04bf[testCollection1_shard2_replica_n2] main]
   [junit4]   2> 471118 INFO  (qtp1831633487-2792) [n:127.0.0.1:48134_solr c:testCollection1 s:shard2 r:core_node4 x:testCollection1_shard2_replica_n2] o.a.s.r.ManagedResourceStorage Configured ZooKeeperStorageIO with znodeBase: /configs/config
   [junit4]   2> 471126 INFO  (qtp1831633487-2792) [n:127.0.0.1:48134_solr c:testCollection1 s:shard2 r:core_node4 x:testCollection1_shard2_replica_n2] o.a.s.r.ManagedResourceStorage Loaded null at path _rest_managed.json using ZooKeeperStorageIO:path=/configs/config
   [junit4]   2> 471127 INFO  (qtp1831633487-2792) [n:127.0.0.1:48134_solr c:testCollection1 s:shard2 r:core_node4 x:testCollection1_shard2_replica_n2] o.a.s.h.ReplicationHandler Commits will be reserved for  10000
   [junit4]   2> 471127 INFO  (qtp1831633487-2792) [n:127.0.0.1:48134_solr c:testCollection1 s:shard2 r:core_node4 x:testCollection1_shard2_replica_n2] o.a.s.u.UpdateLog Could not find max version in index or recent updates, using new clock 1575447945941090304
   [junit4]   2> 471143 INFO  (qtp1831633487-2794) [n:127.0.0.1:48134_solr c:testCollection1 s:shard1 r:core_node3 x:testCollection1_shard1_replica_n1] o.a.s.u.UpdateHandler Using UpdateLog implementation: org.apache.solr.update.UpdateLog
   [junit4]   2> 471143 INFO  (qtp1831633487-2794) [n:127.0.0.1:48134_solr c:testCollection1 s:shard1 r:core_node3 x:testCollection1_shard1_replica_n1] o.a.s.u.UpdateLog Initializing UpdateLog: dataDir=null defaultSyncLevel=FLUSH numRecordsToKeep=100 maxNumLogsToKeep=10 numVersionBuckets=65536
   [junit4]   2> 471144 INFO  (qtp1831633487-2794) [n:127.0.0.1:48134_solr c:testCollection1 s:shard1 r:core_node3 x:testCollection1_shard1_replica_n1] o.a.s.u.CommitTracker Hard AutoCommit: disabled
   [junit4]   2> 471144 INFO  (qtp1831633487-2794) [n:127.0.0.1:48134_solr c:testCollection1 s:shard1 r:core_node3 x:testCollection1_shard1_replica_n1] o.a.s.u.CommitTracker Soft AutoCommit: disabled
   [junit4]   2> 471146 INFO  (searcherExecutor-1317-thread-1-processing-n:127.0.0.1:48134_solr x:testCollection1_shard2_replica_n2 s:shard2 c:testCollection1 r:core_node4) [n:127.0.0.1:48134_solr c:testCollection1 s:shard2 r:core_node4 x:testCollection1_shard2_replica_n2] o.a.s.c.SolrCore [testCollection1_shard2_replica_n2] Registered new searcher Searcher@220d04bf[testCollection1_shard2_replica_n2] main{ExitableDirectoryReader(UninvertingDirectoryReader())}
   [junit4]   2> 471155 INFO  (qtp1831633487-2794) [n:127.0.0.1:48134_solr c:testCollection1 s:shard1 r:core_node3 x:testCollection1_shard1_replica_n1] o.a.s.s.SolrIndexSearcher Opening [Searcher@59ce8b97[testCollection1_shard1_replica_n1] main]
   [junit4]   2> 471157 INFO  (qtp1831633487-2794) [n:127.0.0.1:48134_solr c:testCollection1 s:shard1 r:core_node3 x:testCollection1_shard1_replica_n1] o.a.s.r.ManagedResourceStorage Configured ZooKeeperStorageIO with znodeBase: /configs/config
   [junit4]   2> 471158 INFO  (qtp1831633487-2794) [n:127.0.0.1:48134_solr c:testCollection1 s:shard1 r:core_node3 x:testCollection1_shard1_replica_n1] o.a.s.r.ManagedResourceStorage Loaded null at path _rest_managed.json using ZooKeeperStorageIO:path=/configs/config
   [junit4]   2> 471158 INFO  (qtp1831633487-2794) [n:127.0.0.1:48134_solr c:testCollection1 s:shard1 r:core_node3 x:testCollection1_shard1_replica_n1] o.a.s.h.ReplicationHandler Commits will be reserved for  10000
   [junit4]   2> 471158 INFO  (qtp1831633487-2794) [n:127.0.0.1:48134_solr c:testCollection1 s:shard1 r:core_node3 x:testCollection1_shard1_replica_n1] o.a.s.u.UpdateLog Could not find max version in index or recent updates, using new clock 1575447945973596160
   [junit4]   2> 471202 INFO  (qtp1831633487-2792) [n:127.0.0.1:48134_solr c:testCollection1 s:shard2 r:core_node4 x:testCollection1_shard2_replica_n2] o.a.s.c.ShardLeaderElectionContext Enough replicas found to continue.
   [junit4]   2> 471202 INFO  (qtp1831633487-2792) [n:127.0.0.1:48134_solr c:testCollection1 s:shard2 r:core_node4 x:testCollection1_shard2_replica_n2] o.a.s.c.ShardLeaderElectionContext I may be the new leader - try and sync
   [junit4]   2> 471202 INFO  (qtp1831633487-2792) [n:127.0.0.1:48134_solr c:testCollection1 s:shard2 r:core_node4 x:testCollection1_shard2_replica_n2] o.a.s.c.SyncStrategy Sync replicas to http://127.0.0.1:48134/solr/testCollection1_shard2_replica_n2/
   [junit4]   2> 471202 INFO  (qtp1831633487-2792) [n:127.0.0.1:48134_solr c:testCollection1 s:shard2 r:core_node4 x:testCollection1_shard2_replica_n2] o.a.s.c.SyncStrategy Sync Success - now sync replicas to me
   [junit4]   2> 471202 INFO  (qtp1831633487-2792) [n:127.0.0.1:48134_solr c:testCollection1 s:shard2 r:core_node4 x:testCollection1_shard2_replica_n2] o.a.s.c.SyncStrategy http://127.0.0.1:48134/solr/testCollection1_shard2_replica_n2/ has no replicas
   [junit4]   2> 471202 INFO  (qtp1831633487-2792) [n:127.0.0.1:48134_solr c:testCollection1 s:shard2 r:core_node4 x:testCollection1_shard2_replica_n2] o.a.s.c.ShardLeaderElectionContext Found all replicas participating in election, clear LIR
   [junit4]   2> 471205 INFO  (searcherExecutor-1316-thread-1-processing-n:127.0.0.1:48134_solr x:testCollection1_shard1_replica_n1 s:shard1 c:testCollection1 r:core_node3) [n:127.0.0.1:48134_solr c:testCollection1 s:shard1 r:core_node3 x:testCollection1_shard1_replica_n1] o.a.s.c.SolrCore [testCollection1_shard1_replica_n1] Registered new searcher Searcher@59ce8b97[testCollection1_shard1_replica_n1] main{ExitableDirectoryReader(UninvertingDirectoryReader())}
   [junit4]   2> 471262 INFO  (qtp1831633487-2794) [n:127.0.0.1:48134_solr c:testCollection1 s:shard1 r:core_node3 x:testCollection1_shard1_replica_n1] o.a.s.c.ShardLeaderElectionContext Enough replicas found to continue.
   [junit4]   2> 471262 INFO  (qtp1831633487-2794) [n:127.0.0.1:48134_solr c:testCollection1 s:shard1 r:core_node3 x:testCollection1_shard1_replica_n1] o.a.s.c.ShardLeaderElectionContext I may be the new leader - try and sync
   [junit4]   2> 471262 INFO  (qtp1831633487-2794) [n:127.0.0.1:48134_solr c:testCollection1 s:shard1 r:core_node3 x:testCollection1_shard1_replica_n1] o.a.s.c.SyncStrategy Sync replicas to http://127.0.0.1:48134/solr/testCollection1_shard1_replica_n1/
   [junit4]   2> 471262 INFO  (qtp1831633487-2794) [n:127.0.0.1:48134_solr c:testCollection1 s:shard1 r:core_node3 x:testCollection1_shard1_replica_n1] o.a.s.c.SyncStrategy Sync Success - now sync replicas to me
   [junit4]   2> 471262 INFO  (qtp1831633487-2794) [n:127.0.0.1:48134_solr c:testCollection1 s:shard1 r:core_node3 x:testCollection1_shard1_replica_n1] o.a.s.c.SyncStrategy http://127.0.0.1:48134/solr/testCollection1_shard1_replica_n1/ has no replicas
   [junit4]   2> 471262 INFO  (qtp1831633487-2794) [n:127.0.0.1:48134_solr c:testCollection1 s:shard1 r:core_node3 x:testCollection1_shard1_replica_n1] o.a.s.c.ShardLeaderElectionContext Found all replicas participating in election, clear LIR
   [junit4]   2> 471264 INFO  (qtp1831633487-2792) [n:127.0.0.1:48134_solr c:testCollection1 s:shard2 r:core_node4 x:testCollection1_shard2_replica_n2] o.a.s.c.ShardLeaderElectionContext I am the new leader: http://127.0.0.1:48134/solr/testCollection1_shard2_replica_n2/ shard2
   [junit4]   2> 471306 INFO  (qtp1831633487-2794) [n:127.0.0.1:48134_solr c:testCollection1 s:shard1 r:core_node3 x:testCollection1_shard1_replica_n1] o.a.s.c.ShardLeaderElectionContext I am the new leader: http://127.0.0.1:48134/solr/testCollection1_shard1_replica_n1/ shard1
   [junit4]   2> 471455 INFO  (zkCallback-391-thread-1-processing-n:127.0.0.1:48134_solr) [n:127.0.0.1:48134_solr    ] o.a.s.c.c.ZkStateReader A cluster state change: [WatchedEvent state:SyncConnected type:NodeDataChanged path:/collections/testCollection1/state.json] for collection [testCollection1] has occurred - updating... (live nodes size: [1])
   [junit4]   2> 471455 INFO  (zkCallback-391-thread-2-processing-n:127.0.0.1:48134_solr) [n:127.0.0.1:48134_solr    ] o.a.s.c.c.ZkStateReader A cluster state change: [WatchedEvent state:SyncConnected type:NodeDataChanged path:/collections/testCollection1/state.json] for collection [testCollection1] has occurred - updating... (live nodes size: [1])
   [junit4]   2> 471459 INFO  (qtp1831633487-2794) [n:127.0.0.1:48134_solr c:testCollection1 s:shard1 r:core_node3 x:testCollection1_shard1_replica_n1] o.a.s.c.ZkController I am the leader, no recovery necessary
   [junit4]   2> 471461 INFO  (qtp1831633487-2794) [n:127.0.0.1:48134_solr c:testCollection1 s:shard1 r:core_node3 x:testCollection1_shard1_replica_n1] o.a.s.s.HttpSolrCall [admin] webapp=null path=/admin/cores params={qt=/admin/cores&coreNodeName=core_node3&collection.configName=config&newCollection=true&name=testCollection1_shard1_replica_n1&action=CREATE&numShards=2&collection=testCollection1&shard=shard1&wt=javabin&version=2&replicaType=NRT} status=0 QTime=1737
   [junit4]   2> 471484 INFO  (qtp1831633487-2792) [n:127.0.0.1:48134_solr c:testCollection1 s:shard2 r:core_node4 x:testCollection1_shard2_replica_n2] o.a.s.c.ZkController I am the leader, no recovery necessary
   [junit4]   2> 471490 INFO  (qtp1831633487-2792) [n:127.0.0.1:48134_solr c:testCollection1 s:shard2 r:core_node4 x:testCollection1_shard2_replica_n2] o.a.s.s.HttpSolrCall [admin] webapp=null path=/admin/cores params={qt=/admin/cores&coreNodeName=core_node4&collection.configName=config&newCollection=true&name=testCollection1_shard2_replica_n2&action=CREATE&numShards=2&collection=testCollection1&shard=shard2&wt=javabin&version=2&replicaType=NRT} status=0 QTime=1767
   [junit4]   2> 471520 INFO  (qtp1831633487-2795) [n:127.0.0.1:48134_solr    ] o.a.s.h.a.CollectionsHandler Wait for new collection to be active for at most 30 seconds. Check all shard replicas
   [junit4]   2> 471624 INFO  (zkCallback-391-thread-1-processing-n:127.0.0.1:48134_solr) [n:127.0.0.1:48134_solr    ] o.a.s.c.c.ZkStateReader A cluster state change: [WatchedEvent state:SyncConnected type:NodeDataChanged path:/collections/testCollection1/state.json] for collection [testCollection1] has occurred - updating... (live nodes size: [1])
   [junit4]   2> 471624 INFO  (zkCallback-391-thread-2-processing-n:127.0.0.1:48134_solr) [n:127.0.0.1:48134_solr    ] o.a.s.c.c.ZkStateReader A cluster state change: [WatchedEvent state:SyncConnected type:NodeDataChanged path:/collections/testCollection1/state.json] for collection [testCollection1] has occurred - updating... (live nodes size: [1])
   [junit4]   2> 472521 INFO  (qtp1831633487-2795) [n:127.0.0.1:48134_solr    ] o.a.s.s.HttpSolrCall [admin] webapp=null path=/admin/collections params={replicationFactor=1&collection.configName=config&maxShardsPerNode=1000&name=testCollection1&nrtReplicas=1&action=CREATE&numShards=2&wt=javabin&version=2} status=0 QTime=3245
   [junit4]   2> 472526 INFO  (qtp1831633487-2793) [n:127.0.0.1:48134_solr    ] o.a.s.h.a.CollectionsHandler Invoked Collection Action :create with params replicationFactor=1&collection.configName=config&maxShardsPerNode=1000&name=testCollection2&nrtReplicas=1&action=CREATE&numShards=2&wt=javabin&version=2 and sendToOCPQueue=true
   [junit4]   2> 472546 INFO  (OverseerThreadFactory-1313-thread-2-processing-n:127.0.0.1:48134_solr) [n:127.0.0.1:48134_solr    ] o.a.s.c.CreateCollectionCmd Create collection testCollection2
   [junit4]   2> 472553 INFO  (OverseerCollectionConfigSetProcessor-98465496443191299-127.0.0.1:48134_solr-n_0000000000) [n:127.0.0.1:48134_solr    ] o.a.s.c.OverseerTaskQueue Response ZK path: /overseer/collection-queue-work/qnr-0000000000 doesn't exist.  Requestor may have disconnected from ZooKeeper
   [junit4]   2> 472848 INFO  (OverseerStateUpdate-98465496443191299-127.0.0.1:48134_solr-n_0000000000) [n:127.0.0.1:48134_solr    ] o.a.s.c.o.SliceMutator createReplica() {
   [junit4]   2>   "operation":"ADDREPLICA",
   [junit4]   2>   "collection":"testCollection2",
   [junit4]   2>   "shard":"shard1",
   [junit4]   2>   "core":"testCollection2_shard1_replica_n1",
   [junit4]   2>   "state":"down",
   [junit4]   2>   "base_url":"http://127.0.0.1:48134/solr",
   [junit4]   2>   "type":"NRT"} 
   [junit4]   2> 472866 INFO  (OverseerStateUpdate-98465496443191299-127.0.0.1:48134_solr-n_0000000000) [n:127.0.0.1:48134_solr    ] o.a.s.c.o.SliceMutator createReplica() {
   [junit4]   2>   "operation":"ADDREPLICA",
   [junit4]   2>   "collection":"testCollection2",
   [junit4]   2>   "shard":"shard2",
   [junit4]   2>   "core":"testCollection2_shard2_replica_n3",
   [junit4]   2>   "state":"down",
   [junit4]   2>   "base_url":"http://127.0.0.1:48134/solr",
   [junit4]   2>   "type":"NRT"} 
   [junit4]   2> 473076 INFO  (qtp1831633487-2798) [n:127.0.0.1:48134_solr    ] o.a.s.h.a.CoreAdminOperation core create command qt=/admin/cores&coreNodeName=core_node4&collection.configName=config&newCollection=true&name=testCollection2_shard2_replica_n3&action=CREATE&numShards=2&collection=testCollection2&shard=shard2&wt=javabin&version=2&replicaType=NRT
   [junit4]   2> 473076 INFO  (qtp1831633487-2797) [n:127.0.0.1:48134_solr    ] o.a.s.h.a.CoreAdminOperation core create command qt=/admin/cores&coreNodeName=core_node2&collection.configName=config&newCollection=true&name=testCollection2_shard1_replica_n1&action=CREATE&numShards=2&collection=testCollection2&shard=shard1&wt=javabin&version=2&replicaType=NRT
   [junit4]   2> 473190 INFO  (zkCallback-391-thread-2-processing-n:127.0.0.1:48134_solr) [n:127.0.0.1:48134_solr    ] o.a.s.c.c.ZkStateReader A cluster state change: [WatchedEvent state:SyncConnected type:NodeDataChanged path:/collections/testCollection2/state.json] for collection [testCollection2] has occurred - updating... (live nodes size: [1])
   [junit4]   2> 473190 INFO  (zkCallback-391-thread-1-processing-n:127.0.0.1:48134_solr) [n:127.0.0.1:48134_solr    ] o.a.s.c.c.ZkStateReader A cluster state change: [WatchedEvent state:SyncConnected type:NodeDataChanged path:/collections/testCollection2/state.json] for collection [testCollection2] has occurred - updating... (live nodes size: [1])
   [junit4]   2> 474119 INFO  (qtp1831633487-2797) [n:127.0.0.1:48134_solr c:testCollection2 s:shard1 r:core_node2 x:testCollection2_shard1_replica_n1] o.a.s.c.SolrConfig Using Lucene MatchVersion: 7.1.0
   [junit4]   2> 474140 INFO  (qtp1831633487-2798) [n:127.0.0.1:48134_solr c:testCollection2 s:shard2 r:core_node4 x:testCollection2_shard2_replica_n3] o.a.s.c.SolrConfig Using Lucene MatchVersion: 7.1.0
   [junit4]   2> 474164 INFO  (qtp1831633487-2797) [n:127.0.0.1:48134_solr c:testCollection2 s:shard1 r:core_node2 x:testCollection2_shard1_replica_n1] o.a.s.s.IndexSchema [testCollection2_shard1_replica_n1] Schema name=minimal
   [junit4]   2> 474214 INFO  (qtp1831633487-2797) [n:127.0.0.1:48134_solr c:testCollection2 s:shard1 r:core_node2 x:testCollection2_shard1_replica_n1] o.a.s.s.IndexSchema Loaded schema minimal/1.1 with uniqueid field id
   [junit4]   2> 474214 INFO  (qtp1831633487-2797) [n:127.0.0.1:48134_solr c:testCollection2 s:shard1 r:core_node2 x:testCollection2_shard1_replica_n1] o.a.s.c.CoreContainer Creating SolrCore 'testCollection2_shard1_replica_n1' using configuration from collection testCollection2, trusted=true
   [junit4]   2> 474215 INFO  (qtp1831633487-2798) [n:127.0.0.1:48134_solr c:testCollection2 s:shard2 r:core_node4 x:testCollection2_shard2_replica_n3] o.a.s.s.IndexSchema [testCollection2_shard2_replica_n3] Schema name=minimal
   [junit4]   2> 474217 INFO  (qtp1831633487-2798) [n:127.0.0.1:48134_solr c:testCollection2 s:shard2 r:core_node4 x:testCollection2_shard2_replica_n3] o.a.s.s.IndexSchema Loaded schema minimal/1.1 with uniqueid field id
   [junit4]   2> 474217 INFO  (qtp1831633487-2798) [n:127.0.0.1:48134_solr c:testCollection2 s:shard2 r:core_node4 x:testCollection2_shard2_replica_n3] o.a.s.c.CoreContainer Creating SolrCore 'testCollection2_shard2_replica_n3' using configuration from collection testCollection2, trusted=true
   [junit4]   2> 474217 INFO  (qtp1831633487-2798) [n:127.0.0.1:48134_solr c:testCollection2 s:shard2 r:core_node4 x:testCollection2_shard2_replica_n3] o.a.s.m.r.SolrJmxReporter JMX monitoring for 'solr_48134.solr.core.testCollection2.shard2.replica_n3' (registry 'solr.core.testCollection2.shard2.replica_n3') enabled at server: com.sun.jmx.mbeanserver.JmxMBeanServer@2df557b5
   [junit4]   2> 474217 INFO  (qtp1831633487-2798) [n:127.0.0.1:48134_solr c:testCollection2 s:shard2 r:core_node4 x:testCollection2_shard2_replica_n3] o.a.s.c.SolrCore solr.RecoveryStrategy.Builder
   [junit4]   2> 474218 INFO  (qtp1831633487-2798) [n:127.0.0.1:48134_solr c:testCollection2 s:shard2 r:core_node4 x:testCollection2_shard2_replica_n3] o.a.s.c.SolrCore [[testCollection2_shard2_replica_n3] ] Opening new SolrCore at [/export/home/jenkins/workspace/Lucene-Solr-7.x-Solaris/solr/build/solr-core/test/J1/temp/solr.cloud.LeaderElectionContextKeyTest_93519F5EC49B1438-001/tempDir-001/node1/testCollection2_shard2_replica_n3], dataDir=[/export/home/jenkins/workspace/Lucene-Solr-7.x-Solaris/solr/build/solr-core/test/J1/temp/solr.cloud.LeaderElectionContextKeyTest_93519F5EC49B1438-001/tempDir-001/node1/./testCollection2_shard2_replica_n3/data/]
   [junit4]   2> 474226 INFO  (qtp1831633487-2797) [n:127.0.0.1:48134_solr c:testCollection2 s:shard1 r:core_node2 x:testCollection2_shard1_replica_n1] o.a.s.m.r.SolrJmxReporter JMX monitoring for 'solr_48134.solr.core.testCollection2.shard1.replica_n1' (registry 'solr.core.testCollection2.shard1.replica_n1') enabled at server: com.sun.jmx.mbeanserver.JmxMBeanServer@2df557b5
   [junit4]   2> 474226 INFO  (qtp1831633487-2797) [n:127.0.0.1:48134_solr c:testCollection2 s:shard1 r:core_node2 x:testCollection2_shard1_replica_n1] o.a.s.c.SolrCore solr.RecoveryStrategy.Builder
   [junit4]   2> 474226 INFO  (qtp1831633487-2797) [n:127.0.0.1:48134_solr c:testCollection2 s:shard1 r:core_node2 x:testCollection2_shard1_replica_n1] o.a.s.c.SolrCore [[testCollection2_shard1_replica_n1] ] Opening new SolrCore at [/export/home/jenkins/workspace/Lucene-Solr-7.x-Solaris/solr/build/solr-core/test/J1/temp/solr.cloud.LeaderElectionContextKeyTest_93519F5EC49B1438-001/tempDir-001/node1/testCollection2_shard1_replica_n1], dataDir=[/export/home/jenkins/workspace/Lucene-Solr-7.x-Solaris/solr/build/solr-core/test/J1/temp/solr.cloud.LeaderElectionContextKeyTest_93519F5EC49B1438-001/tempDir-001/node1/./testCollection2_shard1_replica_n1/data/]
   [junit4]   2> 474320 INFO  (qtp1831633487-2797) [n:127.0.0.1:48134_solr c:testCollection2 s:shard1 r:core_node2 x:testCollection2_shard1_replica_n1] o.a.s.u.UpdateHandler Using UpdateLog implementation: org.apache.solr.update.UpdateLog
   [junit4]   2> 474320 INFO  (qtp1831633487-2797) [n:127.0.0.1:48134_solr c:testCollection2 s:shard1 r:core_node2 x:testCollection2_shard1_replica_n1] o.a.s.u.UpdateLog Initializing UpdateLog: dataDir=null defaultSyncLevel=FLUSH numRecordsToKeep=100 maxNumLogsToKeep=10 numVersionBuckets=65536
   [junit4]   2> 474321 INFO  (qtp1831633487-2797) [n:127.0.0.1:48134_solr c:testCollection2 s:shard1 r:core_node2 x:testCollection2_shard1_replica_n1] o.a.s.u.CommitTracker Hard AutoCommit: disabled
   [junit4]   2> 474321 INFO  (qtp1831633487-2797) [n:127.0.0.1:48134_solr c:testCollection2 s:shard1 r:core_node2 x:testCollection2_shard1_replica_n1] o.a.s.u.CommitTracker Soft AutoCommit: disabled
   [junit4]   2> 474322 INFO  (qtp1831633487-2797) [n:127.0.0.1:48134_solr c:testCollection2 s:shard1 r:core_node2 x:testCollection2_shard1_replica_n1] o.a.s.s.SolrIndexSearcher Opening [Searcher@61f0ea2a[testCollection2_shard1_replica_n1] main]
   [junit4]   2> 474346 INFO  (qtp1831633487-2798) [n:127.0.0.1:48134_solr c:testCollection2 s:shard2 r:core_node4 x:testCollection2_shard2_replica_n3] o.a.s.u.UpdateHandler Using UpdateLog implementation: org.apache.solr.update.UpdateLog
   [junit4]   2> 474346 INFO  (qtp1831633487-2798) [n:127.0.0.1:48134_solr c:testCollection2 s:shard2 r:core_node4 x:testCollection2_shard2_replica_n3] o.a.s.u.UpdateLog Initializing UpdateLog: dataDir=null defaultSyncLevel=FLUSH numRecordsToKeep=100 maxNumLogsToKeep=10 numVersionBuckets=65536
   [junit4]   2> 474347 INFO  (qtp1831633487-2798) [n:127.0.0.1:48134_solr c:testCollection2 s:shard2 r:core_node4 x:testCollection2_shard2_replica_n3] o.a.s.u.CommitTracker Hard AutoCommit: disabled
   [junit4]   2> 474347 INFO  (qtp1831633487-2798) [n:127.0.0.1:48134_solr c:testCollection2 s:shard2 r:core_node4 x:testCollection2_shard2_replica_n3] o.a.s.u.CommitTracker Soft AutoCommit: disabled
   [junit4]   2> 474349 INFO  (qtp1831633487-2798) [n:127.0.0.1:48134_solr c:testCollection2 s:shard2 r:core_node4 x:testCollection2_shard2_replica_n3] o.a.s.s.SolrIndexSearcher Opening [Searcher@3b433838[testCollection2_shard2_replica_n3] main]
   [junit4]   2> 474350 INFO  (qtp1831633487-2797) [n:127.0.0.1:48134_solr c:testCollection2 s:shard1 r:core_node2 x:testCollection2_shard1_replica_n1] o.a.s.r.ManagedResourceStorage Configured ZooKeeperStorageIO with znodeBase: /configs/config
   [junit4]   2> 474354 INFO  (qtp1831633487-2797) [n:127.0.0.1:48134_solr c:testCollection2 s:shard1 r:core_node2 x:testCollection2_shard1_replica_n1] o.a.s.r.ManagedResourceStorage Loaded null at path _rest_managed.json using ZooKeeperStorageIO:path=/configs/config
   [junit4]   2> 474355 INFO  (qtp1831633487-2797) [n:127.0.0.1:48134_solr c:testCollection2 s:shard1 r:core_node2 x:testCollection2_shard1_replica_n1] o.a.s.h.ReplicationHandler Commits will be reserved for  10000
   [junit4]   2> 474355 INFO  (qtp1831633487-2797) [n:127.0.0.1:48134_solr c:testCollection2 s:shard1 r:core_node2 x:testCollection2_shard1_replica_n1] o.a.s.u.UpdateLog Could not find max version in index or recent updates, using new clock 1575447949325893632
   [junit4]   2> 474366 INFO  (searcherExecutor-1327-thread-1-processing-n:127.0.0.1:48134_solr x:testCollection2_shard1_replica_n1 s:shard1 c:testCollection2 r:core_node2) [n:127.0.0.1:48134_solr c:testCollection2 s:shard1 r:core_node2 x:testCollection2_shard1_replica_n1] o.a.s.c.SolrCore [testCollection2_shard1_replica_n1] Registered new searcher Searcher@61f0ea2a[testCollection2_shard1_replica_n1] main{ExitableDirectoryReader(UninvertingDirectoryReader())}
   [junit4]   2> 474368 INFO  (qtp1831633487-2798) [n:127.0.0.1:48134_solr c:testCollection2 s:shard2 r:core_node4 x:testCollection2_shard2_replica_n3] o.a.s.r.ManagedResourceStorage Configured ZooKeeperStorageIO with znodeBase: /configs/config
   [junit4]   2> 474368 INFO  (qtp1831633487-2798) [n:127.0.0.1:48134_solr c:testCollection2 s:shard2 r:core_node4 x:testCollection2_shard2_replica_n3] o.a.s.r.ManagedResourceStorage Loaded null at path _rest_managed.json using ZooKeeperStorageIO:path=/configs/config
   [junit4]   2> 474372 INFO  (qtp1831633487-2798) [n:127.0.0.1:48134_solr c:testCollection2 s:shard2 r:core_node4 x:testCollection2_shard2_replica_n3] o.a.s.h.ReplicationHandler Commits will be reserved for  10000
   [junit4]   2> 474372 INFO  (qtp1831633487-2798) [n:127.0.0.1:48134_solr c:testCollection2 s:shard2 r:core_node4 x:testCollection2_shard2_replica_n3] o.a.s.u.UpdateLog Could not find max version in index or recent updates, using new clock 1575447949343719424
   [junit4]   2> 474394 INFO  (searcherExecutor-1326-thread-1-processing-n:127.0.0.1:48134_solr x:testCollection2_shard2_replica_n3 s:shard2 c:testCollection2 r:core_node4) [n:127.0.0.1:48134_solr c:testCollection2 s:shard2 r:core_node4 x:testCollection2_shard2_replica_n3] o.a.s.c.SolrCore [testCollection2_shard2_replica_n3] Registered new searcher Searcher@3b433838[testCollection2_shard2_replica_n3] main{ExitableDirectoryReader(UninvertingDirectoryReader())}
   [junit4]   2> 474395 INFO  (qtp1831633487-2797) [n:127.0.0.1:48134_solr c:testCollection2 s:shard1 r:core_node2 x:testCollection2_shard1_replica_n1] o.a.s.c.ShardLeaderElectionContext Enough replicas found to continue.
   [junit4]   2> 474395 INFO  (qtp1831633487-2797) [n:127.0.0.1:48134_solr c:testCollection2 s:shard1 r:core_node2 x:testCollection2_shard1_replica_n1] o.a.s.c.ShardLeaderElectionContext I may be the new leader - try and sync
   [junit4]   2> 474395 INFO  (qtp1831633487-2797) [n:127.0.0.1:48134_solr c:testCollection2 s:shard1 r:core_node2 x:testCollection2_shard1_replica_n1] o.a.s.c.SyncStrategy Sync replicas to http://127.0.0.1:48134/solr/testCollection2_shard1_replica_n1/
   [junit4]   2> 474395 INFO  (qtp1831633487-2797) [n:127.0.0.1:48134_solr c:testCollection2 s:shard1 r:core_node2 x:testCollection2_shard1_replica_n1] o.a.s.c.SyncStrategy Sync Success - now sync replicas to me
   [junit4]   2> 474395 INFO  (qtp1831633487-2797) [n:127.0.0.1:48134_solr c:testCollection2 s:shard1 r:core_node2 x:testCollection2_shard1_replica_n1] o.a.s.c.SyncStrategy http://127.0.0.1:48134/solr/testCollection2_shard1_replica_n1/ has no replicas
   [junit4]   2> 474395 INFO  (qtp1831633487-2797) [n:127.0.0.1:48134_solr c:testCollection2 s:shard1 r:core_node2 x:testCollection2_shard1_replica_n1] o.a.s.c.ShardLeaderElectionContext Found all replicas participating in election, clear LIR
   [junit4]   2> 474402 INFO  (qtp1831633487-2797) [n:127.0.0.1:48134_solr c:testCollection2 s:shard1 r:core_node2 x:testCollection2_shard1_replica_n1] o.a.s.c.ShardLeaderElectionContext I am the new leader: http://127.0.0.1:48134/solr/testCollection2_shard1_replica_n1/ shard1
   [junit4]   2> 474434 INFO  (qtp1831633487-2798) [n:127.0.0.1:48134_solr c:testCollection2 s:shard2 r:core_node4 x:testCollection2_shard2_replica_n3] o.a.s.c.ShardLeaderElectionContext Enough replicas found to continue.
   [junit4]   2> 474434 INFO  (qtp1831633487-2798) [n:127.0.0.1:48134_solr c:testCollection2 s:shard2 r:core_node4 x:testCollection2_shard2_replica_n3] o.a.s.c.ShardLeaderElectionContext I may be the new leader - try and sync
   [junit4]   2> 474434 INFO  (qtp1831633487-2798) [n:127.0.0.1:48134_solr c:testCollection2 s:shard2 r:core_node4 x:testCollection2_shard2_replica_n3] o.a.s.c.SyncStrategy Sync replicas to http://127.0.0.1:48134/solr/testCollection2_shard2_replica_n3/
   [junit4]   2> 474434 INFO  (qtp1831633487-2798) [n:127.0.0.1:48134_solr c:testCollection2 s:shard2 r:core_node4 x:testCollection2_shard2_replica_n3] o.a.s.c.SyncStrategy Sync Success - now sync replicas to me
   [junit4]   2> 474434 INFO  (qtp1831633487-2798) [n:127.0.0.1:48134_solr c:testCollection2 s:shard2 r:core_node4 x:testCollection2_shard2_replica_n3] o.a.s.c.SyncStrategy http://127.0.0.1:48134/solr/testCollection2_shard2_replica_n3/ has no replicas
   [junit4]   2> 474434 INFO  (qtp1831633487-2798) [n:127.0.0.1:48134_solr c:testCollection2 s:shard2 r:core_node4 x:testCollection2_shard2_replica_n3] o.a.s.c.ShardLeaderElectionContext Found all replicas participating in election, clear LIR
   [junit4]   2> 474450 INFO  (qtp1831633487-2798) [n:127.0.0.1:48134_solr c:testCollection2 s:shard2 r:core_node4 x:testCollection2_shard2_replica_n3] o.a.s.c.ShardLeaderElectionContext I am the new leader: http://127.0.0.1:48134/solr/testCollection2_shard2_replica_n3/ shard2
   [junit4]   2> 474620 INFO  (zkCallback-391-thread-2-processing-n:127.0.0.1:48134_solr) [n:127.0.0.1:48134_solr    ] o.a.s.c.c.ZkStateReader A cluster state change: [WatchedEvent state:SyncConnected type:NodeDataChanged path:/collections/testCollection2/state.json] for collection [testCollection2] has occurred - updating... (live nodes size: [1])
   [junit4]   2> 474621 INFO  (zkCallback-391-thread-1-processing-n:127.0.0.1:48134_solr) [n:127.0.0.1:48134_solr    ] o.a.s.c.c.ZkStateReader A cluster state change: [WatchedEvent state:SyncConnected type:NodeDataChanged path:/collections/testCollection2/state.json] for collection [testCollection2] has occurred - updating... (live nodes size: [1])
   [junit4]   2> 474657 INFO  (qtp1831633487-2798) [n:127.0.0.1:48134_solr c:testCollection2 s:shard2 r:core_node4 x:testCollection2_shard2_replica_n3] o.a.s.c.ZkController I am the leader, no recovery necessary
   [junit4]   2> 474661 INFO  (qtp1831633487-2798) [n:127.0.0.1:48134_solr c:testCollection2 s:shard2 r:core_node4 x:testCollection2_shard2_replica_n3] o.a.s.s.HttpSolrCall [admin] webapp=null path=/admin/cores params={qt=/admin/cores&coreNodeName=core_node4&collection.configName=config&newCollection=true&name=testCollection2_shard2_replica_n3&action=CREATE&numShards=2&collection=testCollection2&shard=shard2&wt=javabin&version=2&replicaType=NRT} status=0 QTime=1586
   [junit4]   2> 474665 INFO  (qtp1831633487-2797) [n:127.0.0.1:48134_solr c:testCollection2 s:shard1 r:core_node2 x:testCollection2_shard1_replica_n1] o.a.s.c.ZkController I am the leader, no recovery necessary
   [junit4]   2> 474667 INFO  (qtp1831633487-2797) [n:127.0.0.1:48134_solr c:testCollection2 s:shard1 r:core_node2 x:testCollection2_shard1_replica_n1] o.a.s.s.HttpSolrCall [admin] webapp=null path=/admin/cores params={qt=/admin/cores&coreNodeName=core_node2&collection.configName=config&newCollection=true&name=testCollection2_shard1_replica_n1&action=CREATE&numShards=2&collection=testCollection2&shard=shard1&wt=javabin&version=2&replicaType=NRT} status=0 QTime=1592
   [junit4]   2> 474672 INFO  (qtp1831633487-2793) [n:127.0.0.1:48134_solr    ] o.a.s.h.a.CollectionsHandler Wait for new collection to be active for at most 30 seconds. Check all shard replicas
   [junit4]   2> 474802 INFO  (zkCallback-391-thread-2-processing-n:127.0.0.1:48134_solr) [n:127.0.0.1:48134_solr    ] o.a.s.c.c.ZkStateReader A cluster state change: [WatchedEvent state:SyncConnected type:NodeDataChanged path:/collections/testCollection2/state.json] for collection [testCollection2] has occurred - updating... (live nodes size: [1])
   [junit4]   2> 474802 INFO  (zkCallback-391-thread-1-processing-n:127.0.0.1:48134_solr) [n:127.0.0.1:48134_solr    ] o.a.s.c.c.ZkStateReader A cluster state change: [WatchedEvent state:SyncConnected type:NodeDataChanged path:/collections/testCollection2/state.json] for collection [testCollection2] has occurred - updating... (live nodes size: [1])
   [junit4]   2> 475673 INFO  (qtp1831633487-2793) [n:127.0.0.1:48134_solr    ] o.a.s.s.HttpSolrCall [admin] webapp=null path=/admin/collections params={replicationFactor=1&collection.configName=config&maxShardsPerNode=1000&name=testCollection2&nrtReplicas=1&action=CREATE&numShards=2&wt=javabin&version=2} status=0 QTime=3148
   [junit4]   2> 475674 INFO  (SUITE-LeaderElectionContextKeyTest-seed#[93519F5EC49B1438]-worker) [    ] o.a.s.c.AbstractDistribZkTestBase Wait for recoveries to finish - collection: testCollection1 failOnTimeout:true timeout (sec):30
   [junit4]   2> 475674 INFO  (SUITE-LeaderElectionContextKeyTest-seed#[93519F5EC49B1438]-worker) [    ] o.a.s.c.AbstractDistribZkTestBase Recoveries finished - collection: testCollection1
   [junit4]   2> 475674 INFO  (SUITE-LeaderElectionContextKeyTest-seed#[93519F5EC49B1438]-worker) [    ] o.a.s.c.AbstractDistribZkTestBase Wait for recoveries to finish - collection: testCollection2 failOnTimeout:true timeout (sec):30
   [junit4]   2> 475675 INFO  (SUITE-LeaderElectionContextKeyTest-seed#[93519F5EC49B1438]-worker) [    ] o.a.s.c.AbstractDistribZkTestBase Recoveries finished - collection: testCollection2
   [junit4]   2> 475705 INFO  (TEST-LeaderElectionContextKeyTest.test-seed#[93519F5EC49B1438]) [    ] o.a.s.SolrTestCaseJ4 ###Starting test
   [junit4]   2> 475711 INFO  (qtp1831633487-2794) [n:127.0.0.1:48134_solr    ] o.a.s.m.SolrMetricManager Closing metric reporters for registry=solr.core.testCollection1.shard2.replica_n2, tag=null
   [junit4]   2> 475716 INFO  (qtp1831633487-2794) [n:127.0.0.1:48134_solr    ] o.a.s.c.SolrCore [testCollection1_shard2_replica_n2]  CLOSING SolrCore org.apache.solr.core.SolrCore@3bbad1f4
   [junit4]   2> 475721 INFO  (qtp1831633487-2794) [n:127.0.0.1:48134_solr    ] o.a.s.m.SolrMetricManager Closing metric reporters for registry=solr.core.testCollection1.shard2.replica_n2, tag=1002099188
   [junit4]   2> 475721 INFO  (qtp1831633487-2794) [n:127.0.0.1:48134_solr    ] o.a.s.m.SolrMetricManager Closing metric reporters for registry=solr.collection.testCollection1.shard2.leader, tag=1002099188
   [junit4]   2> 475727 INFO  (qtp1831633487-2794) [n:127.0.0.1:48134_solr    ] o.a.s.s.HttpSolrCall [admin] webapp=null path=/admin/cores params={deleteInstanceDir=false&core=testCollection1_shard2_replica_n2&deleteDataDir=false&action=UNLOAD&indexInfo=true&wt=javabin&version=2&deleteIndex=false} status=0 QTime=15
   [junit4]   2> 475730 INFO  (TEST-LeaderElectionContextKeyTest.test-seed#[93519F5EC49B1438]) [    ] o.a.s.SolrTestCaseJ4 ###Ending test
   [junit4]   2> NOTE: reproduce with: ant test  -Dtestcase=LeaderElectionContextKeyTest -Dtests.method=test -Dtests.seed=93519F5EC49B1438 -Dtests.slow=true -Dtests.locale=ar-SD -Dtests.timezone=Asia/Thimphu -Dtests.asserts=true -Dtests.file.encoding=US-ASCII
   [junit4] FAILURE 0.06s J1 | LeaderElectionContextKeyTest.test <<<
   [junit4]    > Throwable #1: java.lang.AssertionError
   [junit4]    > 	at __randomizedtesting.SeedInfo.seed([93519F5EC49B1438:1B05A0846A6779C0]:0)
   [junit4]    > 	at org.apache.solr.cloud.LeaderElectionContextKeyTest.test(LeaderElectionContextKeyTest.java:88)
   [junit4]    > 	at java.lang.Thread.run(Thread.java:748)
   [junit4]   2> 475741 INFO  (jetty-closer-385-thread-1) [    ] o.e.j.s.AbstractConnector Stopped ServerConnector@56dc17ea{HTTP/1.1,[http/1.1]}{127.0.0.1:0}
   [junit4]   2> 475741 INFO  (jetty-closer-385-thread-1) [    ] o.a.s.c.CoreContainer Shutting down CoreContainer instance=779327301
   [junit4]   2> 475742 INFO  (jetty-closer-385-thread-1) [    ] o.a.s.m.SolrMetricManager Closing metric reporters for registry=solr.node, tag=null
   [junit4]   2> 475744 INFO  (jetty-closer-385-thread-1) [    ] o.a.s.m.SolrMetricManager Closing metric reporters for registry=solr.jvm, tag=null
   [junit4]   2> 475745 INFO  (jetty-closer-385-thread-1) [    ] o.a.s.m.SolrMetricManager Closing metric reporters for registry=solr.jetty, tag=null
   [junit4]   2> 475765 INFO  (jetty-closer-385-thread-1) [    ] o.a.s.m.SolrMetricManager Closing metric reporters for registry=solr.cluster, tag=null
   [junit4]   2> 475772 INFO  (coreCloseExecutor-1336-thread-1) [n:127.0.0.1:48134_solr c:testCollection1 s:shard1 r:core_node3 x:testCollection1_shard1_replica_n1] o.a.s.c.SolrCore [testCollection1_shard1_replica_n1]  CLOSING SolrCore org.apache.solr.core.SolrCore@423ef686
   [junit4]   2> 475772 INFO  (coreCloseExecutor-1336-thread-2) [n:127.0.0.1:48134_solr c:testCollection2 s:shard1 r:core_node2 x:testCollection2_shard1_replica_n1] o.a.s.c.SolrCore [testCollection2_shard1_replica_n1]  CLOSING SolrCore org.apache.solr.core.SolrCore@1be5c985
   [junit4]   2> 475773 INFO  (coreCloseExecutor-1336-thread-3) [n:127.0.0.1:48134_solr c:testCollection2 s:shard2 r:core_node4 x:testCollection2_shard2_replica_n3] o.a.s.c.SolrCore [testCollection2_shard2_replica_n3]  CLOSING SolrCore org.apache.solr.core.SolrCore@bfd5243
   [junit4]   2> 475805 INFO  (coreCloseExecutor-1336-thread-1) [n:127.0.0.1:48134_solr c:testCollection1 s:shard1 r:core_node3 x:testCollection1_shard1_replica_n1] o.a.s.m.SolrMetricManager Closing metric reporters for registry=solr.core.testCollection1.shard1.replica_n1, tag=1111422598
   [junit4]   2> 475808 INFO  (coreCloseExecutor-1336-thread-1) [n:127.0.0.1:48134_solr c:testCollection1 s:shard1 r:core_node3 x:testCollection1_shard1_replica_n1] o.a.s.m.SolrMetricManager Closing metric reporters for registry=solr.collection.testCollection1.shard1.leader, tag=1111422598
   [junit4]   2> 475812 INFO  (coreCloseExecutor-1336-thread-3) [n:127.0.0.1:48134_solr c:testCollection2 s:shard2 r:core_node4 x:testCollection2_shard2_replica_n3] o.a.s.m.SolrMetricManager Closing metric reporters for registry=solr.core.testCollection2.shard2.replica_n3, tag=201151043
   [junit4]   2> 475815 INFO  (coreCloseExecutor-1336-thread-3) [n:127.0.0.1:48134_solr c:testCollection2 s:shard2 r:core_node4 x:testCollection2_shard2_replica_n3] o.a.s.m.SolrMetricManager Closing metric reporters for registry=solr.collection.testCollection2.shard2.leader, tag=201151043
   [junit4]   2> 475838 INFO  (coreCloseExecutor-1336-thread-2) [n:127.0.0.1:48134_solr c:testCollection2 s:shard1 r:core_node2 x:testCollection2_shard1_replica_n1] o.a.s.m.SolrMetricManager Closing metric reporters for registry=solr.core.testCollection2.shard1.replica_n1, tag=468044165
   [junit4]   2> 475840 INFO  (coreCloseExecutor-1336-thread-2) [n:127.0.0.1:48134_solr c:testCollection2 s:shard1 r:core_node2 x:testCollection2_shard1_replica_n1] o.a.s.m.SolrMetricManager Closing metric reporters for registry=solr.collection.testCollection2.shard1.leader, tag=468044165
   [junit4]   2> 475842 INFO  (jetty-closer-385-thread-1) [    ] o.a.s.c.Overseer Overseer (id=98465496443191299-127.0.0.1:48134_solr-n_0000000000) closing
   [junit4]   2> 475842 INFO  (OverseerStateUpdate-98465496443191299-127.0.0.1:48134_solr-n_0000000000) [n:127.0.0.1:48134_solr    ] o.a.s.c.Overseer Overseer Loop exiting : 127.0.0.1:48134_solr
   [junit4]   2> 475850 INFO  (jetty-closer-385-thread-1) [    ] o.e.j.s.h.ContextHandler Stopped o.e.j.s.ServletContextHandler@537afc3a{/solr,null,UNAVAILABLE}
   [junit4]   2> 475853 ERROR (SUITE-LeaderElectionContextKeyTest-seed#[93519F5EC49B1438]-worker) [    ] o.a.z.s.ZooKeeperServer ZKShutdownHandler is not registered, so ZooKeeper server won't take any action on ERROR or SHUTDOWN server state changes
   [junit4]   2> 475855 INFO  (SUITE-LeaderElectionContextKeyTest-seed#[93519F5EC49B1438]-worker) [    ] o.a.s.c.ZkTestServer connecting to 127.0.0.1:59845 59845
   [junit4]   2> 481715 INFO  (Thread-719) [    ] o.a.s.c.ZkTestServer connecting to 127.0.0.1:59845 59845
   [junit4]   2> 481717 WARN  (Thread-719) [    ] o.a.s.c.ZkTestServer Watch limit violations: 
   [junit4]   2> Maximum concurrent create/delete watches above limit:
   [junit4]   2> 
   [junit4]   2> 	2	/solr/aliases.json
   [junit4]   2> 	2	/solr/clusterprops.json
   [junit4]   2> 
   [junit4]   2> Maximum concurrent data watches above limit:
   [junit4]   2> 
   [junit4]   2> 	5	/solr/collections/testCollection2/state.json
   [junit4]   2> 	5	/solr/collections/testCollection1/state.json
   [junit4]   2> 	2	/solr/clusterstate.json
   [junit4]   2> 
   [junit4]   2> Maximum concurrent children watches above limit:
   [junit4]   2> 
   [junit4]   2> 	2	/solr/live_nodes
   [junit4]   2> 	2	/solr/collections
   [junit4]   2> 
   [junit4]   2> NOTE: leaving temporary files on disk at: /export/home/jenkins/workspace/Lucene-Solr-7.x-Solaris/solr/build/solr-core/test/J1/temp/solr.cloud.LeaderElectionContextKeyTest_93519F5EC49B1438-001
   [junit4]   2> NOTE: test params are: codec=Asserting(Lucene70): {}, docValues:{}, maxPointsInLeafNode=1333, maxMBSortInHeap=6.367940827725594, sim=RandomSimilarity(queryNorm=true): {}, locale=ar-SD, timezone=Asia/Thimphu
   [junit4]   2> NOTE: SunOS 5.11 amd64/Oracle Corporation 1.8.0_141 (64-bit)/cpus=3,threads=1,free=108805288,total=324067328
   [junit4]   2> NOTE: All tests run in this JVM: [TestPartialUpdateDeduplication, SmileWriterTest, ExitableDirectoryReaderTest, SearchHandlerTest, TestSolrConfigHandler, TestSolrDeletionPolicy1, OutOfBoxZkACLAndCredentialsProvidersTest, TestSerializedLuceneMatchVersion, TermVectorComponentTest, TestMaxTokenLenTokenizer, TestShardHandlerFactory, HdfsWriteToMultipleCollectionsTest, TestConfigsApi, SOLR749Test, TestRTGBase, OpenCloseCoreStressTest, SpellPossibilityIteratorTest, TestSolrIndexConfig, BadComponentTest, DocValuesMissingTest, TestWordDelimiterFilterFactory, TestSchemaNameResource, TestRTimerTree, ZkNodePropsTest, ClassificationUpdateProcessorFactoryTest, TestDocBasedVersionConstraints, TestOrdValues, TestScoreJoinQPScore, TestReload, ResponseHeaderTest, TestClassicSimilarityFactory, TestRemoteStreaming, DistribCursorPagingTest, TestInPlaceUpdatesStandalone, TestFastWriter, SSLMigrationTest, RestartWhileUpdatingTest, MoveReplicaHDFSUlogDirTest, TestCloudJSONFacetJoinDomain, CollectionReloadTest, TestPKIAuthenticationPlugin, CollectionsAPISolrJTest, TestUseDocValuesAsStored2, CoreAdminRequestStatusTest, TestTrie, CdcrBootstrapTest, ActionThrottleTest, TestDeleteCollectionOnDownNodes, TestSolrCloudWithKerberosAlt, LeaderElectionContextKeyTest]
   [junit4] Completed [89/728 (1!)] on J1 in 13.33s, 1 test, 1 failure <<< FAILURES!

[...truncated 45528 lines...]

Mime
View raw message