lucene-dev mailing list archives

Site index · List index
Message view « Date » · « Thread »
Top « Date » · « Thread »
From Apache Jenkins Server <jenk...@builds.apache.org>
Subject [JENKINS] Lucene-Solr-NightlyTests-6.6 - Build # 26 - Still Unstable
Date Wed, 23 Aug 2017 01:05:29 GMT
Build: https://builds.apache.org/job/Lucene-Solr-NightlyTests-6.6/26/

9 tests failed.
FAILED:  org.apache.lucene.search.TestInetAddressRangeQueries.testRandomBig

Error Message:
Test abandoned because suite timeout was reached.

Stack Trace:
java.lang.Exception: Test abandoned because suite timeout was reached.
	at __randomizedtesting.SeedInfo.seed([F8BD8548E57E4F77]:0)


FAILED:  junit.framework.TestSuite.org.apache.lucene.search.TestInetAddressRangeQueries

Error Message:
Suite timeout exceeded (>= 7200000 msec).

Stack Trace:
java.lang.Exception: Suite timeout exceeded (>= 7200000 msec).
	at __randomizedtesting.SeedInfo.seed([F8BD8548E57E4F77]:0)


FAILED:  org.apache.solr.cloud.FullSolrCloudDistribCmdsTest.test

Error Message:
Error from server at http://127.0.0.1:34779/collection1: Cannot talk to ZooKeeper - Updates are disabled.

Stack Trace:
org.apache.solr.client.solrj.impl.HttpSolrClient$RemoteSolrException: Error from server at http://127.0.0.1:34779/collection1: Cannot talk to ZooKeeper - Updates are disabled.
	at org.apache.solr.client.solrj.impl.HttpSolrClient.executeMethod(HttpSolrClient.java:612)
	at org.apache.solr.client.solrj.impl.HttpSolrClient.request(HttpSolrClient.java:279)
	at org.apache.solr.client.solrj.impl.HttpSolrClient.request(HttpSolrClient.java:268)
	at org.apache.solr.client.solrj.SolrRequest.process(SolrRequest.java:160)
	at org.apache.solr.client.solrj.SolrClient.commit(SolrClient.java:484)
	at org.apache.solr.client.solrj.SolrClient.commit(SolrClient.java:463)
	at org.apache.solr.cloud.AbstractFullDistribZkTestBase.commit(AbstractFullDistribZkTestBase.java:1529)
	at org.apache.solr.cloud.FullSolrCloudDistribCmdsTest.testIndexingBatchPerRequestWithHttpSolrClient(FullSolrCloudDistribCmdsTest.java:664)
	at org.apache.solr.cloud.FullSolrCloudDistribCmdsTest.test(FullSolrCloudDistribCmdsTest.java:152)
	at sun.reflect.NativeMethodAccessorImpl.invoke0(Native Method)
	at sun.reflect.NativeMethodAccessorImpl.invoke(NativeMethodAccessorImpl.java:62)
	at sun.reflect.DelegatingMethodAccessorImpl.invoke(DelegatingMethodAccessorImpl.java:43)
	at java.lang.reflect.Method.invoke(Method.java:498)
	at com.carrotsearch.randomizedtesting.RandomizedRunner.invoke(RandomizedRunner.java:1713)
	at com.carrotsearch.randomizedtesting.RandomizedRunner$8.evaluate(RandomizedRunner.java:907)
	at com.carrotsearch.randomizedtesting.RandomizedRunner$9.evaluate(RandomizedRunner.java:943)
	at com.carrotsearch.randomizedtesting.RandomizedRunner$10.evaluate(RandomizedRunner.java:957)
	at org.apache.solr.BaseDistributedSearchTestCase$ShardsRepeatRule$ShardsFixedStatement.callStatement(BaseDistributedSearchTestCase.java:992)
	at org.apache.solr.BaseDistributedSearchTestCase$ShardsRepeatRule$ShardsStatement.evaluate(BaseDistributedSearchTestCase.java:967)
	at com.carrotsearch.randomizedtesting.rules.SystemPropertiesRestoreRule$1.evaluate(SystemPropertiesRestoreRule.java:57)
	at org.apache.lucene.util.TestRuleSetupTeardownChained$1.evaluate(TestRuleSetupTeardownChained.java:49)
	at org.apache.lucene.util.AbstractBeforeAfterRule$1.evaluate(AbstractBeforeAfterRule.java:45)
	at org.apache.lucene.util.TestRuleThreadAndTestName$1.evaluate(TestRuleThreadAndTestName.java:48)
	at org.apache.lucene.util.TestRuleIgnoreAfterMaxFailures$1.evaluate(TestRuleIgnoreAfterMaxFailures.java:64)
	at org.apache.lucene.util.TestRuleMarkFailure$1.evaluate(TestRuleMarkFailure.java:47)
	at com.carrotsearch.randomizedtesting.rules.StatementAdapter.evaluate(StatementAdapter.java:36)
	at com.carrotsearch.randomizedtesting.ThreadLeakControl$StatementRunner.run(ThreadLeakControl.java:368)
	at com.carrotsearch.randomizedtesting.ThreadLeakControl.forkTimeoutingTask(ThreadLeakControl.java:817)
	at com.carrotsearch.randomizedtesting.ThreadLeakControl$3.evaluate(ThreadLeakControl.java:468)
	at com.carrotsearch.randomizedtesting.RandomizedRunner.runSingleTest(RandomizedRunner.java:916)
	at com.carrotsearch.randomizedtesting.RandomizedRunner$5.evaluate(RandomizedRunner.java:802)
	at com.carrotsearch.randomizedtesting.RandomizedRunner$6.evaluate(RandomizedRunner.java:852)
	at com.carrotsearch.randomizedtesting.RandomizedRunner$7.evaluate(RandomizedRunner.java:863)
	at com.carrotsearch.randomizedtesting.rules.StatementAdapter.evaluate(StatementAdapter.java:36)
	at com.carrotsearch.randomizedtesting.rules.SystemPropertiesRestoreRule$1.evaluate(SystemPropertiesRestoreRule.java:57)
	at org.apache.lucene.util.AbstractBeforeAfterRule$1.evaluate(AbstractBeforeAfterRule.java:45)
	at com.carrotsearch.randomizedtesting.rules.StatementAdapter.evaluate(StatementAdapter.java:36)
	at org.apache.lucene.util.TestRuleStoreClassName$1.evaluate(TestRuleStoreClassName.java:41)
	at com.carrotsearch.randomizedtesting.rules.NoShadowingOrOverridesOnMethodsRule$1.evaluate(NoShadowingOrOverridesOnMethodsRule.java:40)
	at com.carrotsearch.randomizedtesting.rules.NoShadowingOrOverridesOnMethodsRule$1.evaluate(NoShadowingOrOverridesOnMethodsRule.java:40)
	at com.carrotsearch.randomizedtesting.rules.StatementAdapter.evaluate(StatementAdapter.java:36)
	at com.carrotsearch.randomizedtesting.rules.StatementAdapter.evaluate(StatementAdapter.java:36)
	at com.carrotsearch.randomizedtesting.rules.StatementAdapter.evaluate(StatementAdapter.java:36)
	at org.apache.lucene.util.TestRuleAssertionsRequired$1.evaluate(TestRuleAssertionsRequired.java:53)
	at org.apache.lucene.util.TestRuleMarkFailure$1.evaluate(TestRuleMarkFailure.java:47)
	at org.apache.lucene.util.TestRuleIgnoreAfterMaxFailures$1.evaluate(TestRuleIgnoreAfterMaxFailures.java:64)
	at org.apache.lucene.util.TestRuleIgnoreTestSuites$1.evaluate(TestRuleIgnoreTestSuites.java:54)
	at com.carrotsearch.randomizedtesting.rules.StatementAdapter.evaluate(StatementAdapter.java:36)
	at com.carrotsearch.randomizedtesting.ThreadLeakControl$StatementRunner.run(ThreadLeakControl.java:368)
	at java.lang.Thread.run(Thread.java:748)


FAILED:  org.apache.solr.cloud.LeaderFailoverAfterPartitionTest.test

Error Message:
Expected 2 of 3 replicas to be active but only found 1; [core_node3:{"core":"c8n_1x3_lf_shard1_replica2","base_url":"http://127.0.0.1:34918/vw","node_name":"127.0.0.1:34918_vw","state":"active","leader":"true"}]; clusterState: DocCollection(c8n_1x3_lf//clusterstate.json/31)={   "replicationFactor":"3",   "shards":{"shard1":{       "range":"80000000-7fffffff",       "state":"active",       "replicas":{         "core_node1":{           "core":"c8n_1x3_lf_shard1_replica1",           "base_url":"http://127.0.0.1:35037/vw",           "node_name":"127.0.0.1:35037_vw",           "state":"down"},         "core_node2":{           "state":"down",           "base_url":"http://127.0.0.1:46527/vw",           "core":"c8n_1x3_lf_shard1_replica3",           "node_name":"127.0.0.1:46527_vw"},         "core_node3":{           "core":"c8n_1x3_lf_shard1_replica2",           "base_url":"http://127.0.0.1:34918/vw",           "node_name":"127.0.0.1:34918_vw",           "state":"active",           "leader":"true"}}}},   "router":{"name":"compositeId"},   "maxShardsPerNode":"1",   "autoAddReplicas":"false"}

Stack Trace:
java.lang.AssertionError: Expected 2 of 3 replicas to be active but only found 1; [core_node3:{"core":"c8n_1x3_lf_shard1_replica2","base_url":"http://127.0.0.1:34918/vw","node_name":"127.0.0.1:34918_vw","state":"active","leader":"true"}]; clusterState: DocCollection(c8n_1x3_lf//clusterstate.json/31)={
  "replicationFactor":"3",
  "shards":{"shard1":{
      "range":"80000000-7fffffff",
      "state":"active",
      "replicas":{
        "core_node1":{
          "core":"c8n_1x3_lf_shard1_replica1",
          "base_url":"http://127.0.0.1:35037/vw",
          "node_name":"127.0.0.1:35037_vw",
          "state":"down"},
        "core_node2":{
          "state":"down",
          "base_url":"http://127.0.0.1:46527/vw",
          "core":"c8n_1x3_lf_shard1_replica3",
          "node_name":"127.0.0.1:46527_vw"},
        "core_node3":{
          "core":"c8n_1x3_lf_shard1_replica2",
          "base_url":"http://127.0.0.1:34918/vw",
          "node_name":"127.0.0.1:34918_vw",
          "state":"active",
          "leader":"true"}}}},
  "router":{"name":"compositeId"},
  "maxShardsPerNode":"1",
  "autoAddReplicas":"false"}
	at __randomizedtesting.SeedInfo.seed([37B7808343C9655C:BFE3BF59ED3508A4]:0)
	at org.junit.Assert.fail(Assert.java:93)
	at org.junit.Assert.assertTrue(Assert.java:43)
	at org.apache.solr.cloud.LeaderFailoverAfterPartitionTest.testRf3WithLeaderFailover(LeaderFailoverAfterPartitionTest.java:168)
	at org.apache.solr.cloud.LeaderFailoverAfterPartitionTest.test(LeaderFailoverAfterPartitionTest.java:55)
	at sun.reflect.NativeMethodAccessorImpl.invoke0(Native Method)
	at sun.reflect.NativeMethodAccessorImpl.invoke(NativeMethodAccessorImpl.java:62)
	at sun.reflect.DelegatingMethodAccessorImpl.invoke(DelegatingMethodAccessorImpl.java:43)
	at java.lang.reflect.Method.invoke(Method.java:498)
	at com.carrotsearch.randomizedtesting.RandomizedRunner.invoke(RandomizedRunner.java:1713)
	at com.carrotsearch.randomizedtesting.RandomizedRunner$8.evaluate(RandomizedRunner.java:907)
	at com.carrotsearch.randomizedtesting.RandomizedRunner$9.evaluate(RandomizedRunner.java:943)
	at com.carrotsearch.randomizedtesting.RandomizedRunner$10.evaluate(RandomizedRunner.java:957)
	at org.apache.solr.BaseDistributedSearchTestCase$ShardsRepeatRule$ShardsFixedStatement.callStatement(BaseDistributedSearchTestCase.java:992)
	at org.apache.solr.BaseDistributedSearchTestCase$ShardsRepeatRule$ShardsStatement.evaluate(BaseDistributedSearchTestCase.java:967)
	at com.carrotsearch.randomizedtesting.rules.SystemPropertiesRestoreRule$1.evaluate(SystemPropertiesRestoreRule.java:57)
	at org.apache.lucene.util.TestRuleSetupTeardownChained$1.evaluate(TestRuleSetupTeardownChained.java:49)
	at org.apache.lucene.util.AbstractBeforeAfterRule$1.evaluate(AbstractBeforeAfterRule.java:45)
	at org.apache.lucene.util.TestRuleThreadAndTestName$1.evaluate(TestRuleThreadAndTestName.java:48)
	at org.apache.lucene.util.TestRuleIgnoreAfterMaxFailures$1.evaluate(TestRuleIgnoreAfterMaxFailures.java:64)
	at org.apache.lucene.util.TestRuleMarkFailure$1.evaluate(TestRuleMarkFailure.java:47)
	at com.carrotsearch.randomizedtesting.rules.StatementAdapter.evaluate(StatementAdapter.java:36)
	at com.carrotsearch.randomizedtesting.ThreadLeakControl$StatementRunner.run(ThreadLeakControl.java:368)
	at com.carrotsearch.randomizedtesting.ThreadLeakControl.forkTimeoutingTask(ThreadLeakControl.java:817)
	at com.carrotsearch.randomizedtesting.ThreadLeakControl$3.evaluate(ThreadLeakControl.java:468)
	at com.carrotsearch.randomizedtesting.RandomizedRunner.runSingleTest(RandomizedRunner.java:916)
	at com.carrotsearch.randomizedtesting.RandomizedRunner$5.evaluate(RandomizedRunner.java:802)
	at com.carrotsearch.randomizedtesting.RandomizedRunner$6.evaluate(RandomizedRunner.java:852)
	at com.carrotsearch.randomizedtesting.RandomizedRunner$7.evaluate(RandomizedRunner.java:863)
	at com.carrotsearch.randomizedtesting.rules.StatementAdapter.evaluate(StatementAdapter.java:36)
	at com.carrotsearch.randomizedtesting.rules.SystemPropertiesRestoreRule$1.evaluate(SystemPropertiesRestoreRule.java:57)
	at org.apache.lucene.util.AbstractBeforeAfterRule$1.evaluate(AbstractBeforeAfterRule.java:45)
	at com.carrotsearch.randomizedtesting.rules.StatementAdapter.evaluate(StatementAdapter.java:36)
	at org.apache.lucene.util.TestRuleStoreClassName$1.evaluate(TestRuleStoreClassName.java:41)
	at com.carrotsearch.randomizedtesting.rules.NoShadowingOrOverridesOnMethodsRule$1.evaluate(NoShadowingOrOverridesOnMethodsRule.java:40)
	at com.carrotsearch.randomizedtesting.rules.NoShadowingOrOverridesOnMethodsRule$1.evaluate(NoShadowingOrOverridesOnMethodsRule.java:40)
	at com.carrotsearch.randomizedtesting.rules.StatementAdapter.evaluate(StatementAdapter.java:36)
	at com.carrotsearch.randomizedtesting.rules.StatementAdapter.evaluate(StatementAdapter.java:36)
	at com.carrotsearch.randomizedtesting.rules.StatementAdapter.evaluate(StatementAdapter.java:36)
	at org.apache.lucene.util.TestRuleAssertionsRequired$1.evaluate(TestRuleAssertionsRequired.java:53)
	at org.apache.lucene.util.TestRuleMarkFailure$1.evaluate(TestRuleMarkFailure.java:47)
	at org.apache.lucene.util.TestRuleIgnoreAfterMaxFailures$1.evaluate(TestRuleIgnoreAfterMaxFailures.java:64)
	at org.apache.lucene.util.TestRuleIgnoreTestSuites$1.evaluate(TestRuleIgnoreTestSuites.java:54)
	at com.carrotsearch.randomizedtesting.rules.StatementAdapter.evaluate(StatementAdapter.java:36)
	at com.carrotsearch.randomizedtesting.ThreadLeakControl$StatementRunner.run(ThreadLeakControl.java:368)
	at java.lang.Thread.run(Thread.java:748)


FAILED:  org.apache.solr.cloud.hdfs.StressHdfsTest.test

Error Message:
Timeout occured while waiting response from server at: http://127.0.0.1:40590

Stack Trace:
org.apache.solr.client.solrj.SolrServerException: Timeout occured while waiting response from server at: http://127.0.0.1:40590
	at __randomizedtesting.SeedInfo.seed([37B7808343C9655C:BFE3BF59ED3508A4]:0)
	at org.apache.solr.client.solrj.impl.HttpSolrClient.executeMethod(HttpSolrClient.java:623)
	at org.apache.solr.client.solrj.impl.HttpSolrClient.request(HttpSolrClient.java:279)
	at org.apache.solr.client.solrj.impl.HttpSolrClient.request(HttpSolrClient.java:268)
	at org.apache.solr.client.solrj.impl.LBHttpSolrClient.doRequest(LBHttpSolrClient.java:447)
	at org.apache.solr.client.solrj.impl.LBHttpSolrClient.request(LBHttpSolrClient.java:388)
	at org.apache.solr.client.solrj.impl.CloudSolrClient.sendRequest(CloudSolrClient.java:1383)
	at org.apache.solr.client.solrj.impl.CloudSolrClient.requestWithRetryOnStaleState(CloudSolrClient.java:1134)
	at org.apache.solr.client.solrj.impl.CloudSolrClient.request(CloudSolrClient.java:1073)
	at org.apache.solr.client.solrj.SolrClient.request(SolrClient.java:1219)
	at org.apache.solr.cloud.hdfs.StressHdfsTest.createAndDeleteCollection(StressHdfsTest.java:220)
	at org.apache.solr.cloud.hdfs.StressHdfsTest.test(StressHdfsTest.java:103)
	at sun.reflect.NativeMethodAccessorImpl.invoke0(Native Method)
	at sun.reflect.NativeMethodAccessorImpl.invoke(NativeMethodAccessorImpl.java:62)
	at sun.reflect.DelegatingMethodAccessorImpl.invoke(DelegatingMethodAccessorImpl.java:43)
	at java.lang.reflect.Method.invoke(Method.java:498)
	at com.carrotsearch.randomizedtesting.RandomizedRunner.invoke(RandomizedRunner.java:1713)
	at com.carrotsearch.randomizedtesting.RandomizedRunner$8.evaluate(RandomizedRunner.java:907)
	at com.carrotsearch.randomizedtesting.RandomizedRunner$9.evaluate(RandomizedRunner.java:943)
	at com.carrotsearch.randomizedtesting.RandomizedRunner$10.evaluate(RandomizedRunner.java:957)
	at org.apache.solr.BaseDistributedSearchTestCase$ShardsRepeatRule$ShardsFixedStatement.callStatement(BaseDistributedSearchTestCase.java:992)
	at org.apache.solr.BaseDistributedSearchTestCase$ShardsRepeatRule$ShardsStatement.evaluate(BaseDistributedSearchTestCase.java:967)
	at com.carrotsearch.randomizedtesting.rules.SystemPropertiesRestoreRule$1.evaluate(SystemPropertiesRestoreRule.java:57)
	at org.apache.lucene.util.TestRuleSetupTeardownChained$1.evaluate(TestRuleSetupTeardownChained.java:49)
	at org.apache.lucene.util.AbstractBeforeAfterRule$1.evaluate(AbstractBeforeAfterRule.java:45)
	at org.apache.lucene.util.TestRuleThreadAndTestName$1.evaluate(TestRuleThreadAndTestName.java:48)
	at org.apache.lucene.util.TestRuleIgnoreAfterMaxFailures$1.evaluate(TestRuleIgnoreAfterMaxFailures.java:64)
	at org.apache.lucene.util.TestRuleMarkFailure$1.evaluate(TestRuleMarkFailure.java:47)
	at com.carrotsearch.randomizedtesting.rules.StatementAdapter.evaluate(StatementAdapter.java:36)
	at com.carrotsearch.randomizedtesting.ThreadLeakControl$StatementRunner.run(ThreadLeakControl.java:368)
	at com.carrotsearch.randomizedtesting.ThreadLeakControl.forkTimeoutingTask(ThreadLeakControl.java:817)
	at com.carrotsearch.randomizedtesting.ThreadLeakControl$3.evaluate(ThreadLeakControl.java:468)
	at com.carrotsearch.randomizedtesting.RandomizedRunner.runSingleTest(RandomizedRunner.java:916)
	at com.carrotsearch.randomizedtesting.RandomizedRunner$5.evaluate(RandomizedRunner.java:802)
	at com.carrotsearch.randomizedtesting.RandomizedRunner$6.evaluate(RandomizedRunner.java:852)
	at com.carrotsearch.randomizedtesting.RandomizedRunner$7.evaluate(RandomizedRunner.java:863)
	at com.carrotsearch.randomizedtesting.rules.StatementAdapter.evaluate(StatementAdapter.java:36)
	at com.carrotsearch.randomizedtesting.rules.SystemPropertiesRestoreRule$1.evaluate(SystemPropertiesRestoreRule.java:57)
	at org.apache.lucene.util.AbstractBeforeAfterRule$1.evaluate(AbstractBeforeAfterRule.java:45)
	at com.carrotsearch.randomizedtesting.rules.StatementAdapter.evaluate(StatementAdapter.java:36)
	at org.apache.lucene.util.TestRuleStoreClassName$1.evaluate(TestRuleStoreClassName.java:41)
	at com.carrotsearch.randomizedtesting.rules.NoShadowingOrOverridesOnMethodsRule$1.evaluate(NoShadowingOrOverridesOnMethodsRule.java:40)
	at com.carrotsearch.randomizedtesting.rules.NoShadowingOrOverridesOnMethodsRule$1.evaluate(NoShadowingOrOverridesOnMethodsRule.java:40)
	at com.carrotsearch.randomizedtesting.rules.StatementAdapter.evaluate(StatementAdapter.java:36)
	at com.carrotsearch.randomizedtesting.rules.StatementAdapter.evaluate(StatementAdapter.java:36)
	at com.carrotsearch.randomizedtesting.rules.StatementAdapter.evaluate(StatementAdapter.java:36)
	at org.apache.lucene.util.TestRuleAssertionsRequired$1.evaluate(TestRuleAssertionsRequired.java:53)
	at org.apache.lucene.util.TestRuleMarkFailure$1.evaluate(TestRuleMarkFailure.java:47)
	at org.apache.lucene.util.TestRuleIgnoreAfterMaxFailures$1.evaluate(TestRuleIgnoreAfterMaxFailures.java:64)
	at org.apache.lucene.util.TestRuleIgnoreTestSuites$1.evaluate(TestRuleIgnoreTestSuites.java:54)
	at com.carrotsearch.randomizedtesting.rules.StatementAdapter.evaluate(StatementAdapter.java:36)
	at com.carrotsearch.randomizedtesting.ThreadLeakControl$StatementRunner.run(ThreadLeakControl.java:368)
	at java.lang.Thread.run(Thread.java:748)
Caused by: java.net.SocketTimeoutException: Read timed out
	at java.net.SocketInputStream.socketRead0(Native Method)
	at java.net.SocketInputStream.socketRead(SocketInputStream.java:116)
	at java.net.SocketInputStream.read(SocketInputStream.java:171)
	at java.net.SocketInputStream.read(SocketInputStream.java:141)
	at org.apache.http.impl.io.AbstractSessionInputBuffer.fillBuffer(AbstractSessionInputBuffer.java:160)
	at org.apache.http.impl.io.SocketInputBuffer.fillBuffer(SocketInputBuffer.java:84)
	at org.apache.http.impl.io.AbstractSessionInputBuffer.readLine(AbstractSessionInputBuffer.java:273)
	at org.apache.http.impl.conn.DefaultHttpResponseParser.parseHead(DefaultHttpResponseParser.java:140)
	at org.apache.http.impl.conn.DefaultHttpResponseParser.parseHead(DefaultHttpResponseParser.java:57)
	at org.apache.http.impl.io.AbstractMessageParser.parse(AbstractMessageParser.java:261)
	at org.apache.http.impl.AbstractHttpClientConnection.receiveResponseHeader(AbstractHttpClientConnection.java:283)
	at org.apache.http.impl.conn.DefaultClientConnection.receiveResponseHeader(DefaultClientConnection.java:251)
	at org.apache.http.impl.conn.ManagedClientConnectionImpl.receiveResponseHeader(ManagedClientConnectionImpl.java:197)
	at org.apache.http.protocol.HttpRequestExecutor.doReceiveResponse(HttpRequestExecutor.java:272)
	at org.apache.http.protocol.HttpRequestExecutor.execute(HttpRequestExecutor.java:124)
	at org.apache.http.impl.client.DefaultRequestDirector.tryExecute(DefaultRequestDirector.java:685)
	at org.apache.http.impl.client.DefaultRequestDirector.execute(DefaultRequestDirector.java:487)
	at org.apache.http.impl.client.AbstractHttpClient.doExecute(AbstractHttpClient.java:882)
	at org.apache.http.impl.client.CloseableHttpClient.execute(CloseableHttpClient.java:82)
	at org.apache.http.impl.client.CloseableHttpClient.execute(CloseableHttpClient.java:55)
	at org.apache.solr.client.solrj.impl.HttpSolrClient.executeMethod(HttpSolrClient.java:515)
	... 51 more


FAILED:  org.apache.solr.client.solrj.TestSolrJErrorHandling.testWithXml

Error Message:
expected:<747> but was:<737>

Stack Trace:
java.lang.AssertionError: expected:<747> but was:<737>
	at __randomizedtesting.SeedInfo.seed([D635EEA6D10DC868:7DD75750530BD105]:0)
	at org.junit.Assert.fail(Assert.java:93)
	at org.junit.Assert.failNotEquals(Assert.java:647)
	at org.junit.Assert.assertEquals(Assert.java:128)
	at org.junit.Assert.assertEquals(Assert.java:472)
	at org.junit.Assert.assertEquals(Assert.java:456)
	at org.apache.solr.client.solrj.TestSolrJErrorHandling.doThreads(TestSolrJErrorHandling.java:185)
	at org.apache.solr.client.solrj.TestSolrJErrorHandling.doIt(TestSolrJErrorHandling.java:200)
	at org.apache.solr.client.solrj.TestSolrJErrorHandling.testWithXml(TestSolrJErrorHandling.java:110)
	at sun.reflect.NativeMethodAccessorImpl.invoke0(Native Method)
	at sun.reflect.NativeMethodAccessorImpl.invoke(NativeMethodAccessorImpl.java:62)
	at sun.reflect.DelegatingMethodAccessorImpl.invoke(DelegatingMethodAccessorImpl.java:43)
	at java.lang.reflect.Method.invoke(Method.java:498)
	at com.carrotsearch.randomizedtesting.RandomizedRunner.invoke(RandomizedRunner.java:1713)
	at com.carrotsearch.randomizedtesting.RandomizedRunner$8.evaluate(RandomizedRunner.java:907)
	at com.carrotsearch.randomizedtesting.RandomizedRunner$9.evaluate(RandomizedRunner.java:943)
	at com.carrotsearch.randomizedtesting.RandomizedRunner$10.evaluate(RandomizedRunner.java:957)
	at com.carrotsearch.randomizedtesting.rules.SystemPropertiesRestoreRule$1.evaluate(SystemPropertiesRestoreRule.java:57)
	at org.apache.lucene.util.TestRuleSetupTeardownChained$1.evaluate(TestRuleSetupTeardownChained.java:49)
	at org.apache.lucene.util.AbstractBeforeAfterRule$1.evaluate(AbstractBeforeAfterRule.java:45)
	at org.apache.lucene.util.TestRuleThreadAndTestName$1.evaluate(TestRuleThreadAndTestName.java:48)
	at org.apache.lucene.util.TestRuleIgnoreAfterMaxFailures$1.evaluate(TestRuleIgnoreAfterMaxFailures.java:64)
	at org.apache.lucene.util.TestRuleMarkFailure$1.evaluate(TestRuleMarkFailure.java:47)
	at com.carrotsearch.randomizedtesting.rules.StatementAdapter.evaluate(StatementAdapter.java:36)
	at com.carrotsearch.randomizedtesting.ThreadLeakControl$StatementRunner.run(ThreadLeakControl.java:368)
	at com.carrotsearch.randomizedtesting.ThreadLeakControl.forkTimeoutingTask(ThreadLeakControl.java:817)
	at com.carrotsearch.randomizedtesting.ThreadLeakControl$3.evaluate(ThreadLeakControl.java:468)
	at com.carrotsearch.randomizedtesting.RandomizedRunner.runSingleTest(RandomizedRunner.java:916)
	at com.carrotsearch.randomizedtesting.RandomizedRunner$5.evaluate(RandomizedRunner.java:802)
	at com.carrotsearch.randomizedtesting.RandomizedRunner$6.evaluate(RandomizedRunner.java:852)
	at com.carrotsearch.randomizedtesting.RandomizedRunner$7.evaluate(RandomizedRunner.java:863)
	at com.carrotsearch.randomizedtesting.rules.StatementAdapter.evaluate(StatementAdapter.java:36)
	at com.carrotsearch.randomizedtesting.rules.SystemPropertiesRestoreRule$1.evaluate(SystemPropertiesRestoreRule.java:57)
	at org.apache.lucene.util.AbstractBeforeAfterRule$1.evaluate(AbstractBeforeAfterRule.java:45)
	at com.carrotsearch.randomizedtesting.rules.StatementAdapter.evaluate(StatementAdapter.java:36)
	at org.apache.lucene.util.TestRuleStoreClassName$1.evaluate(TestRuleStoreClassName.java:41)
	at com.carrotsearch.randomizedtesting.rules.NoShadowingOrOverridesOnMethodsRule$1.evaluate(NoShadowingOrOverridesOnMethodsRule.java:40)
	at com.carrotsearch.randomizedtesting.rules.NoShadowingOrOverridesOnMethodsRule$1.evaluate(NoShadowingOrOverridesOnMethodsRule.java:40)
	at com.carrotsearch.randomizedtesting.rules.StatementAdapter.evaluate(StatementAdapter.java:36)
	at com.carrotsearch.randomizedtesting.rules.StatementAdapter.evaluate(StatementAdapter.java:36)
	at com.carrotsearch.randomizedtesting.rules.StatementAdapter.evaluate(StatementAdapter.java:36)
	at org.apache.lucene.util.TestRuleAssertionsRequired$1.evaluate(TestRuleAssertionsRequired.java:53)
	at org.apache.lucene.util.TestRuleMarkFailure$1.evaluate(TestRuleMarkFailure.java:47)
	at org.apache.lucene.util.TestRuleIgnoreAfterMaxFailures$1.evaluate(TestRuleIgnoreAfterMaxFailures.java:64)
	at org.apache.lucene.util.TestRuleIgnoreTestSuites$1.evaluate(TestRuleIgnoreTestSuites.java:54)
	at com.carrotsearch.randomizedtesting.rules.StatementAdapter.evaluate(StatementAdapter.java:36)
	at com.carrotsearch.randomizedtesting.ThreadLeakControl$StatementRunner.run(ThreadLeakControl.java:368)
	at java.lang.Thread.run(Thread.java:748)


FAILED:  org.apache.lucene.spatial3d.TestGeo3DPoint.testRandomBig

Error Message:
Test abandoned because suite timeout was reached.

Stack Trace:
java.lang.Exception: Test abandoned because suite timeout was reached.
	at __randomizedtesting.SeedInfo.seed([BBAAF2BDDFDCCC85]:0)


FAILED:  junit.framework.TestSuite.org.apache.solr.metrics.reporters.SolrJmxReporterCloudTest

Error Message:
Clean up static fields (in @AfterClass?), your test seems to hang on to approximately 19,292,328 bytes (threshold is 10,485,760). Field reference sizes (counted individually):   - 19,291,824 bytes, private static javax.management.MBeanServer org.apache.solr.metrics.reporters.SolrJmxReporterCloudTest.mBeanServer   - 192 bytes, public static org.junit.rules.TestRule org.apache.solr.SolrTestCaseJ4.solrClassRules   - 128 bytes, private static java.lang.String org.apache.solr.SolrTestCaseJ4.factoryProp   - 112 bytes, private static java.lang.String org.apache.solr.metrics.reporters.SolrJmxReporterCloudTest.COLLECTION   - 64 bytes, private static java.lang.String org.apache.solr.SolrTestCaseJ4.coreName   - 48 bytes, private static java.util.Map org.apache.solr.SolrTestCaseJ4.savedClassLogLevels

Stack Trace:
junit.framework.AssertionFailedError: Clean up static fields (in @AfterClass?), your test seems to hang on to approximately 19,292,328 bytes (threshold is 10,485,760). Field reference sizes (counted individually):
  - 19,291,824 bytes, private static javax.management.MBeanServer org.apache.solr.metrics.reporters.SolrJmxReporterCloudTest.mBeanServer
  - 192 bytes, public static org.junit.rules.TestRule org.apache.solr.SolrTestCaseJ4.solrClassRules
  - 128 bytes, private static java.lang.String org.apache.solr.SolrTestCaseJ4.factoryProp
  - 112 bytes, private static java.lang.String org.apache.solr.metrics.reporters.SolrJmxReporterCloudTest.COLLECTION
  - 64 bytes, private static java.lang.String org.apache.solr.SolrTestCaseJ4.coreName
  - 48 bytes, private static java.util.Map org.apache.solr.SolrTestCaseJ4.savedClassLogLevels
	at __randomizedtesting.SeedInfo.seed([37B7808343C9655C]:0)
	at com.carrotsearch.randomizedtesting.rules.StaticFieldsInvariantRule$1.afterAlways(StaticFieldsInvariantRule.java:170)
	at com.carrotsearch.randomizedtesting.rules.StatementAdapter.evaluate(StatementAdapter.java:43)
	at com.carrotsearch.randomizedtesting.rules.StatementAdapter.evaluate(StatementAdapter.java:36)
	at com.carrotsearch.randomizedtesting.rules.StatementAdapter.evaluate(StatementAdapter.java:36)
	at org.apache.lucene.util.TestRuleAssertionsRequired$1.evaluate(TestRuleAssertionsRequired.java:53)
	at org.apache.lucene.util.TestRuleMarkFailure$1.evaluate(TestRuleMarkFailure.java:47)
	at org.apache.lucene.util.TestRuleIgnoreAfterMaxFailures$1.evaluate(TestRuleIgnoreAfterMaxFailures.java:64)
	at org.apache.lucene.util.TestRuleIgnoreTestSuites$1.evaluate(TestRuleIgnoreTestSuites.java:54)
	at com.carrotsearch.randomizedtesting.rules.StatementAdapter.evaluate(StatementAdapter.java:36)
	at com.carrotsearch.randomizedtesting.ThreadLeakControl$StatementRunner.run(ThreadLeakControl.java:368)
	at java.lang.Thread.run(Thread.java:748)


FAILED:  junit.framework.TestSuite.org.apache.lucene.spatial3d.TestGeo3DPoint

Error Message:
Suite timeout exceeded (>= 7200000 msec).

Stack Trace:
java.lang.Exception: Suite timeout exceeded (>= 7200000 msec).
	at __randomizedtesting.SeedInfo.seed([BBAAF2BDDFDCCC85]:0)




Build Log:
[...truncated 8879 lines...]
   [junit4] Suite: org.apache.lucene.search.TestInetAddressRangeQueries
   [junit4]   2> avg 23, 2017 2:12:32 AM com.carrotsearch.randomizedtesting.ThreadLeakControl$2 evaluate
   [junit4]   2> WARNING: Suite execution timed out: org.apache.lucene.search.TestInetAddressRangeQueries
   [junit4]   2>    1) Thread[id=9, name=JUnit4-serializer-daemon, state=TIMED_WAITING, group=main]
   [junit4]   2>         at java.lang.Thread.sleep(Native Method)
   [junit4]   2>         at com.carrotsearch.ant.tasks.junit4.events.Serializer$1.run(Serializer.java:50)
   [junit4]   2>    2) Thread[id=94, name=SUITE-TestInetAddressRangeQueries-seed#[F8BD8548E57E4F77], state=RUNNABLE, group=TGRP-TestInetAddressRangeQueries]
   [junit4]   2>         at java.lang.Thread.getStackTrace(Thread.java:1559)
   [junit4]   2>         at com.carrotsearch.randomizedtesting.ThreadLeakControl$4.run(ThreadLeakControl.java:696)
   [junit4]   2>         at com.carrotsearch.randomizedtesting.ThreadLeakControl$4.run(ThreadLeakControl.java:693)
   [junit4]   2>         at java.security.AccessController.doPrivileged(Native Method)
   [junit4]   2>         at com.carrotsearch.randomizedtesting.ThreadLeakControl.getStackTrace(ThreadLeakControl.java:693)
   [junit4]   2>         at com.carrotsearch.randomizedtesting.ThreadLeakControl.getThreadsWithTraces(ThreadLeakControl.java:709)
   [junit4]   2>         at com.carrotsearch.randomizedtesting.ThreadLeakControl.formatThreadStacksFull(ThreadLeakControl.java:689)
   [junit4]   2>         at com.carrotsearch.randomizedtesting.ThreadLeakControl.access$1000(ThreadLeakControl.java:65)
   [junit4]   2>         at com.carrotsearch.randomizedtesting.ThreadLeakControl$2.evaluate(ThreadLeakControl.java:415)
   [junit4]   2>         at com.carrotsearch.randomizedtesting.RandomizedRunner.runSuite(RandomizedRunner.java:678)
   [junit4]   2>         at com.carrotsearch.randomizedtesting.RandomizedRunner.access$200(RandomizedRunner.java:140)
   [junit4]   2>         at com.carrotsearch.randomizedtesting.RandomizedRunner$2.run(RandomizedRunner.java:598)
   [junit4]   2>    3) Thread[id=1, name=main, state=WAITING, group=main]
   [junit4]   2>         at java.lang.Object.wait(Native Method)
   [junit4]   2>         at java.lang.Thread.join(Thread.java:1252)
   [junit4]   2>         at java.lang.Thread.join(Thread.java:1326)
   [junit4]   2>         at com.carrotsearch.randomizedtesting.RandomizedRunner.runSuite(RandomizedRunner.java:608)
   [junit4]   2>         at com.carrotsearch.randomizedtesting.RandomizedRunner.run(RandomizedRunner.java:457)
   [junit4]   2>         at com.carrotsearch.ant.tasks.junit4.slave.SlaveMain.execute(SlaveMain.java:244)
   [junit4]   2>         at com.carrotsearch.ant.tasks.junit4.slave.SlaveMain.main(SlaveMain.java:355)
   [junit4]   2>         at com.carrotsearch.ant.tasks.junit4.slave.SlaveMainSafe.main(SlaveMainSafe.java:13)
   [junit4]   2>    4) Thread[id=95, name=TEST-TestInetAddressRangeQueries.testRandomBig-seed#[F8BD8548E57E4F77], state=RUNNABLE, group=TGRP-TestInetAddressRangeQueries]
   [junit4]   2>         at java.lang.Throwable.fillInStackTrace(Native Method)
   [junit4]   2>         at java.lang.Throwable.fillInStackTrace(Throwable.java:783)
   [junit4]   2>         at java.lang.Throwable.<init>(Throwable.java:250)
   [junit4]   2>         at java.lang.Exception.<init>(Exception.java:54)
   [junit4]   2>         at java.lang.RuntimeException.<init>(RuntimeException.java:51)
   [junit4]   2>         at java.lang.UnsupportedOperationException.<init>(UnsupportedOperationException.java:42)
   [junit4]   2>         at org.apache.lucene.codecs.compressing.CompressingTermVectorsReader$TVTermsEnum.ord(CompressingTermVectorsReader.java:918)
   [junit4]   2>         at org.apache.lucene.index.CheckIndex.checkFields(CheckIndex.java:1384)
   [junit4]   2>         at org.apache.lucene.index.CheckIndex.testTermVectors(CheckIndex.java:2375)
   [junit4]   2>         at org.apache.lucene.index.CheckIndex.checkIndex(CheckIndex.java:751)
   [junit4]   2>         at org.apache.lucene.util.TestUtil.checkIndex(TestUtil.java:300)
   [junit4]   2>         at org.apache.lucene.store.MockDirectoryWrapper.close(MockDirectoryWrapper.java:865)
   [junit4]   2>         at org.apache.lucene.util.IOUtils.close(IOUtils.java:89)
   [junit4]   2>         at org.apache.lucene.util.IOUtils.close(IOUtils.java:76)
   [junit4]   2>         at org.apache.lucene.search.BaseRangeFieldQueryTestCase.verify(BaseRangeFieldQueryTestCase.java:292)
   [junit4]   2>         at org.apache.lucene.search.BaseRangeFieldQueryTestCase.doTestRandom(BaseRangeFieldQueryTestCase.java:160)
   [junit4]   2>         at org.apache.lucene.search.BaseRangeFieldQueryTestCase.testRandomBig(BaseRangeFieldQueryTestCase.java:75)
   [junit4]   2>         at org.apache.lucene.search.TestInetAddressRangeQueries.testRandomBig(TestInetAddressRangeQueries.java:81)
   [junit4]   2>         at sun.reflect.NativeMethodAccessorImpl.invoke0(Native Method)
   [junit4]   2>         at sun.reflect.NativeMethodAccessorImpl.invoke(NativeMethodAccessorImpl.java:62)
   [junit4]   2>         at sun.reflect.DelegatingMethodAccessorImpl.invoke(DelegatingMethodAccessorImpl.java:43)
   [junit4]   2>         at java.lang.reflect.Method.invoke(Method.java:498)
   [junit4]   2>         at com.carrotsearch.randomizedtesting.RandomizedRunner.invoke(RandomizedRunner.java:1713)
   [junit4]   2>         at com.carrotsearch.randomizedtesting.RandomizedRunner$8.evaluate(RandomizedRunner.java:907)
   [junit4]   2>         at com.carrotsearch.randomizedtesting.RandomizedRunner$9.evaluate(RandomizedRunner.java:943)
   [junit4]   2>         at com.carrotsearch.randomizedtesting.RandomizedRunner$10.evaluate(RandomizedRunner.java:957)
   [junit4]   2>         at org.apache.lucene.util.TestRuleSetupTeardownChained$1.evaluate(TestRuleSetupTeardownChained.java:49)
   [junit4]   2>         at org.apache.lucene.util.AbstractBeforeAfterRule$1.evaluate(AbstractBeforeAfterRule.java:45)
   [junit4]   2>         at org.apache.lucene.util.TestRuleThreadAndTestName$1.evaluate(TestRuleThreadAndTestName.java:48)
   [junit4]   2>         at org.apache.lucene.util.TestRuleIgnoreAfterMaxFailures$1.evaluate(TestRuleIgnoreAfterMaxFailures.java:64)
   [junit4]   2>         at org.apache.lucene.util.TestRuleMarkFailure$1.evaluate(TestRuleMarkFailure.java:47)
   [junit4]   2>         at com.carrotsearch.randomizedtesting.rules.StatementAdapter.evaluate(StatementAdapter.java:36)
   [junit4]   2>         at com.carrotsearch.randomizedtesting.ThreadLeakControl$StatementRunner.run(ThreadLeakControl.java:368)
   [junit4]   2>         at com.carrotsearch.randomizedtesting.ThreadLeakControl.forkTimeoutingTask(ThreadLeakControl.java:817)
   [junit4]   2>         at com.carrotsearch.randomizedtesting.ThreadLeakControl$3.evaluate(ThreadLeakControl.java:468)
   [junit4]   2>         at com.carrotsearch.randomizedtesting.RandomizedRunner.runSingleTest(RandomizedRunner.java:916)
   [junit4]   2>         at com.carrotsearch.randomizedtesting.RandomizedRunner$5.evaluate(RandomizedRunner.java:802)
   [junit4]   2>         at com.carrotsearch.randomizedtesting.RandomizedRunner$6.evaluate(RandomizedRunner.java:852)
   [junit4]   2>         at com.carrotsearch.randomizedtesting.RandomizedRunner$7.evaluate(RandomizedRunner.java:863)
   [junit4]   2>         at org.apache.lucene.util.AbstractBeforeAfterRule$1.evaluate(AbstractBeforeAfterRule.java:45)
   [junit4]   2>         at com.carrotsearch.randomizedtesting.rules.StatementAdapter.evaluate(StatementAdapter.java:36)
   [junit4]   2>         at org.apache.lucene.util.TestRuleStoreClassName$1.evaluate(TestRuleStoreClassName.java:41)
   [junit4]   2>         at com.carrotsearch.randomizedtesting.rules.NoShadowingOrOverridesOnMethodsRule$1.evaluate(NoShadowingOrOverridesOnMethodsRule.java:40)
   [junit4]   2>         at com.carrotsearch.randomizedtesting.rules.NoShadowingOrOverridesOnMethodsRule$1.evaluate(NoShadowingOrOverridesOnMethodsRule.java:40)
   [junit4]   2>         at com.carrotsearch.randomizedtesting.rules.StatementAdapter.evaluate(StatementAdapter.java:36)
   [junit4]   2>         at com.carrotsearch.randomizedtesting.rules.StatementAdapter.evaluate(StatementAdapter.java:36)
   [junit4]   2>         at com.carrotsearch.randomizedtesting.rules.StatementAdapter.evaluate(StatementAdapter.java:36)
   [junit4]   2>         at org.apache.lucene.util.TestRuleAssertionsRequired$1.evaluate(TestRuleAssertionsRequired.java:53)
   [junit4]   2>         at org.apache.lucene.util.TestRuleMarkFailure$1.evaluate(TestRuleMarkFailure.java:47)
   [junit4]   2>         at org.apache.lucene.util.TestRuleIgnoreAfterMaxFailures$1.evaluate(TestRuleIgnoreAfterMaxFailures.java:64)
   [junit4]   2>         at org.apache.lucene.util.TestRuleIgnoreTestSuites$1.evaluate(TestRuleIgnoreTestSuites.java:54)
   [junit4]   2>         at com.carrotsearch.randomizedtesting.rules.StatementAdapter.evaluate(StatementAdapter.java:36)
   [junit4]   2>         at com.carrotsearch.randomizedtesting.ThreadLeakControl$StatementRunner.run(ThreadLeakControl.java:368)
   [junit4]   2>         at java.lang.Thread.run(Thread.java:748)
   [junit4]   2> NOTE: download the large Jenkins line-docs file by running 'ant get-jenkins-line-docs' in the lucene directory.
   [junit4]   2> NOTE: reproduce with: ant test  -Dtestcase=TestInetAddressRangeQueries -Dtests.method=testRandomBig -Dtests.seed=F8BD8548E57E4F77 -Dtests.multiplier=2 -Dtests.nightly=true -Dtests.slow=true -Dtests.linedocsfile=/home/jenkins/jenkins-slave/workspace/Lucene-Solr-NightlyTests-6.6/test-data/enwiki.random.lines.txt -Dtests.locale=sr-Latn-RS -Dtests.timezone=Asia/Macau -Dtests.asserts=true -Dtests.file.encoding=US-ASCII
   [junit4] ERROR   7198s J1 | TestInetAddressRangeQueries.testRandomBig <<<
   [junit4]    > Throwable #1: java.lang.Exception: Test abandoned because suite timeout was reached.
   [junit4]    > 	at __randomizedtesting.SeedInfo.seed([F8BD8548E57E4F77]:0)
   [junit4]   2> avg 23, 2017 2:12:32 AM com.carrotsearch.randomizedtesting.ThreadLeakControl checkThreadLeaks
   [junit4]   2> WARNING: Will linger awaiting termination of 1 leaked thread(s).
   [junit4]   2> avg 23, 2017 2:12:53 AM com.carrotsearch.randomizedtesting.ThreadLeakControl checkThreadLeaks
   [junit4]   2> SEVERE: 1 thread leaked from SUITE scope at org.apache.lucene.search.TestInetAddressRangeQueries: 
   [junit4]   2>    1) Thread[id=95, name=TEST-TestInetAddressRangeQueries.testRandomBig-seed#[F8BD8548E57E4F77], state=RUNNABLE, group=TGRP-TestInetAddressRangeQueries]
   [junit4]   2>         at org.apache.lucene.store.MockIndexInputWrapper.readByte(MockIndexInputWrapper.java:140)
   [junit4]   2>         at org.apache.lucene.codecs.compressing.LZ4.decompress(LZ4.java:110)
   [junit4]   2>         at org.apache.lucene.codecs.compressing.CompressionMode$4.decompress(CompressionMode.java:138)
   [junit4]   2>         at org.apache.lucene.codecs.compressing.CompressingTermVectorsReader.get(CompressingTermVectorsReader.java:560)
   [junit4]   2>         at org.apache.lucene.index.CheckIndex.testTermVectors(CheckIndex.java:2368)
   [junit4]   2>         at org.apache.lucene.index.CheckIndex.checkIndex(CheckIndex.java:751)
   [junit4]   2>         at org.apache.lucene.util.TestUtil.checkIndex(TestUtil.java:300)
   [junit4]   2>         at org.apache.lucene.store.MockDirectoryWrapper.close(MockDirectoryWrapper.java:865)
   [junit4]   2>         at org.apache.lucene.util.IOUtils.close(IOUtils.java:89)
   [junit4]   2>         at org.apache.lucene.util.IOUtils.close(IOUtils.java:76)
   [junit4]   2>         at org.apache.lucene.search.BaseRangeFieldQueryTestCase.verify(BaseRangeFieldQueryTestCase.java:292)
   [junit4]   2>         at org.apache.lucene.search.BaseRangeFieldQueryTestCase.doTestRandom(BaseRangeFieldQueryTestCase.java:160)
   [junit4]   2>         at org.apache.lucene.search.BaseRangeFieldQueryTestCase.testRandomBig(BaseRangeFieldQueryTestCase.java:75)
   [junit4]   2>         at org.apache.lucene.search.TestInetAddressRangeQueries.testRandomBig(TestInetAddressRangeQueries.java:81)
   [junit4]   2>         at sun.reflect.NativeMethodAccessorImpl.invoke0(Native Method)
   [junit4]   2>         at sun.reflect.NativeMethodAccessorImpl.invoke(NativeMethodAccessorImpl.java:62)
   [junit4]   2>         at sun.reflect.DelegatingMethodAccessorImpl.invoke(DelegatingMethodAccessorImpl.java:43)
   [junit4]   2>         at java.lang.reflect.Method.invoke(Method.java:498)
   [junit4]   2>         at com.carrotsearch.randomizedtesting.RandomizedRunner.invoke(RandomizedRunner.java:1713)
   [junit4]   2>         at com.carrotsearch.randomizedtesting.RandomizedRunner$8.evaluate(RandomizedRunner.java:907)
   [junit4]   2>         at com.carrotsearch.randomizedtesting.RandomizedRunner$9.evaluate(RandomizedRunner.java:943)
   [junit4]   2>         at com.carrotsearch.randomizedtesting.RandomizedRunner$10.evaluate(RandomizedRunner.java:957)
   [junit4]   2>         at org.apache.lucene.util.TestRuleSetupTeardownChained$1.evaluate(TestRuleSetupTeardownChained.java:49)
   [junit4]   2>         at org.apache.lucene.util.AbstractBeforeAfterRule$1.evaluate(AbstractBeforeAfterRule.java:45)
   [junit4]   2>         at org.apache.lucene.util.TestRuleThreadAndTestName$1.evaluate(TestRuleThreadAndTestName.java:48)
   [junit4]   2>         at org.apache.lucene.util.TestRuleIgnoreAfterMaxFailures$1.evaluate(TestRuleIgnoreAfterMaxFailures.java:64)
   [junit4]   2>         at org.apache.lucene.util.TestRuleMarkFailure$1.evaluate(TestRuleMarkFailure.java:47)
   [junit4]   2>         at com.carrotsearch.randomizedtesting.rules.StatementAdapter.evaluate(StatementAdapter.java:36)
   [junit4]   2>         at com.carrotsearch.randomizedtesting.ThreadLeakControl$StatementRunner.run(ThreadLeakControl.java:368)
   [junit4]   2>         at com.carrotsearch.randomizedtesting.ThreadLeakControl.forkTimeoutingTask(ThreadLeakControl.java:817)
   [junit4]   2>         at com.carrotsearch.randomizedtesting.ThreadLeakControl$3.evaluate(ThreadLeakControl.java:468)
   [junit4]   2>         at com.carrotsearch.randomizedtesting.RandomizedRunner.runSingleTest(RandomizedRunner.java:916)
   [junit4]   2>         at com.carrotsearch.randomizedtesting.RandomizedRunner$5.evaluate(RandomizedRunner.java:802)
   [junit4]   2>         at com.carrotsearch.randomizedtesting.RandomizedRunner$6.evaluate(RandomizedRunner.java:852)
   [junit4]   2>         at com.carrotsearch.randomizedtesting.RandomizedRunner$7.evaluate(RandomizedRunner.java:863)
   [junit4]   2>         at org.apache.lucene.util.AbstractBeforeAfterRule$1.evaluate(AbstractBeforeAfterRule.java:45)
   [junit4]   2>         at com.carrotsearch.randomizedtesting.rules.StatementAdapter.evaluate(StatementAdapter.java:36)
   [junit4]   2>         at org.apache.lucene.util.TestRuleStoreClassName$1.evaluate(TestRuleStoreClassName.java:41)
   [junit4]   2>         at com.carrotsearch.randomizedtesting.rules.NoShadowingOrOverridesOnMethodsRule$1.evaluate(NoShadowingOrOverridesOnMethodsRule.java:40)
   [junit4]   2>         at com.carrotsearch.randomizedtesting.rules.NoShadowingOrOverridesOnMethodsRule$1.evaluate(NoShadowingOrOverridesOnMethodsRule.java:40)
   [junit4]   2>         at com.carrotsearch.randomizedtesting.rules.StatementAdapter.evaluate(StatementAdapter.java:36)
   [junit4]   2>         at com.carrotsearch.randomizedtesting.rules.StatementAdapter.evaluate(StatementAdapter.java:36)
   [junit4]   2>         at com.carrotsearch.randomizedtesting.rules.StatementAdapter.evaluate(StatementAdapter.java:36)
   [junit4]   2>         at org.apache.lucene.util.TestRuleAssertionsRequired$1.evaluate(TestRuleAssertionsRequired.java:53)
   [junit4]   2>         at org.apache.lucene.util.TestRuleMarkFailure$1.evaluate(TestRuleMarkFailure.java:47)
   [junit4]   2>         at org.apache.lucene.util.TestRuleIgnoreAfterMaxFailures$1.evaluate(TestRuleIgnoreAfterMaxFailures.java:64)
   [junit4]   2>         at org.apache.lucene.util.TestRuleIgnoreTestSuites$1.evaluate(TestRuleIgnoreTestSuites.java:54)
   [junit4]   2>         at com.carrotsearch.randomizedtesting.rules.StatementAdapter.evaluate(StatementAdapter.java:36)
   [junit4]   2>         at com.carrotsearch.randomizedtesting.ThreadLeakControl$StatementRunner.run(ThreadLeakControl.java:368)
   [junit4]   2>         at java.lang.Thread.run(Thread.java:748)
   [junit4]   2> avg 23, 2017 2:12:53 AM com.carrotsearch.randomizedtesting.ThreadLeakControl tryToInterruptAll
   [junit4]   2> INFO: Starting to interrupt leaked threads:
   [junit4]   2>    1) Thread[id=95, name=TEST-TestInetAddressRangeQueries.testRandomBig-seed#[F8BD8548E57E4F77], state=RUNNABLE, group=TGRP-TestInetAddressRangeQueries]
   [junit4]   2> NOTE: leaving temporary files on disk at: /home/jenkins/jenkins-slave/workspace/Lucene-Solr-NightlyTests-6.6/checkout/lucene/build/misc/test/J1/temp/lucene.search.TestInetAddressRangeQueries_F8BD8548E57E4F77-001
   [junit4]   2> Aug 22, 2017 6:12:53 PM com.carrotsearch.randomizedtesting.ThreadLeakControl tryToInterruptAll
   [junit4]   2> INFO: All leaked threads terminated.
   [junit4]   2> NOTE: test params are: codec=Lucene62, sim=RandomSimilarity(queryNorm=false,coord=no): {}, locale=sr-Latn-RS, timezone=Asia/Macau
   [junit4]   2> NOTE: Linux 4.4.0-83-generic amd64/Oracle Corporation 1.8.0_144 (64-bit)/cpus=4,threads=1,free=126919832,total=477626368
   [junit4]   2> NOTE: All tests run in this JVM: [TestFieldCacheReopen, TestFieldCacheSortRandom, TestLazyDocument, TestLegacyFieldCache, TestRAFDirectory, TestFSTsMisc, TestIndexSplitter, TestPKIndexSplitter, TestHighFreqTerms, SweetSpotSimilarityTest, TestDocValuesStatsCollector, TestInetAddressRangeQueries]
   [junit4]   2> NOTE: download the large Jenkins line-docs file by running 'ant get-jenkins-line-docs' in the lucene directory.
   [junit4]   2> NOTE: reproduce with: ant test  -Dtestcase=TestInetAddressRangeQueries -Dtests.seed=F8BD8548E57E4F77 -Dtests.multiplier=2 -Dtests.nightly=true -Dtests.slow=true -Dtests.linedocsfile=/home/jenkins/jenkins-slave/workspace/Lucene-Solr-NightlyTests-6.6/test-data/enwiki.random.lines.txt -Dtests.locale=sr-Latn-RS -Dtests.timezone=Asia/Macau -Dtests.asserts=true -Dtests.file.encoding=US-ASCII
   [junit4] ERROR   0.00s J1 | TestInetAddressRangeQueries (suite) <<<
   [junit4]    > Throwable #1: java.lang.Exception: Suite timeout exceeded (>= 7200000 msec).
   [junit4]    > 	at __randomizedtesting.SeedInfo.seed([F8BD8548E57E4F77]:0)
   [junit4] Completed [26/26 (1!)] on J1 in 7223.10s, 2 tests, 2 errors <<< FAILURES!

[...truncated 1658 lines...]
   [junit4] Suite: org.apache.lucene.spatial3d.TestGeo3DPoint
   [junit4]   2> aug 22, 2017 11:59:24 AM com.carrotsearch.randomizedtesting.ThreadLeakControl$2 evaluate
   [junit4]   2> WARNING: Suite execution timed out: org.apache.lucene.spatial3d.TestGeo3DPoint
   [junit4]   2>    1) Thread[id=12, name=TEST-TestGeo3DPoint.testRandomBig-seed#[BBAAF2BDDFDCCC85], state=RUNNABLE, group=TGRP-TestGeo3DPoint]
   [junit4]   2>         at sun.nio.ch.NativeThread.current(Native Method)
   [junit4]   2>         at sun.nio.ch.NativeThreadSet.add(NativeThreadSet.java:46)
   [junit4]   2>         at sun.nio.ch.FileChannelImpl.readInternal(FileChannelImpl.java:737)
   [junit4]   2>         at sun.nio.ch.FileChannelImpl.read(FileChannelImpl.java:727)
   [junit4]   2>         at org.apache.lucene.mockfile.FilterFileChannel.read(FilterFileChannel.java:111)
   [junit4]   2>         at org.apache.lucene.store.NIOFSDirectory$NIOFSIndexInput.readInternal(NIOFSDirectory.java:179)
   [junit4]   2>         at org.apache.lucene.store.BufferedIndexInput.refill(BufferedIndexInput.java:342)
   [junit4]   2>         at org.apache.lucene.store.BufferedIndexInput.readByte(BufferedIndexInput.java:54)
   [junit4]   2>         at org.apache.lucene.store.DataInput.readInt(DataInput.java:102)
   [junit4]   2>         at org.apache.lucene.store.BufferedIndexInput.readInt(BufferedIndexInput.java:183)
   [junit4]   2>         at org.apache.lucene.store.MockIndexInputWrapper.readInt(MockIndexInputWrapper.java:165)
   [junit4]   2>         at org.apache.lucene.store.IndexInput$1.readInt(IndexInput.java:144)
   [junit4]   2>         at org.apache.lucene.util.packed.DirectReader$DirectPackedReader20.get(DirectReader.java:206)
   [junit4]   2>         at org.apache.lucene.codecs.lucene54.Lucene54DocValuesProducer$2.get(Lucene54DocValuesProducer.java:501)
   [junit4]   2>         at org.apache.lucene.util.LongValues.get(LongValues.java:45)
   [junit4]   2>         at org.apache.lucene.index.MultiDocValues$2.get(MultiDocValues.java:141)
   [junit4]   2>         at org.apache.lucene.spatial3d.TestGeo3DPoint.verify(TestGeo3DPoint.java:839)
   [junit4]   2>         at org.apache.lucene.spatial3d.TestGeo3DPoint.doTestRandom(TestGeo3DPoint.java:548)
   [junit4]   2>         at org.apache.lucene.spatial3d.TestGeo3DPoint.testRandomBig(TestGeo3DPoint.java:480)
   [junit4]   2>         at sun.reflect.NativeMethodAccessorImpl.invoke0(Native Method)
   [junit4]   2>         at sun.reflect.NativeMethodAccessorImpl.invoke(NativeMethodAccessorImpl.java:62)
   [junit4]   2>         at sun.reflect.DelegatingMethodAccessorImpl.invoke(DelegatingMethodAccessorImpl.java:43)
   [junit4]   2>         at java.lang.reflect.Method.invoke(Method.java:498)
   [junit4]   2>         at com.carrotsearch.randomizedtesting.RandomizedRunner.invoke(RandomizedRunner.java:1713)
   [junit4]   2>         at com.carrotsearch.randomizedtesting.RandomizedRunner$8.evaluate(RandomizedRunner.java:907)
   [junit4]   2>         at com.carrotsearch.randomizedtesting.RandomizedRunner$9.evaluate(RandomizedRunner.java:943)
   [junit4]   2>         at com.carrotsearch.randomizedtesting.RandomizedRunner$10.evaluate(RandomizedRunner.java:957)
   [junit4]   2>         at org.apache.lucene.util.TestRuleSetupTeardownChained$1.evaluate(TestRuleSetupTeardownChained.java:49)
   [junit4]   2>         at org.apache.lucene.util.AbstractBeforeAfterRule$1.evaluate(AbstractBeforeAfterRule.java:45)
   [junit4]   2>         at org.apache.lucene.util.TestRuleThreadAndTestName$1.evaluate(TestRuleThreadAndTestName.java:48)
   [junit4]   2>         at org.apache.lucene.util.TestRuleIgnoreAfterMaxFailures$1.evaluate(TestRuleIgnoreAfterMaxFailures.java:64)
   [junit4]   2>         at org.apache.lucene.util.TestRuleMarkFailure$1.evaluate(TestRuleMarkFailure.java:47)
   [junit4]   2>         at com.carrotsearch.randomizedtesting.rules.StatementAdapter.evaluate(StatementAdapter.java:36)
   [junit4]   2>         at com.carrotsearch.randomizedtesting.ThreadLeakControl$StatementRunner.run(ThreadLeakControl.java:368)
   [junit4]   2>         at com.carrotsearch.randomizedtesting.ThreadLeakControl.forkTimeoutingTask(ThreadLeakControl.java:817)
   [junit4]   2>         at com.carrotsearch.randomizedtesting.ThreadLeakControl$3.evaluate(ThreadLeakControl.java:468)
   [junit4]   2>         at com.carrotsearch.randomizedtesting.RandomizedRunner.runSingleTest(RandomizedRunner.java:916)
   [junit4]   2>         at com.carrotsearch.randomizedtesting.RandomizedRunner$5.evaluate(RandomizedRunner.java:802)
   [junit4]   2>         at com.carrotsearch.randomizedtesting.RandomizedRunner$6.evaluate(RandomizedRunner.java:852)
   [junit4]   2>         at com.carrotsearch.randomizedtesting.RandomizedRunner$7.evaluate(RandomizedRunner.java:863)
   [junit4]   2>         at org.apache.lucene.util.AbstractBeforeAfterRule$1.evaluate(AbstractBeforeAfterRule.java:45)
   [junit4]   2>         at com.carrotsearch.randomizedtesting.rules.StatementAdapter.evaluate(StatementAdapter.java:36)
   [junit4]   2>         at org.apache.lucene.util.TestRuleStoreClassName$1.evaluate(TestRuleStoreClassName.java:41)
   [junit4]   2>         at com.carrotsearch.randomizedtesting.rules.NoShadowingOrOverridesOnMethodsRule$1.evaluate(NoShadowingOrOverridesOnMethodsRule.java:40)
   [junit4]   2>         at com.carrotsearch.randomizedtesting.rules.NoShadowingOrOverridesOnMethodsRule$1.evaluate(NoShadowingOrOverridesOnMethodsRule.java:40)
   [junit4]   2>         at com.carrotsearch.randomizedtesting.rules.StatementAdapter.evaluate(StatementAdapter.java:36)
   [junit4]   2>         at com.carrotsearch.randomizedtesting.rules.StatementAdapter.evaluate(StatementAdapter.java:36)
   [junit4]   2>         at com.carrotsearch.randomizedtesting.rules.StatementAdapter.evaluate(StatementAdapter.java:36)
   [junit4]   2>         at org.apache.lucene.util.TestRuleAssertionsRequired$1.evaluate(TestRuleAssertionsRequired.java:53)
   [junit4]   2>         at org.apache.lucene.util.TestRuleMarkFailure$1.evaluate(TestRuleMarkFailure.java:47)
   [junit4]   2>         at org.apache.lucene.util.TestRuleIgnoreAfterMaxFailures$1.evaluate(TestRuleIgnoreAfterMaxFailures.java:64)
   [junit4]   2>         at org.apache.lucene.util.TestRuleIgnoreTestSuites$1.evaluate(TestRuleIgnoreTestSuites.java:54)
   [junit4]   2>         at com.carrotsearch.randomizedtesting.rules.StatementAdapter.evaluate(StatementAdapter.java:36)
   [junit4]   2>         at com.carrotsearch.randomizedtesting.ThreadLeakControl$StatementRunner.run(ThreadLeakControl.java:368)
   [junit4]   2>         at java.lang.Thread.run(Thread.java:748)
   [junit4]   2>    2) Thread[id=1, name=main, state=WAITING, group=main]
   [junit4]   2>         at java.lang.Object.wait(Native Method)
   [junit4]   2>         at java.lang.Thread.join(Thread.java:1252)
   [junit4]   2>         at java.lang.Thread.join(Thread.java:1326)
   [junit4]   2>         at com.carrotsearch.randomizedtesting.RandomizedRunner.runSuite(RandomizedRunner.java:608)
   [junit4]   2>         at com.carrotsearch.randomizedtesting.RandomizedRunner.run(RandomizedRunner.java:457)
   [junit4]   2>         at com.carrotsearch.ant.tasks.junit4.slave.SlaveMain.execute(SlaveMain.java:244)
   [junit4]   2>         at com.carrotsearch.ant.tasks.junit4.slave.SlaveMain.main(SlaveMain.java:355)
   [junit4]   2>         at com.carrotsearch.ant.tasks.junit4.slave.SlaveMainSafe.main(SlaveMainSafe.java:13)
   [junit4]   2>    3) Thread[id=11, name=SUITE-TestGeo3DPoint-seed#[BBAAF2BDDFDCCC85], state=RUNNABLE, group=TGRP-TestGeo3DPoint]
   [junit4]   2>         at java.lang.Thread.getStackTrace(Thread.java:1559)
   [junit4]   2>         at com.carrotsearch.randomizedtesting.ThreadLeakControl$4.run(ThreadLeakControl.java:696)
   [junit4]   2>         at com.carrotsearch.randomizedtesting.ThreadLeakControl$4.run(ThreadLeakControl.java:693)
   [junit4]   2>         at java.security.AccessController.doPrivileged(Native Method)
   [junit4]   2>         at com.carrotsearch.randomizedtesting.ThreadLeakControl.getStackTrace(ThreadLeakControl.java:693)
   [junit4]   2>         at com.carrotsearch.randomizedtesting.ThreadLeakControl.getThreadsWithTraces(ThreadLeakControl.java:709)
   [junit4]   2>         at com.carrotsearch.randomizedtesting.ThreadLeakControl.formatThreadStacksFull(ThreadLeakControl.java:689)
   [junit4]   2>         at com.carrotsearch.randomizedtesting.ThreadLeakControl.access$1000(ThreadLeakControl.java:65)
   [junit4]   2>         at com.carrotsearch.randomizedtesting.ThreadLeakControl$2.evaluate(ThreadLeakControl.java:415)
   [junit4]   2>         at com.carrotsearch.randomizedtesting.RandomizedRunner.runSuite(RandomizedRunner.java:678)
   [junit4]   2>         at com.carrotsearch.randomizedtesting.RandomizedRunner.access$200(RandomizedRunner.java:140)
   [junit4]   2>         at com.carrotsearch.randomizedtesting.RandomizedRunner$2.run(RandomizedRunner.java:598)
   [junit4]   2>    4) Thread[id=9, name=JUnit4-serializer-daemon, state=TIMED_WAITING, group=main]
   [junit4]   2>         at java.lang.Thread.sleep(Native Method)
   [junit4]   2>         at com.carrotsearch.ant.tasks.junit4.events.Serializer$1.run(Serializer.java:50)
   [junit4]   2> NOTE: download the large Jenkins line-docs file by running 'ant get-jenkins-line-docs' in the lucene directory.
   [junit4]   2> NOTE: reproduce with: ant test  -Dtestcase=TestGeo3DPoint -Dtests.method=testRandomBig -Dtests.seed=BBAAF2BDDFDCCC85 -Dtests.multiplier=2 -Dtests.nightly=true -Dtests.slow=true -Dtests.linedocsfile=/home/jenkins/jenkins-slave/workspace/Lucene-Solr-NightlyTests-6.6/test-data/enwiki.random.lines.txt -Dtests.locale=nl -Dtests.timezone=Pacific/Gambier -Dtests.asserts=true -Dtests.file.encoding=US-ASCII
   [junit4] ERROR   7198s J1 | TestGeo3DPoint.testRandomBig <<<
   [junit4]    > Throwable #1: java.lang.Exception: Test abandoned because suite timeout was reached.
   [junit4]    > 	at __randomizedtesting.SeedInfo.seed([BBAAF2BDDFDCCC85]:0)
   [junit4]   2> aug 22, 2017 11:59:24 AM com.carrotsearch.randomizedtesting.ThreadLeakControl checkThreadLeaks
   [junit4]   2> WARNING: Will linger awaiting termination of 1 leaked thread(s).
   [junit4]   2> aug 22, 2017 11:59:44 AM com.carrotsearch.randomizedtesting.ThreadLeakControl checkThreadLeaks
   [junit4]   2> SEVERE: 1 thread leaked from SUITE scope at org.apache.lucene.spatial3d.TestGeo3DPoint: 
   [junit4]   2>    1) Thread[id=12, name=TEST-TestGeo3DPoint.testRandomBig-seed#[BBAAF2BDDFDCCC85], state=RUNNABLE, group=TGRP-TestGeo3DPoint]
   [junit4]   2>         at org.apache.lucene.spatial3d.geom.Plane.findIntersectionBounds(Plane.java:1097)
   [junit4]   2>         at org.apache.lucene.spatial3d.geom.Plane.recordBounds(Plane.java:1214)
   [junit4]   2>         at org.apache.lucene.spatial3d.geom.XYZBounds.addIntersection(XYZBounds.java:262)
   [junit4]   2>         at org.apache.lucene.spatial3d.geom.GeoConvexPolygon.getBounds(GeoConvexPolygon.java:425)
   [junit4]   2>         at org.apache.lucene.spatial3d.geom.GeoCompositeMembershipShape.getBounds(GeoCompositeMembershipShape.java:75)
   [junit4]   2>         at org.apache.lucene.spatial3d.TestGeo3DPoint.verify(TestGeo3DPoint.java:845)
   [junit4]   2>         at org.apache.lucene.spatial3d.TestGeo3DPoint.doTestRandom(TestGeo3DPoint.java:548)
   [junit4]   2>         at org.apache.lucene.spatial3d.TestGeo3DPoint.testRandomBig(TestGeo3DPoint.java:480)
   [junit4]   2>         at sun.reflect.NativeMethodAccessorImpl.invoke0(Native Method)
   [junit4]   2>         at sun.reflect.NativeMethodAccessorImpl.invoke(NativeMethodAccessorImpl.java:62)
   [junit4]   2>         at sun.reflect.DelegatingMethodAccessorImpl.invoke(DelegatingMethodAccessorImpl.java:43)
   [junit4]   2>         at java.lang.reflect.Method.invoke(Method.java:498)
   [junit4]   2>         at com.carrotsearch.randomizedtesting.RandomizedRunner.invoke(RandomizedRunner.java:1713)
   [junit4]   2>         at com.carrotsearch.randomizedtesting.RandomizedRunner$8.evaluate(RandomizedRunner.java:907)
   [junit4]   2>         at com.carrotsearch.randomizedtesting.RandomizedRunner$9.evaluate(RandomizedRunner.java:943)
   [junit4]   2>         at com.carrotsearch.randomizedtesting.RandomizedRunner$10.evaluate(RandomizedRunner.java:957)
   [junit4]   2>         at org.apache.lucene.util.TestRuleSetupTeardownChained$1.evaluate(TestRuleSetupTeardownChained.java:49)
   [junit4]   2>         at org.apache.lucene.util.AbstractBeforeAfterRule$1.evaluate(AbstractBeforeAfterRule.java:45)
   [junit4]   2>         at org.apache.lucene.util.TestRuleThreadAndTestName$1.evaluate(TestRuleThreadAndTestName.java:48)
   [junit4]   2>         at org.apache.lucene.util.TestRuleIgnoreAfterMaxFailures$1.evaluate(TestRuleIgnoreAfterMaxFailures.java:64)
   [junit4]   2>         at org.apache.lucene.util.TestRuleMarkFailure$1.evaluate(TestRuleMarkFailure.java:47)
   [junit4]   2>         at com.carrotsearch.randomizedtesting.rules.StatementAdapter.evaluate(StatementAdapter.java:36)
   [junit4]   2>         at com.carrotsearch.randomizedtesting.ThreadLeakControl$StatementRunner.run(ThreadLeakControl.java:368)
   [junit4]   2>         at com.carrotsearch.randomizedtesting.ThreadLeakControl.forkTimeoutingTask(ThreadLeakControl.java:817)
   [junit4]   2>         at com.carrotsearch.randomizedtesting.ThreadLeakControl$3.evaluate(ThreadLeakControl.java:468)
   [junit4]   2>         at com.carrotsearch.randomizedtesting.RandomizedRunner.runSingleTest(RandomizedRunner.java:916)
   [junit4]   2>         at com.carrotsearch.randomizedtesting.RandomizedRunner$5.evaluate(RandomizedRunner.java:802)
   [junit4]   2>         at com.carrotsearch.randomizedtesting.RandomizedRunner$6.evaluate(RandomizedRunner.java:852)
   [junit4]   2>         at com.carrotsearch.randomizedtesting.RandomizedRunner$7.evaluate(RandomizedRunner.java:863)
   [junit4]   2>         at org.apache.lucene.util.AbstractBeforeAfterRule$1.evaluate(AbstractBeforeAfterRule.java:45)
   [junit4]   2>         at com.carrotsearch.randomizedtesting.rules.StatementAdapter.evaluate(StatementAdapter.java:36)
   [junit4]   2>         at org.apache.lucene.util.TestRuleStoreClassName$1.evaluate(TestRuleStoreClassName.java:41)
   [junit4]   2>         at com.carrotsearch.randomizedtesting.rules.NoShadowingOrOverridesOnMethodsRule$1.evaluate(NoShadowingOrOverridesOnMethodsRule.java:40)
   [junit4]   2>         at com.carrotsearch.randomizedtesting.rules.NoShadowingOrOverridesOnMethodsRule$1.evaluate(NoShadowingOrOverridesOnMethodsRule.java:40)
   [junit4]   2>         at com.carrotsearch.randomizedtesting.rules.StatementAdapter.evaluate(StatementAdapter.java:36)
   [junit4]   2>         at com.carrotsearch.randomizedtesting.rules.StatementAdapter.evaluate(StatementAdapter.java:36)
   [junit4]   2>         at com.carrotsearch.randomizedtesting.rules.StatementAdapter.evaluate(StatementAdapter.java:36)
   [junit4]   2>         at org.apache.lucene.util.TestRuleAssertionsRequired$1.evaluate(TestRuleAssertionsRequired.java:53)
   [junit4]   2>         at org.apache.lucene.util.TestRuleMarkFailure$1.evaluate(TestRuleMarkFailure.java:47)
   [junit4]   2>         at org.apache.lucene.util.TestRuleIgnoreAfterMaxFailures$1.evaluate(TestRuleIgnoreAfterMaxFailures.java:64)
   [junit4]   2>         at org.apache.lucene.util.TestRuleIgnoreTestSuites$1.evaluate(TestRuleIgnoreTestSuites.java:54)
   [junit4]   2>         at com.carrotsearch.randomizedtesting.rules.StatementAdapter.evaluate(StatementAdapter.java:36)
   [junit4]   2>         at com.carrotsearch.randomizedtesting.ThreadLeakControl$StatementRunner.run(ThreadLeakControl.java:368)
   [junit4]   2>         at java.lang.Thread.run(Thread.java:748)
   [junit4]   2> aug 22, 2017 11:59:44 AM com.carrotsearch.randomizedtesting.ThreadLeakControl tryToInterruptAll
   [junit4]   2> INFO: Starting to interrupt leaked threads:
   [junit4]   2>    1) Thread[id=12, name=TEST-TestGeo3DPoint.testRandomBig-seed#[BBAAF2BDDFDCCC85], state=RUNNABLE, group=TGRP-TestGeo3DPoint]
   [junit4]   2> NOTE: leaving temporary files on disk at: /home/jenkins/jenkins-slave/workspace/Lucene-Solr-NightlyTests-6.6/checkout/lucene/build/spatial3d/test/J1/temp/lucene.spatial3d.TestGeo3DPoint_BBAAF2BDDFDCCC85-001
   [junit4]   2> Aug 22, 2017 8:59:44 PM com.carrotsearch.randomizedtesting.ThreadLeakControl tryToInterruptAll
   [junit4]   2> INFO: All leaked threads terminated.
   [junit4]   2> NOTE: test params are: codec=HighCompressionCompressingStoredFields(storedFieldsFormat=CompressingStoredFieldsFormat(compressionMode=HIGH_COMPRESSION, chunkSize=2, maxDocsPerChunk=818, blockSize=333), termVectorsFormat=CompressingTermVectorsFormat(compressionMode=HIGH_COMPRESSION, chunkSize=2, blockSize=333)), sim=RandomSimilarity(queryNorm=true,coord=crazy): {}, locale=nl, timezone=Pacific/Gambier
   [junit4]   2> NOTE: Linux 4.4.0-83-generic amd64/Oracle Corporation 1.8.0_144 (64-bit)/cpus=4,threads=1,free=98270280,total=490733568
   [junit4]   2> NOTE: All tests run in this JVM: [TestGeo3DPoint]
   [junit4]   2> NOTE: download the large Jenkins line-docs file by running 'ant get-jenkins-line-docs' in the lucene directory.
   [junit4]   2> NOTE: reproduce with: ant test  -Dtestcase=TestGeo3DPoint -Dtests.seed=BBAAF2BDDFDCCC85 -Dtests.multiplier=2 -Dtests.nightly=true -Dtests.slow=true -Dtests.linedocsfile=/home/jenkins/jenkins-slave/workspace/Lucene-Solr-NightlyTests-6.6/test-data/enwiki.random.lines.txt -Dtests.locale=nl -Dtests.timezone=Pacific/Gambier -Dtests.asserts=true -Dtests.file.encoding=US-ASCII
   [junit4] ERROR   0.00s J1 | TestGeo3DPoint (suite) <<<
   [junit4]    > Throwable #1: java.lang.Exception: Suite timeout exceeded (>= 7200000 msec).
   [junit4]    > 	at __randomizedtesting.SeedInfo.seed([BBAAF2BDDFDCCC85]:0)
   [junit4] Completed [10/11 (1!)] on J1 in 7221.98s, 1 test, 2 errors <<< FAILURES!

[...truncated 1745 lines...]
   [junit4] Suite: org.apache.solr.cloud.LeaderFailoverAfterPartitionTest
   [junit4]   2> Creating dataDir: /home/jenkins/jenkins-slave/workspace/Lucene-Solr-NightlyTests-6.6/checkout/solr/build/solr-core/test/J1/temp/solr.cloud.LeaderFailoverAfterPartitionTest_37B7808343C9655C-001/init-core-data-001
   [junit4]   2> 297612 INFO  (SUITE-LeaderFailoverAfterPartitionTest-seed#[37B7808343C9655C]-worker) [    ] o.a.s.SolrTestCaseJ4 Using TrieFields
   [junit4]   2> 297633 INFO  (SUITE-LeaderFailoverAfterPartitionTest-seed#[37B7808343C9655C]-worker) [    ] o.a.s.SolrTestCaseJ4 Randomized ssl (false) and clientAuth (false) via: @org.apache.solr.SolrTestCaseJ4$SuppressSSL(bugUrl=https://issues.apache.org/jira/browse/SOLR-5776)
   [junit4]   2> 297633 INFO  (SUITE-LeaderFailoverAfterPartitionTest-seed#[37B7808343C9655C]-worker) [    ] o.a.s.BaseDistributedSearchTestCase Setting hostContext system property: /vw/
   [junit4]   2> 297693 INFO  (TEST-LeaderFailoverAfterPartitionTest.test-seed#[37B7808343C9655C]) [    ] o.a.s.c.ZkTestServer STARTING ZK TEST SERVER
   [junit4]   2> 297702 INFO  (Thread-238) [    ] o.a.s.c.ZkTestServer client port:0.0.0.0/0.0.0.0:0
   [junit4]   2> 297702 INFO  (Thread-238) [    ] o.a.s.c.ZkTestServer Starting server
   [junit4]   2> 297718 ERROR (Thread-238) [    ] o.a.z.s.ZooKeeperServer ZKShutdownHandler is not registered, so ZooKeeper server won't take any action on ERROR or SHUTDOWN server state changes
   [junit4]   2> 297811 INFO  (TEST-LeaderFailoverAfterPartitionTest.test-seed#[37B7808343C9655C]) [    ] o.a.s.c.ZkTestServer start zk server on port:34270
   [junit4]   2> 298269 INFO  (TEST-LeaderFailoverAfterPartitionTest.test-seed#[37B7808343C9655C]) [    ] o.a.s.c.AbstractZkTestCase put /home/jenkins/jenkins-slave/workspace/Lucene-Solr-NightlyTests-6.6/checkout/solr/core/src/test-files/solr/collection1/conf/solrconfig-tlog.xml to /configs/conf1/solrconfig.xml
   [junit4]   2> 298270 INFO  (TEST-LeaderFailoverAfterPartitionTest.test-seed#[37B7808343C9655C]) [    ] o.a.s.c.AbstractZkTestCase put /home/jenkins/jenkins-slave/workspace/Lucene-Solr-NightlyTests-6.6/checkout/solr/core/src/test-files/solr/collection1/conf/schema.xml to /configs/conf1/schema.xml
   [junit4]   2> 298271 INFO  (TEST-LeaderFailoverAfterPartitionTest.test-seed#[37B7808343C9655C]) [    ] o.a.s.c.AbstractZkTestCase put /home/jenkins/jenkins-slave/workspace/Lucene-Solr-NightlyTests-6.6/checkout/solr/core/src/test-files/solr/collection1/conf/solrconfig.snippet.randomindexconfig.xml to /configs/conf1/solrconfig.snippet.randomindexconfig.xml
   [junit4]   2> 298272 INFO  (TEST-LeaderFailoverAfterPartitionTest.test-seed#[37B7808343C9655C]) [    ] o.a.s.c.AbstractZkTestCase put /home/jenkins/jenkins-slave/workspace/Lucene-Solr-NightlyTests-6.6/checkout/solr/core/src/test-files/solr/collection1/conf/stopwords.txt to /configs/conf1/stopwords.txt
   [junit4]   2> 298272 INFO  (TEST-LeaderFailoverAfterPartitionTest.test-seed#[37B7808343C9655C]) [    ] o.a.s.c.AbstractZkTestCase put /home/jenkins/jenkins-slave/workspace/Lucene-Solr-NightlyTests-6.6/checkout/solr/core/src/test-files/solr/collection1/conf/protwords.txt to /configs/conf1/protwords.txt
   [junit4]   2> 298273 INFO  (TEST-LeaderFailoverAfterPartitionTest.test-seed#[37B7808343C9655C]) [    ] o.a.s.c.AbstractZkTestCase put /home/jenkins/jenkins-slave/workspace/Lucene-Solr-NightlyTests-6.6/checkout/solr/core/src/test-files/solr/collection1/conf/currency.xml to /configs/conf1/currency.xml
   [junit4]   2> 298274 INFO  (TEST-LeaderFailoverAfterPartitionTest.test-seed#[37B7808343C9655C]) [    ] o.a.s.c.AbstractZkTestCase put /home/jenkins/jenkins-slave/workspace/Lucene-Solr-NightlyTests-6.6/checkout/solr/core/src/test-files/solr/collection1/conf/enumsConfig.xml to /configs/conf1/enumsConfig.xml
   [junit4]   2> 298274 INFO  (TEST-LeaderFailoverAfterPartitionTest.test-seed#[37B7808343C9655C]) [    ] o.a.s.c.AbstractZkTestCase put /home/jenkins/jenkins-slave/workspace/Lucene-Solr-NightlyTests-6.6/checkout/solr/core/src/test-files/solr/collection1/conf/open-exchange-rates.json to /configs/conf1/open-exchange-rates.json
   [junit4]   2> 298275 INFO  (TEST-LeaderFailoverAfterPartitionTest.test-seed#[37B7808343C9655C]) [    ] o.a.s.c.AbstractZkTestCase put /home/jenkins/jenkins-slave/workspace/Lucene-Solr-NightlyTests-6.6/checkout/solr/core/src/test-files/solr/collection1/conf/mapping-ISOLatin1Accent.txt to /configs/conf1/mapping-ISOLatin1Accent.txt
   [junit4]   2> 298297 INFO  (TEST-LeaderFailoverAfterPartitionTest.test-seed#[37B7808343C9655C]) [    ] o.a.s.c.AbstractZkTestCase put /home/jenkins/jenkins-slave/workspace/Lucene-Solr-NightlyTests-6.6/checkout/solr/core/src/test-files/solr/collection1/conf/old_synonyms.txt to /configs/conf1/old_synonyms.txt
   [junit4]   2> 298298 INFO  (TEST-LeaderFailoverAfterPartitionTest.test-seed#[37B7808343C9655C]) [    ] o.a.s.c.AbstractZkTestCase put /home/jenkins/jenkins-slave/workspace/Lucene-Solr-NightlyTests-6.6/checkout/solr/core/src/test-files/solr/collection1/conf/synonyms.txt to /configs/conf1/synonyms.txt
   [junit4]   2> 299237 INFO  (TEST-LeaderFailoverAfterPartitionTest.test-seed#[37B7808343C9655C]) [    ] o.a.s.SolrTestCaseJ4 Writing core.properties file to /home/jenkins/jenkins-slave/workspace/Lucene-Solr-NightlyTests-6.6/checkout/solr/build/solr-core/test/J1/temp/solr.cloud.LeaderFailoverAfterPartitionTest_37B7808343C9655C-001/control-001/cores/collection1
   [junit4]   2> 299268 INFO  (TEST-LeaderFailoverAfterPartitionTest.test-seed#[37B7808343C9655C]) [    ] o.e.j.s.Server jetty-9.3.14.v20161028
   [junit4]   2> 299403 INFO  (TEST-LeaderFailoverAfterPartitionTest.test-seed#[37B7808343C9655C]) [    ] o.e.j.s.h.ContextHandler Started o.e.j.s.ServletContextHandler@12b30943{/vw,null,AVAILABLE}
   [junit4]   2> 299405 INFO  (TEST-LeaderFailoverAfterPartitionTest.test-seed#[37B7808343C9655C]) [    ] o.e.j.s.AbstractConnector Started ServerConnector@58add6c8{HTTP/1.1,[http/1.1]}{127.0.0.1:38697}
   [junit4]   2> 299405 INFO  (TEST-LeaderFailoverAfterPartitionTest.test-seed#[37B7808343C9655C]) [    ] o.e.j.s.Server Started @312074ms
   [junit4]   2> 299405 INFO  (TEST-LeaderFailoverAfterPartitionTest.test-seed#[37B7808343C9655C]) [    ] o.a.s.c.s.e.JettySolrRunner Jetty properties: {solr.data.dir=/home/jenkins/jenkins-slave/workspace/Lucene-Solr-NightlyTests-6.6/checkout/solr/build/solr-core/test/J1/temp/solr.cloud.LeaderFailoverAfterPartitionTest_37B7808343C9655C-001/tempDir-001/control/data, hostContext=/vw, hostPort=35037, coreRootDirectory=/home/jenkins/jenkins-slave/workspace/Lucene-Solr-NightlyTests-6.6/checkout/solr/build/solr-core/test/J1/temp/solr.cloud.LeaderFailoverAfterPartitionTest_37B7808343C9655C-001/control-001/cores}
   [junit4]   2> 299406 ERROR (TEST-LeaderFailoverAfterPartitionTest.test-seed#[37B7808343C9655C]) [    ] o.a.s.s.StartupLoggingUtils Missing Java Option solr.log.dir. Logging may be missing or incomplete.
   [junit4]   2> 299406 INFO  (TEST-LeaderFailoverAfterPartitionTest.test-seed#[37B7808343C9655C]) [    ] o.a.s.s.SolrDispatchFilter  ___      _       Welcome to Apache Solr? version 6.6.1
   [junit4]   2> 299439 INFO  (TEST-LeaderFailoverAfterPartitionTest.test-seed#[37B7808343C9655C]) [    ] o.a.s.s.SolrDispatchFilter / __| ___| |_ _   Starting in cloud mode on port null
   [junit4]   2> 299439 INFO  (TEST-LeaderFailoverAfterPartitionTest.test-seed#[37B7808343C9655C]) [    ] o.a.s.s.SolrDispatchFilter \__ \/ _ \ | '_|  Install dir: null
   [junit4]   2> 299439 INFO  (TEST-LeaderFailoverAfterPartitionTest.test-seed#[37B7808343C9655C]) [    ] o.a.s.s.SolrDispatchFilter |___/\___/_|_|    Start time: 2017-08-22T21:12:31.689Z
   [junit4]   2> 299505 INFO  (TEST-LeaderFailoverAfterPartitionTest.test-seed#[37B7808343C9655C]) [    ] o.a.s.s.SolrDispatchFilter Loading solr.xml from SolrHome (not found in ZooKeeper)
   [junit4]   2> 299505 INFO  (TEST-LeaderFailoverAfterPartitionTest.test-seed#[37B7808343C9655C]) [    ] o.a.s.c.SolrXmlConfig Loading container configuration from /home/jenkins/jenkins-slave/workspace/Lucene-Solr-NightlyTests-6.6/checkout/solr/build/solr-core/test/J1/temp/solr.cloud.LeaderFailoverAfterPartitionTest_37B7808343C9655C-001/control-001/solr.xml
   [junit4]   2> 299539 INFO  (TEST-LeaderFailoverAfterPartitionTest.test-seed#[37B7808343C9655C]) [    ] o.a.s.u.UpdateShardHandler Creating UpdateShardHandler HTTP client with params: socketTimeout=340000&connTimeout=45000&retry=true
   [junit4]   2> 299552 INFO  (TEST-LeaderFailoverAfterPartitionTest.test-seed#[37B7808343C9655C]) [    ] o.a.s.c.ZkContainer Zookeeper client=127.0.0.1:34270/solr
   [junit4]   2> 299787 INFO  (TEST-LeaderFailoverAfterPartitionTest.test-seed#[37B7808343C9655C]) [n:127.0.0.1:35037_vw    ] o.a.s.c.Overseer Overseer (id=null) closing
   [junit4]   2> 299787 INFO  (TEST-LeaderFailoverAfterPartitionTest.test-seed#[37B7808343C9655C]) [n:127.0.0.1:35037_vw    ] o.a.s.c.OverseerElectionContext I am going to be the leader 127.0.0.1:35037_vw
   [junit4]   2> 299817 INFO  (TEST-LeaderFailoverAfterPartitionTest.test-seed#[37B7808343C9655C]) [n:127.0.0.1:35037_vw    ] o.a.s.c.Overseer Overseer (id=98529204630454276-127.0.0.1:35037_vw-n_0000000000) starting
   [junit4]   2> 299898 INFO  (TEST-LeaderFailoverAfterPartitionTest.test-seed#[37B7808343C9655C]) [n:127.0.0.1:35037_vw    ] o.a.s.c.ZkController Register node as live in ZooKeeper:/live_nodes/127.0.0.1:35037_vw
   [junit4]   2> 299899 INFO  (zkCallback-307-thread-1-processing-n:127.0.0.1:35037_vw) [n:127.0.0.1:35037_vw    ] o.a.s.c.c.ZkStateReader Updated live nodes from ZooKeeper... (0) -> (1)
   [junit4]   2> 300373 INFO  (TEST-LeaderFailoverAfterPartitionTest.test-seed#[37B7808343C9655C]) [n:127.0.0.1:35037_vw    ] o.a.s.c.CorePropertiesLocator Found 1 core definitions underneath /home/jenkins/jenkins-slave/workspace/Lucene-Solr-NightlyTests-6.6/checkout/solr/build/solr-core/test/J1/temp/solr.cloud.LeaderFailoverAfterPartitionTest_37B7808343C9655C-001/control-001/cores
   [junit4]   2> 300374 INFO  (TEST-LeaderFailoverAfterPartitionTest.test-seed#[37B7808343C9655C]) [n:127.0.0.1:35037_vw    ] o.a.s.c.CorePropertiesLocator Cores are: [collection1]
   [junit4]   2> 300459 INFO  (coreLoadExecutor-456-thread-1-processing-n:127.0.0.1:35037_vw) [n:127.0.0.1:35037_vw c:control_collection   x:collection1] o.a.s.c.TransientSolrCoreCacheDefault Allocating transient cache for 4 transient cores
   [junit4]   2> 300460 INFO  (OverseerStateUpdate-98529204630454276-127.0.0.1:35037_vw-n_0000000000) [n:127.0.0.1:35037_vw    ] o.a.s.c.o.ReplicaMutator Assigning new node to shard shard=shard1
   [junit4]   2> 300574 INFO  (coreLoadExecutor-456-thread-1-processing-n:127.0.0.1:35037_vw) [n:127.0.0.1:35037_vw c:control_collection   x:collection1] o.a.s.c.SolrConfig Using Lucene MatchVersion: 6.6.1
   [junit4]   2> 300789 INFO  (coreLoadExecutor-456-thread-1-processing-n:127.0.0.1:35037_vw) [n:127.0.0.1:35037_vw c:control_collection   x:collection1] o.a.s.s.IndexSchema [collection1] Schema name=test
   [junit4]   2> 301423 INFO  (coreLoadExecutor-456-thread-1-processing-n:127.0.0.1:35037_vw) [n:127.0.0.1:35037_vw c:control_collection   x:collection1] o.a.s.s.IndexSchema Loaded schema test/1.0 with uniqueid field id
   [junit4]   2> 301457 INFO  (coreLoadExecutor-456-thread-1-processing-n:127.0.0.1:35037_vw) [n:127.0.0.1:35037_vw c:control_collection   x:collection1] o.a.s.c.CoreContainer Creating SolrCore 'collection1' using configuration from collection control_collection, trusted=true
   [junit4]   2> 301457 INFO  (coreLoadExecutor-456-thread-1-processing-n:127.0.0.1:35037_vw) [n:127.0.0.1:35037_vw c:control_collection   x:collection1] o.a.s.c.SolrCore solr.RecoveryStrategy.Builder
   [junit4]   2> 301457 INFO  (coreLoadExecutor-456-thread-1-processing-n:127.0.0.1:35037_vw) [n:127.0.0.1:35037_vw c:control_collection   x:collection1] o.a.s.c.SolrCore [[collection1] ] Opening new SolrCore at [/home/jenkins/jenkins-slave/workspace/Lucene-Solr-NightlyTests-6.6/checkout/solr/build/solr-core/test/J1/temp/solr.cloud.LeaderFailoverAfterPartitionTest_37B7808343C9655C-001/control-001/cores/collection1], dataDir=[/home/jenkins/jenkins-slave/workspace/Lucene-Solr-NightlyTests-6.6/checkout/solr/build/solr-core/test/J1/temp/solr.cloud.LeaderFailoverAfterPartitionTest_37B7808343C9655C-001/control-001/cores/collection1/data/]
   [junit4]   2> 301458 INFO  (coreLoadExecutor-456-thread-1-processing-n:127.0.0.1:35037_vw) [n:127.0.0.1:35037_vw c:control_collection   x:collection1] o.a.s.c.JmxMonitoredMap JMX monitoring is enabled. Adding Solr mbeans to JMX Server: com.sun.jmx.mbeanserver.JmxMBeanServer@6a29347
   [junit4]   2> 301459 INFO  (coreLoadExecutor-456-thread-1-processing-n:127.0.0.1:35037_vw) [n:127.0.0.1:35037_vw c:control_collection   x:collection1] o.a.s.u.RandomMergePolicy RandomMergePolicy wrapping class org.apache.lucene.index.LogDocMergePolicy: [LogDocMergePolicy: minMergeSize=1000, mergeFactor=11, maxMergeSize=9223372036854775807, maxMergeSizeForForcedMerge=9223372036854775807, calibrateSizeByDeletes=true, maxMergeDocs=2147483647, maxCFSSegmentSizeMB=8.796093022207999E12, noCFSRatio=0.29639301721677114]
   [junit4]   2> 301651 WARN  (coreLoadExecutor-456-thread-1-processing-n:127.0.0.1:35037_vw) [n:127.0.0.1:35037_vw c:control_collection   x:collection1] o.a.s.c.RequestHandlers INVALID paramSet a in requestHandler {type = requestHandler,name = /dump,class = DumpRequestHandler,attributes = {initParams=a, name=/dump, class=DumpRequestHandler},args = {defaults={a=A,b=B}}}
   [junit4]   2> 301819 INFO  (coreLoadExecutor-456-thread-1-processing-n:127.0.0.1:35037_vw) [n:127.0.0.1:35037_vw c:control_collection   x:collection1] o.a.s.u.UpdateHandler Using UpdateLog implementation: org.apache.solr.update.UpdateLog
   [junit4]   2> 301819 INFO  (coreLoadExecutor-456-thread-1-processing-n:127.0.0.1:35037_vw) [n:127.0.0.1:35037_vw c:control_collection   x:collection1] o.a.s.u.UpdateLog Initializing UpdateLog: dataDir= defaultSyncLevel=FLUSH numRecordsToKeep=100 maxNumLogsToKeep=10 numVersionBuckets=65536
   [junit4]   2> 301819 INFO  (coreLoadExecutor-456-thread-1-processing-n:127.0.0.1:35037_vw) [n:127.0.0.1:35037_vw c:control_collection   x:collection1] o.a.s.u.CommitTracker Hard AutoCommit: disabled
   [junit4]   2> 301819 INFO  (coreLoadExecutor-456-thread-1-processing-n:127.0.0.1:35037_vw) [n:127.0.0.1:35037_vw c:control_collection   x:collection1] o.a.s.u.CommitTracker Soft AutoCommit: disabled
   [junit4]   2> 301820 INFO  (coreLoadExecutor-456-thread-1-processing-n:127.0.0.1:35037_vw) [n:127.0.0.1:35037_vw c:control_collection   x:collection1] o.a.s.u.RandomMergePolicy RandomMergePolicy wrapping class org.apache.lucene.index.MockRandomMergePolicy: org.apache.lucene.index.MockRandomMergePolicy@32067512
   [junit4]   2> 301820 INFO  (coreLoadExecutor-456-thread-1-processing-n:127.0.0.1:35037_vw) [n:127.0.0.1:35037_vw c:control_collection   x:collection1] o.a.s.s.SolrIndexSearcher Opening [Searcher@6832492f[collection1] main]
   [junit4]   2> 301850 INFO  (coreLoadExecutor-456-thread-1-processing-n:127.0.0.1:35037_vw) [n:127.0.0.1:35037_vw c:control_collection   x:collection1] o.a.s.r.ManagedResourceStorage Configured ZooKeeperStorageIO with znodeBase: /configs/conf1
   [junit4]   2> 301850 INFO  (coreLoadExecutor-456-thread-1-processing-n:127.0.0.1:35037_vw) [n:127.0.0.1:35037_vw c:control_collection   x:collection1] o.a.s.r.ManagedResourceStorage Loaded null at path _rest_managed.json using ZooKeeperStorageIO:path=/configs/conf1
   [junit4]   2> 301850 INFO  (coreLoadExecutor-456-thread-1-processing-n:127.0.0.1:35037_vw) [n:127.0.0.1:35037_vw c:control_collection   x:collection1] o.a.s.h.ReplicationHandler Commits will be reserved for  10000
   [junit4]   2> 301932 INFO  (searcherExecutor-457-thread-1-processing-n:127.0.0.1:35037_vw x:collection1 c:control_collection) [n:127.0.0.1:35037_vw c:control_collection   x:collection1] o.a.s.c.SolrCore [collection1] Registered new searcher Searcher@6832492f[collection1] main{ExitableDirectoryReader(UninvertingDirectoryReader())}
   [junit4]   2> 301932 INFO  (coreLoadExecutor-456-thread-1-processing-n:127.0.0.1:35037_vw) [n:127.0.0.1:35037_vw c:control_collection   x:collection1] o.a.s.u.UpdateLog Could not find max version in index or recent updates, using new clock 1576467278522744832
   [junit4]   2> 301953 INFO  (coreZkRegister-449-thread-1-processing-n:127.0.0.1:35037_vw x:collection1 c:control_collection) [n:127.0.0.1:35037_vw c:control_collection s:shard1 r:core_node1 x:collection1] o.a.s.c.ShardLeaderElectionContext Enough replicas found to continue.
   [junit4]   2> 301953 INFO  (coreZkRegister-449-thread-1-processing-n:127.0.0.1:35037_vw x:collection1 c:control_collection) [n:127.0.0.1:35037_vw c:control_collection s:shard1 r:core_node1 x:collection1] o.a.s.c.ShardLeaderElectionContext I may be the new leader - try and sync
   [junit4]   2> 301953 INFO  (coreZkRegister-449-thread-1-processing-n:127.0.0.1:35037_vw x:collection1 c:control_collection) [n:127.0.0.1:35037_vw c:control_collection s:shard1 r:core_node1 x:collection1] o.a.s.c.SyncStrategy Sync replicas to http://127.0.0.1:35037/vw/collection1/
   [junit4]   2> 301953 INFO  (coreZkRegister-449-thread-1-processing-n:127.0.0.1:35037_vw x:collection1 c:control_collection) [n:127.0.0.1:35037_vw c:control_collection s:shard1 r:core_node1 x:collection1] o.a.s.c.SyncStrategy Sync Success - now sync replicas to me
   [junit4]   2> 301953 INFO  (coreZkRegister-449-thread-1-processing-n:127.0.0.1:35037_vw x:collection1 c:control_collection) [n:127.0.0.1:35037_vw c:control_collection s:shard1 r:core_node1 x:collection1] o.a.s.c.SyncStrategy http://127.0.0.1:35037/vw/collection1/ has no replicas
   [junit4]   2> 301953 INFO  (coreZkRegister-449-thread-1-processing-n:127.0.0.1:35037_vw x:collection1 c:control_collection) [n:127.0.0.1:35037_vw c:control_collection s:shard1 r:core_node1 x:collection1] o.a.s.c.ShardLeaderElectionContext Found all replicas participating in election, clear LIR
   [junit4]   2> 301973 INFO  (coreZkRegister-449-thread-1-processing-n:127.0.0.1:35037_vw x:collection1 c:control_collection) [n:127.0.0.1:35037_vw c:control_collection s:shard1 r:core_node1 x:collection1] o.a.s.c.ShardLeaderElectionContext I am the new leader: http://127.0.0.1:35037/vw/collection1/ shard1
   [junit4]   2> 302078 INFO  (coreZkRegister-449-thread-1-processing-n:127.0.0.1:35037_vw x:collection1 c:control_collection) [n:127.0.0.1:35037_vw c:control_collection s:shard1 r:core_node1 x:collection1] o.a.s.c.ZkController I am the leader, no recovery necessary
   [junit4]   2> 302100 INFO  (TEST-LeaderFailoverAfterPartitionTest.test-seed#[37B7808343C9655C]) [    ] o.a.s.c.c.ZkStateReader Updated live nodes from ZooKeeper... (0) -> (1)
   [junit4]   2> 302100 INFO  (TEST-LeaderFailoverAfterPartitionTest.test-seed#[37B7808343C9655C]) [    ] o.a.s.c.s.i.ZkClientClusterStateProvider Cluster at 127.0.0.1:34270/solr ready
   [junit4]   2> 302100 INFO  (TEST-LeaderFailoverAfterPartitionTest.test-seed#[37B7808343C9655C]) [    ] o.a.s.c.ChaosMonkey monkey: init - expire sessions:false cause connection loss:false
   [junit4]   2> 302528 INFO  (TEST-LeaderFailoverAfterPartitionTest.test-seed#[37B7808343C9655C]) [    ] o.a.s.SolrTestCaseJ4 Writing core.properties file to /home/jenkins/jenkins-slave/workspace/Lucene-Solr-NightlyTests-6.6/checkout/solr/build/solr-core/test/J1/temp/solr.cloud.LeaderFailoverAfterPartitionTest_37B7808343C9655C-001/shard-1-001/cores/collection1
   [junit4]   2> 302541 INFO  (TEST-LeaderFailoverAfterPartitionTest.test-seed#[37B7808343C9655C]) [    ] o.a.s.c.AbstractFullDistribZkTestBase create jetty 1 in directory /home/jenkins/jenkins-slave/workspace/Lucene-Solr-NightlyTests-6.6/checkout/solr/build/solr-core/test/J1/temp/solr.cloud.LeaderFailoverAfterPartitionTest_37B7808343C9655C-001/shard-1-001
   [junit4]   2> 302542 INFO  (TEST-LeaderFailoverAfterPartitionTest.test-seed#[37B7808343C9655C]) [    ] o.e.j.s.Server jetty-9.3.14.v20161028
   [junit4]   2> 302558 INFO  (TEST-LeaderFailoverAfterPartitionTest.test-seed#[37B7808343C9655C]) [    ] o.e.j.s.h.ContextHandler Started o.e.j.s.ServletContextHandler@4bec60de{/vw,null,AVAILABLE}
   [junit4]   2> 302558 INFO  (TEST-LeaderFailoverAfterPartitionTest.test-seed#[37B7808343C9655C]) [    ] o.e.j.s.AbstractConnector Started ServerConnector@580a7834{HTTP/1.1,[http/1.1]}{127.0.0.1:33354}
   [junit4]   2> 302558 INFO  (TEST-LeaderFailoverAfterPartitionTest.test-seed#[37B7808343C9655C]) [    ] o.e.j.s.Server Started @315228ms
   [junit4]   2> 302558 INFO  (TEST-LeaderFailoverAfterPartitionTest.test-seed#[37B7808343C9655C]) [    ] o.a.s.c.s.e.JettySolrRunner Jetty properties: {solr.data.dir=/home/jenkins/jenkins-slave/workspace/Lucene-Solr-NightlyTests-6.6/checkout/solr/build/solr-core/test/J1/temp/solr.cloud.LeaderFailoverAfterPartitionTest_37B7808343C9655C-001/tempDir-001/jetty1, solrconfig=solrconfig.xml, hostContext=/vw, hostPort=34918, coreRootDirectory=/home/jenkins/jenkins-slave/workspace/Lucene-Solr-NightlyTests-6.6/checkout/solr/build/solr-core/test/J1/temp/solr.cloud.LeaderFailoverAfterPartitionTest_37B7808343C9655C-001/shard-1-001/cores}
   [junit4]   2> 302559 ERROR (TEST-LeaderFailoverAfterPartitionTest.test-seed#[37B7808343C9655C]) [    ] o.a.s.s.StartupLoggingUtils Missing Java Option solr.log.dir. Logging may be missing or incomplete.
   [junit4]   2> 302573 INFO  (TEST-LeaderFailoverAfterPartitionTest.test-seed#[37B7808343C9655C]) [    ] o.a.s.s.SolrDispatchFilter  ___      _       Welcome to Apache Solr? version 6.6.1
   [junit4]   2> 302573 INFO  (TEST-LeaderFailoverAfterPartitionTest.test-seed#[37B7808343C9655C]) [    ] o.a.s.s.SolrDispatchFilter / __| ___| |_ _   Starting in cloud mode on port null
   [junit4]   2> 302573 INFO  (TEST-LeaderFailoverAfterPartitionTest.test-seed#[37B7808343C9655C]) [    ] o.a.s.s.SolrDispatchFilter \__ \/ _ \ | '_|  Install dir: null
   [junit4]   2> 302574 INFO  (TEST-LeaderFailoverAfterPartitionTest.test-seed#[37B7808343C9655C]) [    ] o.a.s.s.SolrDispatchFilter |___/\___/_|_|    Start time: 2017-08-22T21:12:34.823Z
   [junit4]   2> 302659 INFO  (TEST-LeaderFailoverAfterPartitionTest.test-seed#[37B7808343C9655C]) [    ] o.a.s.s.SolrDispatchFilter Loading solr.xml from SolrHome (not found in ZooKeeper)
   [junit4]   2> 302659 INFO  (TEST-LeaderFailoverAfterPartitionTest.test-seed#[37B7808343C9655C]) [    ] o.a.s.c.SolrXmlConfig Loading container configuration from /home/jenkins/jenkins-slave/workspace/Lucene-Solr-NightlyTests-6.6/checkout/solr/build/solr-core/test/J1/temp/solr.cloud.LeaderFailoverAfterPartitionTest_37B7808343C9655C-001/shard-1-001/solr.xml
   [junit4]   2> 302693 INFO  (TEST-LeaderFailoverAfterPartitionTest.test-seed#[37B7808343C9655C]) [    ] o.a.s.u.UpdateShardHandler Creating UpdateShardHandler HTTP client with params: socketTimeout=340000&connTimeout=45000&retry=true
   [junit4]   2> 302695 INFO  (TEST-LeaderFailoverAfterPartitionTest.test-seed#[37B7808343C9655C]) [    ] o.a.s.c.ZkContainer Zookeeper client=127.0.0.1:34270/solr
   [junit4]   2> 302768 INFO  (TEST-LeaderFailoverAfterPartitionTest.test-seed#[37B7808343C9655C]) [n:127.0.0.1:34918_vw    ] o.a.s.c.c.ZkStateReader Updated live nodes from ZooKeeper... (0) -> (1)
   [junit4]   2> 302796 INFO  (TEST-LeaderFailoverAfterPartitionTest.test-seed#[37B7808343C9655C]) [n:127.0.0.1:34918_vw    ] o.a.s.c.Overseer Overseer (id=null) closing
   [junit4]   2> 302828 INFO  (TEST-LeaderFailoverAfterPartitionTest.test-seed#[37B7808343C9655C]) [n:127.0.0.1:34918_vw    ] o.a.s.c.ZkController Register node as live in ZooKeeper:/live_nodes/127.0.0.1:34918_vw
   [junit4]   2> 302841 INFO  (zkCallback-311-thread-1) [    ] o.a.s.c.c.ZkStateReader Updated live nodes from ZooKeeper... (1) -> (2)
   [junit4]   2> 302843 INFO  (zkCallback-307-thread-2-processing-n:127.0.0.1:35037_vw) [n:127.0.0.1:35037_vw    ] o.a.s.c.c.ZkStateReader Updated live nodes from ZooKeeper... (1) -> (2)
   [junit4]   2> 302955 INFO  (zkCallback-316-thread-1-processing-n:127.0.0.1:34918_vw) [n:127.0.0.1:34918_vw    ] o.a.s.c.c.ZkStateReader Updated live nodes from ZooKeeper... (1) -> (2)
   [junit4]   2> 303191 INFO  (TEST-LeaderFailoverAfterPartitionTest.test-seed#[37B7808343C9655C]) [n:127.0.0.1:34918_vw    ] o.a.s.c.CorePropertiesLocator Found 1 core definitions underneath /home/jenkins/jenkins-slave/workspace/Lucene-Solr-NightlyTests-6.6/checkout/solr/build/solr-core/test/J1/temp/solr.cloud.LeaderFailoverAfterPartitionTest_37B7808343C9655C-001/shard-1-001/cores
   [junit4]   2> 303191 INFO  (TEST-LeaderFailoverAfterPartitionTest.test-seed#[37B7808343C9655C]) [n:127.0.0.1:34918_vw    ] o.a.s.c.CorePropertiesLocator Cores are: [collection1]
   [junit4]   2> 303204 INFO  (coreLoadExecutor-467-thread-1-processing-n:127.0.0.1:34918_vw) [n:127.0.0.1:34918_vw c:collection1   x:collection1] o.a.s.c.TransientSolrCoreCacheDefault Allocating transient cache for 4 transient cores
   [junit4]   2> 303240 INFO  (OverseerStateUpdate-98529204630454276-127.0.0.1:35037_vw-n_0000000000) [n:127.0.0.1:35037_vw    ] o.a.s.c.o.ReplicaMutator Assigning new node to shard shard=shard2
   [junit4]   2> 304317 INFO  (coreLoadExecutor-467-thread-1-proce

[...truncated too long message...]

jvm
   [junit4]   2> 155028 INFO  (SUITE-TestSolrJErrorHandling-seed#[D635EEA6D10DC868]-worker) [    ] o.a.s.m.SolrMetricManager Closing metric reporters for: solr.jetty
   [junit4]   2> 155051 INFO  (coreCloseExecutor-54-thread-1) [    x:collection1] o.a.s.c.SolrCore [collection1]  CLOSING SolrCore org.apache.solr.core.SolrCore@9ba3480
   [junit4]   2> 155052 INFO  (coreCloseExecutor-54-thread-1) [    x:collection1] o.a.s.u.LoggingInfoStream [IW][coreCloseExecutor-54-thread-1]: now flush at close
   [junit4]   2> 155052 INFO  (coreCloseExecutor-54-thread-1) [    x:collection1] o.a.s.u.LoggingInfoStream [IW][coreCloseExecutor-54-thread-1]:   start flush: applyAllDeletes=true
   [junit4]   2> 155052 INFO  (coreCloseExecutor-54-thread-1) [    x:collection1] o.a.s.u.LoggingInfoStream [IW][coreCloseExecutor-54-thread-1]:   index before flush _7(6.6.1):C383/382:delGen=1 _8(6.6.1):C10/10:delGen=1
   [junit4]   2> 155052 INFO  (coreCloseExecutor-54-thread-1) [    x:collection1] o.a.s.u.LoggingInfoStream [DW][coreCloseExecutor-54-thread-1]: startFullFlush
   [junit4]   2> 155052 INFO  (coreCloseExecutor-54-thread-1) [    x:collection1] o.a.s.u.LoggingInfoStream [DW][coreCloseExecutor-54-thread-1]: coreCloseExecutor-54-thread-1 finishFullFlush success=true
   [junit4]   2> 155052 INFO  (coreCloseExecutor-54-thread-1) [    x:collection1] o.a.s.u.LoggingInfoStream [IW][coreCloseExecutor-54-thread-1]: apply all deletes during flush
   [junit4]   2> 155052 INFO  (coreCloseExecutor-54-thread-1) [    x:collection1] o.a.s.u.LoggingInfoStream [IW][coreCloseExecutor-54-thread-1]: now apply all deletes for all segments maxDoc=393
   [junit4]   2> 155052 INFO  (coreCloseExecutor-54-thread-1) [    x:collection1] o.a.s.u.LoggingInfoStream [BD][coreCloseExecutor-54-thread-1]: applyDeletes: open segment readers took 0 msec
   [junit4]   2> 155052 INFO  (coreCloseExecutor-54-thread-1) [    x:collection1] o.a.s.u.LoggingInfoStream [BD][coreCloseExecutor-54-thread-1]: applyDeletes: no segments; skipping
   [junit4]   2> 155052 INFO  (coreCloseExecutor-54-thread-1) [    x:collection1] o.a.s.u.LoggingInfoStream [BD][coreCloseExecutor-54-thread-1]: prune sis=segments_7: _7(6.6.1):C383/382:delGen=1 _8(6.6.1):C10/10:delGen=1 minGen=34 packetCount=0
   [junit4]   2> 155052 INFO  (coreCloseExecutor-54-thread-1) [    x:collection1] o.a.s.u.LoggingInfoStream [MS][coreCloseExecutor-54-thread-1]: updateMergeThreads ioThrottle=true targetMBPerSec=10240.0 MB/sec
   [junit4]   2> 155052 INFO  (coreCloseExecutor-54-thread-1) [    x:collection1] o.a.s.u.LoggingInfoStream [MS][coreCloseExecutor-54-thread-1]: now merge
   [junit4]   2> 155053 INFO  (coreCloseExecutor-54-thread-1) [    x:collection1] o.a.s.u.LoggingInfoStream [MS][coreCloseExecutor-54-thread-1]:   index: _7(6.6.1):C383/382:delGen=1 _8(6.6.1):C10/10:delGen=1
   [junit4]   2> 155053 INFO  (coreCloseExecutor-54-thread-1) [    x:collection1] o.a.s.u.LoggingInfoStream [MS][coreCloseExecutor-54-thread-1]:   no more merges pending; now return
   [junit4]   2> 155053 INFO  (coreCloseExecutor-54-thread-1) [    x:collection1] o.a.s.u.LoggingInfoStream [IW][coreCloseExecutor-54-thread-1]: waitForMerges
   [junit4]   2> 155053 INFO  (coreCloseExecutor-54-thread-1) [    x:collection1] o.a.s.u.LoggingInfoStream [IW][coreCloseExecutor-54-thread-1]: waitForMerges done
   [junit4]   2> 155053 INFO  (coreCloseExecutor-54-thread-1) [    x:collection1] o.a.s.u.LoggingInfoStream [IW][coreCloseExecutor-54-thread-1]: commit: start
   [junit4]   2> 155053 INFO  (coreCloseExecutor-54-thread-1) [    x:collection1] o.a.s.u.LoggingInfoStream [IW][coreCloseExecutor-54-thread-1]: commit: enter lock
   [junit4]   2> 155053 INFO  (coreCloseExecutor-54-thread-1) [    x:collection1] o.a.s.u.LoggingInfoStream [IW][coreCloseExecutor-54-thread-1]: commit: now prepare
   [junit4]   2> 155053 INFO  (coreCloseExecutor-54-thread-1) [    x:collection1] o.a.s.u.LoggingInfoStream [IW][coreCloseExecutor-54-thread-1]: prepareCommit: flush
   [junit4]   2> 155053 INFO  (coreCloseExecutor-54-thread-1) [    x:collection1] o.a.s.u.LoggingInfoStream [IW][coreCloseExecutor-54-thread-1]:   index before flush _7(6.6.1):C383/382:delGen=1 _8(6.6.1):C10/10:delGen=1
   [junit4]   2> 155053 INFO  (coreCloseExecutor-54-thread-1) [    x:collection1] o.a.s.u.LoggingInfoStream [DW][coreCloseExecutor-54-thread-1]: startFullFlush
   [junit4]   2> 155053 INFO  (coreCloseExecutor-54-thread-1) [    x:collection1] o.a.s.u.LoggingInfoStream [IW][coreCloseExecutor-54-thread-1]: apply all deletes during flush
   [junit4]   2> 155053 INFO  (coreCloseExecutor-54-thread-1) [    x:collection1] o.a.s.u.LoggingInfoStream [IW][coreCloseExecutor-54-thread-1]: now apply all deletes for all segments maxDoc=393
   [junit4]   2> 155053 INFO  (coreCloseExecutor-54-thread-1) [    x:collection1] o.a.s.u.LoggingInfoStream [BD][coreCloseExecutor-54-thread-1]: applyDeletes: open segment readers took 0 msec
   [junit4]   2> 155053 INFO  (coreCloseExecutor-54-thread-1) [    x:collection1] o.a.s.u.LoggingInfoStream [BD][coreCloseExecutor-54-thread-1]: applyDeletes: no segments; skipping
   [junit4]   2> 155053 INFO  (coreCloseExecutor-54-thread-1) [    x:collection1] o.a.s.u.LoggingInfoStream [BD][coreCloseExecutor-54-thread-1]: prune sis=segments_7: _7(6.6.1):C383/382:delGen=1 _8(6.6.1):C10/10:delGen=1 minGen=34 packetCount=0
   [junit4]   2> 155053 INFO  (coreCloseExecutor-54-thread-1) [    x:collection1] o.a.s.u.LoggingInfoStream [DW][coreCloseExecutor-54-thread-1]: coreCloseExecutor-54-thread-1 finishFullFlush success=true
   [junit4]   2> 155053 INFO  (coreCloseExecutor-54-thread-1) [    x:collection1] o.a.s.u.LoggingInfoStream [IW][coreCloseExecutor-54-thread-1]: startCommit(): start
   [junit4]   2> 155053 INFO  (coreCloseExecutor-54-thread-1) [    x:collection1] o.a.s.u.LoggingInfoStream [IW][coreCloseExecutor-54-thread-1]:   skip startCommit(): no changes pending
   [junit4]   2> 155053 INFO  (coreCloseExecutor-54-thread-1) [    x:collection1] o.a.s.u.LoggingInfoStream [IFD][coreCloseExecutor-54-thread-1]: delete []
   [junit4]   2> 155053 INFO  (coreCloseExecutor-54-thread-1) [    x:collection1] o.a.s.u.LoggingInfoStream [IW][coreCloseExecutor-54-thread-1]: commit: pendingCommit == null; skip
   [junit4]   2> 155053 INFO  (coreCloseExecutor-54-thread-1) [    x:collection1] o.a.s.u.LoggingInfoStream [IW][coreCloseExecutor-54-thread-1]: commit: took 0.5 msec
   [junit4]   2> 155053 INFO  (coreCloseExecutor-54-thread-1) [    x:collection1] o.a.s.u.LoggingInfoStream [IW][coreCloseExecutor-54-thread-1]: commit: done
   [junit4]   2> 155053 INFO  (coreCloseExecutor-54-thread-1) [    x:collection1] o.a.s.u.LoggingInfoStream [IW][coreCloseExecutor-54-thread-1]: rollback
   [junit4]   2> 155053 INFO  (coreCloseExecutor-54-thread-1) [    x:collection1] o.a.s.u.LoggingInfoStream [IW][coreCloseExecutor-54-thread-1]: all running merges have aborted
   [junit4]   2> 155053 INFO  (coreCloseExecutor-54-thread-1) [    x:collection1] o.a.s.u.LoggingInfoStream [IW][coreCloseExecutor-54-thread-1]: rollback: done finish merges
   [junit4]   2> 155053 INFO  (coreCloseExecutor-54-thread-1) [    x:collection1] o.a.s.u.LoggingInfoStream [DW][coreCloseExecutor-54-thread-1]: abort
   [junit4]   2> 155053 INFO  (coreCloseExecutor-54-thread-1) [    x:collection1] o.a.s.u.LoggingInfoStream [DW][coreCloseExecutor-54-thread-1]: done abort success=true
   [junit4]   2> 155053 INFO  (coreCloseExecutor-54-thread-1) [    x:collection1] o.a.s.u.LoggingInfoStream [IW][coreCloseExecutor-54-thread-1]: rollback: infos=_7(6.6.1):C383/382:delGen=1 _8(6.6.1):C10/10:delGen=1
   [junit4]   2> 155054 INFO  (coreCloseExecutor-54-thread-1) [    x:collection1] o.a.s.u.LoggingInfoStream [IFD][coreCloseExecutor-54-thread-1]: now checkpoint "_7(6.6.1):C383/382:delGen=1 _8(6.6.1):C10/10:delGen=1" [2 segments ; isCommit = false]
   [junit4]   2> 155054 INFO  (coreCloseExecutor-54-thread-1) [    x:collection1] o.a.s.u.LoggingInfoStream [IFD][coreCloseExecutor-54-thread-1]: delete []
   [junit4]   2> 155054 INFO  (coreCloseExecutor-54-thread-1) [    x:collection1] o.a.s.u.LoggingInfoStream [IFD][coreCloseExecutor-54-thread-1]: 0 msec to checkpoint
   [junit4]   2> 155054 INFO  (coreCloseExecutor-54-thread-1) [    x:collection1] o.a.s.u.LoggingInfoStream [IFD][coreCloseExecutor-54-thread-1]: delete []
   [junit4]   2> 155054 INFO  (coreCloseExecutor-54-thread-1) [    x:collection1] o.a.s.u.LoggingInfoStream [IFD][coreCloseExecutor-54-thread-1]: delete []
   [junit4]   2> 155689 INFO  (coreCloseExecutor-54-thread-1) [    x:collection1] o.a.s.m.SolrMetricManager Closing metric reporters for: solr.core.collection1
   [junit4]   2> 156059 INFO  (SUITE-TestSolrJErrorHandling-seed#[D635EEA6D10DC868]-worker) [    ] o.e.j.s.h.ContextHandler Stopped o.e.j.s.ServletContextHandler@51252054{/solr,null,UNAVAILABLE}
   [junit4]   2> 156060 INFO  (SUITE-TestSolrJErrorHandling-seed#[D635EEA6D10DC868]-worker) [    ] o.a.s.SolrTestCaseJ4 ###deleteCore
   [junit4]   2> NOTE: leaving temporary files on disk at: /home/jenkins/jenkins-slave/workspace/Lucene-Solr-NightlyTests-6.6/checkout/solr/build/solr-solrj/test/J1/temp/solr.client.solrj.TestSolrJErrorHandling_D635EEA6D10DC868-001
   [junit4]   2> NOTE: test params are: codec=CheapBastard, sim=RandomSimilarity(queryNorm=false,coord=yes): {}, locale=es-PR, timezone=Pacific/Guadalcanal
   [junit4]   2> NOTE: Linux 4.4.0-83-generic amd64/Oracle Corporation 1.8.0_144 (64-bit)/cpus=4,threads=1,free=219976816,total=392167424
   [junit4]   2> NOTE: All tests run in this JVM: [SolrDocumentTest, UuidEvaluatorTest, HttpSolrClientBuilderTest, FloorEvaluatorTest, SelectWithEvaluatorsTest, SolrQueryTest, CoalesceEvaluatorTest, StreamExpressionToExplanationTest, DocumentAnalysisResponseTest, CommonAdminParamsTest, SolrZkClientTest, ConcurrentUpdateSolrClientBuilderTest, TestSolrJErrorHandling]
   [junit4] Completed [46/130 (1!)] on J1 in 104.10s, 4 tests, 1 failure <<< FAILURES!

[...truncated 42918 lines...]

Mime
View raw message