lucene-dev mailing list archives

Site index · List index
Message view « Date » · « Thread »
Top « Date » · « Thread »
From Policeman Jenkins Server <jenk...@thetaphi.de>
Subject [JENKINS] Lucene-Solr-master-MacOSX (64bit/jdk1.8.0) - Build # 4150 - Still Unstable!
Date Sun, 27 Aug 2017 18:04:34 GMT
Build: https://jenkins.thetaphi.de/job/Lucene-Solr-master-MacOSX/4150/
Java: 64bit/jdk1.8.0 -XX:-UseCompressedOops -XX:+UseSerialGC

1 tests failed.
FAILED:  org.apache.solr.metrics.reporters.SolrSlf4jReporterTest.testReporter

Error Message:
count1=6, count2=6 - no 'solr.node' logs in: {numFound=0,start=0,docs=[]}

Stack Trace:
java.lang.AssertionError: count1=6, count2=6 - no 'solr.node' logs in: {numFound=0,start=0,docs=[]}
	at __randomizedtesting.SeedInfo.seed([9A9A0D0A5342CB91:C57E203D384E58D4]:0)
	at org.junit.Assert.fail(Assert.java:93)
	at org.apache.solr.metrics.reporters.SolrSlf4jReporterTest.testReporter(SolrSlf4jReporterTest.java:90)
	at sun.reflect.NativeMethodAccessorImpl.invoke0(Native Method)
	at sun.reflect.NativeMethodAccessorImpl.invoke(NativeMethodAccessorImpl.java:62)
	at sun.reflect.DelegatingMethodAccessorImpl.invoke(DelegatingMethodAccessorImpl.java:43)
	at java.lang.reflect.Method.invoke(Method.java:498)
	at com.carrotsearch.randomizedtesting.RandomizedRunner.invoke(RandomizedRunner.java:1713)
	at com.carrotsearch.randomizedtesting.RandomizedRunner$8.evaluate(RandomizedRunner.java:907)
	at com.carrotsearch.randomizedtesting.RandomizedRunner$9.evaluate(RandomizedRunner.java:943)
	at com.carrotsearch.randomizedtesting.RandomizedRunner$10.evaluate(RandomizedRunner.java:957)
	at com.carrotsearch.randomizedtesting.rules.SystemPropertiesRestoreRule$1.evaluate(SystemPropertiesRestoreRule.java:57)
	at org.apache.lucene.util.TestRuleSetupTeardownChained$1.evaluate(TestRuleSetupTeardownChained.java:49)
	at org.apache.lucene.util.AbstractBeforeAfterRule$1.evaluate(AbstractBeforeAfterRule.java:45)
	at org.apache.lucene.util.TestRuleThreadAndTestName$1.evaluate(TestRuleThreadAndTestName.java:48)
	at org.apache.lucene.util.TestRuleIgnoreAfterMaxFailures$1.evaluate(TestRuleIgnoreAfterMaxFailures.java:64)
	at org.apache.lucene.util.TestRuleMarkFailure$1.evaluate(TestRuleMarkFailure.java:47)
	at com.carrotsearch.randomizedtesting.rules.StatementAdapter.evaluate(StatementAdapter.java:36)
	at com.carrotsearch.randomizedtesting.ThreadLeakControl$StatementRunner.run(ThreadLeakControl.java:368)
	at com.carrotsearch.randomizedtesting.ThreadLeakControl.forkTimeoutingTask(ThreadLeakControl.java:817)
	at com.carrotsearch.randomizedtesting.ThreadLeakControl$3.evaluate(ThreadLeakControl.java:468)
	at com.carrotsearch.randomizedtesting.RandomizedRunner.runSingleTest(RandomizedRunner.java:916)
	at com.carrotsearch.randomizedtesting.RandomizedRunner$5.evaluate(RandomizedRunner.java:802)
	at com.carrotsearch.randomizedtesting.RandomizedRunner$6.evaluate(RandomizedRunner.java:852)
	at com.carrotsearch.randomizedtesting.RandomizedRunner$7.evaluate(RandomizedRunner.java:863)
	at com.carrotsearch.randomizedtesting.rules.StatementAdapter.evaluate(StatementAdapter.java:36)
	at com.carrotsearch.randomizedtesting.rules.SystemPropertiesRestoreRule$1.evaluate(SystemPropertiesRestoreRule.java:57)
	at org.apache.lucene.util.AbstractBeforeAfterRule$1.evaluate(AbstractBeforeAfterRule.java:45)
	at com.carrotsearch.randomizedtesting.rules.StatementAdapter.evaluate(StatementAdapter.java:36)
	at org.apache.lucene.util.TestRuleStoreClassName$1.evaluate(TestRuleStoreClassName.java:41)
	at com.carrotsearch.randomizedtesting.rules.NoShadowingOrOverridesOnMethodsRule$1.evaluate(NoShadowingOrOverridesOnMethodsRule.java:40)
	at com.carrotsearch.randomizedtesting.rules.NoShadowingOrOverridesOnMethodsRule$1.evaluate(NoShadowingOrOverridesOnMethodsRule.java:40)
	at com.carrotsearch.randomizedtesting.rules.StatementAdapter.evaluate(StatementAdapter.java:36)
	at com.carrotsearch.randomizedtesting.rules.StatementAdapter.evaluate(StatementAdapter.java:36)
	at com.carrotsearch.randomizedtesting.rules.StatementAdapter.evaluate(StatementAdapter.java:36)
	at org.apache.lucene.util.TestRuleAssertionsRequired$1.evaluate(TestRuleAssertionsRequired.java:53)
	at org.apache.lucene.util.TestRuleMarkFailure$1.evaluate(TestRuleMarkFailure.java:47)
	at org.apache.lucene.util.TestRuleIgnoreAfterMaxFailures$1.evaluate(TestRuleIgnoreAfterMaxFailures.java:64)
	at org.apache.lucene.util.TestRuleIgnoreTestSuites$1.evaluate(TestRuleIgnoreTestSuites.java:54)
	at com.carrotsearch.randomizedtesting.rules.StatementAdapter.evaluate(StatementAdapter.java:36)
	at com.carrotsearch.randomizedtesting.ThreadLeakControl$StatementRunner.run(ThreadLeakControl.java:368)
	at java.lang.Thread.run(Thread.java:748)




Build Log:
[...truncated 12780 lines...]
   [junit4] Suite: org.apache.solr.metrics.reporters.SolrSlf4jReporterTest
   [junit4]   2> 3074086 INFO  (SUITE-SolrSlf4jReporterTest-seed#[9A9A0D0A5342CB91]-worker)
[    ] o.a.s.SolrTestCaseJ4 SecureRandom sanity checks: test.solr.allowed.securerandom=null
& java.security.egd=file:/dev/./urandom
   [junit4]   2> Creating dataDir: /Users/jenkins/workspace/Lucene-Solr-master-MacOSX/solr/build/solr-core/test/J1/temp/solr.metrics.reporters.SolrSlf4jReporterTest_9A9A0D0A5342CB91-001/init-core-data-001
   [junit4]   2> 3074087 WARN  (SUITE-SolrSlf4jReporterTest-seed#[9A9A0D0A5342CB91]-worker)
[    ] o.a.s.SolrTestCaseJ4 startTrackingSearchers: numOpens=6 numCloses=6
   [junit4]   2> 3074090 INFO  (SUITE-SolrSlf4jReporterTest-seed#[9A9A0D0A5342CB91]-worker)
[    ] o.a.s.SolrTestCaseJ4 Using PointFields (NUMERIC_POINTS_SYSPROP=true) w/NUMERIC_DOCVALUES_SYSPROP=true
   [junit4]   2> 3074095 INFO  (SUITE-SolrSlf4jReporterTest-seed#[9A9A0D0A5342CB91]-worker)
[    ] o.a.s.SolrTestCaseJ4 Randomized ssl (false) and clientAuth (false) via: @org.apache.solr.util.RandomizeSSL(reason=,
value=NaN, ssl=NaN, clientAuth=NaN) w/ MAC_OS_X supressed clientAuth
   [junit4]   2> 3074099 INFO  (TEST-SolrSlf4jReporterTest.testReporter-seed#[9A9A0D0A5342CB91])
[    ] o.a.s.SolrTestCaseJ4 ###Starting testReporter
   [junit4]   2> 3080548 INFO  (TEST-SolrSlf4jReporterTest.testReporter-seed#[9A9A0D0A5342CB91])
[    ] o.a.s.SolrTestCaseJ4 ###Ending testReporter
   [junit4]   2> NOTE: reproduce with: ant test  -Dtestcase=SolrSlf4jReporterTest -Dtests.method=testReporter
-Dtests.seed=9A9A0D0A5342CB91 -Dtests.slow=true -Dtests.locale=cs-CZ -Dtests.timezone=Brazil/East
-Dtests.asserts=true -Dtests.file.encoding=UTF-8
   [junit4] FAILURE 6.46s J1 | SolrSlf4jReporterTest.testReporter <<<
   [junit4]    > Throwable #1: java.lang.AssertionError: count1=6, count2=6 - no 'solr.node'
logs in: {numFound=0,start=0,docs=[]}
   [junit4]    > 	at __randomizedtesting.SeedInfo.seed([9A9A0D0A5342CB91:C57E203D384E58D4]:0)
   [junit4]    > 	at org.apache.solr.metrics.reporters.SolrSlf4jReporterTest.testReporter(SolrSlf4jReporterTest.java:90)
   [junit4]    > 	at java.lang.Thread.run(Thread.java:748)
   [junit4]   2> 3080552 INFO  (SUITE-SolrSlf4jReporterTest-seed#[9A9A0D0A5342CB91]-worker)
[    ] o.a.s.SolrTestCaseJ4 ###deleteCore
   [junit4]   2> NOTE: leaving temporary files on disk at: /Users/jenkins/workspace/Lucene-Solr-master-MacOSX/solr/build/solr-core/test/J1/temp/solr.metrics.reporters.SolrSlf4jReporterTest_9A9A0D0A5342CB91-001
   [junit4]   2> NOTE: test params are: codec=Asserting(Lucene70): {}, docValues:{}, maxPointsInLeafNode=1515,
maxMBSortInHeap=5.510937628923985, sim=RandomSimilarity(queryNorm=true): {}, locale=cs-CZ,
timezone=Brazil/East
   [junit4]   2> NOTE: Mac OS X 10.11.6 x86_64/Oracle Corporation 1.8.0_144 (64-bit)/cpus=3,threads=1,free=149326824,total=518979584
   [junit4]   2> NOTE: All tests run in this JVM: [TestCoreDiscovery, TestWordDelimiterFilterFactory,
AtomicUpdateProcessorFactoryTest, TestLRUCache, LargeFieldTest, UpdateRequestProcessorFactoryTest,
TestSchemaNameResource, TestSha256AuthenticationProvider, TestManagedSynonymGraphFilterFactory,
HdfsThreadLeakTest, SpellCheckComponentTest, DeleteReplicaTest, JavabinLoaderTest, FullSolrCloudDistribCmdsTest,
MoveReplicaHDFSUlogDirTest, SchemaVersionSpecificBehaviorTest, TestRandomFaceting, SolrShardReporterTest,
DocumentAnalysisRequestHandlerTest, PingRequestHandlerTest, AutoScalingHandlerTest, SpellCheckCollatorWithCollapseTest,
TestLegacyNumericRangeQueryBuilder, CurrencyFieldTypeTest, SparseHLLTest, TestOrdValues, TestHashQParserPlugin,
ZkNodePropsTest, TestReplicationHandlerBackup, DeleteStatusTest, MetricsHandlerTest, DebugComponentTest,
TestBackupRepositoryFactory, TestPointFields, CollectionsAPIAsyncDistributedZkTest, ClassificationUpdateProcessorFactoryTest,
StressHdfsTest, ZkStateReaderTest, TestJoin, CoreAdminCreateDiscoverTest, SmileWriterTest,
TestPartialUpdateDeduplication, ShardRoutingCustomTest, TestConfigSets, TestSerializedLuceneMatchVersion,
TestFastWriter, CdcrUpdateLogTest, ConnectionManagerTest, ReplaceNodeTest, TestSearchPerf,
SolrCLIZkUtilsTest, LukeRequestHandlerTest, DocumentBuilderTest, TestRangeQuery, SolrGangliaReporterTest,
SOLR749Test, SuggesterFSTTest, SearchHandlerTest, TestRTGBase, ClassificationUpdateProcessorTest,
TestLuceneMatchVersion, SecurityConfHandlerTest, HLLSerializationTest, TestPKIAuthenticationPlugin,
DistributedQueryComponentOptimizationTest, UninvertDocValuesMergePolicyTest, FacetPivotSmallTest,
TestAddFieldRealTimeGet, TestManagedSchemaAPI, DocExpirationUpdateProcessorFactoryTest, ExplicitHLLTest,
TestLeaderElectionZkExpiry, PreAnalyzedFieldTest, TestCloudSchemaless, TestSearcherReuse,
TestImpersonationWithHadoopAuth, TestConfig, CacheHeaderTest, ShardSplitTest, TestScoreJoinQPScore,
TestTrie, TestUnifiedSolrHighlighter, FieldMutatingUpdateProcessorTest, TestDistribIDF, TestRestoreCore,
CdcrReplicationDistributedZkTest, TestBM25SimilarityFactory, HealthCheckHandlerTest, TestSchemalessBufferedUpdates,
TestReload, TestFieldCache, HdfsRecoverLeaseTest, TestXmlQParserPlugin, FileBasedSpellCheckerTest,
TestSegmentSorting, BasicFunctionalityTest, TestRawResponseWriter, TestRecoveryHdfs, HdfsCollectionsAPIDistributedZkTest,
GraphQueryTest, TestLMJelinekMercerSimilarityFactory, DistributedFacetPivotLargeTest, TestBlendedInfixSuggestions,
LeaderElectionContextKeyTest, DOMUtilTest, LoggingHandlerTest, BasicDistributedZk2Test, TestIndexSearcher,
CopyFieldTest, CdcrRequestHandlerTest, AnalyticsQueryTest, TestConfigReload, OpenExchangeRatesOrgProviderTest,
TestCollectionAPIs, AssignTest, LeaderInitiatedRecoveryOnShardRestartTest, TestRandomRequestDistribution,
TestInPlaceUpdatesStandalone, JvmMetricsTest, TestCrossCoreJoin, TestSolrCoreParser, MissingSegmentRecoveryTest,
BasicZkTest, SharedFSAutoReplicaFailoverUtilsTest, TestPayloadCheckQParserPlugin, SignatureUpdateProcessorFactoryTest,
TestFastOutputStream, TestSQLHandlerNonCloud, TestSolrJ, BooleanFieldTest, TestSolrCloudWithKerberosAlt,
TestFieldCacheSort, TermVectorComponentTest, TestHalfAndHalfDocValues, DistribDocExpirationUpdateProcessorTest,
TestCSVLoader, TestSolrQueryParser, DirectSolrSpellCheckerTest, TestStressLiveNodes, TestDownShardTolerantSearch,
TestJavabinTupleStreamParser, PeerSyncWithIndexFingerprintCachingTest, CheckHdfsIndexTest,
CustomCollectionTest, ExternalFileFieldSortTest, TestCharFilters, DirectoryFactoryTest, TestSolr4Spatial,
TestEmbeddedSolrServerAdminHandler, TestEmbeddedSolrServerSchemaAPI, TestStandardQParsers,
FileUtilsTest, ShowFileRequestHandlerTest, TestMergePolicyConfig, SpellPossibilityIteratorTest,
MultiThreadedOCPTest, LeaderElectionIntegrationTest, DistributedTermsComponentTest, TestPerFieldSimilarity,
SearchHandlerTest, TestStressCloudBlindAtomicUpdates, TestMiniSolrCloudClusterSSL, TestFilteredDocIdSet,
TestCloudSearcherWarming, TestDistributedMissingSort, V2ApiIntegrationTest, CoreMergeIndexesAdminHandlerTest,
TestManagedStopFilterFactory, TestCoreAdminApis, TestFreeTextSuggestions, TestSolrCoreSnapshots,
SpatialHeatmapFacetsTest, TestConfigSetImmutable, BigEndianAscendingWordSerializerTest, TestNoOpRegenerator,
TestCustomSort, CloudMLTQParserTest, TestDistributedGrouping, ChaosMonkeySafeLeaderTest, CollectionsAPIDistributedZkTest,
SyncSliceTest, OpenCloseCoreStressTest, OverseerTest, RecoveryZkTest, ClusterStateUpdateTest,
ZkSolrClientTest, TestZkChroot, TestRandomDVFaceting, ZkCLITest, TestDistributedSearch, DistributedSpellCheckComponentTest,
ZkControllerTest, HardAutoCommitTest, SolrCmdDistributorTest, QueryElevationComponentTest,
PeerSyncTest, DirectUpdateHandlerTest, TestBadConfig, TestExtendedDismaxParser, SpellCheckCollatorTest,
CoreAdminHandlerTest, SuggesterTSTTest, TestStressLucene, SpatialFilterTest, SuggesterWFSTTest,
PolyFieldTest, SolrCoreCheckLockOnStartupTest, TestPseudoReturnFields, QueryEqualityTest,
TestRemoteStreaming, DocValuesMultiTest, TestSolrDeletionPolicy1, DisMaxRequestHandlerTest,
TestQueryUtils, TestWriterPerf, TermsComponentTest, SolrPluginUtilsTest, TestCollationField,
QueryParsingTest, TestAnalyzedSuggestions, UniqFieldsUpdateProcessorFactoryTest, JsonLoaderTest,
TestPHPSerializedResponseWriter, TestComponentsName, TestLFUCache, HighlighterConfigTest,
UpdateParamsTest, AlternateDirectoryTest, TestSolrIndexConfig, SolrIndexConfigTest, BadComponentTest,
MultiTermTest, SampleTest, TestDocSet, TestBinaryField, MinimalSchemaTest, TestElisionMultitermQuery,
OutputWriterTest, TestFuzzyAnalyzedSuggestions, TestPostingsSolrHighlighter, SynonymTokenizerTest,
EchoParamsTest, TestSweetSpotSimilarityFactory, TestLMDirichletSimilarityFactory, TimeZoneUtilsTest,
PluginInfoTest, TestFastLRUCache, TestSystemIdResolver, TestSuggestSpellingConverter, SpellingQueryConverterTest,
ClusterStateTest, TestUtils, SliceStateTest, CursorPagingTest, TestSimpleTrackingShardHandler,
AliasIntegrationTest, BaseCdcrDistributedZkTest, ChaosMonkeyNothingIsSafeWithPullReplicasTest,
CleanupOldIndexTest, CloudExitableDirectoryReaderTest, CollectionReloadTest, CollectionsAPISolrJTest,
DocValuesNotIndexedTest, LeaderFailureAfterFreshStartTest, MigrateRouteKeyTest, OutOfBoxZkACLAndCredentialsProvidersTest,
OverseerCollectionConfigSetProcessorTest, OverseerModifyCollectionTest, OverseerRolesTest,
OverseerStatusTest, OverseerTaskQueueTest, PeerSyncReplicationTest, SSLMigrationTest, SolrCloudExampleTest,
TestCloudDeleteByQuery, TestCloudJSONFacetJoinDomain, TestCloudPseudoReturnFields, TestCloudRecovery,
TestCollectionsAPIViaSolrCloudCluster, TestConfigSetsAPIZkFailure, TestCryptoKeys, TestDeleteCollectionOnDownNodes,
TestExclusionRuleCollectionAccess, TestHdfsCloudBackupRestore, TestLeaderElectionWithEmptyReplica,
TestLeaderInitiatedRecoveryThread, TestOnReconnectListenerSupport, TestPrepRecovery, TestPullReplicaErrorHandling,
TestReplicaProperties, TestSizeLimitedDistributedMap, TestTlogReplica, BlobRepositoryCloudTest,
ConfigureRecoveryStrategyTest, ExitableDirectoryReaderTest, HdfsDirectoryFactoryTest, TestConfigOverlay,
TestConfigSetProperties, TestDynamicLoading, TestSolrXml, TestBlobHandler, TestSystemCollAutoCreate,
TestConfigsApi, DistributedExpandComponentTest, DistributedFacetPivotLongTailTest, DistributedFacetPivotSmallTest,
ReplicaListTransformerTest, SuggestComponentTest, TestExpandComponent, TestHttpShardHandlerFactory,
TestPivotHelperCode, TestTrackingShardHandlerFactory, HighlighterMaxOffsetTest, WrapperMergePolicyFactoryTest,
TestLegacyField, TestLegacyFieldReuse, TestLegacyNumericUtils, TestLegacyTerms, TestMultiValuedNumericRangeQuery,
TestNumericRangeQuery32, TestNumericTokenStream, SolrCoreMetricManagerTest, SolrMetricManagerTest,
SolrMetricReporterTest, SolrMetricsIntegrationTest, SolrJmxReporterTest, SolrSlf4jReporterTest]
   [junit4] Completed [625/732 (1!)] on J1 in 6.50s, 1 test, 1 failure <<< FAILURES!

[...truncated 43675 lines...]

Mime
View raw message