lucene-dev mailing list archives

Site index · List index
Message view « Date » · « Thread »
Top « Date » · « Thread »
From Policeman Jenkins Server <jenk...@thetaphi.de>
Subject [JENKINS-EA] Lucene-Solr-6.6-Linux (64bit/jdk-9-ea+181) - Build # 76 - Still Unstable!
Date Mon, 21 Aug 2017 17:04:46 GMT
Build: https://jenkins.thetaphi.de/job/Lucene-Solr-6.6-Linux/76/
Java: 64bit/jdk-9-ea+181 -XX:-UseCompressedOops -XX:+UseConcMarkSweepGC --illegal-access=deny

2 tests failed.
FAILED:  junit.framework.TestSuite.org.apache.solr.core.TestJmxIntegration

Error Message:
No JMX server found by monitor map

Stack Trace:
java.lang.AssertionError: No JMX server found by monitor map
	at __randomizedtesting.SeedInfo.seed([30D29E49C16D8F36]:0)
	at org.junit.Assert.fail(Assert.java:93)
	at org.junit.Assert.assertTrue(Assert.java:43)
	at org.junit.Assert.assertNotNull(Assert.java:526)
	at org.apache.solr.core.TestJmxIntegration.beforeClass(TestJmxIntegration.java:75)
	at java.base/jdk.internal.reflect.NativeMethodAccessorImpl.invoke0(Native Method)
	at java.base/jdk.internal.reflect.NativeMethodAccessorImpl.invoke(NativeMethodAccessorImpl.java:62)
	at java.base/jdk.internal.reflect.DelegatingMethodAccessorImpl.invoke(DelegatingMethodAccessorImpl.java:43)
	at java.base/java.lang.reflect.Method.invoke(Method.java:564)
	at com.carrotsearch.randomizedtesting.RandomizedRunner.invoke(RandomizedRunner.java:1713)
	at com.carrotsearch.randomizedtesting.RandomizedRunner$6.evaluate(RandomizedRunner.java:847)
	at com.carrotsearch.randomizedtesting.RandomizedRunner$7.evaluate(RandomizedRunner.java:863)
	at com.carrotsearch.randomizedtesting.rules.StatementAdapter.evaluate(StatementAdapter.java:36)
	at com.carrotsearch.randomizedtesting.rules.SystemPropertiesRestoreRule$1.evaluate(SystemPropertiesRestoreRule.java:57)
	at org.apache.lucene.util.AbstractBeforeAfterRule$1.evaluate(AbstractBeforeAfterRule.java:45)
	at com.carrotsearch.randomizedtesting.rules.StatementAdapter.evaluate(StatementAdapter.java:36)
	at org.apache.lucene.util.TestRuleStoreClassName$1.evaluate(TestRuleStoreClassName.java:41)
	at com.carrotsearch.randomizedtesting.rules.NoShadowingOrOverridesOnMethodsRule$1.evaluate(NoShadowingOrOverridesOnMethodsRule.java:40)
	at com.carrotsearch.randomizedtesting.rules.NoShadowingOrOverridesOnMethodsRule$1.evaluate(NoShadowingOrOverridesOnMethodsRule.java:40)
	at com.carrotsearch.randomizedtesting.rules.StatementAdapter.evaluate(StatementAdapter.java:36)
	at com.carrotsearch.randomizedtesting.rules.StatementAdapter.evaluate(StatementAdapter.java:36)
	at org.apache.lucene.util.TestRuleAssertionsRequired$1.evaluate(TestRuleAssertionsRequired.java:53)
	at org.apache.lucene.util.TestRuleMarkFailure$1.evaluate(TestRuleMarkFailure.java:47)
	at org.apache.lucene.util.TestRuleIgnoreAfterMaxFailures$1.evaluate(TestRuleIgnoreAfterMaxFailures.java:64)
	at org.apache.lucene.util.TestRuleIgnoreTestSuites$1.evaluate(TestRuleIgnoreTestSuites.java:54)
	at com.carrotsearch.randomizedtesting.rules.StatementAdapter.evaluate(StatementAdapter.java:36)
	at com.carrotsearch.randomizedtesting.ThreadLeakControl$StatementRunner.run(ThreadLeakControl.java:368)
	at java.base/java.lang.Thread.run(Thread.java:844)


FAILED:  org.apache.solr.cloud.CollectionsAPIDistributedZkTest.testCollectionsAPI

Error Message:
Something is broken in the assert for no shards using the same indexDir - probably something was changed in the attributes published in the MBean of SolrCore : {}

Stack Trace:
java.lang.AssertionError: Something is broken in the assert for no shards using the same indexDir - probably something was changed in the attributes published in the MBean of SolrCore : {}
	at __randomizedtesting.SeedInfo.seed([30D29E49C16D8F36:78A7EAFDC75EA0A3]:0)
	at org.junit.Assert.fail(Assert.java:93)
	at org.junit.Assert.assertTrue(Assert.java:43)
	at org.apache.solr.cloud.CollectionsAPIDistributedZkTest.checkNoTwoShardsUseTheSameIndexDir(CollectionsAPIDistributedZkTest.java:646)
	at org.apache.solr.cloud.CollectionsAPIDistributedZkTest.testCollectionsAPI(CollectionsAPIDistributedZkTest.java:524)
	at java.base/jdk.internal.reflect.NativeMethodAccessorImpl.invoke0(Native Method)
	at java.base/jdk.internal.reflect.NativeMethodAccessorImpl.invoke(NativeMethodAccessorImpl.java:62)
	at java.base/jdk.internal.reflect.DelegatingMethodAccessorImpl.invoke(DelegatingMethodAccessorImpl.java:43)
	at java.base/java.lang.reflect.Method.invoke(Method.java:564)
	at com.carrotsearch.randomizedtesting.RandomizedRunner.invoke(RandomizedRunner.java:1713)
	at com.carrotsearch.randomizedtesting.RandomizedRunner$8.evaluate(RandomizedRunner.java:907)
	at com.carrotsearch.randomizedtesting.RandomizedRunner$9.evaluate(RandomizedRunner.java:943)
	at com.carrotsearch.randomizedtesting.RandomizedRunner$10.evaluate(RandomizedRunner.java:957)
	at com.carrotsearch.randomizedtesting.rules.SystemPropertiesRestoreRule$1.evaluate(SystemPropertiesRestoreRule.java:57)
	at org.apache.lucene.util.TestRuleSetupTeardownChained$1.evaluate(TestRuleSetupTeardownChained.java:49)
	at org.apache.lucene.util.AbstractBeforeAfterRule$1.evaluate(AbstractBeforeAfterRule.java:45)
	at org.apache.lucene.util.TestRuleThreadAndTestName$1.evaluate(TestRuleThreadAndTestName.java:48)
	at org.apache.lucene.util.TestRuleIgnoreAfterMaxFailures$1.evaluate(TestRuleIgnoreAfterMaxFailures.java:64)
	at org.apache.lucene.util.TestRuleMarkFailure$1.evaluate(TestRuleMarkFailure.java:47)
	at com.carrotsearch.randomizedtesting.rules.StatementAdapter.evaluate(StatementAdapter.java:36)
	at com.carrotsearch.randomizedtesting.ThreadLeakControl$StatementRunner.run(ThreadLeakControl.java:368)
	at com.carrotsearch.randomizedtesting.ThreadLeakControl.forkTimeoutingTask(ThreadLeakControl.java:817)
	at com.carrotsearch.randomizedtesting.ThreadLeakControl$3.evaluate(ThreadLeakControl.java:468)
	at com.carrotsearch.randomizedtesting.RandomizedRunner.runSingleTest(RandomizedRunner.java:916)
	at com.carrotsearch.randomizedtesting.RandomizedRunner$5.evaluate(RandomizedRunner.java:802)
	at com.carrotsearch.randomizedtesting.RandomizedRunner$6.evaluate(RandomizedRunner.java:852)
	at com.carrotsearch.randomizedtesting.RandomizedRunner$7.evaluate(RandomizedRunner.java:863)
	at com.carrotsearch.randomizedtesting.rules.StatementAdapter.evaluate(StatementAdapter.java:36)
	at com.carrotsearch.randomizedtesting.rules.SystemPropertiesRestoreRule$1.evaluate(SystemPropertiesRestoreRule.java:57)
	at org.apache.lucene.util.AbstractBeforeAfterRule$1.evaluate(AbstractBeforeAfterRule.java:45)
	at com.carrotsearch.randomizedtesting.rules.StatementAdapter.evaluate(StatementAdapter.java:36)
	at org.apache.lucene.util.TestRuleStoreClassName$1.evaluate(TestRuleStoreClassName.java:41)
	at com.carrotsearch.randomizedtesting.rules.NoShadowingOrOverridesOnMethodsRule$1.evaluate(NoShadowingOrOverridesOnMethodsRule.java:40)
	at com.carrotsearch.randomizedtesting.rules.NoShadowingOrOverridesOnMethodsRule$1.evaluate(NoShadowingOrOverridesOnMethodsRule.java:40)
	at com.carrotsearch.randomizedtesting.rules.StatementAdapter.evaluate(StatementAdapter.java:36)
	at com.carrotsearch.randomizedtesting.rules.StatementAdapter.evaluate(StatementAdapter.java:36)
	at org.apache.lucene.util.TestRuleAssertionsRequired$1.evaluate(TestRuleAssertionsRequired.java:53)
	at org.apache.lucene.util.TestRuleMarkFailure$1.evaluate(TestRuleMarkFailure.java:47)
	at org.apache.lucene.util.TestRuleIgnoreAfterMaxFailures$1.evaluate(TestRuleIgnoreAfterMaxFailures.java:64)
	at org.apache.lucene.util.TestRuleIgnoreTestSuites$1.evaluate(TestRuleIgnoreTestSuites.java:54)
	at com.carrotsearch.randomizedtesting.rules.StatementAdapter.evaluate(StatementAdapter.java:36)
	at com.carrotsearch.randomizedtesting.ThreadLeakControl$StatementRunner.run(ThreadLeakControl.java:368)
	at java.base/java.lang.Thread.run(Thread.java:844)




Build Log:
[...truncated 1704 lines...]
   [junit4] JVM J1: stderr was not empty, see: /home/jenkins/workspace/Lucene-Solr-6.6-Linux/lucene/build/core/test/temp/junit4-J1-20170821_155814_8189063778453202070886.syserr
   [junit4] >>> JVM J1 emitted unexpected output (verbatim) ----
   [junit4] Java HotSpot(TM) 64-Bit Server VM warning: Option UseConcMarkSweepGC was deprecated in version 9.0 and will likely be removed in a future release.
   [junit4] <<< JVM J1: EOF ----

[...truncated 5 lines...]
   [junit4] JVM J0: stderr was not empty, see: /home/jenkins/workspace/Lucene-Solr-6.6-Linux/lucene/build/core/test/temp/junit4-J0-20170821_155814_8188919562836508487886.syserr
   [junit4] >>> JVM J0 emitted unexpected output (verbatim) ----
   [junit4] Java HotSpot(TM) 64-Bit Server VM warning: Option UseConcMarkSweepGC was deprecated in version 9.0 and will likely be removed in a future release.
   [junit4] <<< JVM J0: EOF ----

   [junit4] JVM J2: stderr was not empty, see: /home/jenkins/workspace/Lucene-Solr-6.6-Linux/lucene/build/core/test/temp/junit4-J2-20170821_155814_81716071547906664655977.syserr
   [junit4] >>> JVM J2 emitted unexpected output (verbatim) ----
   [junit4] Java HotSpot(TM) 64-Bit Server VM warning: Option UseConcMarkSweepGC was deprecated in version 9.0 and will likely be removed in a future release.
   [junit4] <<< JVM J2: EOF ----

[...truncated 289 lines...]
   [junit4] JVM J1: stderr was not empty, see: /home/jenkins/workspace/Lucene-Solr-6.6-Linux/lucene/build/test-framework/test/temp/junit4-J1-20170821_160428_92513641190570773323838.syserr
   [junit4] >>> JVM J1 emitted unexpected output (verbatim) ----
   [junit4] Java HotSpot(TM) 64-Bit Server VM warning: Option UseConcMarkSweepGC was deprecated in version 9.0 and will likely be removed in a future release.
   [junit4] <<< JVM J1: EOF ----

   [junit4] JVM J2: stderr was not empty, see: /home/jenkins/workspace/Lucene-Solr-6.6-Linux/lucene/build/test-framework/test/temp/junit4-J2-20170821_160428_92518154004262547589520.syserr
   [junit4] >>> JVM J2 emitted unexpected output (verbatim) ----
   [junit4] Java HotSpot(TM) 64-Bit Server VM warning: Option UseConcMarkSweepGC was deprecated in version 9.0 and will likely be removed in a future release.
   [junit4] <<< JVM J2: EOF ----

[...truncated 3 lines...]
   [junit4] JVM J0: stderr was not empty, see: /home/jenkins/workspace/Lucene-Solr-6.6-Linux/lucene/build/test-framework/test/temp/junit4-J0-20170821_160428_92412325092403666501800.syserr
   [junit4] >>> JVM J0 emitted unexpected output (verbatim) ----
   [junit4] Java HotSpot(TM) 64-Bit Server VM warning: Option UseConcMarkSweepGC was deprecated in version 9.0 and will likely be removed in a future release.
   [junit4] <<< JVM J0: EOF ----

[...truncated 1027 lines...]
   [junit4] JVM J1: stderr was not empty, see: /home/jenkins/workspace/Lucene-Solr-6.6-Linux/lucene/build/analysis/common/test/temp/junit4-J1-20170821_160530_68016477380976824474308.syserr
   [junit4] >>> JVM J1 emitted unexpected output (verbatim) ----
   [junit4] Java HotSpot(TM) 64-Bit Server VM warning: Option UseConcMarkSweepGC was deprecated in version 9.0 and will likely be removed in a future release.
   [junit4] <<< JVM J1: EOF ----

[...truncated 3 lines...]
   [junit4] JVM J2: stderr was not empty, see: /home/jenkins/workspace/Lucene-Solr-6.6-Linux/lucene/build/analysis/common/test/temp/junit4-J2-20170821_160530_68114364426334089470559.syserr
   [junit4] >>> JVM J2 emitted unexpected output (verbatim) ----
   [junit4] Java HotSpot(TM) 64-Bit Server VM warning: Option UseConcMarkSweepGC was deprecated in version 9.0 and will likely be removed in a future release.
   [junit4] <<< JVM J2: EOF ----

[...truncated 3 lines...]
   [junit4] JVM J0: stderr was not empty, see: /home/jenkins/workspace/Lucene-Solr-6.6-Linux/lucene/build/analysis/common/test/temp/junit4-J0-20170821_160530_68014718568580532052309.syserr
   [junit4] >>> JVM J0 emitted unexpected output (verbatim) ----
   [junit4] Java HotSpot(TM) 64-Bit Server VM warning: Option UseConcMarkSweepGC was deprecated in version 9.0 and will likely be removed in a future release.
   [junit4] <<< JVM J0: EOF ----

[...truncated 216 lines...]
   [junit4] JVM J2: stderr was not empty, see: /home/jenkins/workspace/Lucene-Solr-6.6-Linux/lucene/build/analysis/icu/test/temp/junit4-J2-20170821_160744_91111575209809486788797.syserr
   [junit4] >>> JVM J2 emitted unexpected output (verbatim) ----
   [junit4] Java HotSpot(TM) 64-Bit Server VM warning: Option UseConcMarkSweepGC was deprecated in version 9.0 and will likely be removed in a future release.
   [junit4] <<< JVM J2: EOF ----

   [junit4] JVM J0: stderr was not empty, see: /home/jenkins/workspace/Lucene-Solr-6.6-Linux/lucene/build/analysis/icu/test/temp/junit4-J0-20170821_160744_91013404922665381071820.syserr
   [junit4] >>> JVM J0 emitted unexpected output (verbatim) ----
   [junit4] Java HotSpot(TM) 64-Bit Server VM warning: Option UseConcMarkSweepGC was deprecated in version 9.0 and will likely be removed in a future release.
   [junit4] <<< JVM J0: EOF ----

[...truncated 5 lines...]
   [junit4] JVM J1: stderr was not empty, see: /home/jenkins/workspace/Lucene-Solr-6.6-Linux/lucene/build/analysis/icu/test/temp/junit4-J1-20170821_160744_91016954677794925018815.syserr
   [junit4] >>> JVM J1 emitted unexpected output (verbatim) ----
   [junit4] Java HotSpot(TM) 64-Bit Server VM warning: Option UseConcMarkSweepGC was deprecated in version 9.0 and will likely be removed in a future release.
   [junit4] <<< JVM J1: EOF ----

[...truncated 235 lines...]
   [junit4] JVM J2: stderr was not empty, see: /home/jenkins/workspace/Lucene-Solr-6.6-Linux/lucene/build/analysis/kuromoji/test/temp/junit4-J2-20170821_160759_0312589836790429726217.syserr
   [junit4] >>> JVM J2 emitted unexpected output (verbatim) ----
   [junit4] Java HotSpot(TM) 64-Bit Server VM warning: Option UseConcMarkSweepGC was deprecated in version 9.0 and will likely be removed in a future release.
   [junit4] <<< JVM J2: EOF ----

[...truncated 5 lines...]
   [junit4] JVM J0: stderr was not empty, see: /home/jenkins/workspace/Lucene-Solr-6.6-Linux/lucene/build/analysis/kuromoji/test/temp/junit4-J0-20170821_160759_0313551387465698727568.syserr
   [junit4] >>> JVM J0 emitted unexpected output (verbatim) ----
   [junit4] Java HotSpot(TM) 64-Bit Server VM warning: Option UseConcMarkSweepGC was deprecated in version 9.0 and will likely be removed in a future release.
   [junit4] <<< JVM J0: EOF ----

[...truncated 3 lines...]
   [junit4] JVM J1: stderr was not empty, see: /home/jenkins/workspace/Lucene-Solr-6.6-Linux/lucene/build/analysis/kuromoji/test/temp/junit4-J1-20170821_160759_03111298812315054453535.syserr
   [junit4] >>> JVM J1 emitted unexpected output (verbatim) ----
   [junit4] Java HotSpot(TM) 64-Bit Server VM warning: Option UseConcMarkSweepGC was deprecated in version 9.0 and will likely be removed in a future release.
   [junit4] <<< JVM J1: EOF ----

[...truncated 146 lines...]
   [junit4] JVM J1: stderr was not empty, see: /home/jenkins/workspace/Lucene-Solr-6.6-Linux/lucene/build/analysis/morfologik/test/temp/junit4-J1-20170821_160829_8989524015221966025201.syserr
   [junit4] >>> JVM J1 emitted unexpected output (verbatim) ----
   [junit4] Java HotSpot(TM) 64-Bit Server VM warning: Option UseConcMarkSweepGC was deprecated in version 9.0 and will likely be removed in a future release.
   [junit4] <<< JVM J1: EOF ----

[...truncated 6 lines...]
   [junit4] JVM J2: stderr was not empty, see: /home/jenkins/workspace/Lucene-Solr-6.6-Linux/lucene/build/analysis/morfologik/test/temp/junit4-J2-20170821_160829_89817415162626786585386.syserr
   [junit4] >>> JVM J2 emitted unexpected output (verbatim) ----
   [junit4] Java HotSpot(TM) 64-Bit Server VM warning: Option UseConcMarkSweepGC was deprecated in version 9.0 and will likely be removed in a future release.
   [junit4] <<< JVM J2: EOF ----

   [junit4] JVM J0: stderr was not empty, see: /home/jenkins/workspace/Lucene-Solr-6.6-Linux/lucene/build/analysis/morfologik/test/temp/junit4-J0-20170821_160829_8981130321377031230247.syserr
   [junit4] >>> JVM J0 emitted unexpected output (verbatim) ----
   [junit4] Java HotSpot(TM) 64-Bit Server VM warning: Option UseConcMarkSweepGC was deprecated in version 9.0 and will likely be removed in a future release.
   [junit4] <<< JVM J0: EOF ----

[...truncated 158 lines...]
   [junit4] JVM J2: stderr was not empty, see: /home/jenkins/workspace/Lucene-Solr-6.6-Linux/lucene/build/analysis/phonetic/test/temp/junit4-J2-20170821_160834_6531053928071905805924.syserr
   [junit4] >>> JVM J2 emitted unexpected output (verbatim) ----
   [junit4] Java HotSpot(TM) 64-Bit Server VM warning: Option UseConcMarkSweepGC was deprecated in version 9.0 and will likely be removed in a future release.
   [junit4] <<< JVM J2: EOF ----

[...truncated 3 lines...]
   [junit4] JVM J0: stderr was not empty, see: /home/jenkins/workspace/Lucene-Solr-6.6-Linux/lucene/build/analysis/phonetic/test/temp/junit4-J0-20170821_160834_6537951491673185760466.syserr
   [junit4] >>> JVM J0 emitted unexpected output (verbatim) ----
   [junit4] Java HotSpot(TM) 64-Bit Server VM warning: Option UseConcMarkSweepGC was deprecated in version 9.0 and will likely be removed in a future release.
   [junit4] <<< JVM J0: EOF ----

[...truncated 3 lines...]
   [junit4] JVM J1: stderr was not empty, see: /home/jenkins/workspace/Lucene-Solr-6.6-Linux/lucene/build/analysis/phonetic/test/temp/junit4-J1-20170821_160834_65310740986916219177083.syserr
   [junit4] >>> JVM J1 emitted unexpected output (verbatim) ----
   [junit4] Java HotSpot(TM) 64-Bit Server VM warning: Option UseConcMarkSweepGC was deprecated in version 9.0 and will likely be removed in a future release.
   [junit4] <<< JVM J1: EOF ----

[...truncated 145 lines...]
   [junit4] JVM J1: stderr was not empty, see: /home/jenkins/workspace/Lucene-Solr-6.6-Linux/lucene/build/analysis/smartcn/test/temp/junit4-J1-20170821_160844_6564069611275829144004.syserr
   [junit4] >>> JVM J1 emitted unexpected output (verbatim) ----
   [junit4] Java HotSpot(TM) 64-Bit Server VM warning: Option UseConcMarkSweepGC was deprecated in version 9.0 and will likely be removed in a future release.
   [junit4] <<< JVM J1: EOF ----

[...truncated 3 lines...]
   [junit4] JVM J0: stderr was not empty, see: /home/jenkins/workspace/Lucene-Solr-6.6-Linux/lucene/build/analysis/smartcn/test/temp/junit4-J0-20170821_160844_6567475200966545728547.syserr
   [junit4] >>> JVM J0 emitted unexpected output (verbatim) ----
   [junit4] Java HotSpot(TM) 64-Bit Server VM warning: Option UseConcMarkSweepGC was deprecated in version 9.0 and will likely be removed in a future release.
   [junit4] <<< JVM J0: EOF ----

[...truncated 146 lines...]
   [junit4] JVM J1: stderr was not empty, see: /home/jenkins/workspace/Lucene-Solr-6.6-Linux/lucene/build/analysis/stempel/test/temp/junit4-J1-20170821_160852_1829289127696370987122.syserr
   [junit4] >>> JVM J1 emitted unexpected output (verbatim) ----
   [junit4] Java HotSpot(TM) 64-Bit Server VM warning: Option UseConcMarkSweepGC was deprecated in version 9.0 and will likely be removed in a future release.
   [junit4] <<< JVM J1: EOF ----

[...truncated 3 lines...]
   [junit4] JVM J2: stderr was not empty, see: /home/jenkins/workspace/Lucene-Solr-6.6-Linux/lucene/build/analysis/stempel/test/temp/junit4-J2-20170821_160852_18212124631535681576610.syserr
   [junit4] >>> JVM J2 emitted unexpected output (verbatim) ----
   [junit4] Java HotSpot(TM) 64-Bit Server VM warning: Option UseConcMarkSweepGC was deprecated in version 9.0 and will likely be removed in a future release.
   [junit4] <<< JVM J2: EOF ----

[...truncated 3 lines...]
   [junit4] JVM J0: stderr was not empty, see: /home/jenkins/workspace/Lucene-Solr-6.6-Linux/lucene/build/analysis/stempel/test/temp/junit4-J0-20170821_160852_1822703715772066829373.syserr
   [junit4] >>> JVM J0 emitted unexpected output (verbatim) ----
   [junit4] Java HotSpot(TM) 64-Bit Server VM warning: Option UseConcMarkSweepGC was deprecated in version 9.0 and will likely be removed in a future release.
   [junit4] <<< JVM J0: EOF ----

[...truncated 161 lines...]
   [junit4] JVM J0: stderr was not empty, see: /home/jenkins/workspace/Lucene-Solr-6.6-Linux/lucene/build/analysis/uima/test/temp/junit4-J0-20170821_160854_90011401998050511998864.syserr
   [junit4] >>> JVM J0 emitted unexpected output (verbatim) ----
   [junit4] Java HotSpot(TM) 64-Bit Server VM warning: Option UseConcMarkSweepGC was deprecated in version 9.0 and will likely be removed in a future release.
   [junit4] <<< JVM J0: EOF ----

[...truncated 157 lines...]
   [junit4] JVM J2: stderr was not empty, see: /home/jenkins/workspace/Lucene-Solr-6.6-Linux/lucene/build/backward-codecs/test/temp/junit4-J2-20170821_160901_5127106392227807559519.syserr
   [junit4] >>> JVM J2 emitted unexpected output (verbatim) ----
   [junit4] Java HotSpot(TM) 64-Bit Server VM warning: Option UseConcMarkSweepGC was deprecated in version 9.0 and will likely be removed in a future release.
   [junit4] <<< JVM J2: EOF ----

[...truncated 17 lines...]
   [junit4] JVM J0: stderr was not empty, see: /home/jenkins/workspace/Lucene-Solr-6.6-Linux/lucene/build/backward-codecs/test/temp/junit4-J0-20170821_160901_51216250995991631298135.syserr
   [junit4] >>> JVM J0 emitted unexpected output (verbatim) ----
   [junit4] Java HotSpot(TM) 64-Bit Server VM warning: Option UseConcMarkSweepGC was deprecated in version 9.0 and will likely be removed in a future release.
   [junit4] <<< JVM J0: EOF ----

[...truncated 9 lines...]
   [junit4] JVM J1: stderr was not empty, see: /home/jenkins/workspace/Lucene-Solr-6.6-Linux/lucene/build/backward-codecs/test/temp/junit4-J1-20170821_160901_51215032968054301809318.syserr
   [junit4] >>> JVM J1 emitted unexpected output (verbatim) ----
   [junit4] Java HotSpot(TM) 64-Bit Server VM warning: Option UseConcMarkSweepGC was deprecated in version 9.0 and will likely be removed in a future release.
   [junit4] <<< JVM J1: EOF ----

[...truncated 1344 lines...]
   [junit4] JVM J2: stderr was not empty, see: /home/jenkins/workspace/Lucene-Solr-6.6-Linux/lucene/build/benchmark/test/temp/junit4-J2-20170821_161008_0537416394670765541942.syserr
   [junit4] >>> JVM J2 emitted unexpected output (verbatim) ----
   [junit4] Java HotSpot(TM) 64-Bit Server VM warning: Option UseConcMarkSweepGC was deprecated in version 9.0 and will likely be removed in a future release.
   [junit4] <<< JVM J2: EOF ----

   [junit4] JVM J1: stderr was not empty, see: /home/jenkins/workspace/Lucene-Solr-6.6-Linux/lucene/build/benchmark/test/temp/junit4-J1-20170821_161008_0533945883737376957077.syserr
   [junit4] >>> JVM J1 emitted unexpected output (verbatim) ----
   [junit4] Java HotSpot(TM) 64-Bit Server VM warning: Option UseConcMarkSweepGC was deprecated in version 9.0 and will likely be removed in a future release.
   [junit4] <<< JVM J1: EOF ----

[...truncated 3 lines...]
   [junit4] JVM J0: stderr was not empty, see: /home/jenkins/workspace/Lucene-Solr-6.6-Linux/lucene/build/benchmark/test/temp/junit4-J0-20170821_161008_05315914447792332874341.syserr
   [junit4] >>> JVM J0 emitted unexpected output (verbatim) ----
   [junit4] Java HotSpot(TM) 64-Bit Server VM warning: Option UseConcMarkSweepGC was deprecated in version 9.0 and will likely be removed in a future release.
   [junit4] <<< JVM J0: EOF ----

[...truncated 226 lines...]
   [junit4] JVM J0: stderr was not empty, see: /home/jenkins/workspace/Lucene-Solr-6.6-Linux/lucene/build/classification/test/temp/junit4-J0-20170821_161015_54313830370031807933049.syserr
   [junit4] >>> JVM J0 emitted unexpected output (verbatim) ----
   [junit4] Java HotSpot(TM) 64-Bit Server VM warning: Option UseConcMarkSweepGC was deprecated in version 9.0 and will likely be removed in a future release.
   [junit4] <<< JVM J0: EOF ----

   [junit4] JVM J1: stderr was not empty, see: /home/jenkins/workspace/Lucene-Solr-6.6-Linux/lucene/build/classification/test/temp/junit4-J1-20170821_161015_5431709177431920749493.syserr
   [junit4] >>> JVM J1 emitted unexpected output (verbatim) ----
   [junit4] Java HotSpot(TM) 64-Bit Server VM warning: Option UseConcMarkSweepGC was deprecated in version 9.0 and will likely be removed in a future release.
   [junit4] <<< JVM J1: EOF ----

[...truncated 3 lines...]
   [junit4] JVM J2: stderr was not empty, see: /home/jenkins/workspace/Lucene-Solr-6.6-Linux/lucene/build/classification/test/temp/junit4-J2-20170821_161015_5434027341201885076167.syserr
   [junit4] >>> JVM J2 emitted unexpected output (verbatim) ----
   [junit4] Java HotSpot(TM) 64-Bit Server VM warning: Option UseConcMarkSweepGC was deprecated in version 9.0 and will likely be removed in a future release.
   [junit4] <<< JVM J2: EOF ----

[...truncated 242 lines...]
   [junit4] JVM J1: stderr was not empty, see: /home/jenkins/workspace/Lucene-Solr-6.6-Linux/lucene/build/codecs/test/temp/junit4-J1-20170821_161022_88513772770203526600071.syserr
   [junit4] >>> JVM J1 emitted unexpected output (verbatim) ----
   [junit4] Java HotSpot(TM) 64-Bit Server VM warning: Option UseConcMarkSweepGC was deprecated in version 9.0 and will likely be removed in a future release.
   [junit4] <<< JVM J1: EOF ----

[...truncated 3 lines...]
   [junit4] JVM J2: stderr was not empty, see: /home/jenkins/workspace/Lucene-Solr-6.6-Linux/lucene/build/codecs/test/temp/junit4-J2-20170821_161022_88512242356739792464962.syserr
   [junit4] >>> JVM J2 emitted unexpected output (verbatim) ----
   [junit4] Java HotSpot(TM) 64-Bit Server VM warning: Option UseConcMarkSweepGC was deprecated in version 9.0 and will likely be removed in a future release.
   [junit4] <<< JVM J2: EOF ----

[...truncated 11 lines...]
   [junit4] JVM J0: stderr was not empty, see: /home/jenkins/workspace/Lucene-Solr-6.6-Linux/lucene/build/codecs/test/temp/junit4-J0-20170821_161022_8859442548299446471278.syserr
   [junit4] >>> JVM J0 emitted unexpected output (verbatim) ----
   [junit4] Java HotSpot(TM) 64-Bit Server VM warning: Option UseConcMarkSweepGC was deprecated in version 9.0 and will likely be removed in a future release.
   [junit4] <<< JVM J0: EOF ----

[...truncated 229 lines...]
   [junit4] JVM J1: stderr was not empty, see: /home/jenkins/workspace/Lucene-Solr-6.6-Linux/lucene/build/demo/test/temp/junit4-J1-20170821_161237_76211480713504464416519.syserr
   [junit4] >>> JVM J1 emitted unexpected output (verbatim) ----
   [junit4] Java HotSpot(TM) 64-Bit Server VM warning: Option UseConcMarkSweepGC was deprecated in version 9.0 and will likely be removed in a future release.
   [junit4] <<< JVM J1: EOF ----

   [junit4] JVM J2: stderr was not empty, see: /home/jenkins/workspace/Lucene-Solr-6.6-Linux/lucene/build/demo/test/temp/junit4-J2-20170821_161237_7623486313697036137483.syserr
   [junit4] >>> JVM J2 emitted unexpected output (verbatim) ----
   [junit4] Java HotSpot(TM) 64-Bit Server VM warning: Option UseConcMarkSweepGC was deprecated in version 9.0 and will likely be removed in a future release.
   [junit4] <<< JVM J2: EOF ----

   [junit4] JVM J0: stderr was not empty, see: /home/jenkins/workspace/Lucene-Solr-6.6-Linux/lucene/build/demo/test/temp/junit4-J0-20170821_161237_76213293121117248987235.syserr
   [junit4] >>> JVM J0 emitted unexpected output (verbatim) ----
   [junit4] Java HotSpot(TM) 64-Bit Server VM warning: Option UseConcMarkSweepGC was deprecated in version 9.0 and will likely be removed in a future release.
   [junit4] <<< JVM J0: EOF ----

[...truncated 159 lines...]
   [junit4] JVM J2: stderr was not empty, see: /home/jenkins/workspace/Lucene-Solr-6.6-Linux/lucene/build/expressions/test/temp/junit4-J2-20170821_161240_3468024288215693866956.syserr
   [junit4] >>> JVM J2 emitted unexpected output (verbatim) ----
   [junit4] Java HotSpot(TM) 64-Bit Server VM warning: Option UseConcMarkSweepGC was deprecated in version 9.0 and will likely be removed in a future release.
   [junit4] <<< JVM J2: EOF ----

[...truncated 3 lines...]
   [junit4] JVM J1: stderr was not empty, see: /home/jenkins/workspace/Lucene-Solr-6.6-Linux/lucene/build/expressions/test/temp/junit4-J1-20170821_161240_34616968164822677529104.syserr
   [junit4] >>> JVM J1 emitted unexpected output (verbatim) ----
   [junit4] Java HotSpot(TM) 64-Bit Server VM warning: Option UseConcMarkSweepGC was deprecated in version 9.0 and will likely be removed in a future release.
   [junit4] <<< JVM J1: EOF ----

[...truncated 6 lines...]
   [junit4] JVM J0: stderr was not empty, see: /home/jenkins/workspace/Lucene-Solr-6.6-Linux/lucene/build/expressions/test/temp/junit4-J0-20170821_161240_34614231846682457951867.syserr
   [junit4] >>> JVM J0 emitted unexpected output (verbatim) ----
   [junit4] Java HotSpot(TM) 64-Bit Server VM warning: Option UseConcMarkSweepGC was deprecated in version 9.0 and will likely be removed in a future release.
   [junit4] <<< JVM J0: EOF ----

[...truncated 209 lines...]
   [junit4] JVM J1: stderr was not empty, see: /home/jenkins/workspace/Lucene-Solr-6.6-Linux/lucene/build/facet/test/temp/junit4-J1-20170821_161246_00418303922941439633084.syserr
   [junit4] >>> JVM J1 emitted unexpected output (verbatim) ----
   [junit4] Java HotSpot(TM) 64-Bit Server VM warning: Option UseConcMarkSweepGC was deprecated in version 9.0 and will likely be removed in a future release.
   [junit4] <<< JVM J1: EOF ----

[...truncated 3 lines...]
   [junit4] JVM J0: stderr was not empty, see: /home/jenkins/workspace/Lucene-Solr-6.6-Linux/lucene/build/facet/test/temp/junit4-J0-20170821_161246_0046235197638152702561.syserr
   [junit4] >>> JVM J0 emitted unexpected output (verbatim) ----
   [junit4] Java HotSpot(TM) 64-Bit Server VM warning: Option UseConcMarkSweepGC was deprecated in version 9.0 and will likely be removed in a future release.
   [junit4] <<< JVM J0: EOF ----

[...truncated 3 lines...]
   [junit4] JVM J2: stderr was not empty, see: /home/jenkins/workspace/Lucene-Solr-6.6-Linux/lucene/build/facet/test/temp/junit4-J2-20170821_161246_0047969729571016328118.syserr
   [junit4] >>> JVM J2 emitted unexpected output (verbatim) ----
   [junit4] Java HotSpot(TM) 64-Bit Server VM warning: Option UseConcMarkSweepGC was deprecated in version 9.0 and will likely be removed in a future release.
   [junit4] <<< JVM J2: EOF ----

[...truncated 156 lines...]
   [junit4] JVM J2: stderr was not empty, see: /home/jenkins/workspace/Lucene-Solr-6.6-Linux/lucene/build/grouping/test/temp/junit4-J2-20170821_161352_693588416281658747715.syserr
   [junit4] >>> JVM J2 emitted unexpected output (verbatim) ----
   [junit4] Java HotSpot(TM) 64-Bit Server VM warning: Option UseConcMarkSweepGC was deprecated in version 9.0 and will likely be removed in a future release.
   [junit4] <<< JVM J2: EOF ----

[...truncated 3 lines...]
   [junit4] JVM J1: stderr was not empty, see: /home/jenkins/workspace/Lucene-Solr-6.6-Linux/lucene/build/grouping/test/temp/junit4-J1-20170821_161352_69315760742465707319116.syserr
   [junit4] >>> JVM J1 emitted unexpected output (verbatim) ----
   [junit4] Java HotSpot(TM) 64-Bit Server VM warning: Option UseConcMarkSweepGC was deprecated in version 9.0 and will likely be removed in a future release.
   [junit4] <<< JVM J1: EOF ----

[...truncated 3 lines...]
   [junit4] JVM J0: stderr was not empty, see: /home/jenkins/workspace/Lucene-Solr-6.6-Linux/lucene/build/grouping/test/temp/junit4-J0-20170821_161352_69316155607496976758035.syserr
   [junit4] >>> JVM J0 emitted unexpected output (verbatim) ----
   [junit4] Java HotSpot(TM) 64-Bit Server VM warning: Option UseConcMarkSweepGC was deprecated in version 9.0 and will likely be removed in a future release.
   [junit4] <<< JVM J0: EOF ----

[...truncated 241 lines...]
   [junit4] JVM J2: stderr was not empty, see: /home/jenkins/workspace/Lucene-Solr-6.6-Linux/lucene/build/highlighter/test/temp/junit4-J2-20170821_161401_95313288923753475206779.syserr
   [junit4] >>> JVM J2 emitted unexpected output (verbatim) ----
   [junit4] Java HotSpot(TM) 64-Bit Server VM warning: Option UseConcMarkSweepGC was deprecated in version 9.0 and will likely be removed in a future release.
   [junit4] <<< JVM J2: EOF ----

[...truncated 6 lines...]
   [junit4] JVM J0: stderr was not empty, see: /home/jenkins/workspace/Lucene-Solr-6.6-Linux/lucene/build/highlighter/test/temp/junit4-J0-20170821_161401_9538809536247995148831.syserr
   [junit4] >>> JVM J0 emitted unexpected output (verbatim) ----
   [junit4] Java HotSpot(TM) 64-Bit Server VM warning: Option UseConcMarkSweepGC was deprecated in version 9.0 and will likely be removed in a future release.
   [junit4] <<< JVM J0: EOF ----

[...truncated 3 lines...]
   [junit4] JVM J1: stderr was not empty, see: /home/jenkins/workspace/Lucene-Solr-6.6-Linux/lucene/build/highlighter/test/temp/junit4-J1-20170821_161401_95316498271906592853756.syserr
   [junit4] >>> JVM J1 emitted unexpected output (verbatim) ----
   [junit4] Java HotSpot(TM) 64-Bit Server VM warning: Option UseConcMarkSweepGC was deprecated in version 9.0 and will likely be removed in a future release.
   [junit4] <<< JVM J1: EOF ----

[...truncated 152 lines...]
   [junit4] JVM J2: stderr was not empty, see: /home/jenkins/workspace/Lucene-Solr-6.6-Linux/lucene/build/join/test/temp/junit4-J2-20170821_161421_17115953926345309873733.syserr
   [junit4] >>> JVM J2 emitted unexpected output (verbatim) ----
   [junit4] Java HotSpot(TM) 64-Bit Server VM warning: Option UseConcMarkSweepGC was deprecated in version 9.0 and will likely be removed in a future release.
   [junit4] <<< JVM J2: EOF ----

[...truncated 3 lines...]
   [junit4] JVM J0: stderr was not empty, see: /home/jenkins/workspace/Lucene-Solr-6.6-Linux/lucene/build/join/test/temp/junit4-J0-20170821_161421_17115237417942926605893.syserr
   [junit4] >>> JVM J0 emitted unexpected output (verbatim) ----
   [junit4] Java HotSpot(TM) 64-Bit Server VM warning: Option UseConcMarkSweepGC was deprecated in version 9.0 and will likely be removed in a future release.
   [junit4] <<< JVM J0: EOF ----

[...truncated 3 lines...]
   [junit4] JVM J1: stderr was not empty, see: /home/jenkins/workspace/Lucene-Solr-6.6-Linux/lucene/build/join/test/temp/junit4-J1-20170821_161421_1714773192276589855746.syserr
   [junit4] >>> JVM J1 emitted unexpected output (verbatim) ----
   [junit4] Java HotSpot(TM) 64-Bit Server VM warning: Option UseConcMarkSweepGC was deprecated in version 9.0 and will likely be removed in a future release.
   [junit4] <<< JVM J1: EOF ----

[...truncated 143 lines...]
   [junit4] JVM J0: stderr was not empty, see: /home/jenkins/workspace/Lucene-Solr-6.6-Linux/lucene/build/memory/test/temp/junit4-J0-20170821_161435_7907832250444869388465.syserr
   [junit4] >>> JVM J0 emitted unexpected output (verbatim) ----
   [junit4] Java HotSpot(TM) 64-Bit Server VM warning: Option UseConcMarkSweepGC was deprecated in version 9.0 and will likely be removed in a future release.
   [junit4] <<< JVM J0: EOF ----

[...truncated 3 lines...]
   [junit4] JVM J1: stderr was not empty, see: /home/jenkins/workspace/Lucene-Solr-6.6-Linux/lucene/build/memory/test/temp/junit4-J1-20170821_161435_7903631217899746273179.syserr
   [junit4] >>> JVM J1 emitted unexpected output (verbatim) ----
   [junit4] Java HotSpot(TM) 64-Bit Server VM warning: Option UseConcMarkSweepGC was deprecated in version 9.0 and will likely be removed in a future release.
   [junit4] <<< JVM J1: EOF ----

[...truncated 210 lines...]
   [junit4] JVM J0: stderr was not empty, see: /home/jenkins/workspace/Lucene-Solr-6.6-Linux/lucene/build/misc/test/temp/junit4-J0-20170821_161444_25512066565612545824015.syserr
   [junit4] >>> JVM J0 emitted unexpected output (verbatim) ----
   [junit4] Java HotSpot(TM) 64-Bit Server VM warning: Option UseConcMarkSweepGC was deprecated in version 9.0 and will likely be removed in a future release.
   [junit4] <<< JVM J0: EOF ----

[...truncated 5 lines...]
   [junit4] JVM J2: stderr was not empty, see: /home/jenkins/workspace/Lucene-Solr-6.6-Linux/lucene/build/misc/test/temp/junit4-J2-20170821_161444_2552781452673872100370.syserr
   [junit4] >>> JVM J2 emitted unexpected output (verbatim) ----
   [junit4] Java HotSpot(TM) 64-Bit Server VM warning: Option UseConcMarkSweepGC was deprecated in version 9.0 and will likely be removed in a future release.
   [junit4] <<< JVM J2: EOF ----

[...truncated 3 lines...]
   [junit4] JVM J1: stderr was not empty, see: /home/jenkins/workspace/Lucene-Solr-6.6-Linux/lucene/build/misc/test/temp/junit4-J1-20170821_161444_255948634207761769390.syserr
   [junit4] >>> JVM J1 emitted unexpected output (verbatim) ----
   [junit4] Java HotSpot(TM) 64-Bit Server VM warning: Option UseConcMarkSweepGC was deprecated in version 9.0 and will likely be removed in a future release.
   [junit4] <<< JVM J1: EOF ----

[...truncated 309 lines...]
   [junit4] JVM J1: stderr was not empty, see: /home/jenkins/workspace/Lucene-Solr-6.6-Linux/lucene/build/queries/test/temp/junit4-J1-20170821_161505_11615359723270163529174.syserr
   [junit4] >>> JVM J1 emitted unexpected output (verbatim) ----
   [junit4] Java HotSpot(TM) 64-Bit Server VM warning: Option UseConcMarkSweepGC was deprecated in version 9.0 and will likely be removed in a future release.
   [junit4] <<< JVM J1: EOF ----

[...truncated 6 lines...]
   [junit4] JVM J2: stderr was not empty, see: /home/jenkins/workspace/Lucene-Solr-6.6-Linux/lucene/build/queries/test/temp/junit4-J2-20170821_161505_11616890034129688755403.syserr
   [junit4] >>> JVM J2 emitted unexpected output (verbatim) ----
   [junit4] Java HotSpot(TM) 64-Bit Server VM warning: Option UseConcMarkSweepGC was deprecated in version 9.0 and will likely be removed in a future release.
   [junit4] <<< JVM J2: EOF ----

   [junit4] JVM J0: stderr was not empty, see: /home/jenkins/workspace/Lucene-Solr-6.6-Linux/lucene/build/queries/test/temp/junit4-J0-20170821_161505_1167124841981592013271.syserr
   [junit4] >>> JVM J0 emitted unexpected output (verbatim) ----
   [junit4] Java HotSpot(TM) 64-Bit Server VM warning: Option UseConcMarkSweepGC was deprecated in version 9.0 and will likely be removed in a future release.
   [junit4] <<< JVM J0: EOF ----

[...truncated 227 lines...]
   [junit4] JVM J1: stderr was not empty, see: /home/jenkins/workspace/Lucene-Solr-6.6-Linux/lucene/build/queryparser/test/temp/junit4-J1-20170821_161512_6545443676759868246075.syserr
   [junit4] >>> JVM J1 emitted unexpected output (verbatim) ----
   [junit4] Java HotSpot(TM) 64-Bit Server VM warning: Option UseConcMarkSweepGC was deprecated in version 9.0 and will likely be removed in a future release.
   [junit4] <<< JVM J1: EOF ----

[...truncated 6 lines...]
   [junit4] JVM J0: stderr was not empty, see: /home/jenkins/workspace/Lucene-Solr-6.6-Linux/lucene/build/queryparser/test/temp/junit4-J0-20170821_161512_65413525589258294118846.syserr
   [junit4] >>> JVM J0 emitted unexpected output (verbatim) ----
   [junit4] Java HotSpot(TM) 64-Bit Server VM warning: Option UseConcMarkSweepGC was deprecated in version 9.0 and will likely be removed in a future release.
   [junit4] <<< JVM J0: EOF ----

   [junit4] JVM J2: stderr was not empty, see: /home/jenkins/workspace/Lucene-Solr-6.6-Linux/lucene/build/queryparser/test/temp/junit4-J2-20170821_161512_6549973235614231289042.syserr
   [junit4] >>> JVM J2 emitted unexpected output (verbatim) ----
   [junit4] Java HotSpot(TM) 64-Bit Server VM warning: Option UseConcMarkSweepGC was deprecated in version 9.0 and will likely be removed in a future release.
   [junit4] <<< JVM J2: EOF ----

[...truncated 199 lines...]
   [junit4] JVM J1: stderr was not empty, see: /home/jenkins/workspace/Lucene-Solr-6.6-Linux/lucene/build/replicator/test/temp/junit4-J1-20170821_161519_59210512963349772912173.syserr
   [junit4] >>> JVM J1 emitted unexpected output (verbatim) ----
   [junit4] Java HotSpot(TM) 64-Bit Server VM warning: Option UseConcMarkSweepGC was deprecated in version 9.0 and will likely be removed in a future release.
   [junit4] <<< JVM J1: EOF ----

[...truncated 3 lines...]
   [junit4] JVM J0: stderr was not empty, see: /home/jenkins/workspace/Lucene-Solr-6.6-Linux/lucene/build/replicator/test/temp/junit4-J0-20170821_161519_59216199445541343237616.syserr
   [junit4] >>> JVM J0 emitted unexpected output (verbatim) ----
   [junit4] Java HotSpot(TM) 64-Bit Server VM warning: Option UseConcMarkSweepGC was deprecated in version 9.0 and will likely be removed in a future release.
   [junit4] <<< JVM J0: EOF ----

[...truncated 3 lines...]
   [junit4] JVM J2: stderr was not empty, see: /home/jenkins/workspace/Lucene-Solr-6.6-Linux/lucene/build/replicator/test/temp/junit4-J2-20170821_161519_59213252858850543924235.syserr
   [junit4] >>> JVM J2 emitted unexpected output (verbatim) ----
   [junit4] Java HotSpot(TM) 64-Bit Server VM warning: Option UseConcMarkSweepGC was deprecated in version 9.0 and will likely be removed in a future release.
   [junit4] <<< JVM J2: EOF ----

[...truncated 191 lines...]
   [junit4] JVM J2: stderr was not empty, see: /home/jenkins/workspace/Lucene-Solr-6.6-Linux/lucene/build/sandbox/test/temp/junit4-J2-20170821_161531_8343740131438053674542.syserr
   [junit4] >>> JVM J2 emitted unexpected output (verbatim) ----
   [junit4] Java HotSpot(TM) 64-Bit Server VM warning: Option UseConcMarkSweepGC was deprecated in version 9.0 and will likely be removed in a future release.
   [junit4] <<< JVM J2: EOF ----

[...truncated 21 lines...]
   [junit4] JVM J0: stderr was not empty, see: /home/jenkins/workspace/Lucene-Solr-6.6-Linux/lucene/build/sandbox/test/temp/junit4-J0-20170821_161531_83412535290449646343499.syserr
   [junit4] >>> JVM J0 emitted unexpected output (verbatim) ----
   [junit4] Java HotSpot(TM) 64-Bit Server VM warning: Option UseConcMarkSweepGC was deprecated in version 9.0 and will likely be removed in a future release.
   [junit4] <<< JVM J0: EOF ----

[...truncated 7 lines...]
   [junit4] JVM J1: stderr was not empty, see: /home/jenkins/workspace/Lucene-Solr-6.6-Linux/lucene/build/sandbox/test/temp/junit4-J1-20170821_161531_83415772298486826043083.syserr
   [junit4] >>> JVM J1 emitted unexpected output (verbatim) ----
   [junit4] Java HotSpot(TM) 64-Bit Server VM warning: Option UseConcMarkSweepGC was deprecated in version 9.0 and will likely be removed in a future release.
   [junit4] <<< JVM J1: EOF ----

[...truncated 208 lines...]
   [junit4] JVM J1: stderr was not empty, see: /home/jenkins/workspace/Lucene-Solr-6.6-Linux/lucene/build/spatial-extras/test/temp/junit4-J1-20170821_161606_87210632466826669034157.syserr
   [junit4] >>> JVM J1 emitted unexpected output (verbatim) ----
   [junit4] Java HotSpot(TM) 64-Bit Server VM warning: Option UseConcMarkSweepGC was deprecated in version 9.0 and will likely be removed in a future release.
   [junit4] <<< JVM J1: EOF ----

[...truncated 6 lines...]
   [junit4] JVM J2: stderr was not empty, see: /home/jenkins/workspace/Lucene-Solr-6.6-Linux/lucene/build/spatial-extras/test/temp/junit4-J2-20170821_161606_8729169169871056774343.syserr
   [junit4] >>> JVM J2 emitted unexpected output (verbatim) ----
   [junit4] Java HotSpot(TM) 64-Bit Server VM warning: Option UseConcMarkSweepGC was deprecated in version 9.0 and will likely be removed in a future release.
   [junit4] <<< JVM J2: EOF ----

   [junit4] JVM J0: stderr was not empty, see: /home/jenkins/workspace/Lucene-Solr-6.6-Linux/lucene/build/spatial-extras/test/temp/junit4-J0-20170821_161606_87210033488079846085572.syserr
   [junit4] >>> JVM J0 emitted unexpected output (verbatim) ----
   [junit4] Java HotSpot(TM) 64-Bit Server VM warning: Option UseConcMarkSweepGC was deprecated in version 9.0 and will likely be removed in a future release.
   [junit4] <<< JVM J0: EOF ----

[...truncated 151 lines...]
   [junit4] JVM J0: stderr was not empty, see: /home/jenkins/workspace/Lucene-Solr-6.6-Linux/lucene/build/spatial/test/temp/junit4-J0-20170821_161618_692815201150387671982.syserr
   [junit4] >>> JVM J0 emitted unexpected output (verbatim) ----
   [junit4] Java HotSpot(TM) 64-Bit Server VM warning: Option UseConcMarkSweepGC was deprecated in version 9.0 and will likely be removed in a future release.
   [junit4] <<< JVM J0: EOF ----

[...truncated 7 lines...]
   [junit4] JVM J2: stderr was not empty, see: /home/jenkins/workspace/Lucene-Solr-6.6-Linux/lucene/build/spatial/test/temp/junit4-J2-20170821_161618_69214887948970692521049.syserr
   [junit4] >>> JVM J2 emitted unexpected output (verbatim) ----
   [junit4] Java HotSpot(TM) 64-Bit Server VM warning: Option UseConcMarkSweepGC was deprecated in version 9.0 and will likely be removed in a future release.
   [junit4] <<< JVM J2: EOF ----

[...truncated 11 lines...]
   [junit4] JVM J1: stderr was not empty, see: /home/jenkins/workspace/Lucene-Solr-6.6-Linux/lucene/build/spatial/test/temp/junit4-J1-20170821_161618_69212667227425154429872.syserr
   [junit4] >>> JVM J1 emitted unexpected output (verbatim) ----
   [junit4] Java HotSpot(TM) 64-Bit Server VM warning: Option UseConcMarkSweepGC was deprecated in version 9.0 and will likely be removed in a future release.
   [junit4] <<< JVM J1: EOF ----

[...truncated 161 lines...]
   [junit4] JVM J2: stderr was not empty, see: /home/jenkins/workspace/Lucene-Solr-6.6-Linux/lucene/build/spatial3d/test/temp/junit4-J2-20170821_161817_8631423645298298274317.syserr
   [junit4] >>> JVM J2 emitted unexpected output (verbatim) ----
   [junit4] Java HotSpot(TM) 64-Bit Server VM warning: Option UseConcMarkSweepGC was deprecated in version 9.0 and will likely be removed in a future release.
   [junit4] <<< JVM J2: EOF ----

   [junit4] JVM J0: stderr was not empty, see: /home/jenkins/workspace/Lucene-Solr-6.6-Linux/lucene/build/spatial3d/test/temp/junit4-J0-20170821_161817_8634568223322098485435.syserr
   [junit4] >>> JVM J0 emitted unexpected output (verbatim) ----
   [junit4] Java HotSpot(TM) 64-Bit Server VM warning: Option UseConcMarkSweepGC was deprecated in version 9.0 and will likely be removed in a future release.
   [junit4] <<< JVM J0: EOF ----

[...truncated 8 lines...]
   [junit4] JVM J1: stderr was not empty, see: /home/jenkins/workspace/Lucene-Solr-6.6-Linux/lucene/build/spatial3d/test/temp/junit4-J1-20170821_161817_86311535622497996204563.syserr
   [junit4] >>> JVM J1 emitted unexpected output (verbatim) ----
   [junit4] Java HotSpot(TM) 64-Bit Server VM warning: Option UseConcMarkSweepGC was deprecated in version 9.0 and will likely be removed in a future release.
   [junit4] <<< JVM J1: EOF ----

[...truncated 305 lines...]
   [junit4] JVM J1: stderr was not empty, see: /home/jenkins/workspace/Lucene-Solr-6.6-Linux/lucene/build/suggest/test/temp/junit4-J1-20170821_161912_8919260607927965110762.syserr
   [junit4] >>> JVM J1 emitted unexpected output (verbatim) ----
   [junit4] Java HotSpot(TM) 64-Bit Server VM warning: Option UseConcMarkSweepGC was deprecated in version 9.0 and will likely be removed in a future release.
   [junit4] <<< JVM J1: EOF ----

[...truncated 3 lines...]
   [junit4] JVM J0: stderr was not empty, see: /home/jenkins/workspace/Lucene-Solr-6.6-Linux/lucene/build/suggest/test/temp/junit4-J0-20170821_161912_89115188280225492037350.syserr
   [junit4] >>> JVM J0 emitted unexpected output (verbatim) ----
   [junit4] Java HotSpot(TM) 64-Bit Server VM warning: Option UseConcMarkSweepGC was deprecated in version 9.0 and will likely be removed in a future release.
   [junit4] <<< JVM J0: EOF ----

[...truncated 3 lines...]
   [junit4] JVM J2: stderr was not empty, see: /home/jenkins/workspace/Lucene-Solr-6.6-Linux/lucene/build/suggest/test/temp/junit4-J2-20170821_161912_8918117809652047110854.syserr
   [junit4] >>> JVM J2 emitted unexpected output (verbatim) ----
   [junit4] Java HotSpot(TM) 64-Bit Server VM warning: Option UseConcMarkSweepGC was deprecated in version 9.0 and will likely be removed in a future release.
   [junit4] <<< JVM J2: EOF ----

[...truncated 2422 lines...]
   [junit4] Suite: org.apache.solr.cloud.CollectionsAPIDistributedZkTest
   [junit4]   2> Creating dataDir: /home/jenkins/workspace/Lucene-Solr-6.6-Linux/solr/build/solr-core/test/J1/temp/solr.cloud.CollectionsAPIDistributedZkTest_30D29E49C16D8F36-001/init-core-data-001
   [junit4]   2> 1023773 WARN  (SUITE-CollectionsAPIDistributedZkTest-seed#[30D29E49C16D8F36]-worker) [    ] o.a.s.SolrTestCaseJ4 startTrackingSearchers: numOpens=2 numCloses=2
   [junit4]   2> 1023773 INFO  (SUITE-CollectionsAPIDistributedZkTest-seed#[30D29E49C16D8F36]-worker) [    ] o.a.s.SolrTestCaseJ4 Using PointFields
   [junit4]   2> 1023774 INFO  (SUITE-CollectionsAPIDistributedZkTest-seed#[30D29E49C16D8F36]-worker) [    ] o.a.s.SolrTestCaseJ4 Randomized ssl (true) and clientAuth (true) via: @org.apache.solr.util.RandomizeSSL(reason="", ssl=0.0/0.0, value=0.0/0.0, clientAuth=0.0/0.0)
   [junit4]   2> 1023774 INFO  (SUITE-CollectionsAPIDistributedZkTest-seed#[30D29E49C16D8F36]-worker) [    ] o.a.s.c.MiniSolrCloudCluster Starting cluster of 4 servers in /home/jenkins/workspace/Lucene-Solr-6.6-Linux/solr/build/solr-core/test/J1/temp/solr.cloud.CollectionsAPIDistributedZkTest_30D29E49C16D8F36-001/tempDir-001
   [junit4]   2> 1023775 INFO  (SUITE-CollectionsAPIDistributedZkTest-seed#[30D29E49C16D8F36]-worker) [    ] o.a.s.c.ZkTestServer STARTING ZK TEST SERVER
   [junit4]   2> 1023775 INFO  (Thread-2621) [    ] o.a.s.c.ZkTestServer client port:0.0.0.0/0.0.0.0:0
   [junit4]   2> 1023775 INFO  (Thread-2621) [    ] o.a.s.c.ZkTestServer Starting server
   [junit4]   2> 1023780 ERROR (Thread-2621) [    ] o.a.z.s.ZooKeeperServer ZKShutdownHandler is not registered, so ZooKeeper server won't take any action on ERROR or SHUTDOWN server state changes
   [junit4]   2> 1023875 INFO  (SUITE-CollectionsAPIDistributedZkTest-seed#[30D29E49C16D8F36]-worker) [    ] o.a.s.c.ZkTestServer start zk server on port:44537
   [junit4]   2> 1023879 INFO  (jetty-launcher-1363-thread-1) [    ] o.e.j.s.Server jetty-9.3.14.v20161028
   [junit4]   2> 1023879 INFO  (jetty-launcher-1363-thread-3) [    ] o.e.j.s.Server jetty-9.3.14.v20161028
   [junit4]   2> 1023879 INFO  (jetty-launcher-1363-thread-4) [    ] o.e.j.s.Server jetty-9.3.14.v20161028
   [junit4]   2> 1023879 INFO  (jetty-launcher-1363-thread-2) [    ] o.e.j.s.Server jetty-9.3.14.v20161028
   [junit4]   2> 1023883 INFO  (jetty-launcher-1363-thread-4) [    ] o.e.j.s.h.ContextHandler Started o.e.j.s.ServletContextHandler@606bc417{/solr,null,AVAILABLE}
   [junit4]   2> 1023883 INFO  (jetty-launcher-1363-thread-3) [    ] o.e.j.s.h.ContextHandler Started o.e.j.s.ServletContextHandler@bc3ff2d{/solr,null,AVAILABLE}
   [junit4]   2> 1023884 INFO  (jetty-launcher-1363-thread-2) [    ] o.e.j.s.h.ContextHandler Started o.e.j.s.ServletContextHandler@6754f56c{/solr,null,AVAILABLE}
   [junit4]   2> 1023884 INFO  (jetty-launcher-1363-thread-1) [    ] o.e.j.s.h.ContextHandler Started o.e.j.s.ServletContextHandler@7bebc7a{/solr,null,AVAILABLE}
   [junit4]   2> 1023885 INFO  (jetty-launcher-1363-thread-3) [    ] o.e.j.s.AbstractConnector Started ServerConnector@55785179{SSL,[ssl, http/1.1]}{127.0.0.1:34827}
   [junit4]   2> 1023885 INFO  (jetty-launcher-1363-thread-2) [    ] o.e.j.s.AbstractConnector Started ServerConnector@251c2345{SSL,[ssl, http/1.1]}{127.0.0.1:37325}
   [junit4]   2> 1023885 INFO  (jetty-launcher-1363-thread-3) [    ] o.e.j.s.Server Started @1025428ms
   [junit4]   2> 1023885 INFO  (jetty-launcher-1363-thread-2) [    ] o.e.j.s.Server Started @1025428ms
   [junit4]   2> 1023885 INFO  (jetty-launcher-1363-thread-3) [    ] o.a.s.c.s.e.JettySolrRunner Jetty properties: {hostContext=/solr, hostPort=34827}
   [junit4]   2> 1023885 INFO  (jetty-launcher-1363-thread-2) [    ] o.a.s.c.s.e.JettySolrRunner Jetty properties: {hostContext=/solr, hostPort=37325}
   [junit4]   2> 1023885 INFO  (jetty-launcher-1363-thread-4) [    ] o.e.j.s.AbstractConnector Started ServerConnector@113206f8{SSL,[ssl, http/1.1]}{127.0.0.1:36739}
   [junit4]   2> 1023885 INFO  (jetty-launcher-1363-thread-1) [    ] o.e.j.s.AbstractConnector Started ServerConnector@7cb42f5b{SSL,[ssl, http/1.1]}{127.0.0.1:37267}
   [junit4]   2> 1023885 INFO  (jetty-launcher-1363-thread-4) [    ] o.e.j.s.Server Started @1025428ms
   [junit4]   2> 1023885 INFO  (jetty-launcher-1363-thread-1) [    ] o.e.j.s.Server Started @1025428ms
   [junit4]   2> 1023885 INFO  (jetty-launcher-1363-thread-4) [    ] o.a.s.c.s.e.JettySolrRunner Jetty properties: {hostContext=/solr, hostPort=36739}
   [junit4]   2> 1023885 ERROR (jetty-launcher-1363-thread-2) [    ] o.a.s.s.StartupLoggingUtils Missing Java Option solr.log.dir. Logging may be missing or incomplete.
   [junit4]   2> 1023885 ERROR (jetty-launcher-1363-thread-4) [    ] o.a.s.s.StartupLoggingUtils Missing Java Option solr.log.dir. Logging may be missing or incomplete.
   [junit4]   2> 1023885 INFO  (jetty-launcher-1363-thread-2) [    ] o.a.s.s.SolrDispatchFilter  ___      _       Welcome to Apache Solr? version 6.6.1
   [junit4]   2> 1023886 INFO  (jetty-launcher-1363-thread-4) [    ] o.a.s.s.SolrDispatchFilter  ___      _       Welcome to Apache Solr? version 6.6.1
   [junit4]   2> 1023886 INFO  (jetty-launcher-1363-thread-2) [    ] o.a.s.s.SolrDispatchFilter / __| ___| |_ _   Starting in cloud mode on port null
   [junit4]   2> 1023886 INFO  (jetty-launcher-1363-thread-4) [    ] o.a.s.s.SolrDispatchFilter / __| ___| |_ _   Starting in cloud mode on port null
   [junit4]   2> 1023886 INFO  (jetty-launcher-1363-thread-2) [    ] o.a.s.s.SolrDispatchFilter \__ \/ _ \ | '_|  Install dir: null
   [junit4]   2> 1023886 INFO  (jetty-launcher-1363-thread-4) [    ] o.a.s.s.SolrDispatchFilter \__ \/ _ \ | '_|  Install dir: null
   [junit4]   2> 1023886 INFO  (jetty-launcher-1363-thread-2) [    ] o.a.s.s.SolrDispatchFilter |___/\___/_|_|    Start time: 2017-08-21T16:37:10.332107Z
   [junit4]   2> 1023886 INFO  (jetty-launcher-1363-thread-4) [    ] o.a.s.s.SolrDispatchFilter |___/\___/_|_|    Start time: 2017-08-21T16:37:10.332125Z
   [junit4]   2> 1023885 ERROR (jetty-launcher-1363-thread-3) [    ] o.a.s.s.StartupLoggingUtils Missing Java Option solr.log.dir. Logging may be missing or incomplete.
   [junit4]   2> 1023885 INFO  (jetty-launcher-1363-thread-1) [    ] o.a.s.c.s.e.JettySolrRunner Jetty properties: {hostContext=/solr, hostPort=37267}
   [junit4]   2> 1023886 INFO  (jetty-launcher-1363-thread-3) [    ] o.a.s.s.SolrDispatchFilter  ___      _       Welcome to Apache Solr? version 6.6.1
   [junit4]   2> 1023886 INFO  (jetty-launcher-1363-thread-3) [    ] o.a.s.s.SolrDispatchFilter / __| ___| |_ _   Starting in cloud mode on port null
   [junit4]   2> 1023886 INFO  (jetty-launcher-1363-thread-3) [    ] o.a.s.s.SolrDispatchFilter \__ \/ _ \ | '_|  Install dir: null
   [junit4]   2> 1023886 ERROR (jetty-launcher-1363-thread-1) [    ] o.a.s.s.StartupLoggingUtils Missing Java Option solr.log.dir. Logging may be missing or incomplete.
   [junit4]   2> 1023886 INFO  (jetty-launcher-1363-thread-3) [    ] o.a.s.s.SolrDispatchFilter |___/\___/_|_|    Start time: 2017-08-21T16:37:10.332305Z
   [junit4]   2> 1023886 INFO  (jetty-launcher-1363-thread-1) [    ] o.a.s.s.SolrDispatchFilter  ___      _       Welcome to Apache Solr? version 6.6.1
   [junit4]   2> 1023886 INFO  (jetty-launcher-1363-thread-1) [    ] o.a.s.s.SolrDispatchFilter / __| ___| |_ _   Starting in cloud mode on port null
   [junit4]   2> 1023886 INFO  (jetty-launcher-1363-thread-1) [    ] o.a.s.s.SolrDispatchFilter \__ \/ _ \ | '_|  Install dir: null
   [junit4]   2> 1023886 INFO  (jetty-launcher-1363-thread-1) [    ] o.a.s.s.SolrDispatchFilter |___/\___/_|_|    Start time: 2017-08-21T16:37:10.332480Z
   [junit4]   2> 1023894 INFO  (jetty-launcher-1363-thread-2) [    ] o.a.s.s.SolrDispatchFilter solr.xml found in ZooKeeper. Loading...
   [junit4]   2> 1023896 INFO  (jetty-launcher-1363-thread-4) [    ] o.a.s.s.SolrDispatchFilter solr.xml found in ZooKeeper. Loading...
   [junit4]   2> 1023896 INFO  (jetty-launcher-1363-thread-1) [    ] o.a.s.s.SolrDispatchFilter solr.xml found in ZooKeeper. Loading...
   [junit4]   2> 1023902 INFO  (jetty-launcher-1363-thread-3) [    ] o.a.s.s.SolrDispatchFilter solr.xml found in ZooKeeper. Loading...
   [junit4]   2> 1023905 INFO  (jetty-launcher-1363-thread-2) [    ] o.a.s.u.UpdateShardHandler Creating UpdateShardHandler HTTP client with params: socketTimeout=340000&connTimeout=45000&retry=true
   [junit4]   2> 1023905 INFO  (jetty-launcher-1363-thread-1) [    ] o.a.s.u.UpdateShardHandler Creating UpdateShardHandler HTTP client with params: socketTimeout=340000&connTimeout=45000&retry=true
   [junit4]   2> 1023907 INFO  (jetty-launcher-1363-thread-2) [    ] o.a.s.c.ZkContainer Zookeeper client=127.0.0.1:44537/solr
   [junit4]   2> 1023910 INFO  (jetty-launcher-1363-thread-4) [    ] o.a.s.u.UpdateShardHandler Creating UpdateShardHandler HTTP client with params: socketTimeout=340000&connTimeout=45000&retry=true
   [junit4]   2> 1023913 INFO  (jetty-launcher-1363-thread-1) [    ] o.a.s.c.ZkContainer Zookeeper client=127.0.0.1:44537/solr
   [junit4]   2> 1023918 INFO  (jetty-launcher-1363-thread-3) [    ] o.a.s.u.UpdateShardHandler Creating UpdateShardHandler HTTP client with params: socketTimeout=340000&connTimeout=45000&retry=true
   [junit4]   2> 1023922 INFO  (jetty-launcher-1363-thread-4) [    ] o.a.s.c.ZkContainer Zookeeper client=127.0.0.1:44537/solr
   [junit4]   2> 1023926 INFO  (jetty-launcher-1363-thread-3) [    ] o.a.s.c.ZkContainer Zookeeper client=127.0.0.1:44537/solr
   [junit4]   2> 1023947 INFO  (jetty-launcher-1363-thread-2) [    ] o.a.s.c.Overseer Overseer (id=null) closing
   [junit4]   2> 1023947 INFO  (jetty-launcher-1363-thread-1) [    ] o.a.s.c.Overseer Overseer (id=null) closing
   [junit4]   2> 1023951 INFO  (jetty-launcher-1363-thread-2) [    ] o.a.s.c.OverseerElectionContext I am going to be the leader 127.0.0.1:37325_solr
   [junit4]   2> 1023953 INFO  (jetty-launcher-1363-thread-1) [    ] o.a.s.c.ZkController Register node as live in ZooKeeper:/live_nodes/127.0.0.1:37267_solr
   [junit4]   2> 1023953 INFO  (jetty-launcher-1363-thread-2) [    ] o.a.s.c.Overseer Overseer (id=98522459683291145-127.0.0.1:37325_solr-n_0000000000) starting
   [junit4]   2> 1023954 INFO  (zkCallback-1383-thread-1) [    ] o.a.s.c.c.ZkStateReader Updated live nodes from ZooKeeper... (0) -> (1)
   [junit4]   2> 1023954 INFO  (zkCallback-1384-thread-1) [    ] o.a.s.c.c.ZkStateReader Updated live nodes from ZooKeeper... (0) -> (1)
   [junit4]   2> 1023954 INFO  (zkCallback-1380-thread-1) [    ] o.a.s.c.c.ZkStateReader Updated live nodes from ZooKeeper... (0) -> (1)
   [junit4]   2> 1023954 INFO  (jetty-launcher-1363-thread-4) [    ] o.a.s.c.Overseer Overseer (id=null) closing
   [junit4]   2> 1023955 INFO  (jetty-launcher-1363-thread-3) [    ] o.a.s.c.c.ZkStateReader Updated live nodes from ZooKeeper... (0) -> (1)
   [junit4]   2> 1023955 INFO  (jetty-launcher-1363-thread-4) [    ] o.a.s.c.ZkController Register node as live in ZooKeeper:/live_nodes/127.0.0.1:36739_solr
   [junit4]   2> 1023955 INFO  (zkCallback-1380-thread-1) [    ] o.a.s.c.c.ZkStateReader Updated live nodes from ZooKeeper... (1) -> (2)
   [junit4]   2> 1023958 INFO  (zkCallback-1384-thread-1) [    ] o.a.s.c.c.ZkStateReader Updated live nodes from ZooKeeper... (1) -> (2)
   [junit4]   2> 1023958 INFO  (zkCallback-1385-thread-1) [    ] o.a.s.c.c.ZkStateReader Updated live nodes from ZooKeeper... (1) -> (2)
   [junit4]   2> 1023958 INFO  (jetty-launcher-1363-thread-3) [    ] o.a.s.c.Overseer Overseer (id=null) closing
   [junit4]   2> 1023959 INFO  (jetty-launcher-1363-thread-3) [    ] o.a.s.c.ZkController Register node as live in ZooKeeper:/live_nodes/127.0.0.1:34827_solr
   [junit4]   2> 1023960 INFO  (zkCallback-1384-thread-1) [    ] o.a.s.c.c.ZkStateReader Updated live nodes from ZooKeeper... (2) -> (3)
   [junit4]   2> 1023960 INFO  (zkCallback-1385-thread-1) [    ] o.a.s.c.c.ZkStateReader Updated live nodes from ZooKeeper... (2) -> (3)
   [junit4]   2> 1023960 INFO  (zkCallback-1380-thread-1) [    ] o.a.s.c.c.ZkStateReader Updated live nodes from ZooKeeper... (2) -> (3)
   [junit4]   2> 1023962 INFO  (zkCallback-1383-thread-1) [    ] o.a.s.c.c.ZkStateReader Updated live nodes from ZooKeeper... (1) -> (3)
   [junit4]   2> 1023971 INFO  (jetty-launcher-1363-thread-2) [    ] o.a.s.c.ZkController Register node as live in ZooKeeper:/live_nodes/127.0.0.1:37325_solr
   [junit4]   2> 1023971 INFO  (zkCallback-1384-thread-1) [    ] o.a.s.c.c.ZkStateReader Updated live nodes from ZooKeeper... (3) -> (4)
   [junit4]   2> 1023971 INFO  (zkCallback-1383-thread-1) [    ] o.a.s.c.c.ZkStateReader Updated live nodes from ZooKeeper... (3) -> (4)
   [junit4]   2> 1023971 INFO  (zkCallback-1385-thread-1) [    ] o.a.s.c.c.ZkStateReader Updated live nodes from ZooKeeper... (3) -> (4)
   [junit4]   2> 1023972 INFO  (zkCallback-1380-thread-1) [    ] o.a.s.c.c.ZkStateReader Updated live nodes from ZooKeeper... (3) -> (4)
   [junit4]   2> 1023980 INFO  (jetty-launcher-1363-thread-3) [    ] o.a.s.c.CorePropertiesLocator Found 0 core definitions underneath /home/jenkins/workspace/Lucene-Solr-6.6-Linux/solr/build/solr-core/test/J1/temp/solr.cloud.CollectionsAPIDistributedZkTest_30D29E49C16D8F36-001/tempDir-001/node3/.
   [junit4]   2> 1023989 INFO  (jetty-launcher-1363-thread-1) [    ] o.a.s.c.CorePropertiesLocator Found 0 core definitions underneath /home/jenkins/workspace/Lucene-Solr-6.6-Linux/solr/build/solr-core/test/J1/temp/solr.cloud.CollectionsAPIDistributedZkTest_30D29E49C16D8F36-001/tempDir-001/node1/.
   [junit4]   2> 1023992 INFO  (jetty-launcher-1363-thread-4) [    ] o.a.s.c.CorePropertiesLocator Found 0 core definitions underneath /home/jenkins/workspace/Lucene-Solr-6.6-Linux/solr/build/solr-core/test/J1/temp/solr.cloud.CollectionsAPIDistributedZkTest_30D29E49C16D8F36-001/tempDir-001/node4/.
   [junit4]   2> 1024009 INFO  (jetty-launcher-1363-thread-2) [    ] o.a.s.c.CorePropertiesLocator Found 0 core definitions underneath /home/jenkins/workspace/Lucene-Solr-6.6-Linux/solr/build/solr-core/test/J1/temp/solr.cloud.CollectionsAPIDistributedZkTest_30D29E49C16D8F36-001/tempDir-001/node2/.
   [junit4]   2> 1024016 INFO  (SUITE-CollectionsAPIDistributedZkTest-seed#[30D29E49C16D8F36]-worker) [    ] o.a.s.c.c.ZkStateReader Updated live nodes from ZooKeeper... (0) -> (4)
   [junit4]   2> 1024016 INFO  (SUITE-CollectionsAPIDistributedZkTest-seed#[30D29E49C16D8F36]-worker) [    ] o.a.s.c.s.i.ZkClientClusterStateProvider Cluster at 127.0.0.1:44537/solr ready
   [junit4]   2> 1024034 INFO  (TEST-CollectionsAPIDistributedZkTest.testNoCollectionSpecified-seed#[30D29E49C16D8F36]) [    ] o.a.s.SolrTestCaseJ4 ###Starting testNoCollectionSpecified
   [junit4]   2> 1024035 INFO  (TEST-CollectionsAPIDistributedZkTest.testNoCollectionSpecified-seed#[30D29E49C16D8F36]) [    ] o.a.s.c.c.ZkStateReader Updated live nodes from ZooKeeper... (0) -> (4)
   [junit4]   2> 1024088 INFO  (qtp482222126-9073) [    ] o.a.s.h.a.CoreAdminOperation core create command dataDir=/home/jenkins/workspace/Lucene-Solr-6.6-Linux/solr/build/solr-core/test/J1/temp/solr.cloud.CollectionsAPIDistributedZkTest_30D29E49C16D8F36-001/tempDir-002&collection.configName=conf&name=corewithnocollection&action=CREATE&numShards=1&collection=&wt=javabin&version=2
   [junit4]   2> 1024088 INFO  (qtp482222126-9073) [    ] o.a.s.c.TransientSolrCoreCacheDefault Allocating transient cache for 2147483647 transient cores
   [junit4]   2> 1024089 INFO  (OverseerStateUpdate-98522459683291145-127.0.0.1:37325_solr-n_0000000000) [    ] o.a.s.c.o.ReplicaMutator Assigning new node to shard shard=shard1
   [junit4]   2> 1025094 INFO  (qtp482222126-9073) [    ] o.a.s.c.SolrConfig Using Lucene MatchVersion: 6.6.1
   [junit4]   2> 1025100 INFO  (qtp482222126-9073) [    ] o.a.s.s.IndexSchema [corewithnocollection] Schema name=minimal
   [junit4]   2> 1025101 INFO  (qtp482222126-9073) [    ] o.a.s.s.IndexSchema Loaded schema minimal/1.1 with uniqueid field id
   [junit4]   2> 1025101 INFO  (qtp482222126-9073) [    ] o.a.s.c.CoreContainer Creating SolrCore 'corewithnocollection' using configuration from collection corewithnocollection, trusted=true
   [junit4]   2> 1025101 INFO  (qtp482222126-9073) [    ] o.a.s.c.SolrCore solr.RecoveryStrategy.Builder
   [junit4]   2> 1025102 INFO  (qtp482222126-9073) [    ] o.a.s.c.SolrCore [[corewithnocollection] ] Opening new SolrCore at [/home/jenkins/workspace/Lucene-Solr-6.6-Linux/solr/build/solr-core/test/J1/temp/solr.cloud.CollectionsAPIDistributedZkTest_30D29E49C16D8F36-001/tempDir-001/node1/corewithnocollection], dataDir=[/home/jenkins/workspace/Lucene-Solr-6.6-Linux/solr/build/solr-core/test/J1/temp/solr.cloud.CollectionsAPIDistributedZkTest_30D29E49C16D8F36-001/tempDir-002/]
   [junit4]   2> 1025132 INFO  (qtp482222126-9073) [    ] o.a.s.u.UpdateHandler Using UpdateLog implementation: org.apache.solr.update.UpdateLog
   [junit4]   2> 1025132 INFO  (qtp482222126-9073) [    ] o.a.s.u.UpdateLog Initializing UpdateLog: dataDir=null defaultSyncLevel=FLUSH numRecordsToKeep=100 maxNumLogsToKeep=10 numVersionBuckets=65536
   [junit4]   2> 1025133 INFO  (qtp482222126-9073) [    ] o.a.s.u.CommitTracker Hard AutoCommit: disabled
   [junit4]   2> 1025133 INFO  (qtp482222126-9073) [    ] o.a.s.u.CommitTracker Soft AutoCommit: disabled
   [junit4]   2> 1025133 INFO  (qtp482222126-9073) [    ] o.a.s.s.SolrIndexSearcher Opening [Searcher@3f1e2dfa[corewithnocollection] main]
   [junit4]   2> 1025134 INFO  (qtp482222126-9073) [    ] o.a.s.r.ManagedResourceStorage Configured ZooKeeperStorageIO with znodeBase: /configs/conf
   [junit4]   2> 1025134 INFO  (qtp482222126-9073) [    ] o.a.s.r.ManagedResourceStorage Loaded null at path _rest_managed.json using ZooKeeperStorageIO:path=/configs/conf
   [junit4]   2> 1025134 INFO  (qtp482222126-9073) [    ] o.a.s.h.ReplicationHandler Commits will be reserved for  10000
   [junit4]   2> 1025134 INFO  (searcherExecutor-3500-thread-1) [    ] o.a.s.c.SolrCore [corewithnocollection] Registered new searcher Searcher@3f1e2dfa[corewithnocollection] main{ExitableDirectoryReader(UninvertingDirectoryReader())}
   [junit4]   2> 1025134 INFO  (qtp482222126-9073) [    ] o.a.s.u.UpdateLog Could not find max version in index or recent updates, using new clock 1576359356352430080
   [junit4]   2> 1025137 INFO  (qtp482222126-9073) [    ] o.a.s.c.ShardLeaderElectionContext Enough replicas found to continue.
   [junit4]   2> 1025137 INFO  (qtp482222126-9073) [    ] o.a.s.c.ShardLeaderElectionContext I may be the new leader - try and sync
   [junit4]   2> 1025137 INFO  (qtp482222126-9073) [    ] o.a.s.c.SyncStrategy Sync replicas to https://127.0.0.1:37267/solr/corewithnocollection/
   [junit4]   2> 1025137 INFO  (qtp482222126-9073) [    ] o.a.s.c.SyncStrategy Sync Success - now sync replicas to me
   [junit4]   2> 1025137 INFO  (qtp482222126-9073) [    ] o.a.s.c.SyncStrategy https://127.0.0.1:37267/solr/corewithnocollection/ has no replicas
   [junit4]   2> 1025137 INFO  (qtp482222126-9073) [    ] o.a.s.c.ShardLeaderElectionContext Found all replicas participating in election, clear LIR
   [junit4]   2> 1025138 INFO  (qtp482222126-9073) [    ] o.a.s.c.ShardLeaderElectionContext I am the new leader: https://127.0.0.1:37267/solr/corewithnocollection/ shard1
   [junit4]   2> 1025289 INFO  (qtp482222126-9073) [    ] o.a.s.c.ZkController I am the leader, no recovery necessary
   [junit4]   2> 1025290 INFO  (qtp482222126-9073) [    ] o.a.s.s.HttpSolrCall [admin] webapp=null path=/admin/cores params={dataDir=/home/jenkins/workspace/Lucene-Solr-6.6-Linux/solr/build/solr-core/test/J1/temp/solr.cloud.CollectionsAPIDistributedZkTest_30D29E49C16D8F36-001/tempDir-002&collection.configName=conf&name=corewithnocollection&action=CREATE&numShards=1&collection=&wt=javabin&version=2} status=0 QTime=1202
   [junit4]   2> 1025292 INFO  (qtp482222126-9094) [    ] o.a.s.h.a.CoreAdminOperation core create command dataDir=/home/jenkins/workspace/Lucene-Solr-6.6-Linux/solr/build/solr-core/test/J1/temp/solr.cloud.CollectionsAPIDistributedZkTest_30D29E49C16D8F36-001/tempDir-002&collection.configName=conf&name=corewithnocollection2&action=CREATE&numShards=1&wt=javabin&version=2
   [junit4]   2> 1025293 INFO  (OverseerStateUpdate-98522459683291145-127.0.0.1:37325_solr-n_0000000000) [    ] o.a.s.c.o.ReplicaMutator Assigning new node to shard shard=shard1
   [junit4]   2> 1026297 INFO  (qtp482222126-9094) [    ] o.a.s.c.SolrConfig Using Lucene MatchVersion: 6.6.1
   [junit4]   2> 1026301 INFO  (qtp482222126-9094) [    ] o.a.s.s.IndexSchema [corewithnocollection2] Schema name=minimal
   [junit4]   2> 1026302 INFO  (qtp482222126-9094) [    ] o.a.s.s.IndexSchema Loaded schema minimal/1.1 with uniqueid field id
   [junit4]   2> 1026302 INFO  (qtp482222126-9094) [    ] o.a.s.c.CoreContainer Creating SolrCore 'corewithnocollection2' using configuration from collection corewithnocollection2, trusted=true
   [junit4]   2> 1026302 INFO  (qtp482222126-9094) [    ] o.a.s.c.SolrCore solr.RecoveryStrategy.Builder
   [junit4]   2> 1026302 INFO  (qtp482222126-9094) [    ] o.a.s.c.SolrCore [[corewithnocollection2] ] Opening new SolrCore at [/home/jenkins/workspace/Lucene-Solr-6.6-Linux/solr/build/solr-core/test/J1/temp/solr.cloud.CollectionsAPIDistributedZkTest_30D29E49C16D8F36-001/tempDir-001/node1/corewithnocollection2], dataDir=[/home/jenkins/workspace/Lucene-Solr-6.6-Linux/solr/build/solr-core/test/J1/temp/solr.cloud.CollectionsAPIDistributedZkTest_30D29E49C16D8F36-001/tempDir-002/]
   [junit4]   2> 1026339 INFO  (qtp482222126-9094) [    ] o.a.s.u.UpdateHandler Using UpdateLog implementation: org.apache.solr.update.UpdateLog
   [junit4]   2> 1026339 INFO  (qtp482222126-9094) [    ] o.a.s.u.UpdateLog Initializing UpdateLog: dataDir=null defaultSyncLevel=FLUSH numRecordsToKeep=100 maxNumLogsToKeep=10 numVersionBuckets=65536
   [junit4]   2> 1026339 INFO  (qtp482222126-9094) [    ] o.a.s.u.CommitTracker Hard AutoCommit: disabled
   [junit4]   2> 1026339 INFO  (qtp482222126-9094) [    ] o.a.s.u.CommitTracker Soft AutoCommit: disabled
   [junit4]   2> 1026340 INFO  (qtp482222126-9094) [    ] o.a.s.s.SolrIndexSearcher Opening [Searcher@1e0fd4a3[corewithnocollection2] main]
   [junit4]   2> 1026340 INFO  (qtp482222126-9094) [    ] o.a.s.r.ManagedResourceStorage Configured ZooKeeperStorageIO with znodeBase: /configs/conf
   [junit4]   2> 1026340 INFO  (qtp482222126-9094) [    ] o.a.s.r.ManagedResourceStorage Loaded null at path _rest_managed.json using ZooKeeperStorageIO:path=/configs/conf
   [junit4]   2> 1026340 INFO  (qtp482222126-9094) [    ] o.a.s.h.ReplicationHandler Commits will be reserved for  10000
   [junit4]   2> 1026341 INFO  (searcherExecutor-3505-thread-1) [    ] o.a.s.c.SolrCore [corewithnocollection2] Registered new searcher Searcher@1e0fd4a3[corewithnocollection2] main{ExitableDirectoryReader(UninvertingDirectoryReader())}
   [junit4]   2> 1026341 INFO  (qtp482222126-9094) [    ] o.a.s.u.UpdateLog Could not find max version in index or recent updates, using new clock 1576359357618061312
   [junit4]   2> 1026344 INFO  (qtp482222126-9094) [    ] o.a.s.c.ShardLeaderElectionContext Enough replicas found to continue.
   [junit4]   2> 1026344 INFO  (qtp482222126-9094) [    ] o.a.s.c.ShardLeaderElectionContext I may be the new leader - try and sync
   [junit4]   2> 1026344 INFO  (qtp482222126-9094) [    ] o.a.s.c.SyncStrategy Sync replicas to https://127.0.0.1:37267/solr/corewithnocollection2/
   [junit4]   2> 1026344 INFO  (qtp482222126-9094) [    ] o.a.s.c.SyncStrategy Sync Success - now sync replicas to me
   [junit4]   2> 1026344 INFO  (qtp482222126-9094) [    ] o.a.s.c.SyncStrategy https://127.0.0.1:37267/solr/corewithnocollection2/ has no replicas
   [junit4]   2> 1026344 INFO  (qtp482222126-9094) [    ] o.a.s.c.ShardLeaderElectionContext Found all replicas participating in election, clear LIR
   [junit4]   2> 1026346 INFO  (qtp482222126-9094) [    ] o.a.s.c.ShardLeaderElectionContext I am the new leader: https://127.0.0.1:37267/solr/corewithnocollection2/ shard1
   [junit4]   2> 1026496 INFO  (qtp482222126-9094) [    ] o.a.s.c.ZkController I am the leader, no recovery necessary
   [junit4]   2> 1026497 INFO  (qtp482222126-9094) [    ] o.a.s.s.HttpSolrCall [admin] webapp=null path=/admin/cores params={dataDir=/home/jenkins/workspace/Lucene-Solr-6.6-Linux/solr/build/solr-core/test/J1/temp/solr.cloud.CollectionsAPIDistributedZkTest_30D29E49C16D8F36-001/tempDir-002&collection.configName=conf&name=corewithnocollection2&action=CREATE&numShards=1&wt=javabin&version=2} status=0 QTime=1205
   [junit4]   2> 1026498 INFO  (TEST-CollectionsAPIDistributedZkTest.testNoCollectionSpecified-seed#[30D29E49C16D8F36]) [    ] o.a.s.SolrTestCaseJ4 ###Ending testNoCollectionSpecified
   [junit4]   2> 1026517 INFO  (TEST-CollectionsAPIDistributedZkTest.deletePartiallyCreatedCollection-seed#[30D29E49C16D8F36]) [    ] o.a.s.SolrTestCaseJ4 ###Starting deletePartiallyCreatedCollection
   [junit4]   2> 1026517 INFO  (TEST-CollectionsAPIDistributedZkTest.deletePartiallyCreatedCollection-seed#[30D29E49C16D8F36]) [    ] o.a.s.c.c.ZkStateReader Updated live nodes from ZooKeeper... (0) -> (4)
   [junit4]   2> 1026519 INFO  (qtp482222126-9100) [    ] o.a.s.h.a.CollectionsHandler Invoked Collection Action :delete with params name=corewithnocollection&action=DELETE&wt=javabin&version=2 and sendToOCPQueue=true
   [junit4]   2> 1026520 INFO  (OverseerThreadFactory-3491-thread-1) [    ] o.a.s.c.OverseerCollectionMessageHandler Executing Collection Cmd : action=UNLOAD&deleteInstanceDir=true&deleteDataDir=true
   [junit4]   2> 1026527 INFO  (qtp482222126-9073) [    ] o.a.s.m.SolrMetricManager Closing metric reporters for: solr.core.corewithnocollection
   [junit4]   2> 1026528 INFO  (qtp482222126-9073) [    ] o.a.s.c.SolrCore [corewithnocollection]  CLOSING SolrCore org.apache.solr.core.SolrCore@56dacd5b
   [junit4]   2> 1026528 INFO  (qtp482222126-9073) [    ] o.a.s.m.SolrMetricManager Closing metric reporters for: solr.core.corewithnocollection
   [junit4]   2> 1026529 INFO  (qtp482222126-9073) [    ] o.a.s.s.HttpSolrCall [admin] webapp=null path=/admin/cores params={deleteInstanceDir=true&core=corewithnocollection&qt=/admin/cores&deleteDataDir=true&action=UNLOAD&wt=javabin&version=2} status=0 QTime=1
   [junit4]   2> 1027232 INFO  (qtp482222126-9100) [    ] o.a.s.s.HttpSolrCall [admin] webapp=null path=/admin/collections params={name=corewithnocollection&action=DELETE&wt=javabin&version=2} status=0 QTime=712
   [junit4]   2> 1027233 INFO  (qtp482222126-9105) [    ] o.a.s.h.a.CollectionsHandler Invoked Collection Action :delete with params name=corewithnocollection2&action=DELETE&wt=javabin&version=2 and sendToOCPQueue=true
   [junit4]   2> 1027234 INFO  (OverseerCollectionConfigSetProcessor-98522459683291145-127.0.0.1:37325_solr-n_0000000000) [    ] o.a.s.c.OverseerTaskQueue Response ZK path: /overseer/collection-queue-work/qnr-0000000000 doesn't exist.  Requestor may have disconnected from ZooKeeper
   [junit4]   2> 1027234 INFO  (OverseerThreadFactory-3491-thread-2) [    ] o.a.s.c.OverseerCollectionMessageHandler Executing Collection Cmd : action=UNLOAD&deleteInstanceDir=true&deleteDataDir=true
   [junit4]   2> 1027236 INFO  (qtp482222126-9094) [    ] o.a.s.m.SolrMetricManager Closing metric reporters for: solr.core.corewithnocollection2
   [junit4]   2> 1027236 INFO  (qtp482222126-9094) [    ] o.a.s.c.SolrCore [corewithnocollection2]  CLOSING SolrCore org.apache.solr.core.SolrCore@702acc8a
   [junit4]   2> 1027236 INFO  (qtp482222126-9094) [    ] o.a.s.m.SolrMetricManager Closing metric reporters for: solr.core.corewithnocollection2
   [junit4]   2> 1027237 INFO  (qtp482222126-9094) [    ] o.a.s.s.HttpSolrCall [admin] webapp=null path=/admin/cores params={deleteInstanceDir=true&core=corewithnocollection2&qt=/admin/cores&deleteDataDir=true&action=UNLOAD&wt=javabin&version=2} status=0 QTime=1
   [junit4]   2> 1027939 INFO  (qtp482222126-9105) [    ] o.a.s.s.HttpSolrCall [admin] webapp=null path=/admin/collections params={name=corewithnocollection2&action=DELETE&wt=javabin&version=2} status=0 QTime=705
   [junit4]   2> 1027941 INFO  (qtp482222126-9079) [    ] o.a.s.h.a.CoreAdminOperation core create command dataDir=/home/jenkins/workspace/Lucene-Solr-6.6-Linux/solr/build/solr-core/test/J1/temp/solr.cloud.CollectionsAPIDistributedZkTest_30D29E49C16D8F36-001/tempDir-003&collection.configName=conf&name=halfdeletedcollection_shard1_replica1&action=CREATE&numShards=2&collection=halfdeletedcollection&wt=javabin&version=2
   [junit4]   2> 1027942 INFO  (OverseerStateUpdate-98522459683291145-127.0.0.1:37325_solr-n_0000000000) [    ] o.a.s.c.o.ReplicaMutator Assigning new node to shard shard=shard2
   [junit4]   2> 1028946 INFO  (qtp482222126-9079) [    ] o.a.s.c.SolrConfig Using Lucene MatchVersion: 6.6.1
   [junit4]   2> 1028950 INFO  (qtp482222126-9079) [    ] o.a.s.s.IndexSchema [halfdeletedcollection_shard1_replica1] Schema name=minimal
   [junit4]   2> 1028951 INFO  (qtp482222126-9079) [    ] o.a.s.s.IndexSchema Loaded schema minimal/1.1 with uniqueid field id
   [junit4]   2> 1028951 INFO  (qtp482222126-9079) [    ] o.a.s.c.CoreContainer Creating SolrCore 'halfdeletedcollection_shard1_replica1' using configuration from collection halfdeletedcollection, trusted=true
   [junit4]   2> 1028952 INFO  (qtp482222126-9079) [    ] o.a.s.c.SolrCore solr.RecoveryStrategy.Builder
   [junit4]   2> 1028952 INFO  (qtp482222126-9079) [    ] o.a.s.c.SolrCore [[halfdeletedcollection_shard1_replica1] ] Opening new SolrCore at [/home/jenkins/workspace/Lucene-Solr-6.6-Linux/solr/build/solr-core/test/J1/temp/solr.cloud.CollectionsAPIDistributedZkTest_30D29E49C16D8F36-001/tempDir-001/node1/halfdeletedcollection_shard1_replica1], dataDir=[/home/jenkins/workspace/Lucene-Solr-6.6-Linux/solr/build/solr-core/test/J1/temp/solr.cloud.CollectionsAPIDistributedZkTest_30D29E49C16D8F36-001/tempDir-003/]
   [junit4]   2> 1028984 INFO  (qtp482222126-9079) [    ] o.a.s.u.UpdateHandler Using UpdateLog implementation: org.apache.solr.update.UpdateLog
   [junit4]   2> 1028984 INFO  (qtp482222126-9079) [    ] o.a.s.u.UpdateLog Initializing UpdateLog: dataDir=null defaultSyncLevel=FLUSH numRecordsToKeep=100 maxNumLogsToKeep=10 numVersionBuckets=65536
   [junit4]   2> 1028985 INFO  (qtp482222126-9079) [    ] o.a.s.u.CommitTracker Hard AutoCommit: disabled
   [junit4]   2> 1028985 INFO  (qtp482222126-9079) [    ] o.a.s.u.CommitTracker Soft AutoCommit: disabled
   [junit4]   2> 1028985 INFO  (qtp482222126-9079) [    ] o.a.s.s.SolrIndexSearcher Opening [Searcher@743a1794[halfdeletedcollection_shard1_replica1] main]
   [junit4]   2> 1028986 INFO  (qtp482222126-9079) [    ] o.a.s.r.ManagedResourceStorage Configured ZooKeeperStorageIO with znodeBase: /configs/conf
   [junit4]   2> 1028986 INFO  (qtp482222126-9079) [    ] o.a.s.r.ManagedResourceStorage Loaded null at path _rest_managed.json using ZooKeeperStorageIO:path=/configs/conf
   [junit4]   2> 1028986 INFO  (qtp482222126-9079) [    ] o.a.s.h.ReplicationHandler Commits will be reserved for  10000
   [junit4]   2> 1028986 INFO  (searcherExecutor-3510-thread-1) [    ] o.a.s.c.SolrCore [halfdeletedcollection_shard1_replica1] Registered new searcher Searcher@743a1794[halfdeletedcollection_shard1_replica1] main{ExitableDirectoryReader(UninvertingDirectoryReader())}
   [junit4]   2> 1028986 INFO  (qtp482222126-9079) [    ] o.a.s.u.UpdateLog Could not find max version in index or recent updates, using new clock 1576359360391544832
   [junit4]   2> 1028989 INFO  (qtp482222126-9079) [    ] o.a.s.c.ShardLeaderElectionContext Enough replicas found to continue.
   [junit4]   2> 1028989 INFO  (qtp482222126-9079) [    ] o.a.s.c.ShardLeaderElectionContext I may be the new leader - try and sync
   [junit4]   2> 1028989 INFO  (qtp482222126-9079) [    ] o.a.s.c.SyncStrategy Sync replicas to https://127.0.0.1:37267/solr/halfdeletedcollection_shard1_replica1/
   [junit4]   2> 1028989 INFO  (qtp482222126-9079) [    ] o.a.s.c.SyncStrategy Sync Success - now sync replicas to me
   [junit4]   2> 1028989 INFO  (qtp482222126-9079) [    ] o.a.s.c.SyncStrategy https://127.0.0.1:37267/solr/halfdeletedcollection_shard1_replica1/ has no replicas
   [junit4]   2> 1028989 INFO  (qtp482222126-9079) [    ] o.a.s.c.ShardLeaderElectionContext Found all replicas participating in election, clear LIR
   [junit4]   2> 1028990 INFO  (qtp482222126-9079) [    ] o.a.s.c.ShardLeaderElectionContext I am the new leader: https://127.0.0.1:37267/solr/halfdeletedcollection_shard1_replica1/ shard2
   [junit4]   2> 1029141 INFO  (qtp482222126-9079) [    ] o.a.s.c.ZkController I am the leader, no recovery necessary
   [junit4]   2> 1029141 INFO  (qtp482222126-9079) [    ] o.a.s.s.HttpSolrCall [admin] webapp=null path=/admin/cores params={dataDir=/home/jenkins/workspace/Lucene-Solr-6.6-Linux/solr/build/solr-core/test/J1/temp/solr.cloud.CollectionsAPIDistributedZkTest_30D29E49C16D8F36-001/tempDir-003&collection.configName=conf&name=halfdeletedcollection_shard1_replica1&action=CREATE&numShards=2&collection=halfdeletedcollection&wt=javabin&version=2} status=0 QTime=1200
   [junit4]   2> 1029144 INFO  (qtp482222126-9079) [    ] o.a.s.h.a.CollectionsHandler Invoked Collection Action :delete with params name=halfdeletedcollection&action=DELETE&wt=javabin&version=2 and sendToOCPQueue=true
   [junit4]   2> 1029146 INFO  (OverseerCollectionConfigSetProcessor-98522459683291145-127.0.0.1:37325_solr-n_0000000000) [    ] o.a.s.c.OverseerTaskQueue Response ZK path: /overseer/collection-queue-work/qnr-0000000002 doesn't exist.  Requestor may have disconnected from ZooKeeper
   [junit4]   2> 1029146 INFO  (OverseerThreadFactory-3491-thread-3) [    ] o.a.s.c.OverseerCollectionMessageHandler Executing Collection Cmd : action=UNLOAD&deleteInstanceDir=true&deleteDataDir=true
   [junit4]   2> 1029148 INFO  (qtp482222126-9073) [    ] o.a.s.m.SolrMetricManager Closing metric reporters for: solr.core.halfdeletedcollection.shard1.replica1
   [junit4]   2> 1029148 INFO  (qtp482222126-9073) [    ] o.a.s.c.SolrCore [halfdeletedcollection_shard1_replica1]  CLOSING SolrCore org.apache.solr.core.SolrCore@7842bc04
   [junit4]   2> 1029149 INFO  (qtp482222126-9073) [    ] o.a.s.m.SolrMetricManager Closing metric reporters for: solr.core.halfdeletedcollection.shard1.replica1
   [junit4]   2> 1029150 INFO  (qtp482222126-9073) [    ] o.a.s.s.HttpSolrCall [admin] webapp=null path=/admin/cores params={deleteInstanceDir=true&core=halfdeletedcollection_shard1_replica1&qt=/admin/cores&deleteDataDir=true&action=UNLOAD&wt=javabin&version=2} status=0 QTime=2
   [junit4]   2> 1029853 INFO  (qtp482222126-9079) [    ] o.a.s.s.HttpSolrCall [admin] webapp=null path=/admin/collections params={name=halfdeletedcollection&action=DELETE&wt=javabin&version=2} status=0 QTime=708
   [junit4]   2> 1029854 INFO  (qtp482222126-9100) [    ] o.a.s.h.a.CollectionsHandler Invoked Collection Action :list with params action=LIST&wt=javabin&version=2 and sendToOCPQueue=true
   [junit4]   2> 1029854 INFO  (qtp482222126-9100) [    ] o.a.s.s.HttpSolrCall [admin] webapp=null path=/admin/collections params={action=LIST&wt=javabin&version=2} status=0 QTime=0
   [junit4]   2> 1029856 INFO  (qtp482222126-9105) [    ] o.a.s.h.a.CollectionsHandler Invoked Collection Action :create with params replicationFactor=1&collection.configName=conf&name=halfdeletedcollection&action=CREATE&numShards=2&wt=javabin&version=2 and sendToOCPQueue=true
   [junit4]   2> 1029857 INFO  (OverseerThreadFactory-3491-thread-4) [    ] o.a.s.c.CreateCollectionCmd Create collection halfdeletedcollection
   [junit4]   2> 1029857 INFO  (OverseerCollectionConfigSetProcessor-98522459683291145-127.0.0.1:37325_solr-n_0000000000) [    ] o.a.s.c.OverseerTaskQueue Response ZK path: /overseer/collection-queue-work/qnr-0000000004 doesn't exist.  Requestor may have disconnected from ZooKeeper
   [junit4]   2> 1030060 INFO  (qtp482222126-9094) [    ] o.a.s.u.TestInjection Inject random core creation delay of 2s
   [junit4]   2> 1030108 INFO  (qtp2122892029-9077) [    ] o.a.s.h.a.CoreAdminOperation core create command qt=/admin/cores&collection.configName=conf&newCollection=true&name=halfdeletedcollection_shard1_replica1&action=CREATE&numShards=2&collection=halfdeletedcollection&shard=shard1&wt=javabin&version=2
   [junit4]   2> 1030108 INFO  (qtp2122892029-9077) [    ] o.a.s.c.TransientSolrCoreCacheDefault Allocating transient cache for 2147483647 transient cores
   [junit4]   2> 1030210 INFO  (zkCallback-1380-thread-2) [    ] o.a.s.c.c.ZkStateReader A cluster state change: [WatchedEvent state:SyncConnected type:NodeDataChanged path:/collections/halfdeletedcollection/state.json] for collection [halfdeletedcollection] has occurred - updating... (live nodes size: [4])
   [junit4]   2> 1031114 INFO  (qtp2122892029-9077) [    ] o.a.s.c.SolrConfig Using Lucene MatchVersion: 6.6.1
   [junit4]   2> 1031118 INFO  (qtp2122892029-9077) [    ] o.a.s.s.IndexSchema [halfdeletedcollection_shard1_replica1] Schema name=minimal
   [junit4]   2> 1031119 INFO  (qtp2122892029-9077) [    ] o.a.s.s.IndexSchema Loaded schema minimal/1.1 with uniqueid field id
   [junit4]   2> 1031119 INFO  (qtp2122892029-9077) [    ] o.a.s.c.CoreContainer Creating SolrCore 'halfdeletedcollection_shard1_replica1' using configuration from collection halfdeletedcollection, trusted=true
   [junit4]   2> 1031119 INFO  (qtp2122892029-9077) [    ] o.a.s.c.SolrCore solr.RecoveryStrategy.Builder
   [junit4]   2> 1031119 INFO  (qtp2122892029-9077) [    ] o.a.s.c.SolrCore [[halfdeletedcollection_shard1_replica1] ] Opening new SolrCore at [/home/jenkins/workspace/Lucene-Solr-6.6-Linux/solr/build/solr-core/test/J1/temp/solr.cloud.CollectionsAPIDistributedZkTest_30D29E49C16D8F36-001/tempDir-001/node2/halfdeletedcollection_shard1_replica1], dataDir=[/home/jenkins/workspace/Lucene-Solr-6.6-Linux/solr/build/solr-core/test/J1/temp/solr.cloud.CollectionsAPIDistributedZkTest_30D29E49C16D8F36-001/tempDir-001/node2/./halfdeletedcollection_shard1_replica1/data/]
   [junit4]   2> 1031144 INFO  (qtp2122892029-9077) [    ] o.a.s.u.UpdateHandler Using UpdateLog implementation: org.apache.solr.update.UpdateLog
   [junit4]   2> 1031144 INFO  (qtp2122892029-9077) [    ] o.a.s.u.UpdateLog Initializing UpdateLog: dataDir=null defaultSyncLevel=FLUSH numRecordsToKeep=100 maxNumLogsToKeep=10 numVersionBuckets=65536
   [junit4]   2> 1031145 INFO  (qtp2122892029-9077) [    ] o.a.s.u.CommitTracker Hard AutoCommit: disabled
   [junit4]   2> 1031145 INFO  (qtp2122892029-9077) [    ] o.a.s.u.CommitTracker Soft AutoCommit: disabled
   [junit4]   2> 1031145 INFO  (qtp2122892029-9077) [    ] o.a.s.s.SolrIndexSearcher Opening [Searcher@5d3e4493[halfdeletedcollection_shard1_replica1] main]
   [junit4]   2> 1031146 INFO  (qtp2122892029-9077) [    ] o.a.s.r.ManagedResourceStorage Configured ZooKeeperStorageIO with znodeBase: /configs/conf
   [junit4]   2> 1031146 INFO  (qtp2122892029-9077) [    ] o.a.s.r.ManagedResourceStorage Loaded null at path _rest_managed.json using ZooKeeperStorageIO:path=/configs/conf
   [junit4]   2> 1031146 INFO  (qtp2122892029-9077) [    ] o.a.s.h.ReplicationHandler Commits will be reserved for  10000
   [junit4]   2> 1031146 INFO  (searcherExecutor-3515-thread-1) [    ] o.a.s.c.SolrCore [halfdeletedcollection_shard1_replica1] Registered new searcher Searcher@5d3e4493[halfdeletedcollection_shard1_replica1] main{ExitableDirectoryReader(UninvertingDirectoryReader())}
   [junit4]   2> 1031146 INFO  (qtp2122892029-9077) [    ] o.a.s.u.UpdateLog Could not find max version in index or recent updates, using new clock 1576359362656468992
   [junit4]   2> 1031149 INFO  (qtp2122892029-9077) [    ] o.a.s.c.ShardLeaderElectionContext Enough replicas found to continue.
   [junit4]   2> 1031149 INFO  (qtp2122892029-9077) [    ] o.a.s.c.ShardLeaderElectionContext I may be the new leader - try and sync
   [junit4]   2> 1031149 INFO  (qtp2122892029-9077) [    ] o.a.s.c.SyncStrategy Sync replicas to https://127.0.0.1:37325/solr/halfdeletedcollection_shard1_replica1/
   [junit4]   2> 1031149 INFO  (qtp2122892029-9077) [    ] o.a.s.c.SyncStrategy Sync Success - now sync replicas to me
   [junit4]   2> 1031149 INFO  (qtp2122892029-9077) [    ] o.a.s.c.SyncStrategy https://127.0.0.1:37325/solr/halfdeletedcollection_shard1_replica1/ has no replicas
   [junit4]   2> 1031149 INFO  (qtp2122892029-9077) [    ] o.a.s.c.ShardLeaderElectionContext Found all replicas participating in election, clear LIR
   [junit4]   2> 1031150 INFO  (qtp2122892029-9077) [    ] o.a.s.c.ShardLeaderElectionContext I am the new leader: https://127.0.0.1:37325/solr/halfdeletedcollection_shard1_replica1/ shard1
   [junit4]   2> 1031251 INFO  (zkCallback-1380-thread-2) [    ] o.a.s.c.c.ZkStateReader A cluster state change: [WatchedEvent state:SyncConnected type:NodeDataChanged path:/collections/halfdeletedcollection/state.json] for collection [halfdeletedcollection] has occurred - updating... (live nodes size: [4])
   [junit4]   2> 1031300 INFO  (qtp2122892029-9077) [    ] o.a.s.c.ZkController I am the leader, no recovery necessary
   [junit4]   2> 1031301 INFO  (qtp2122892029-9077) [    ] o.a.s.s.HttpSolrCall [admin] webapp=null path=/admin/cores params={qt=/admin/cores&collection.configName=conf&newCollection=true&name=halfdeletedcollection_shard1_replica1&action=CREATE&numShards=2&collection=halfdeletedcollection&shard=shard1&wt=javabin&version=2} status=0 QTime=1193
   [junit4]   2> 1031402 INFO  (zkCallback-1380-thread-2) [    ] o.a.s.c.c.ZkStateReader A cluster state change: [WatchedEvent state:SyncConnected type:NodeDataChanged path:/collections/halfdeletedcollection/state.json] for collection [halfdeletedcollection] has occurred - updating... (live nodes size: [4])
   [junit4]   2> 1032060 INFO  (qtp482222126-9094) [    ] o.a.s.h.a.CoreAdminOperation core create command qt=/admin/cores&collection.configName=conf&newCollection=true&name=halfdeletedcollection_shard2_replica1&action=CREATE&numShards=2&collection=halfdeletedcollection&shard=shard2&wt=javabin&version=2
   [junit4]   2> 1032163 INFO  (zkCallback-1380-thread-2) [    ] o.a.s.c.c.ZkStateReader A cluster state change: [WatchedEvent state:SyncConnected type:NodeDataChanged path:/collections/halfdeletedcollection/state.json] for collection [halfdeletedcollection] has occurred - upda

[...truncated too long message...]

   [junit4] JVM J1: stderr was not empty, see: /home/jenkins/workspace/Lucene-Solr-6.6-Linux/solr/build/contrib/solr-analytics/test/temp/junit4-J1-20170821_170027_092605387959808116667.syserr
   [junit4] >>> JVM J1 emitted unexpected output (verbatim) ----
   [junit4] Java HotSpot(TM) 64-Bit Server VM warning: Option UseConcMarkSweepGC was deprecated in version 9.0 and will likely be removed in a future release.
   [junit4] <<< JVM J1: EOF ----

   [junit4] JVM J2: stderr was not empty, see: /home/jenkins/workspace/Lucene-Solr-6.6-Linux/solr/build/contrib/solr-analytics/test/temp/junit4-J2-20170821_170027_09215167400985061363067.syserr
   [junit4] >>> JVM J2 emitted unexpected output (verbatim) ----
   [junit4] Java HotSpot(TM) 64-Bit Server VM warning: Option UseConcMarkSweepGC was deprecated in version 9.0 and will likely be removed in a future release.
   [junit4] <<< JVM J2: EOF ----

[...truncated 499 lines...]
   [junit4] JVM J2: stderr was not empty, see: /home/jenkins/workspace/Lucene-Solr-6.6-Linux/solr/build/contrib/solr-clustering/test/temp/junit4-J2-20170821_170044_7982632588889097331850.syserr
   [junit4] >>> JVM J2 emitted unexpected output (verbatim) ----
   [junit4] Java HotSpot(TM) 64-Bit Server VM warning: Option UseConcMarkSweepGC was deprecated in version 9.0 and will likely be removed in a future release.
   [junit4] <<< JVM J2: EOF ----

[...truncated 3 lines...]
   [junit4] JVM J1: stderr was not empty, see: /home/jenkins/workspace/Lucene-Solr-6.6-Linux/solr/build/contrib/solr-clustering/test/temp/junit4-J1-20170821_170044_79811986279397255635688.syserr
   [junit4] >>> JVM J1 emitted unexpected output (verbatim) ----
   [junit4] Java HotSpot(TM) 64-Bit Server VM warning: Option UseConcMarkSweepGC was deprecated in version 9.0 and will likely be removed in a future release.
   [junit4] <<< JVM J1: EOF ----

[...truncated 3 lines...]
   [junit4] JVM J0: stderr was not empty, see: /home/jenkins/workspace/Lucene-Solr-6.6-Linux/solr/build/contrib/solr-clustering/test/temp/junit4-J0-20170821_170044_7983426300328507760822.syserr
   [junit4] >>> JVM J0 emitted unexpected output (verbatim) ----
   [junit4] Java HotSpot(TM) 64-Bit Server VM warning: Option UseConcMarkSweepGC was deprecated in version 9.0 and will likely be removed in a future release.
   [junit4] <<< JVM J0: EOF ----

[...truncated 1136 lines...]
   [junit4] JVM J1: stderr was not empty, see: /home/jenkins/workspace/Lucene-Solr-6.6-Linux/solr/build/contrib/solr-dataimporthandler-extras/test/temp/junit4-J1-20170821_170106_22514673722150408380434.syserr
   [junit4] >>> JVM J1 emitted unexpected output (verbatim) ----
   [junit4] Java HotSpot(TM) 64-Bit Server VM warning: Option UseConcMarkSweepGC was deprecated in version 9.0 and will likely be removed in a future release.
   [junit4] <<< JVM J1: EOF ----

[...truncated 3 lines...]
   [junit4] JVM J0: stderr was not empty, see: /home/jenkins/workspace/Lucene-Solr-6.6-Linux/solr/build/contrib/solr-dataimporthandler-extras/test/temp/junit4-J0-20170821_170106_2255726502895051204811.syserr
   [junit4] >>> JVM J0 emitted unexpected output (verbatim) ----
   [junit4] Java HotSpot(TM) 64-Bit Server VM warning: Option UseConcMarkSweepGC was deprecated in version 9.0 and will likely be removed in a future release.
   [junit4] <<< JVM J0: EOF ----

[...truncated 593 lines...]
   [junit4] JVM J0: stderr was not empty, see: /home/jenkins/workspace/Lucene-Solr-6.6-Linux/solr/build/contrib/solr-dataimporthandler/test/temp/junit4-J0-20170821_170113_65110521272823505085379.syserr
   [junit4] >>> JVM J0 emitted unexpected output (verbatim) ----
   [junit4] Java HotSpot(TM) 64-Bit Server VM warning: Option UseConcMarkSweepGC was deprecated in version 9.0 and will likely be removed in a future release.
   [junit4] <<< JVM J0: EOF ----

   [junit4] JVM J2: stderr was not empty, see: /home/jenkins/workspace/Lucene-Solr-6.6-Linux/solr/build/contrib/solr-dataimporthandler/test/temp/junit4-J2-20170821_170113_65111196336056317422923.syserr
   [junit4] >>> JVM J2 emitted unexpected output (verbatim) ----
   [junit4] Java HotSpot(TM) 64-Bit Server VM warning: Option UseConcMarkSweepGC was deprecated in version 9.0 and will likely be removed in a future release.
   [junit4] <<< JVM J2: EOF ----

[...truncated 3 lines...]
   [junit4] JVM J1: stderr was not empty, see: /home/jenkins/workspace/Lucene-Solr-6.6-Linux/solr/build/contrib/solr-dataimporthandler/test/temp/junit4-J1-20170821_170113_6518511746480278371837.syserr
   [junit4] >>> JVM J1 emitted unexpected output (verbatim) ----
   [junit4] Java HotSpot(TM) 64-Bit Server VM warning: Option UseConcMarkSweepGC was deprecated in version 9.0 and will likely be removed in a future release.
   [junit4] <<< JVM J1: EOF ----

[...truncated 503 lines...]
   [junit4] JVM J1: stderr was not empty, see: /home/jenkins/workspace/Lucene-Solr-6.6-Linux/solr/build/contrib/solr-cell/test/temp/junit4-J1-20170821_170139_89915822781153948987629.syserr
   [junit4] >>> JVM J1 emitted unexpected output (verbatim) ----
   [junit4] Java HotSpot(TM) 64-Bit Server VM warning: Option UseConcMarkSweepGC was deprecated in version 9.0 and will likely be removed in a future release.
   [junit4] <<< JVM J1: EOF ----

[...truncated 3 lines...]
   [junit4] JVM J2: stderr was not empty, see: /home/jenkins/workspace/Lucene-Solr-6.6-Linux/solr/build/contrib/solr-cell/test/temp/junit4-J2-20170821_170139_899482935696556455308.syserr
   [junit4] >>> JVM J2 emitted unexpected output (verbatim) ----
   [junit4] Java HotSpot(TM) 64-Bit Server VM warning: Option UseConcMarkSweepGC was deprecated in version 9.0 and will likely be removed in a future release.
   [junit4] <<< JVM J2: EOF ----

[...truncated 3 lines...]
   [junit4] JVM J0: stderr was not empty, see: /home/jenkins/workspace/Lucene-Solr-6.6-Linux/solr/build/contrib/solr-cell/test/temp/junit4-J0-20170821_170139_89215811771836994344537.syserr
   [junit4] >>> JVM J0 emitted unexpected output (verbatim) ----
   [junit4] Java HotSpot(TM) 64-Bit Server VM warning: Option UseConcMarkSweepGC was deprecated in version 9.0 and will likely be removed in a future release.
   [junit4] <<< JVM J0: EOF ----

[...truncated 504 lines...]
   [junit4] JVM J1: stderr was not empty, see: /home/jenkins/workspace/Lucene-Solr-6.6-Linux/solr/build/contrib/solr-langid/test/temp/junit4-J1-20170821_170151_57318327891946963678057.syserr
   [junit4] >>> JVM J1 emitted unexpected output (verbatim) ----
   [junit4] Java HotSpot(TM) 64-Bit Server VM warning: Option UseConcMarkSweepGC was deprecated in version 9.0 and will likely be removed in a future release.
   [junit4] <<< JVM J1: EOF ----

[...truncated 3 lines...]
   [junit4] JVM J0: stderr was not empty, see: /home/jenkins/workspace/Lucene-Solr-6.6-Linux/solr/build/contrib/solr-langid/test/temp/junit4-J0-20170821_170151_57112056992483619292525.syserr
   [junit4] >>> JVM J0 emitted unexpected output (verbatim) ----
   [junit4] Java HotSpot(TM) 64-Bit Server VM warning: Option UseConcMarkSweepGC was deprecated in version 9.0 and will likely be removed in a future release.
   [junit4] <<< JVM J0: EOF ----

[...truncated 590 lines...]
   [junit4] JVM J1: stderr was not empty, see: /home/jenkins/workspace/Lucene-Solr-6.6-Linux/solr/build/contrib/solr-ltr/test/temp/junit4-J1-20170821_170158_7205393021500123884966.syserr
   [junit4] >>> JVM J1 emitted unexpected output (verbatim) ----
   [junit4] Java HotSpot(TM) 64-Bit Server VM warning: Option UseConcMarkSweepGC was deprecated in version 9.0 and will likely be removed in a future release.
   [junit4] <<< JVM J1: EOF ----

[...truncated 3 lines...]
   [junit4] JVM J0: stderr was not empty, see: /home/jenkins/workspace/Lucene-Solr-6.6-Linux/solr/build/contrib/solr-ltr/test/temp/junit4-J0-20170821_170158_72016724217954532786576.syserr
   [junit4] >>> JVM J0 emitted unexpected output (verbatim) ----
   [junit4] Java HotSpot(TM) 64-Bit Server VM warning: Option UseConcMarkSweepGC was deprecated in version 9.0 and will likely be removed in a future release.
   [junit4] <<< JVM J0: EOF ----

[...truncated 3 lines...]
   [junit4] JVM J2: stderr was not empty, see: /home/jenkins/workspace/Lucene-Solr-6.6-Linux/solr/build/contrib/solr-ltr/test/temp/junit4-J2-20170821_170158_7203176512032751181824.syserr
   [junit4] >>> JVM J2 emitted unexpected output (verbatim) ----
   [junit4] Java HotSpot(TM) 64-Bit Server VM warning: Option UseConcMarkSweepGC was deprecated in version 9.0 and will likely be removed in a future release.
   [junit4] <<< JVM J2: EOF ----

[...truncated 540 lines...]
   [junit4] JVM J1: stderr was not empty, see: /home/jenkins/workspace/Lucene-Solr-6.6-Linux/solr/build/contrib/solr-uima/test/temp/junit4-J1-20170821_170228_5981585916733938556059.syserr
   [junit4] >>> JVM J1 emitted unexpected output (verbatim) ----
   [junit4] Java HotSpot(TM) 64-Bit Server VM warning: Option UseConcMarkSweepGC was deprecated in version 9.0 and will likely be removed in a future release.
   [junit4] <<< JVM J1: EOF ----

[...truncated 3 lines...]
   [junit4] JVM J0: stderr was not empty, see: /home/jenkins/workspace/Lucene-Solr-6.6-Linux/solr/build/contrib/solr-uima/test/temp/junit4-J0-20170821_170228_4784702192714540474673.syserr
   [junit4] >>> JVM J0 emitted unexpected output (verbatim) ----
   [junit4] Java HotSpot(TM) 64-Bit Server VM warning: Option UseConcMarkSweepGC was deprecated in version 9.0 and will likely be removed in a future release.
   [junit4] <<< JVM J0: EOF ----

[...truncated 494 lines...]
   [junit4] JVM J0: stderr was not empty, see: /home/jenkins/workspace/Lucene-Solr-6.6-Linux/solr/build/contrib/solr-velocity/test/temp/junit4-J0-20170821_170238_2814194333667244061735.syserr
   [junit4] >>> JVM J0 emitted unexpected output (verbatim) ----
   [junit4] Java HotSpot(TM) 64-Bit Server VM warning: Option UseConcMarkSweepGC was deprecated in version 9.0 and will likely be removed in a future release.
   [junit4] <<< JVM J0: EOF ----

[...truncated 28890 lines...]

Mime
View raw message