lucene-dev mailing list archives

Site index · List index
Message view « Date » · « Thread »
Top « Date » · « Thread »
From Policeman Jenkins Server <jenk...@thetaphi.de>
Subject [JENKINS-EA] Lucene-Solr-7.x-Windows (32bit/jdk-9-ea+178) - Build # 97 - Still Unstable!
Date Tue, 01 Aug 2017 17:06:49 GMT
Build: https://jenkins.thetaphi.de/job/Lucene-Solr-7.x-Windows/97/
Java: 32bit/jdk-9-ea+178 -server -XX:+UseConcMarkSweepGC --illegal-access=deny

3 tests failed.
FAILED:  junit.framework.TestSuite.org.apache.solr.util.TestSolrCLIRunExample

Error Message:
ObjectTracker found 1 object(s) that were not released!!! [TransactionLog] org.apache.solr.common.util.ObjectReleaseTracker$ObjectTrackerException: org.apache.solr.update.TransactionLog  at org.apache.solr.common.util.ObjectReleaseTracker.track(ObjectReleaseTracker.java:42)  at org.apache.solr.update.TransactionLog.<init>(TransactionLog.java:190)  at org.apache.solr.update.UpdateLog.newTransactionLog(UpdateLog.java:446)  at org.apache.solr.update.UpdateLog.ensureLog(UpdateLog.java:1258)  at org.apache.solr.update.UpdateLog.add(UpdateLog.java:532)  at org.apache.solr.update.UpdateLog.add(UpdateLog.java:517)  at org.apache.solr.update.DirectUpdateHandler2.doNormalUpdate(DirectUpdateHandler2.java:347)  at org.apache.solr.update.DirectUpdateHandler2.addDoc0(DirectUpdateHandler2.java:266)  at org.apache.solr.update.DirectUpdateHandler2.addDoc(DirectUpdateHandler2.java:216)  at org.apache.solr.update.processor.RunUpdateProcessor.processAdd(RunUpdateProcessorFactory.java:67)  at org.apache.solr.update.processor.UpdateRequestProcessor.processAdd(UpdateRequestProcessor.java:55)  at org.apache.solr.update.processor.DistributedUpdateProcessor.doLocalAdd(DistributedUpdateProcessor.java:991)  at org.apache.solr.update.processor.DistributedUpdateProcessor.versionAdd(DistributedUpdateProcessor.java:1207)  at org.apache.solr.update.processor.DistributedUpdateProcessor.processAdd(DistributedUpdateProcessor.java:753)  at org.apache.solr.update.processor.LogUpdateProcessorFactory$LogUpdateProcessor.processAdd(LogUpdateProcessorFactory.java:103)  at org.apache.solr.update.processor.UpdateRequestProcessor.processAdd(UpdateRequestProcessor.java:55)  at org.apache.solr.update.processor.AddSchemaFieldsUpdateProcessorFactory$AddSchemaFieldsUpdateProcessor.processAdd(AddSchemaFieldsUpdateProcessorFactory.java:474)  at org.apache.solr.update.processor.UpdateRequestProcessor.processAdd(UpdateRequestProcessor.java:55)  at org.apache.solr.update.processor.FieldMutatingUpdateProcessor.processAdd(FieldMutatingUpdateProcessor.java:118)  at org.apache.solr.update.processor.UpdateRequestProcessor.processAdd(UpdateRequestProcessor.java:55)  at org.apache.solr.update.processor.FieldMutatingUpdateProcessor.processAdd(FieldMutatingUpdateProcessor.java:118)  at org.apache.solr.update.processor.UpdateRequestProcessor.processAdd(UpdateRequestProcessor.java:55)  at org.apache.solr.update.processor.FieldMutatingUpdateProcessor.processAdd(FieldMutatingUpdateProcessor.java:118)  at org.apache.solr.update.processor.UpdateRequestProcessor.processAdd(UpdateRequestProcessor.java:55)  at org.apache.solr.update.processor.FieldMutatingUpdateProcessor.processAdd(FieldMutatingUpdateProcessor.java:118)  at org.apache.solr.update.processor.UpdateRequestProcessor.processAdd(UpdateRequestProcessor.java:55)  at org.apache.solr.update.processor.FieldNameMutatingUpdateProcessorFactory$1.processAdd(FieldNameMutatingUpdateProcessorFactory.java:74)  at org.apache.solr.update.processor.UpdateRequestProcessor.processAdd(UpdateRequestProcessor.java:55)  at org.apache.solr.update.processor.FieldMutatingUpdateProcessor.processAdd(FieldMutatingUpdateProcessor.java:118)  at org.apache.solr.update.processor.UpdateRequestProcessor.processAdd(UpdateRequestProcessor.java:55)  at org.apache.solr.update.processor.AbstractDefaultValueUpdateProcessorFactory$DefaultValueUpdateProcessor.processAdd(AbstractDefaultValueUpdateProcessorFactory.java:91)  at org.apache.solr.handler.loader.JavabinLoader$1.update(JavabinLoader.java:98)  at org.apache.solr.client.solrj.request.JavaBinUpdateRequestCodec$1.readOuterMostDocIterator(JavaBinUpdateRequestCodec.java:188)  at org.apache.solr.client.solrj.request.JavaBinUpdateRequestCodec$1.readIterator(JavaBinUpdateRequestCodec.java:144)  at org.apache.solr.common.util.JavaBinCodec.readObject(JavaBinCodec.java:311)  at org.apache.solr.common.util.JavaBinCodec.readVal(JavaBinCodec.java:256)  at org.apache.solr.client.solrj.request.JavaBinUpdateRequestCodec$1.readNamedList(JavaBinUpdateRequestCodec.java:130)  at org.apache.solr.common.util.JavaBinCodec.readObject(JavaBinCodec.java:276)  at org.apache.solr.common.util.JavaBinCodec.readVal(JavaBinCodec.java:256)  at org.apache.solr.common.util.JavaBinCodec.unmarshal(JavaBinCodec.java:178)  at org.apache.solr.client.solrj.request.JavaBinUpdateRequestCodec.unmarshal(JavaBinUpdateRequestCodec.java:195)  at org.apache.solr.handler.loader.JavabinLoader.parseAndLoadDocs(JavabinLoader.java:108)  at org.apache.solr.handler.loader.JavabinLoader.load(JavabinLoader.java:55)  at org.apache.solr.handler.UpdateRequestHandler$1.load(UpdateRequestHandler.java:97)  at org.apache.solr.handler.ContentStreamHandlerBase.handleRequestBody(ContentStreamHandlerBase.java:68)  at org.apache.solr.handler.RequestHandlerBase.handleRequest(RequestHandlerBase.java:177)  at org.apache.solr.core.SolrCore.execute(SolrCore.java:2473)  at org.apache.solr.servlet.HttpSolrCall.execute(HttpSolrCall.java:720)  at org.apache.solr.servlet.HttpSolrCall.call(HttpSolrCall.java:526)  at org.apache.solr.servlet.SolrDispatchFilter.doFilter(SolrDispatchFilter.java:378)  at org.apache.solr.servlet.SolrDispatchFilter.doFilter(SolrDispatchFilter.java:322)  at org.eclipse.jetty.servlet.ServletHandler$CachedChain.doFilter(ServletHandler.java:1699)  at org.apache.solr.client.solrj.embedded.JettySolrRunner$DebugFilter.doFilter(JettySolrRunner.java:139)  at org.eclipse.jetty.servlet.ServletHandler$CachedChain.doFilter(ServletHandler.java:1699)  at org.eclipse.jetty.servlet.ServletHandler.doHandle(ServletHandler.java:582)  at org.eclipse.jetty.server.session.SessionHandler.doHandle(SessionHandler.java:224)  at org.eclipse.jetty.server.handler.ContextHandler.doHandle(ContextHandler.java:1180)  at org.eclipse.jetty.servlet.ServletHandler.doScope(ServletHandler.java:512)  at org.eclipse.jetty.server.session.SessionHandler.doScope(SessionHandler.java:185)  at org.eclipse.jetty.server.handler.ContextHandler.doScope(ContextHandler.java:1112)  at org.eclipse.jetty.server.handler.ScopedHandler.handle(ScopedHandler.java:141)  at org.eclipse.jetty.server.handler.gzip.GzipHandler.handle(GzipHandler.java:395)  at org.eclipse.jetty.server.handler.HandlerWrapper.handle(HandlerWrapper.java:134)  at org.eclipse.jetty.server.Server.handle(Server.java:534)  at org.eclipse.jetty.server.HttpChannel.handle(HttpChannel.java:320)  at org.eclipse.jetty.server.HttpConnection.onFillable(HttpConnection.java:251)  at org.eclipse.jetty.io.AbstractConnection$ReadCallback.succeeded(AbstractConnection.java:273)  at org.eclipse.jetty.io.FillInterest.fillable(FillInterest.java:95)  at org.eclipse.jetty.io.SelectChannelEndPoint$2.run(SelectChannelEndPoint.java:93)  at org.eclipse.jetty.util.thread.strategy.ExecuteProduceConsume.executeProduceConsume(ExecuteProduceConsume.java:303)  at org.eclipse.jetty.util.thread.strategy.ExecuteProduceConsume.produceConsume(ExecuteProduceConsume.java:148)  at org.eclipse.jetty.util.thread.strategy.ExecuteProduceConsume.run(ExecuteProduceConsume.java:136)  at org.eclipse.jetty.util.thread.QueuedThreadPool.runJob(QueuedThreadPool.java:671)  at org.eclipse.jetty.util.thread.QueuedThreadPool$2.run(QueuedThreadPool.java:589)  at java.base/java.lang.Thread.run(Thread.java:844)  

Stack Trace:
java.lang.AssertionError: ObjectTracker found 1 object(s) that were not released!!! [TransactionLog]
org.apache.solr.common.util.ObjectReleaseTracker$ObjectTrackerException: org.apache.solr.update.TransactionLog
	at org.apache.solr.common.util.ObjectReleaseTracker.track(ObjectReleaseTracker.java:42)
	at org.apache.solr.update.TransactionLog.<init>(TransactionLog.java:190)
	at org.apache.solr.update.UpdateLog.newTransactionLog(UpdateLog.java:446)
	at org.apache.solr.update.UpdateLog.ensureLog(UpdateLog.java:1258)
	at org.apache.solr.update.UpdateLog.add(UpdateLog.java:532)
	at org.apache.solr.update.UpdateLog.add(UpdateLog.java:517)
	at org.apache.solr.update.DirectUpdateHandler2.doNormalUpdate(DirectUpdateHandler2.java:347)
	at org.apache.solr.update.DirectUpdateHandler2.addDoc0(DirectUpdateHandler2.java:266)
	at org.apache.solr.update.DirectUpdateHandler2.addDoc(DirectUpdateHandler2.java:216)
	at org.apache.solr.update.processor.RunUpdateProcessor.processAdd(RunUpdateProcessorFactory.java:67)
	at org.apache.solr.update.processor.UpdateRequestProcessor.processAdd(UpdateRequestProcessor.java:55)
	at org.apache.solr.update.processor.DistributedUpdateProcessor.doLocalAdd(DistributedUpdateProcessor.java:991)
	at org.apache.solr.update.processor.DistributedUpdateProcessor.versionAdd(DistributedUpdateProcessor.java:1207)
	at org.apache.solr.update.processor.DistributedUpdateProcessor.processAdd(DistributedUpdateProcessor.java:753)
	at org.apache.solr.update.processor.LogUpdateProcessorFactory$LogUpdateProcessor.processAdd(LogUpdateProcessorFactory.java:103)
	at org.apache.solr.update.processor.UpdateRequestProcessor.processAdd(UpdateRequestProcessor.java:55)
	at org.apache.solr.update.processor.AddSchemaFieldsUpdateProcessorFactory$AddSchemaFieldsUpdateProcessor.processAdd(AddSchemaFieldsUpdateProcessorFactory.java:474)
	at org.apache.solr.update.processor.UpdateRequestProcessor.processAdd(UpdateRequestProcessor.java:55)
	at org.apache.solr.update.processor.FieldMutatingUpdateProcessor.processAdd(FieldMutatingUpdateProcessor.java:118)
	at org.apache.solr.update.processor.UpdateRequestProcessor.processAdd(UpdateRequestProcessor.java:55)
	at org.apache.solr.update.processor.FieldMutatingUpdateProcessor.processAdd(FieldMutatingUpdateProcessor.java:118)
	at org.apache.solr.update.processor.UpdateRequestProcessor.processAdd(UpdateRequestProcessor.java:55)
	at org.apache.solr.update.processor.FieldMutatingUpdateProcessor.processAdd(FieldMutatingUpdateProcessor.java:118)
	at org.apache.solr.update.processor.UpdateRequestProcessor.processAdd(UpdateRequestProcessor.java:55)
	at org.apache.solr.update.processor.FieldMutatingUpdateProcessor.processAdd(FieldMutatingUpdateProcessor.java:118)
	at org.apache.solr.update.processor.UpdateRequestProcessor.processAdd(UpdateRequestProcessor.java:55)
	at org.apache.solr.update.processor.FieldNameMutatingUpdateProcessorFactory$1.processAdd(FieldNameMutatingUpdateProcessorFactory.java:74)
	at org.apache.solr.update.processor.UpdateRequestProcessor.processAdd(UpdateRequestProcessor.java:55)
	at org.apache.solr.update.processor.FieldMutatingUpdateProcessor.processAdd(FieldMutatingUpdateProcessor.java:118)
	at org.apache.solr.update.processor.UpdateRequestProcessor.processAdd(UpdateRequestProcessor.java:55)
	at org.apache.solr.update.processor.AbstractDefaultValueUpdateProcessorFactory$DefaultValueUpdateProcessor.processAdd(AbstractDefaultValueUpdateProcessorFactory.java:91)
	at org.apache.solr.handler.loader.JavabinLoader$1.update(JavabinLoader.java:98)
	at org.apache.solr.client.solrj.request.JavaBinUpdateRequestCodec$1.readOuterMostDocIterator(JavaBinUpdateRequestCodec.java:188)
	at org.apache.solr.client.solrj.request.JavaBinUpdateRequestCodec$1.readIterator(JavaBinUpdateRequestCodec.java:144)
	at org.apache.solr.common.util.JavaBinCodec.readObject(JavaBinCodec.java:311)
	at org.apache.solr.common.util.JavaBinCodec.readVal(JavaBinCodec.java:256)
	at org.apache.solr.client.solrj.request.JavaBinUpdateRequestCodec$1.readNamedList(JavaBinUpdateRequestCodec.java:130)
	at org.apache.solr.common.util.JavaBinCodec.readObject(JavaBinCodec.java:276)
	at org.apache.solr.common.util.JavaBinCodec.readVal(JavaBinCodec.java:256)
	at org.apache.solr.common.util.JavaBinCodec.unmarshal(JavaBinCodec.java:178)
	at org.apache.solr.client.solrj.request.JavaBinUpdateRequestCodec.unmarshal(JavaBinUpdateRequestCodec.java:195)
	at org.apache.solr.handler.loader.JavabinLoader.parseAndLoadDocs(JavabinLoader.java:108)
	at org.apache.solr.handler.loader.JavabinLoader.load(JavabinLoader.java:55)
	at org.apache.solr.handler.UpdateRequestHandler$1.load(UpdateRequestHandler.java:97)
	at org.apache.solr.handler.ContentStreamHandlerBase.handleRequestBody(ContentStreamHandlerBase.java:68)
	at org.apache.solr.handler.RequestHandlerBase.handleRequest(RequestHandlerBase.java:177)
	at org.apache.solr.core.SolrCore.execute(SolrCore.java:2473)
	at org.apache.solr.servlet.HttpSolrCall.execute(HttpSolrCall.java:720)
	at org.apache.solr.servlet.HttpSolrCall.call(HttpSolrCall.java:526)
	at org.apache.solr.servlet.SolrDispatchFilter.doFilter(SolrDispatchFilter.java:378)
	at org.apache.solr.servlet.SolrDispatchFilter.doFilter(SolrDispatchFilter.java:322)
	at org.eclipse.jetty.servlet.ServletHandler$CachedChain.doFilter(ServletHandler.java:1699)
	at org.apache.solr.client.solrj.embedded.JettySolrRunner$DebugFilter.doFilter(JettySolrRunner.java:139)
	at org.eclipse.jetty.servlet.ServletHandler$CachedChain.doFilter(ServletHandler.java:1699)
	at org.eclipse.jetty.servlet.ServletHandler.doHandle(ServletHandler.java:582)
	at org.eclipse.jetty.server.session.SessionHandler.doHandle(SessionHandler.java:224)
	at org.eclipse.jetty.server.handler.ContextHandler.doHandle(ContextHandler.java:1180)
	at org.eclipse.jetty.servlet.ServletHandler.doScope(ServletHandler.java:512)
	at org.eclipse.jetty.server.session.SessionHandler.doScope(SessionHandler.java:185)
	at org.eclipse.jetty.server.handler.ContextHandler.doScope(ContextHandler.java:1112)
	at org.eclipse.jetty.server.handler.ScopedHandler.handle(ScopedHandler.java:141)
	at org.eclipse.jetty.server.handler.gzip.GzipHandler.handle(GzipHandler.java:395)
	at org.eclipse.jetty.server.handler.HandlerWrapper.handle(HandlerWrapper.java:134)
	at org.eclipse.jetty.server.Server.handle(Server.java:534)
	at org.eclipse.jetty.server.HttpChannel.handle(HttpChannel.java:320)
	at org.eclipse.jetty.server.HttpConnection.onFillable(HttpConnection.java:251)
	at org.eclipse.jetty.io.AbstractConnection$ReadCallback.succeeded(AbstractConnection.java:273)
	at org.eclipse.jetty.io.FillInterest.fillable(FillInterest.java:95)
	at org.eclipse.jetty.io.SelectChannelEndPoint$2.run(SelectChannelEndPoint.java:93)
	at org.eclipse.jetty.util.thread.strategy.ExecuteProduceConsume.executeProduceConsume(ExecuteProduceConsume.java:303)
	at org.eclipse.jetty.util.thread.strategy.ExecuteProduceConsume.produceConsume(ExecuteProduceConsume.java:148)
	at org.eclipse.jetty.util.thread.strategy.ExecuteProduceConsume.run(ExecuteProduceConsume.java:136)
	at org.eclipse.jetty.util.thread.QueuedThreadPool.runJob(QueuedThreadPool.java:671)
	at org.eclipse.jetty.util.thread.QueuedThreadPool$2.run(QueuedThreadPool.java:589)
	at java.base/java.lang.Thread.run(Thread.java:844)


	at __randomizedtesting.SeedInfo.seed([F89A5455F9A94B92]:0)
	at org.junit.Assert.fail(Assert.java:93)
	at org.junit.Assert.assertTrue(Assert.java:43)
	at org.junit.Assert.assertNull(Assert.java:551)
	at org.apache.solr.SolrTestCaseJ4.teardownTestCases(SolrTestCaseJ4.java:297)
	at jdk.internal.reflect.GeneratedMethodAccessor35.invoke(Unknown Source)
	at java.base/jdk.internal.reflect.DelegatingMethodAccessorImpl.invoke(DelegatingMethodAccessorImpl.java:43)
	at java.base/java.lang.reflect.Method.invoke(Method.java:564)
	at com.carrotsearch.randomizedtesting.RandomizedRunner.invoke(RandomizedRunner.java:1713)
	at com.carrotsearch.randomizedtesting.RandomizedRunner$7.evaluate(RandomizedRunner.java:870)
	at com.carrotsearch.randomizedtesting.rules.StatementAdapter.evaluate(StatementAdapter.java:36)
	at com.carrotsearch.randomizedtesting.rules.SystemPropertiesRestoreRule$1.evaluate(SystemPropertiesRestoreRule.java:57)
	at org.apache.lucene.util.AbstractBeforeAfterRule$1.evaluate(AbstractBeforeAfterRule.java:45)
	at com.carrotsearch.randomizedtesting.rules.StatementAdapter.evaluate(StatementAdapter.java:36)
	at org.apache.lucene.util.TestRuleStoreClassName$1.evaluate(TestRuleStoreClassName.java:41)
	at com.carrotsearch.randomizedtesting.rules.NoShadowingOrOverridesOnMethodsRule$1.evaluate(NoShadowingOrOverridesOnMethodsRule.java:40)
	at com.carrotsearch.randomizedtesting.rules.NoShadowingOrOverridesOnMethodsRule$1.evaluate(NoShadowingOrOverridesOnMethodsRule.java:40)
	at com.carrotsearch.randomizedtesting.rules.StatementAdapter.evaluate(StatementAdapter.java:36)
	at com.carrotsearch.randomizedtesting.rules.StatementAdapter.evaluate(StatementAdapter.java:36)
	at org.apache.lucene.util.TestRuleAssertionsRequired$1.evaluate(TestRuleAssertionsRequired.java:53)
	at org.apache.lucene.util.TestRuleMarkFailure$1.evaluate(TestRuleMarkFailure.java:47)
	at org.apache.lucene.util.TestRuleIgnoreAfterMaxFailures$1.evaluate(TestRuleIgnoreAfterMaxFailures.java:64)
	at org.apache.lucene.util.TestRuleIgnoreTestSuites$1.evaluate(TestRuleIgnoreTestSuites.java:54)
	at com.carrotsearch.randomizedtesting.rules.StatementAdapter.evaluate(StatementAdapter.java:36)
	at com.carrotsearch.randomizedtesting.ThreadLeakControl$StatementRunner.run(ThreadLeakControl.java:368)
	at java.base/java.lang.Thread.run(Thread.java:844)


FAILED:  junit.framework.TestSuite.org.apache.solr.util.TestSolrCLIRunExample

Error Message:
Could not remove the following files (in the order of attempts):    C:\Users\jenkins\workspace\Lucene-Solr-7.x-Windows\solr\build\solr-core\test\J0\temp\solr.util.TestSolrCLIRunExample_F89A5455F9A94B92-001\tempDir-004\node1\testCloudExamplePrompt_shard2_replica_n6\data\tlog\tlog.0000000000000000000: java.nio.file.FileSystemException: C:\Users\jenkins\workspace\Lucene-Solr-7.x-Windows\solr\build\solr-core\test\J0\temp\solr.util.TestSolrCLIRunExample_F89A5455F9A94B92-001\tempDir-004\node1\testCloudExamplePrompt_shard2_replica_n6\data\tlog\tlog.0000000000000000000: The process cannot access the file because it is being used by another process.     C:\Users\jenkins\workspace\Lucene-Solr-7.x-Windows\solr\build\solr-core\test\J0\temp\solr.util.TestSolrCLIRunExample_F89A5455F9A94B92-001\tempDir-004\node1\testCloudExamplePrompt_shard2_replica_n6\data\tlog: java.nio.file.DirectoryNotEmptyException: C:\Users\jenkins\workspace\Lucene-Solr-7.x-Windows\solr\build\solr-core\test\J0\temp\solr.util.TestSolrCLIRunExample_F89A5455F9A94B92-001\tempDir-004\node1\testCloudExamplePrompt_shard2_replica_n6\data\tlog    C:\Users\jenkins\workspace\Lucene-Solr-7.x-Windows\solr\build\solr-core\test\J0\temp\solr.util.TestSolrCLIRunExample_F89A5455F9A94B92-001\tempDir-004\node1\testCloudExamplePrompt_shard2_replica_n6\data: java.nio.file.DirectoryNotEmptyException: C:\Users\jenkins\workspace\Lucene-Solr-7.x-Windows\solr\build\solr-core\test\J0\temp\solr.util.TestSolrCLIRunExample_F89A5455F9A94B92-001\tempDir-004\node1\testCloudExamplePrompt_shard2_replica_n6\data    C:\Users\jenkins\workspace\Lucene-Solr-7.x-Windows\solr\build\solr-core\test\J0\temp\solr.util.TestSolrCLIRunExample_F89A5455F9A94B92-001\tempDir-004\node1\testCloudExamplePrompt_shard2_replica_n6: java.nio.file.DirectoryNotEmptyException: C:\Users\jenkins\workspace\Lucene-Solr-7.x-Windows\solr\build\solr-core\test\J0\temp\solr.util.TestSolrCLIRunExample_F89A5455F9A94B92-001\tempDir-004\node1\testCloudExamplePrompt_shard2_replica_n6    C:\Users\jenkins\workspace\Lucene-Solr-7.x-Windows\solr\build\solr-core\test\J0\temp\solr.util.TestSolrCLIRunExample_F89A5455F9A94B92-001\tempDir-004\node1: java.nio.file.DirectoryNotEmptyException: C:\Users\jenkins\workspace\Lucene-Solr-7.x-Windows\solr\build\solr-core\test\J0\temp\solr.util.TestSolrCLIRunExample_F89A5455F9A94B92-001\tempDir-004\node1    C:\Users\jenkins\workspace\Lucene-Solr-7.x-Windows\solr\build\solr-core\test\J0\temp\solr.util.TestSolrCLIRunExample_F89A5455F9A94B92-001\tempDir-004: java.nio.file.DirectoryNotEmptyException: C:\Users\jenkins\workspace\Lucene-Solr-7.x-Windows\solr\build\solr-core\test\J0\temp\solr.util.TestSolrCLIRunExample_F89A5455F9A94B92-001\tempDir-004    C:\Users\jenkins\workspace\Lucene-Solr-7.x-Windows\solr\build\solr-core\test\J0\temp\solr.util.TestSolrCLIRunExample_F89A5455F9A94B92-001: java.nio.file.DirectoryNotEmptyException: C:\Users\jenkins\workspace\Lucene-Solr-7.x-Windows\solr\build\solr-core\test\J0\temp\solr.util.TestSolrCLIRunExample_F89A5455F9A94B92-001 

Stack Trace:
java.io.IOException: Could not remove the following files (in the order of attempts):
   C:\Users\jenkins\workspace\Lucene-Solr-7.x-Windows\solr\build\solr-core\test\J0\temp\solr.util.TestSolrCLIRunExample_F89A5455F9A94B92-001\tempDir-004\node1\testCloudExamplePrompt_shard2_replica_n6\data\tlog\tlog.0000000000000000000: java.nio.file.FileSystemException: C:\Users\jenkins\workspace\Lucene-Solr-7.x-Windows\solr\build\solr-core\test\J0\temp\solr.util.TestSolrCLIRunExample_F89A5455F9A94B92-001\tempDir-004\node1\testCloudExamplePrompt_shard2_replica_n6\data\tlog\tlog.0000000000000000000: The process cannot access the file because it is being used by another process.

   C:\Users\jenkins\workspace\Lucene-Solr-7.x-Windows\solr\build\solr-core\test\J0\temp\solr.util.TestSolrCLIRunExample_F89A5455F9A94B92-001\tempDir-004\node1\testCloudExamplePrompt_shard2_replica_n6\data\tlog: java.nio.file.DirectoryNotEmptyException: C:\Users\jenkins\workspace\Lucene-Solr-7.x-Windows\solr\build\solr-core\test\J0\temp\solr.util.TestSolrCLIRunExample_F89A5455F9A94B92-001\tempDir-004\node1\testCloudExamplePrompt_shard2_replica_n6\data\tlog
   C:\Users\jenkins\workspace\Lucene-Solr-7.x-Windows\solr\build\solr-core\test\J0\temp\solr.util.TestSolrCLIRunExample_F89A5455F9A94B92-001\tempDir-004\node1\testCloudExamplePrompt_shard2_replica_n6\data: java.nio.file.DirectoryNotEmptyException: C:\Users\jenkins\workspace\Lucene-Solr-7.x-Windows\solr\build\solr-core\test\J0\temp\solr.util.TestSolrCLIRunExample_F89A5455F9A94B92-001\tempDir-004\node1\testCloudExamplePrompt_shard2_replica_n6\data
   C:\Users\jenkins\workspace\Lucene-Solr-7.x-Windows\solr\build\solr-core\test\J0\temp\solr.util.TestSolrCLIRunExample_F89A5455F9A94B92-001\tempDir-004\node1\testCloudExamplePrompt_shard2_replica_n6: java.nio.file.DirectoryNotEmptyException: C:\Users\jenkins\workspace\Lucene-Solr-7.x-Windows\solr\build\solr-core\test\J0\temp\solr.util.TestSolrCLIRunExample_F89A5455F9A94B92-001\tempDir-004\node1\testCloudExamplePrompt_shard2_replica_n6
   C:\Users\jenkins\workspace\Lucene-Solr-7.x-Windows\solr\build\solr-core\test\J0\temp\solr.util.TestSolrCLIRunExample_F89A5455F9A94B92-001\tempDir-004\node1: java.nio.file.DirectoryNotEmptyException: C:\Users\jenkins\workspace\Lucene-Solr-7.x-Windows\solr\build\solr-core\test\J0\temp\solr.util.TestSolrCLIRunExample_F89A5455F9A94B92-001\tempDir-004\node1
   C:\Users\jenkins\workspace\Lucene-Solr-7.x-Windows\solr\build\solr-core\test\J0\temp\solr.util.TestSolrCLIRunExample_F89A5455F9A94B92-001\tempDir-004: java.nio.file.DirectoryNotEmptyException: C:\Users\jenkins\workspace\Lucene-Solr-7.x-Windows\solr\build\solr-core\test\J0\temp\solr.util.TestSolrCLIRunExample_F89A5455F9A94B92-001\tempDir-004
   C:\Users\jenkins\workspace\Lucene-Solr-7.x-Windows\solr\build\solr-core\test\J0\temp\solr.util.TestSolrCLIRunExample_F89A5455F9A94B92-001: java.nio.file.DirectoryNotEmptyException: C:\Users\jenkins\workspace\Lucene-Solr-7.x-Windows\solr\build\solr-core\test\J0\temp\solr.util.TestSolrCLIRunExample_F89A5455F9A94B92-001

	at org.apache.lucene.util.IOUtils.rm(IOUtils.java:329)
	at org.apache.lucene.util.TestRuleTemporaryFilesCleanup.afterAlways(TestRuleTemporaryFilesCleanup.java:216)
	at com.carrotsearch.randomizedtesting.rules.TestRuleAdapter$1.afterAlways(TestRuleAdapter.java:31)
	at com.carrotsearch.randomizedtesting.rules.StatementAdapter.evaluate(StatementAdapter.java:43)
	at com.carrotsearch.randomizedtesting.rules.StatementAdapter.evaluate(StatementAdapter.java:36)
	at org.apache.lucene.util.TestRuleAssertionsRequired$1.evaluate(TestRuleAssertionsRequired.java:53)
	at org.apache.lucene.util.TestRuleMarkFailure$1.evaluate(TestRuleMarkFailure.java:47)
	at org.apache.lucene.util.TestRuleIgnoreAfterMaxFailures$1.evaluate(TestRuleIgnoreAfterMaxFailures.java:64)
	at org.apache.lucene.util.TestRuleIgnoreTestSuites$1.evaluate(TestRuleIgnoreTestSuites.java:54)
	at com.carrotsearch.randomizedtesting.rules.StatementAdapter.evaluate(StatementAdapter.java:36)
	at com.carrotsearch.randomizedtesting.ThreadLeakControl$StatementRunner.run(ThreadLeakControl.java:368)
	at java.base/java.lang.Thread.run(Thread.java:844)


FAILED:  org.apache.solr.client.solrj.io.stream.StreamExpressionTest.testExecutorStream

Error Message:
Error from server at http://127.0.0.1:64011/solr/mainCorpus_shard2_replica_n3: Expected mime type application/octet-stream but got text/html. <html> <head> <meta http-equiv="Content-Type" content="text/html;charset=ISO-8859-1"/> <title>Error 404 </title> </head> <body> <h2>HTTP ERROR: 404</h2> <p>Problem accessing /solr/mainCorpus_shard2_replica_n3/update. Reason: <pre>    Can not find: /solr/mainCorpus_shard2_replica_n3/update</pre></p> <hr /><a href="http://eclipse.org/jetty">Powered by Jetty:// 9.3.14.v20161028</a><hr/> </body> </html> 

Stack Trace:
org.apache.solr.client.solrj.impl.CloudSolrClient$RouteException: Error from server at http://127.0.0.1:64011/solr/mainCorpus_shard2_replica_n3: Expected mime type application/octet-stream but got text/html. <html>
<head>
<meta http-equiv="Content-Type" content="text/html;charset=ISO-8859-1"/>
<title>Error 404 </title>
</head>
<body>
<h2>HTTP ERROR: 404</h2>
<p>Problem accessing /solr/mainCorpus_shard2_replica_n3/update. Reason:
<pre>    Can not find: /solr/mainCorpus_shard2_replica_n3/update</pre></p>
<hr /><a href="http://eclipse.org/jetty">Powered by Jetty:// 9.3.14.v20161028</a><hr/>
</body>
</html>

	at __randomizedtesting.SeedInfo.seed([CB585FF90504331B:E998DE02266E190B]:0)
	at org.apache.solr.client.solrj.impl.CloudSolrClient.directUpdate(CloudSolrClient.java:539)
	at org.apache.solr.client.solrj.impl.CloudSolrClient.sendRequest(CloudSolrClient.java:993)
	at org.apache.solr.client.solrj.impl.CloudSolrClient.requestWithRetryOnStaleState(CloudSolrClient.java:862)
	at org.apache.solr.client.solrj.impl.CloudSolrClient.request(CloudSolrClient.java:793)
	at org.apache.solr.client.solrj.SolrRequest.process(SolrRequest.java:178)
	at org.apache.solr.client.solrj.request.UpdateRequest.commit(UpdateRequest.java:233)
	at org.apache.solr.client.solrj.io.stream.StreamExpressionTest.testExecutorStream(StreamExpressionTest.java:6795)
	at java.base/jdk.internal.reflect.NativeMethodAccessorImpl.invoke0(Native Method)
	at java.base/jdk.internal.reflect.NativeMethodAccessorImpl.invoke(NativeMethodAccessorImpl.java:62)
	at java.base/jdk.internal.reflect.DelegatingMethodAccessorImpl.invoke(DelegatingMethodAccessorImpl.java:43)
	at java.base/java.lang.reflect.Method.invoke(Method.java:564)
	at com.carrotsearch.randomizedtesting.RandomizedRunner.invoke(RandomizedRunner.java:1713)
	at com.carrotsearch.randomizedtesting.RandomizedRunner$8.evaluate(RandomizedRunner.java:907)
	at com.carrotsearch.randomizedtesting.RandomizedRunner$9.evaluate(RandomizedRunner.java:943)
	at com.carrotsearch.randomizedtesting.RandomizedRunner$10.evaluate(RandomizedRunner.java:957)
	at com.carrotsearch.randomizedtesting.rules.SystemPropertiesRestoreRule$1.evaluate(SystemPropertiesRestoreRule.java:57)
	at org.apache.lucene.util.TestRuleSetupTeardownChained$1.evaluate(TestRuleSetupTeardownChained.java:49)
	at org.apache.lucene.util.AbstractBeforeAfterRule$1.evaluate(AbstractBeforeAfterRule.java:45)
	at org.apache.lucene.util.TestRuleThreadAndTestName$1.evaluate(TestRuleThreadAndTestName.java:48)
	at org.apache.lucene.util.TestRuleIgnoreAfterMaxFailures$1.evaluate(TestRuleIgnoreAfterMaxFailures.java:64)
	at org.apache.lucene.util.TestRuleMarkFailure$1.evaluate(TestRuleMarkFailure.java:47)
	at com.carrotsearch.randomizedtesting.rules.StatementAdapter.evaluate(StatementAdapter.java:36)
	at com.carrotsearch.randomizedtesting.ThreadLeakControl$StatementRunner.run(ThreadLeakControl.java:368)
	at com.carrotsearch.randomizedtesting.ThreadLeakControl.forkTimeoutingTask(ThreadLeakControl.java:817)
	at com.carrotsearch.randomizedtesting.ThreadLeakControl$3.evaluate(ThreadLeakControl.java:468)
	at com.carrotsearch.randomizedtesting.RandomizedRunner.runSingleTest(RandomizedRunner.java:916)
	at com.carrotsearch.randomizedtesting.RandomizedRunner$5.evaluate(RandomizedRunner.java:802)
	at com.carrotsearch.randomizedtesting.RandomizedRunner$6.evaluate(RandomizedRunner.java:852)
	at com.carrotsearch.randomizedtesting.RandomizedRunner$7.evaluate(RandomizedRunner.java:863)
	at com.carrotsearch.randomizedtesting.rules.StatementAdapter.evaluate(StatementAdapter.java:36)
	at com.carrotsearch.randomizedtesting.rules.SystemPropertiesRestoreRule$1.evaluate(SystemPropertiesRestoreRule.java:57)
	at org.apache.lucene.util.AbstractBeforeAfterRule$1.evaluate(AbstractBeforeAfterRule.java:45)
	at com.carrotsearch.randomizedtesting.rules.StatementAdapter.evaluate(StatementAdapter.java:36)
	at org.apache.lucene.util.TestRuleStoreClassName$1.evaluate(TestRuleStoreClassName.java:41)
	at com.carrotsearch.randomizedtesting.rules.NoShadowingOrOverridesOnMethodsRule$1.evaluate(NoShadowingOrOverridesOnMethodsRule.java:40)
	at com.carrotsearch.randomizedtesting.rules.NoShadowingOrOverridesOnMethodsRule$1.evaluate(NoShadowingOrOverridesOnMethodsRule.java:40)
	at com.carrotsearch.randomizedtesting.rules.StatementAdapter.evaluate(StatementAdapter.java:36)
	at com.carrotsearch.randomizedtesting.rules.StatementAdapter.evaluate(StatementAdapter.java:36)
	at org.apache.lucene.util.TestRuleAssertionsRequired$1.evaluate(TestRuleAssertionsRequired.java:53)
	at org.apache.lucene.util.TestRuleMarkFailure$1.evaluate(TestRuleMarkFailure.java:47)
	at org.apache.lucene.util.TestRuleIgnoreAfterMaxFailures$1.evaluate(TestRuleIgnoreAfterMaxFailures.java:64)
	at org.apache.lucene.util.TestRuleIgnoreTestSuites$1.evaluate(TestRuleIgnoreTestSuites.java:54)
	at com.carrotsearch.randomizedtesting.rules.StatementAdapter.evaluate(StatementAdapter.java:36)
	at com.carrotsearch.randomizedtesting.ThreadLeakControl$StatementRunner.run(ThreadLeakControl.java:368)
	at java.base/java.lang.Thread.run(Thread.java:844)
Caused by: org.apache.solr.client.solrj.impl.HttpSolrClient$RemoteSolrException: Error from server at http://127.0.0.1:64011/solr/mainCorpus_shard2_replica_n3: Expected mime type application/octet-stream but got text/html. <html>
<head>
<meta http-equiv="Content-Type" content="text/html;charset=ISO-8859-1"/>
<title>Error 404 </title>
</head>
<body>
<h2>HTTP ERROR: 404</h2>
<p>Problem accessing /solr/mainCorpus_shard2_replica_n3/update. Reason:
<pre>    Can not find: /solr/mainCorpus_shard2_replica_n3/update</pre></p>
<hr /><a href="http://eclipse.org/jetty">Powered by Jetty:// 9.3.14.v20161028</a><hr/>
</body>
</html>

	at org.apache.solr.client.solrj.impl.HttpSolrClient.executeMethod(HttpSolrClient.java:588)
	at org.apache.solr.client.solrj.impl.HttpSolrClient.request(HttpSolrClient.java:252)
	at org.apache.solr.client.solrj.impl.HttpSolrClient.request(HttpSolrClient.java:241)
	at org.apache.solr.client.solrj.impl.LBHttpSolrClient.doRequest(LBHttpSolrClient.java:483)
	at org.apache.solr.client.solrj.impl.LBHttpSolrClient.request(LBHttpSolrClient.java:413)
	at org.apache.solr.client.solrj.impl.CloudSolrClient.lambda$directUpdate$0(CloudSolrClient.java:516)
	at java.base/java.util.concurrent.FutureTask.run(FutureTask.java:264)
	at org.apache.solr.common.util.ExecutorUtil$MDCAwareThreadPoolExecutor.lambda$execute$0(ExecutorUtil.java:188)
	at java.base/java.util.concurrent.ThreadPoolExecutor.runWorker(ThreadPoolExecutor.java:1161)
	at java.base/java.util.concurrent.ThreadPoolExecutor$Worker.run(ThreadPoolExecutor.java:635)
	... 1 more




Build Log:
[...truncated 1720 lines...]
   [junit4] JVM J0: stderr was not empty, see: C:\Users\jenkins\workspace\Lucene-Solr-7.x-Windows\lucene\build\core\test\temp\junit4-J0-20170801_153414_36414212524980701136982.syserr
   [junit4] >>> JVM J0 emitted unexpected output (verbatim) ----
   [junit4] Java HotSpot(TM) Server VM warning: Option UseConcMarkSweepGC was deprecated in version 9.0 and will likely be removed in a future release.
   [junit4] <<< JVM J0: EOF ----

[...truncated 3 lines...]
   [junit4] JVM J1: stderr was not empty, see: C:\Users\jenkins\workspace\Lucene-Solr-7.x-Windows\lucene\build\core\test\temp\junit4-J1-20170801_153414_36416215854073818586503.syserr
   [junit4] >>> JVM J1 emitted unexpected output (verbatim) ----
   [junit4] Java HotSpot(TM) Server VM warning: Option UseConcMarkSweepGC was deprecated in version 9.0 and will likely be removed in a future release.
   [junit4] <<< JVM J1: EOF ----

[...truncated 301 lines...]
   [junit4] JVM J0: stderr was not empty, see: C:\Users\jenkins\workspace\Lucene-Solr-7.x-Windows\lucene\build\test-framework\test\temp\junit4-J0-20170801_154130_8781457745421432319500.syserr
   [junit4] >>> JVM J0 emitted unexpected output (verbatim) ----
   [junit4] Java HotSpot(TM) Server VM warning: Option UseConcMarkSweepGC was deprecated in version 9.0 and will likely be removed in a future release.
   [junit4] <<< JVM J0: EOF ----

[...truncated 3 lines...]
   [junit4] JVM J1: stderr was not empty, see: C:\Users\jenkins\workspace\Lucene-Solr-7.x-Windows\lucene\build\test-framework\test\temp\junit4-J1-20170801_154130_8788462833616758815702.syserr
   [junit4] >>> JVM J1 emitted unexpected output (verbatim) ----
   [junit4] Java HotSpot(TM) Server VM warning: Option UseConcMarkSweepGC was deprecated in version 9.0 and will likely be removed in a future release.
   [junit4] <<< JVM J1: EOF ----

[...truncated 1052 lines...]
   [junit4] JVM J1: stderr was not empty, see: C:\Users\jenkins\workspace\Lucene-Solr-7.x-Windows\lucene\build\analysis\common\test\temp\junit4-J1-20170801_154256_98212743946397648886058.syserr
   [junit4] >>> JVM J1 emitted unexpected output (verbatim) ----
   [junit4] Java HotSpot(TM) Server VM warning: Option UseConcMarkSweepGC was deprecated in version 9.0 and will likely be removed in a future release.
   [junit4] <<< JVM J1: EOF ----

[...truncated 3 lines...]
   [junit4] JVM J0: stderr was not empty, see: C:\Users\jenkins\workspace\Lucene-Solr-7.x-Windows\lucene\build\analysis\common\test\temp\junit4-J0-20170801_154256_98216365369367111720796.syserr
   [junit4] >>> JVM J0 emitted unexpected output (verbatim) ----
   [junit4] Java HotSpot(TM) Server VM warning: Option UseConcMarkSweepGC was deprecated in version 9.0 and will likely be removed in a future release.
   [junit4] <<< JVM J0: EOF ----

[...truncated 220 lines...]
   [junit4] JVM J0: stderr was not empty, see: C:\Users\jenkins\workspace\Lucene-Solr-7.x-Windows\lucene\build\analysis\icu\test\temp\junit4-J0-20170801_154526_45715589985459348865592.syserr
   [junit4] >>> JVM J0 emitted unexpected output (verbatim) ----
   [junit4] Java HotSpot(TM) Server VM warning: Option UseConcMarkSweepGC was deprecated in version 9.0 and will likely be removed in a future release.
   [junit4] <<< JVM J0: EOF ----

   [junit4] JVM J1: stderr was not empty, see: C:\Users\jenkins\workspace\Lucene-Solr-7.x-Windows\lucene\build\analysis\icu\test\temp\junit4-J1-20170801_154526_45712859016823307310317.syserr
   [junit4] >>> JVM J1 emitted unexpected output (verbatim) ----
   [junit4] Java HotSpot(TM) Server VM warning: Option UseConcMarkSweepGC was deprecated in version 9.0 and will likely be removed in a future release.
   [junit4] <<< JVM J1: EOF ----

[...truncated 235 lines...]
   [junit4] JVM J0: stderr was not empty, see: C:\Users\jenkins\workspace\Lucene-Solr-7.x-Windows\lucene\build\analysis\kuromoji\test\temp\junit4-J0-20170801_154537_3176520633702223412096.syserr
   [junit4] >>> JVM J0 emitted unexpected output (verbatim) ----
   [junit4] Java HotSpot(TM) Server VM warning: Option UseConcMarkSweepGC was deprecated in version 9.0 and will likely be removed in a future release.
   [junit4] <<< JVM J0: EOF ----

[...truncated 6 lines...]
   [junit4] JVM J1: stderr was not empty, see: C:\Users\jenkins\workspace\Lucene-Solr-7.x-Windows\lucene\build\analysis\kuromoji\test\temp\junit4-J1-20170801_154537_31714820965586520619204.syserr
   [junit4] >>> JVM J1 emitted unexpected output (verbatim) ----
   [junit4] Java HotSpot(TM) Server VM warning: Option UseConcMarkSweepGC was deprecated in version 9.0 and will likely be removed in a future release.
   [junit4] <<< JVM J1: EOF ----

[...truncated 147 lines...]
   [junit4] JVM J1: stderr was not empty, see: C:\Users\jenkins\workspace\Lucene-Solr-7.x-Windows\lucene\build\analysis\morfologik\test\temp\junit4-J1-20170801_154603_8991245161163753249494.syserr
   [junit4] >>> JVM J1 emitted unexpected output (verbatim) ----
   [junit4] Java HotSpot(TM) Server VM warning: Option UseConcMarkSweepGC was deprecated in version 9.0 and will likely be removed in a future release.
   [junit4] <<< JVM J1: EOF ----

[...truncated 3 lines...]
   [junit4] JVM J0: stderr was not empty, see: C:\Users\jenkins\workspace\Lucene-Solr-7.x-Windows\lucene\build\analysis\morfologik\test\temp\junit4-J0-20170801_154603_8997204622843881433514.syserr
   [junit4] >>> JVM J0 emitted unexpected output (verbatim) ----
   [junit4] Java HotSpot(TM) Server VM warning: Option UseConcMarkSweepGC was deprecated in version 9.0 and will likely be removed in a future release.
   [junit4] <<< JVM J0: EOF ----

[...truncated 153 lines...]
   [junit4] JVM J0: stderr was not empty, see: C:\Users\jenkins\workspace\Lucene-Solr-7.x-Windows\lucene\build\analysis\phonetic\test\temp\junit4-J0-20170801_154608_02911891291726117656192.syserr
   [junit4] >>> JVM J0 emitted unexpected output (verbatim) ----
   [junit4] Java HotSpot(TM) Server VM warning: Option UseConcMarkSweepGC was deprecated in version 9.0 and will likely be removed in a future release.
   [junit4] <<< JVM J0: EOF ----

[...truncated 9 lines...]
   [junit4] JVM J1: stderr was not empty, see: C:\Users\jenkins\workspace\Lucene-Solr-7.x-Windows\lucene\build\analysis\phonetic\test\temp\junit4-J1-20170801_154608_029918893298806939007.syserr
   [junit4] >>> JVM J1 emitted unexpected output (verbatim) ----
   [junit4] Java HotSpot(TM) Server VM warning: Option UseConcMarkSweepGC was deprecated in version 9.0 and will likely be removed in a future release.
   [junit4] <<< JVM J1: EOF ----

[...truncated 144 lines...]
   [junit4] JVM J1: stderr was not empty, see: C:\Users\jenkins\workspace\Lucene-Solr-7.x-Windows\lucene\build\analysis\smartcn\test\temp\junit4-J1-20170801_154616_6288844753744947738448.syserr
   [junit4] >>> JVM J1 emitted unexpected output (verbatim) ----
   [junit4] Java HotSpot(TM) Server VM warning: Option UseConcMarkSweepGC was deprecated in version 9.0 and will likely be removed in a future release.
   [junit4] <<< JVM J1: EOF ----

[...truncated 3 lines...]
   [junit4] JVM J0: stderr was not empty, see: C:\Users\jenkins\workspace\Lucene-Solr-7.x-Windows\lucene\build\analysis\smartcn\test\temp\junit4-J0-20170801_154616_6283439127019102110348.syserr
   [junit4] >>> JVM J0 emitted unexpected output (verbatim) ----
   [junit4] Java HotSpot(TM) Server VM warning: Option UseConcMarkSweepGC was deprecated in version 9.0 and will likely be removed in a future release.
   [junit4] <<< JVM J0: EOF ----

[...truncated 152 lines...]
   [junit4] JVM J1: stderr was not empty, see: C:\Users\jenkins\workspace\Lucene-Solr-7.x-Windows\lucene\build\analysis\stempel\test\temp\junit4-J1-20170801_154626_43611356879368210158517.syserr
   [junit4] >>> JVM J1 emitted unexpected output (verbatim) ----
   [junit4] Java HotSpot(TM) Server VM warning: Option UseConcMarkSweepGC was deprecated in version 9.0 and will likely be removed in a future release.
   [junit4] <<< JVM J1: EOF ----

   [junit4] JVM J0: stderr was not empty, see: C:\Users\jenkins\workspace\Lucene-Solr-7.x-Windows\lucene\build\analysis\stempel\test\temp\junit4-J0-20170801_154626_43612524000675319502365.syserr
   [junit4] >>> JVM J0 emitted unexpected output (verbatim) ----
   [junit4] Java HotSpot(TM) Server VM warning: Option UseConcMarkSweepGC was deprecated in version 9.0 and will likely be removed in a future release.
   [junit4] <<< JVM J0: EOF ----

[...truncated 160 lines...]
   [junit4] JVM J0: stderr was not empty, see: C:\Users\jenkins\workspace\Lucene-Solr-7.x-Windows\lucene\build\analysis\uima\test\temp\junit4-J0-20170801_154630_9971699806447196523938.syserr
   [junit4] >>> JVM J0 emitted unexpected output (verbatim) ----
   [junit4] Java HotSpot(TM) Server VM warning: Option UseConcMarkSweepGC was deprecated in version 9.0 and will likely be removed in a future release.
   [junit4] <<< JVM J0: EOF ----

[...truncated 204 lines...]
   [junit4] JVM J0: stderr was not empty, see: C:\Users\jenkins\workspace\Lucene-Solr-7.x-Windows\lucene\build\backward-codecs\test\temp\junit4-J0-20170801_154654_8985431248815607106609.syserr
   [junit4] >>> JVM J0 emitted unexpected output (verbatim) ----
   [junit4] Java HotSpot(TM) Server VM warning: Option UseConcMarkSweepGC was deprecated in version 9.0 and will likely be removed in a future release.
   [junit4] <<< JVM J0: EOF ----

[...truncated 9 lines...]
   [junit4] JVM J1: stderr was not empty, see: C:\Users\jenkins\workspace\Lucene-Solr-7.x-Windows\lucene\build\backward-codecs\test\temp\junit4-J1-20170801_154654_8986903890381401642996.syserr
   [junit4] >>> JVM J1 emitted unexpected output (verbatim) ----
   [junit4] Java HotSpot(TM) Server VM warning: Option UseConcMarkSweepGC was deprecated in version 9.0 and will likely be removed in a future release.
   [junit4] <<< JVM J1: EOF ----

[...truncated 1222 lines...]
   [junit4] JVM J1: stderr was not empty, see: C:\Users\jenkins\workspace\Lucene-Solr-7.x-Windows\lucene\build\benchmark\test\temp\junit4-J1-20170801_154753_96512748986896332241088.syserr
   [junit4] >>> JVM J1 emitted unexpected output (verbatim) ----
   [junit4] Java HotSpot(TM) Server VM warning: Option UseConcMarkSweepGC was deprecated in version 9.0 and will likely be removed in a future release.
   [junit4] <<< JVM J1: EOF ----

   [junit4] JVM J0: stderr was not empty, see: C:\Users\jenkins\workspace\Lucene-Solr-7.x-Windows\lucene\build\benchmark\test\temp\junit4-J0-20170801_154753_9629193249753706262816.syserr
   [junit4] >>> JVM J0 emitted unexpected output (verbatim) ----
   [junit4] Java HotSpot(TM) Server VM warning: Option UseConcMarkSweepGC was deprecated in version 9.0 and will likely be removed in a future release.
   [junit4] <<< JVM J0: EOF ----

[...truncated 219 lines...]
   [junit4] JVM J1: stderr was not empty, see: C:\Users\jenkins\workspace\Lucene-Solr-7.x-Windows\lucene\build\classification\test\temp\junit4-J1-20170801_154804_54615120310362347908048.syserr
   [junit4] >>> JVM J1 emitted unexpected output (verbatim) ----
   [junit4] Java HotSpot(TM) Server VM warning: Option UseConcMarkSweepGC was deprecated in version 9.0 and will likely be removed in a future release.
   [junit4] <<< JVM J1: EOF ----

[...truncated 6 lines...]
   [junit4] JVM J0: stderr was not empty, see: C:\Users\jenkins\workspace\Lucene-Solr-7.x-Windows\lucene\build\classification\test\temp\junit4-J0-20170801_154804_54611184874329243632219.syserr
   [junit4] >>> JVM J0 emitted unexpected output (verbatim) ----
   [junit4] Java HotSpot(TM) Server VM warning: Option UseConcMarkSweepGC was deprecated in version 9.0 and will likely be removed in a future release.
   [junit4] <<< JVM J0: EOF ----

[...truncated 248 lines...]
   [junit4] JVM J1: stderr was not empty, see: C:\Users\jenkins\workspace\Lucene-Solr-7.x-Windows\lucene\build\codecs\test\temp\junit4-J1-20170801_154824_3039959768038141111471.syserr
   [junit4] >>> JVM J1 emitted unexpected output (verbatim) ----
   [junit4] Java HotSpot(TM) Server VM warning: Option UseConcMarkSweepGC was deprecated in version 9.0 and will likely be removed in a future release.
   [junit4] <<< JVM J1: EOF ----

[...truncated 7 lines...]
   [junit4] JVM J0: stderr was not empty, see: C:\Users\jenkins\workspace\Lucene-Solr-7.x-Windows\lucene\build\codecs\test\temp\junit4-J0-20170801_154824_2985964316869322684082.syserr
   [junit4] >>> JVM J0 emitted unexpected output (verbatim) ----
   [junit4] Java HotSpot(TM) Server VM warning: Option UseConcMarkSweepGC was deprecated in version 9.0 and will likely be removed in a future release.
   [junit4] <<< JVM J0: EOF ----

[...truncated 229 lines...]
   [junit4] JVM J0: stderr was not empty, see: C:\Users\jenkins\workspace\Lucene-Solr-7.x-Windows\lucene\build\demo\test\temp\junit4-J0-20170801_155006_6829754027438325831216.syserr
   [junit4] >>> JVM J0 emitted unexpected output (verbatim) ----
   [junit4] Java HotSpot(TM) Server VM warning: Option UseConcMarkSweepGC was deprecated in version 9.0 and will likely be removed in a future release.
   [junit4] <<< JVM J0: EOF ----

   [junit4] JVM J1: stderr was not empty, see: C:\Users\jenkins\workspace\Lucene-Solr-7.x-Windows\lucene\build\demo\test\temp\junit4-J1-20170801_155006_68210387368994057214795.syserr
   [junit4] >>> JVM J1 emitted unexpected output (verbatim) ----
   [junit4] Java HotSpot(TM) Server VM warning: Option UseConcMarkSweepGC was deprecated in version 9.0 and will likely be removed in a future release.
   [junit4] <<< JVM J1: EOF ----

[...truncated 163 lines...]
   [junit4] JVM J1: stderr was not empty, see: C:\Users\jenkins\workspace\Lucene-Solr-7.x-Windows\lucene\build\expressions\test\temp\junit4-J1-20170801_155009_65013633973220881060108.syserr
   [junit4] >>> JVM J1 emitted unexpected output (verbatim) ----
   [junit4] Java HotSpot(TM) Server VM warning: Option UseConcMarkSweepGC was deprecated in version 9.0 and will likely be removed in a future release.
   [junit4] <<< JVM J1: EOF ----

[...truncated 3 lines...]
   [junit4] JVM J0: stderr was not empty, see: C:\Users\jenkins\workspace\Lucene-Solr-7.x-Windows\lucene\build\expressions\test\temp\junit4-J0-20170801_155009_6504953905407482022629.syserr
   [junit4] >>> JVM J0 emitted unexpected output (verbatim) ----
   [junit4] Java HotSpot(TM) Server VM warning: Option UseConcMarkSweepGC was deprecated in version 9.0 and will likely be removed in a future release.
   [junit4] <<< JVM J0: EOF ----

[...truncated 208 lines...]
   [junit4] JVM J1: stderr was not empty, see: C:\Users\jenkins\workspace\Lucene-Solr-7.x-Windows\lucene\build\facet\test\temp\junit4-J1-20170801_155014_20014407640361060010699.syserr
   [junit4] >>> JVM J1 emitted unexpected output (verbatim) ----
   [junit4] Java HotSpot(TM) Server VM warning: Option UseConcMarkSweepGC was deprecated in version 9.0 and will likely be removed in a future release.
   [junit4] <<< JVM J1: EOF ----

[...truncated 3 lines...]
   [junit4] JVM J0: stderr was not empty, see: C:\Users\jenkins\workspace\Lucene-Solr-7.x-Windows\lucene\build\facet\test\temp\junit4-J0-20170801_155014_2006542690387208109424.syserr
   [junit4] >>> JVM J0 emitted unexpected output (verbatim) ----
   [junit4] Java HotSpot(TM) Server VM warning: Option UseConcMarkSweepGC was deprecated in version 9.0 and will likely be removed in a future release.
   [junit4] <<< JVM J0: EOF ----

[...truncated 172 lines...]
   [junit4] JVM J1: stderr was not empty, see: C:\Users\jenkins\workspace\Lucene-Solr-7.x-Windows\lucene\build\grouping\test\temp\junit4-J1-20170801_155031_80016009673608018427450.syserr
   [junit4] >>> JVM J1 emitted unexpected output (verbatim) ----
   [junit4] Java HotSpot(TM) Server VM warning: Option UseConcMarkSweepGC was deprecated in version 9.0 and will likely be removed in a future release.
   [junit4] <<< JVM J1: EOF ----

[...truncated 3 lines...]
   [junit4] JVM J0: stderr was not empty, see: C:\Users\jenkins\workspace\Lucene-Solr-7.x-Windows\lucene\build\grouping\test\temp\junit4-J0-20170801_155031_80015458141364558295864.syserr
   [junit4] >>> JVM J0 emitted unexpected output (verbatim) ----
   [junit4] Java HotSpot(TM) Server VM warning: Option UseConcMarkSweepGC was deprecated in version 9.0 and will likely be removed in a future release.
   [junit4] <<< JVM J0: EOF ----

[...truncated 221 lines...]
   [junit4] JVM J1: stderr was not empty, see: C:\Users\jenkins\workspace\Lucene-Solr-7.x-Windows\lucene\build\highlighter\test\temp\junit4-J1-20170801_155038_4205757498295187895225.syserr
   [junit4] >>> JVM J1 emitted unexpected output (verbatim) ----
   [junit4] Java HotSpot(TM) Server VM warning: Option UseConcMarkSweepGC was deprecated in version 9.0 and will likely be removed in a future release.
   [junit4] <<< JVM J1: EOF ----

[...truncated 18 lines...]
   [junit4] JVM J0: stderr was not empty, see: C:\Users\jenkins\workspace\Lucene-Solr-7.x-Windows\lucene\build\highlighter\test\temp\junit4-J0-20170801_155038_42015671581042507432819.syserr
   [junit4] >>> JVM J0 emitted unexpected output (verbatim) ----
   [junit4] Java HotSpot(TM) Server VM warning: Option UseConcMarkSweepGC was deprecated in version 9.0 and will likely be removed in a future release.
   [junit4] <<< JVM J0: EOF ----

[...truncated 159 lines...]
   [junit4] JVM J0: stderr was not empty, see: C:\Users\jenkins\workspace\Lucene-Solr-7.x-Windows\lucene\build\join\test\temp\junit4-J0-20170801_155054_1563795650747383090901.syserr
   [junit4] >>> JVM J0 emitted unexpected output (verbatim) ----
   [junit4] Java HotSpot(TM) Server VM warning: Option UseConcMarkSweepGC was deprecated in version 9.0 and will likely be removed in a future release.
   [junit4] <<< JVM J0: EOF ----

   [junit4] JVM J1: stderr was not empty, see: C:\Users\jenkins\workspace\Lucene-Solr-7.x-Windows\lucene\build\join\test\temp\junit4-J1-20170801_155054_1569619673573909280742.syserr
   [junit4] >>> JVM J1 emitted unexpected output (verbatim) ----
   [junit4] Java HotSpot(TM) Server VM warning: Option UseConcMarkSweepGC was deprecated in version 9.0 and will likely be removed in a future release.
   [junit4] <<< JVM J1: EOF ----

[...truncated 140 lines...]
   [junit4] JVM J0: stderr was not empty, see: C:\Users\jenkins\workspace\Lucene-Solr-7.x-Windows\lucene\build\memory\test\temp\junit4-J0-20170801_155102_80613120508341377577396.syserr
   [junit4] >>> JVM J0 emitted unexpected output (verbatim) ----
   [junit4] Java HotSpot(TM) Server VM warning: Option UseConcMarkSweepGC was deprecated in version 9.0 and will likely be removed in a future release.
   [junit4] <<< JVM J0: EOF ----

[...truncated 3 lines...]
   [junit4] JVM J1: stderr was not empty, see: C:\Users\jenkins\workspace\Lucene-Solr-7.x-Windows\lucene\build\memory\test\temp\junit4-J1-20170801_155102_8064063730554636825620.syserr
   [junit4] >>> JVM J1 emitted unexpected output (verbatim) ----
   [junit4] Java HotSpot(TM) Server VM warning: Option UseConcMarkSweepGC was deprecated in version 9.0 and will likely be removed in a future release.
   [junit4] <<< JVM J1: EOF ----

[...truncated 177 lines...]
   [junit4] JVM J0: stderr was not empty, see: C:\Users\jenkins\workspace\Lucene-Solr-7.x-Windows\lucene\build\misc\test\temp\junit4-J0-20170801_155108_9878255600376764976413.syserr
   [junit4] >>> JVM J0 emitted unexpected output (verbatim) ----
   [junit4] Java HotSpot(TM) Server VM warning: Option UseConcMarkSweepGC was deprecated in version 9.0 and will likely be removed in a future release.
   [junit4] <<< JVM J0: EOF ----

[...truncated 3 lines...]
   [junit4] JVM J1: stderr was not empty, see: C:\Users\jenkins\workspace\Lucene-Solr-7.x-Windows\lucene\build\misc\test\temp\junit4-J1-20170801_155108_9874494241244587906790.syserr
   [junit4] >>> JVM J1 emitted unexpected output (verbatim) ----
   [junit4] Java HotSpot(TM) Server VM warning: Option UseConcMarkSweepGC was deprecated in version 9.0 and will likely be removed in a future release.
   [junit4] <<< JVM J1: EOF ----

[...truncated 305 lines...]
   [junit4] JVM J1: stderr was not empty, see: C:\Users\jenkins\workspace\Lucene-Solr-7.x-Windows\lucene\build\queries\test\temp\junit4-J1-20170801_155135_68615892914386696604519.syserr
   [junit4] >>> JVM J1 emitted unexpected output (verbatim) ----
   [junit4] Java HotSpot(TM) Server VM warning: Option UseConcMarkSweepGC was deprecated in version 9.0 and will likely be removed in a future release.
   [junit4] <<< JVM J1: EOF ----

[...truncated 3 lines...]
   [junit4] JVM J0: stderr was not empty, see: C:\Users\jenkins\workspace\Lucene-Solr-7.x-Windows\lucene\build\queries\test\temp\junit4-J0-20170801_155135_68316278883753552047785.syserr
   [junit4] >>> JVM J0 emitted unexpected output (verbatim) ----
   [junit4] Java HotSpot(TM) Server VM warning: Option UseConcMarkSweepGC was deprecated in version 9.0 and will likely be removed in a future release.
   [junit4] <<< JVM J0: EOF ----

[...truncated 217 lines...]
   [junit4] JVM J1: stderr was not empty, see: C:\Users\jenkins\workspace\Lucene-Solr-7.x-Windows\lucene\build\queryparser\test\temp\junit4-J1-20170801_155144_4762630621702407250250.syserr
   [junit4] >>> JVM J1 emitted unexpected output (verbatim) ----
   [junit4] Java HotSpot(TM) Server VM warning: Option UseConcMarkSweepGC was deprecated in version 9.0 and will likely be removed in a future release.
   [junit4] <<< JVM J1: EOF ----

[...truncated 3 lines...]
   [junit4] JVM J0: stderr was not empty, see: C:\Users\jenkins\workspace\Lucene-Solr-7.x-Windows\lucene\build\queryparser\test\temp\junit4-J0-20170801_155144_4767265918848534230303.syserr
   [junit4] >>> JVM J0 emitted unexpected output (verbatim) ----
   [junit4] Java HotSpot(TM) Server VM warning: Option UseConcMarkSweepGC was deprecated in version 9.0 and will likely be removed in a future release.
   [junit4] <<< JVM J0: EOF ----

[...truncated 194 lines...]
   [junit4] JVM J1: stderr was not empty, see: C:\Users\jenkins\workspace\Lucene-Solr-7.x-Windows\lucene\build\replicator\test\temp\junit4-J1-20170801_155151_6051949142305281201401.syserr
   [junit4] >>> JVM J1 emitted unexpected output (verbatim) ----
   [junit4] Java HotSpot(TM) Server VM warning: Option UseConcMarkSweepGC was deprecated in version 9.0 and will likely be removed in a future release.
   [junit4] <<< JVM J1: EOF ----

[...truncated 9 lines...]
   [junit4] JVM J0: stderr was not empty, see: C:\Users\jenkins\workspace\Lucene-Solr-7.x-Windows\lucene\build\replicator\test\temp\junit4-J0-20170801_155151_6053108161350346973293.syserr
   [junit4] >>> JVM J0 emitted unexpected output (verbatim) ----
   [junit4] Java HotSpot(TM) Server VM warning: Option UseConcMarkSweepGC was deprecated in version 9.0 and will likely be removed in a future release.
   [junit4] <<< JVM J0: EOF ----

[...truncated 198 lines...]
   [junit4] JVM J1: stderr was not empty, see: C:\Users\jenkins\workspace\Lucene-Solr-7.x-Windows\lucene\build\sandbox\test\temp\junit4-J1-20170801_155206_38116898479802543415987.syserr
   [junit4] >>> JVM J1 emitted unexpected output (verbatim) ----
   [junit4] Java HotSpot(TM) Server VM warning: Option UseConcMarkSweepGC was deprecated in version 9.0 and will likely be removed in a future release.
   [junit4] <<< JVM J1: EOF ----

[...truncated 7 lines...]
   [junit4] JVM J0: stderr was not empty, see: C:\Users\jenkins\workspace\Lucene-Solr-7.x-Windows\lucene\build\sandbox\test\temp\junit4-J0-20170801_155206_381206688249874353964.syserr
   [junit4] >>> JVM J0 emitted unexpected output (verbatim) ----
   [junit4] Java HotSpot(TM) Server VM warning: Option UseConcMarkSweepGC was deprecated in version 9.0 and will likely be removed in a future release.
   [junit4] <<< JVM J0: EOF ----

[...truncated 208 lines...]
   [junit4] JVM J0: stderr was not empty, see: C:\Users\jenkins\workspace\Lucene-Solr-7.x-Windows\lucene\build\spatial-extras\test\temp\junit4-J0-20170801_155233_45315198309183349890820.syserr
   [junit4] >>> JVM J0 emitted unexpected output (verbatim) ----
   [junit4] Java HotSpot(TM) Server VM warning: Option UseConcMarkSweepGC was deprecated in version 9.0 and will likely be removed in a future release.
   [junit4] <<< JVM J0: EOF ----

[...truncated 3 lines...]
   [junit4] JVM J1: stderr was not empty, see: C:\Users\jenkins\workspace\Lucene-Solr-7.x-Windows\lucene\build\spatial-extras\test\temp\junit4-J1-20170801_155233_45216397930164051400343.syserr
   [junit4] >>> JVM J1 emitted unexpected output (verbatim) ----
   [junit4] Java HotSpot(TM) Server VM warning: Option UseConcMarkSweepGC was deprecated in version 9.0 and will likely be removed in a future release.
   [junit4] <<< JVM J1: EOF ----

[...truncated 160 lines...]
   [junit4] JVM J0: stderr was not empty, see: C:\Users\jenkins\workspace\Lucene-Solr-7.x-Windows\lucene\build\spatial3d\test\temp\junit4-J0-20170801_155243_71910234593631661711714.syserr
   [junit4] >>> JVM J0 emitted unexpected output (verbatim) ----
   [junit4] Java HotSpot(TM) Server VM warning: Option UseConcMarkSweepGC was deprecated in version 9.0 and will likely be removed in a future release.
   [junit4] <<< JVM J0: EOF ----

[...truncated 8 lines...]
   [junit4] JVM J1: stderr was not empty, see: C:\Users\jenkins\workspace\Lucene-Solr-7.x-Windows\lucene\build\spatial3d\test\temp\junit4-J1-20170801_155243_71918266050983437610817.syserr
   [junit4] >>> JVM J1 emitted unexpected output (verbatim) ----
   [junit4] Java HotSpot(TM) Server VM warning: Option UseConcMarkSweepGC was deprecated in version 9.0 and will likely be removed in a future release.
   [junit4] <<< JVM J1: EOF ----

[...truncated 139 lines...]
   [junit4] JVM J0: stderr was not empty, see: C:\Users\jenkins\workspace\Lucene-Solr-7.x-Windows\lucene\build\spatial\test\temp\junit4-J0-20170801_155257_3273260428508935869229.syserr
   [junit4] >>> JVM J0 emitted unexpected output (verbatim) ----
   [junit4] Java HotSpot(TM) Server VM warning: Option UseConcMarkSweepGC was deprecated in version 9.0 and will likely be removed in a future release.
   [junit4] <<< JVM J0: EOF ----

[...truncated 298 lines...]
   [junit4] JVM J1: stderr was not empty, see: C:\Users\jenkins\workspace\Lucene-Solr-7.x-Windows\lucene\build\suggest\test\temp\junit4-J1-20170801_155301_72314193111415109934004.syserr
   [junit4] >>> JVM J1 emitted unexpected output (verbatim) ----
   [junit4] Java HotSpot(TM) Server VM warning: Option UseConcMarkSweepGC was deprecated in version 9.0 and will likely be removed in a future release.
   [junit4] <<< JVM J1: EOF ----

[...truncated 3 lines...]
   [junit4] JVM J0: stderr was not empty, see: C:\Users\jenkins\workspace\Lucene-Solr-7.x-Windows\lucene\build\suggest\test\temp\junit4-J0-20170801_155301_7238826854445219959424.syserr
   [junit4] >>> JVM J0 emitted unexpected output (verbatim) ----
   [junit4] Java HotSpot(TM) Server VM warning: Option UseConcMarkSweepGC was deprecated in version 9.0 and will likely be removed in a future release.
   [junit4] <<< JVM J0: EOF ----

[...truncated 3814 lines...]
   [junit4] JVM J1: stderr was not empty, see: C:\Users\jenkins\workspace\Lucene-Solr-7.x-Windows\solr\build\solr-core\test\temp\junit4-J1-20170801_155422_30410109928192307850796.syserr
   [junit4] >>> JVM J1 emitted unexpected output (verbatim) ----
   [junit4] Java HotSpot(TM) Server VM warning: Option UseConcMarkSweepGC was deprecated in version 9.0 and will likely be removed in a future release.
   [junit4] <<< JVM J1: EOF ----

   [junit4] Suite: org.apache.solr.util.TestSolrCLIRunExample
   [junit4]   2> Creating dataDir: C:\Users\jenkins\workspace\Lucene-Solr-7.x-Windows\solr\build\solr-core\test\J0\temp\solr.util.TestSolrCLIRunExample_F89A5455F9A94B92-001\init-core-data-001
   [junit4]   2> 3339583 WARN  (SUITE-TestSolrCLIRunExample-seed#[F89A5455F9A94B92]-worker) [    ] o.a.s.SolrTestCaseJ4 startTrackingSearchers: numOpens=1 numCloses=1
   [junit4]   2> 3339583 INFO  (SUITE-TestSolrCLIRunExample-seed#[F89A5455F9A94B92]-worker) [    ] o.a.s.SolrTestCaseJ4 Using PointFields (NUMERIC_POINTS_SYSPROP=true) w/NUMERIC_DOCVALUES_SYSPROP=true
   [junit4]   2> 3339588 INFO  (SUITE-TestSolrCLIRunExample-seed#[F89A5455F9A94B92]-worker) [    ] o.a.s.SolrTestCaseJ4 Randomized ssl (false) and clientAuth (false) via: @org.apache.solr.SolrTestCaseJ4$SuppressSSL(bugUrl="https://issues.apache.org/jira/browse/SOLR-5776")
   [junit4]   2> 3339588 INFO  (SUITE-TestSolrCLIRunExample-seed#[F89A5455F9A94B92]-worker) [    ] o.a.s.SolrTestCaseJ4 SecureRandom sanity checks: test.solr.allowed.securerandom=null & java.security.egd=file:/dev/./urandom
   [junit4]   2> 3339591 INFO  (TEST-TestSolrCLIRunExample.testSchemalessExample-seed#[F89A5455F9A94B92]) [    ] o.a.s.SolrTestCaseJ4 ###Starting testSchemalessExample
   [junit4]   2> 3339616 INFO  (TEST-TestSolrCLIRunExample.testSchemalessExample-seed#[F89A5455F9A94B92]) [    ] o.a.s.u.TestSolrCLIRunExample Selected port 62228 to start schemaless example Solr instance on ...
   [junit4]   2> 3340854 INFO  (Thread-5788) [    ] o.e.j.s.Server jetty-9.3.14.v20161028
   [junit4]   2> 3340856 INFO  (Thread-5788) [    ] o.e.j.s.h.ContextHandler Started o.e.j.s.ServletContextHandler@12f2e55{/solr,null,AVAILABLE}
   [junit4]   2> 3340868 INFO  (Thread-5788) [    ] o.e.j.s.AbstractConnector Started ServerConnector@8174be{HTTP/1.1,[http/1.1]}{127.0.0.1:62228}
   [junit4]   2> 3340868 INFO  (Thread-5788) [    ] o.e.j.s.Server Started @3341956ms
   [junit4]   2> 3340868 INFO  (Thread-5788) [    ] o.a.s.c.s.e.JettySolrRunner Jetty properties: {hostContext=/solr, hostPort=62228}
   [junit4]   2> 3340869 ERROR (Thread-5788) [    ] o.a.s.s.StartupLoggingUtils Missing Java Option solr.log.dir. Logging may be missing or incomplete.
   [junit4]   2> 3340869 INFO  (Thread-5788) [    ] o.a.s.s.SolrDispatchFilter  ___      _       Welcome to Apache Solr? version 7.1.0
   [junit4]   2> 3340869 INFO  (Thread-5788) [    ] o.a.s.s.SolrDispatchFilter / __| ___| |_ _   Starting in standalone mode on port 62228
   [junit4]   2> 3340870 INFO  (Thread-5788) [    ] o.a.s.s.SolrDispatchFilter \__ \/ _ \ | '_|  Install dir: null, Default config dir: null
   [junit4]   2> 3340870 INFO  (Thread-5788) [    ] o.a.s.s.SolrDispatchFilter |___/\___/_|_|    Start time: 2017-08-01T16:50:04.380437200Z
   [junit4]   2> 3340870 INFO  (Thread-5788) [    ] o.a.s.c.SolrXmlConfig Loading container configuration from C:\Users\jenkins\workspace\Lucene-Solr-7.x-Windows\solr\build\solr-core\test\J0\temp\solr.util.TestSolrCLIRunExample_F89A5455F9A94B92-001\tempDir-001\schemaless\solr\solr.xml
   [junit4]   2> 3340894 INFO  (Thread-5788) [    ] o.a.s.c.SolrXmlConfig MBean server found: com.sun.jmx.mbeanserver.JmxMBeanServer@7d3d76, but no JMX reporters were configured - adding default JMX reporter.
   [junit4]   2> 3340981 INFO  (Thread-5788) [    ] o.a.s.m.r.SolrJmxReporter JMX monitoring for 'solr.node' (registry 'solr.node') enabled at server: com.sun.jmx.mbeanserver.JmxMBeanServer@7d3d76
   [junit4]   2> 3340996 INFO  (Thread-5788) [    ] o.a.s.m.r.SolrJmxReporter JMX monitoring for 'solr.jvm' (registry 'solr.jvm') enabled at server: com.sun.jmx.mbeanserver.JmxMBeanServer@7d3d76
   [junit4]   2> 3341000 INFO  (Thread-5788) [    ] o.a.s.m.r.SolrJmxReporter JMX monitoring for 'solr.jetty' (registry 'solr.jetty') enabled at server: com.sun.jmx.mbeanserver.JmxMBeanServer@7d3d76
   [junit4]   2> 3341000 INFO  (Thread-5788) [    ] o.a.s.c.CorePropertiesLocator Found 0 core definitions underneath C:\Users\jenkins\workspace\Lucene-Solr-7.x-Windows\solr\build\solr-core\test\J0\temp\solr.util.TestSolrCLIRunExample_F89A5455F9A94B92-001\tempDir-001\schemaless\solr
   [junit4]   2> 3343925 INFO  (qtp2665325-30977) [    ] o.a.s.s.HttpSolrCall [admin] webapp=null path=/admin/info/system params={wt=json} status=0 QTime=25
   [junit4]   2> 3343939 INFO  (qtp2665325-30983) [    ] o.a.s.c.TransientSolrCoreCacheDefault Allocating transient cache for 2147483647 transient cores
   [junit4]   2> 3343940 INFO  (qtp2665325-30983) [    ] o.a.s.s.HttpSolrCall [admin] webapp=null path=/admin/cores params={core=gettingstarted&action=STATUS&wt=json} status=0 QTime=0
   [junit4]   2> 3343988 INFO  (qtp2665325-30977) [    ] o.a.s.s.HttpSolrCall [admin] webapp=null path=/admin/info/system params={wt=json} status=0 QTime=39
   [junit4]   2> 3344041 INFO  (qtp2665325-30979) [    ] o.a.s.s.HttpSolrCall [admin] webapp=null path=/admin/info/system params={wt=json} status=0 QTime=44
   [junit4]   2> 3344055 INFO  (qtp2665325-30982) [    ] o.a.s.s.HttpSolrCall [admin] webapp=null path=/admin/cores params={core=gettingstarted&action=STATUS&wt=json} status=0 QTime=0
   [junit4]   2> 3344205 INFO  (qtp2665325-30979) [    ] o.a.s.h.a.CoreAdminOperation core create command name=gettingstarted&action=CREATE&instanceDir=gettingstarted&wt=json
   [junit4]   2> 3344226 WARN  (qtp2665325-30979) [    ] o.a.s.c.SolrConfig Couldn't add files from C:\Users\jenkins\workspace\Lucene-Solr-7.x-Windows\solr\build\solr-core\test\J0\temp\solr.util.TestSolrCLIRunExample_F89A5455F9A94B92-001\tempDir-001\schemaless\solr\gettingstarted\..\..\..\..\contrib\extraction\lib filtered by .*\.jar to classpath: C:\Users\jenkins\workspace\Lucene-Solr-7.x-Windows\solr\build\solr-core\test\J0\temp\solr.util.TestSolrCLIRunExample_F89A5455F9A94B92-001\tempDir-001\schemaless\solr\gettingstarted\..\..\..\..\contrib\extraction\lib
   [junit4]   2> 3344227 WARN  (qtp2665325-30979) [    ] o.a.s.c.SolrConfig Couldn't add files from C:\Users\jenkins\workspace\Lucene-Solr-7.x-Windows\solr\build\solr-core\test\J0\temp\solr.util.TestSolrCLIRunExample_F89A5455F9A94B92-001\tempDir-001\schemaless\solr\gettingstarted\..\..\..\..\dist filtered by solr-cell-\d.*\.jar to classpath: C:\Users\jenkins\workspace\Lucene-Solr-7.x-Windows\solr\build\solr-core\test\J0\temp\solr.util.TestSolrCLIRunExample_F89A5455F9A94B92-001\tempDir-001\schemaless\solr\gettingstarted\..\..\..\..\dist
   [junit4]   2> 3344228 WARN  (qtp2665325-30979) [    ] o.a.s.c.SolrConfig Couldn't add files from C:\Users\jenkins\workspace\Lucene-Solr-7.x-Windows\solr\build\solr-core\test\J0\temp\solr.util.TestSolrCLIRunExample_F89A5455F9A94B92-001\tempDir-001\schemaless\solr\gettingstarted\..\..\..\..\contrib\clustering\lib filtered by .*\.jar to classpath: C:\Users\jenkins\workspace\Lucene-Solr-7.x-Windows\solr\build\solr-core\test\J0\temp\solr.util.TestSolrCLIRunExample_F89A5455F9A94B92-001\tempDir-001\schemaless\solr\gettingstarted\..\..\..\..\contrib\clustering\lib
   [junit4]   2> 3344228 WARN  (qtp2665325-30979) [    ] o.a.s.c.SolrConfig Couldn't add files from C:\Users\jenkins\workspace\Lucene-Solr-7.x-Windows\solr\build\solr-core\test\J0\temp\solr.util.TestSolrCLIRunExample_F89A5455F9A94B92-001\tempDir-001\schemaless\solr\gettingstarted\..\..\..\..\dist filtered by solr-clustering-\d.*\.jar to classpath: C:\Users\jenkins\workspace\Lucene-Solr-7.x-Windows\solr\build\solr-core\test\J0\temp\solr.util.TestSolrCLIRunExample_F89A5455F9A94B92-001\tempDir-001\schemaless\solr\gettingstarted\..\..\..\..\dist
   [junit4]   2> 3344228 WARN  (qtp2665325-30979) [    ] o.a.s.c.SolrConfig Couldn't add files from C:\Users\jenkins\workspace\Lucene-Solr-7.x-Windows\solr\build\solr-core\test\J0\temp\solr.util.TestSolrCLIRunExample_F89A5455F9A94B92-001\tempDir-001\schemaless\solr\gettingstarted\..\..\..\..\contrib\langid\lib filtered by .*\.jar to classpath: C:\Users\jenkins\workspace\Lucene-Solr-7.x-Windows\solr\build\solr-core\test\J0\temp\solr.util.TestSolrCLIRunExample_F89A5455F9A94B92-001\tempDir-001\schemaless\solr\gettingstarted\..\..\..\..\contrib\langid\lib
   [junit4]   2> 3344230 WARN  (qtp2665325-30979) [    ] o.a.s.c.SolrConfig Couldn't add files from C:\Users\jenkins\workspace\Lucene-Solr-7.x-Windows\solr\build\solr-core\test\J0\temp\solr.util.TestSolrCLIRunExample_F89A5455F9A94B92-001\tempDir-001\schemaless\solr\gettingstarted\..\..\..\..\dist filtered by solr-langid-\d.*\.jar to classpath: C:\Users\jenkins\workspace\Lucene-Solr-7.x-Windows\solr\build\solr-core\test\J0\temp\solr.util.TestSolrCLIRunExample_F89A5455F9A94B92-001\tempDir-001\schemaless\solr\gettingstarted\..\..\..\..\dist
   [junit4]   2> 3344230 WARN  (qtp2665325-30979) [    ] o.a.s.c.SolrConfig Couldn't add files from C:\Users\jenkins\workspace\Lucene-Solr-7.x-Windows\solr\build\solr-core\test\J0\temp\solr.util.TestSolrCLIRunExample_F89A5455F9A94B92-001\tempDir-001\schemaless\solr\gettingstarted\..\..\..\..\contrib\velocity\lib filtered by .*\.jar to classpath: C:\Users\jenkins\workspace\Lucene-Solr-7.x-Windows\solr\build\solr-core\test\J0\temp\solr.util.TestSolrCLIRunExample_F89A5455F9A94B92-001\tempDir-001\schemaless\solr\gettingstarted\..\..\..\..\contrib\velocity\lib
   [junit4]   2> 3344232 WARN  (qtp2665325-30979) [    ] o.a.s.c.SolrConfig Couldn't add files from C:\Users\jenkins\workspace\Lucene-Solr-7.x-Windows\solr\build\solr-core\test\J0\temp\solr.util.TestSolrCLIRunExample_F89A5455F9A94B92-001\tempDir-001\schemaless\solr\gettingstarted\..\..\..\..\dist filtered by solr-velocity-\d.*\.jar to classpath: C:\Users\jenkins\workspace\Lucene-Solr-7.x-Windows\solr\build\solr-core\test\J0\temp\solr.util.TestSolrCLIRunExample_F89A5455F9A94B92-001\tempDir-001\schemaless\solr\gettingstarted\..\..\..\..\dist
   [junit4]   2> 3344245 INFO  (qtp2665325-30979) [    ] o.a.s.c.SolrConfig Using Lucene MatchVersion: 7.1.0
   [junit4]   2> 3344288 INFO  (qtp2665325-30979) [    ] o.a.s.s.IndexSchema [gettingstarted] Schema name=default-config
   [junit4]   2> 3344586 INFO  (qtp2665325-30979) [    ] o.a.s.s.IndexSchema Loaded schema default-config/1.6 with uniqueid field id
   [junit4]   2> 3344647 INFO  (qtp2665325-30979) [    ] o.a.s.c.CoreContainer Creating SolrCore 'gettingstarted' using configuration from instancedir C:\Users\jenkins\workspace\Lucene-Solr-7.x-Windows\solr\build\solr-core\test\J0\temp\solr.util.TestSolrCLIRunExample_F89A5455F9A94B92-001\tempDir-001\schemaless\solr\gettingstarted, trusted=true
   [junit4]   2> 3344648 INFO  (qtp2665325-30979) [    ] o.a.s.m.r.SolrJmxReporter JMX monitoring for 'solr.core.gettingstarted' (registry 'solr.core.gettingstarted') enabled at server: com.sun.jmx.mbeanserver.JmxMBeanServer@7d3d76
   [junit4]   2> 3344648 INFO  (qtp2665325-30979) [    ] o.a.s.c.SolrCore solr.RecoveryStrategy.Builder
   [junit4]   2> 3344648 INFO  (qtp2665325-30979) [    ] o.a.s.c.SolrCore [[gettingstarted] ] Opening new SolrCore at [C:\Users\jenkins\workspace\Lucene-Solr-7.x-Windows\solr\build\solr-core\test\J0\temp\solr.util.TestSolrCLIRunExample_F89A5455F9A94B92-001\tempDir-001\schemaless\solr\gettingstarted], dataDir=[C:\Users\jenkins\workspace\Lucene-Solr-7.x-Windows\solr\build\solr-core\test\J0\temp\solr.util.TestSolrCLIRunExample_F89A5455F9A94B92-001\tempDir-001\schemaless\solr\gettingstarted\data\]
   [junit4]   2> 3344724 INFO  (qtp2665325-30979) [    ] o.a.s.r.XSLTResponseWriter xsltCacheLifetimeSeconds=5
   [junit4]   2> 3344935 INFO  (qtp2665325-30979) [    ] o.a.s.u.UpdateHandler Using UpdateLog implementation: org.apache.solr.update.UpdateLog
   [junit4]   2> 3344935 INFO  (qtp2665325-30979) [    ] o.a.s.u.UpdateLog Initializing UpdateLog: dataDir= defaultSyncLevel=FLUSH numRecordsToKeep=100 maxNumLogsToKeep=10 numVersionBuckets=65536
   [junit4]   2> 3344938 INFO  (qtp2665325-30979) [    ] o.a.s.u.CommitTracker Hard AutoCommit: if uncommited for 15000ms; 
   [junit4]   2> 3344938 INFO  (qtp2665325-30979) [    ] o.a.s.u.CommitTracker Soft AutoCommit: disabled
   [junit4]   2> 3344946 INFO  (qtp2665325-30979) [    ] o.a.s.s.SolrIndexSearcher Opening [Searcher@111a8af[gettingstarted] main]
   [junit4]   2> 3344948 INFO  (qtp2665325-30979) [    ] o.a.s.r.ManagedResourceStorage File-based storage initialized to use dir: C:\Users\jenkins\workspace\Lucene-Solr-7.x-Windows\solr\build\solr-core\test\J0\temp\solr.util.TestSolrCLIRunExample_F89A5455F9A94B92-001\tempDir-001\schemaless\solr\gettingstarted\conf
   [junit4]   2> 3344949 INFO  (qtp2665325-30979) [    ] o.a.s.h.c.SpellCheckComponent Initializing spell checkers
   [junit4]   2> 3344950 INFO  (qtp2665325-30979) [    ] o.a.s.s.DirectSolrSpellChecker init: {name=default,field=_text_,classname=solr.DirectSolrSpellChecker,distanceMeasure=internal,accuracy=0.5,maxEdits=2,minPrefix=1,maxInspections=5,minQueryLength=4,maxQueryFrequency=0.01}
   [junit4]   2> 3344952 INFO  (qtp2665325-30979) [    ] o.a.s.h.ReplicationHandler Commits will be reserved for  10000
   [junit4]   2> 3344952 INFO  (searcherExecutor-11941-thread-1) [    ] o.a.s.c.QuerySenderListener QuerySenderListener sending requests to Searcher@111a8af[gettingstarted] main{ExitableDirectoryReader(UninvertingDirectoryReader())}
   [junit4]   2> 3344952 INFO  (searcherExecutor-11941-thread-1) [    ] o.a.s.c.QuerySenderListener QuerySenderListener done.
   [junit4]   2> 3344952 INFO  (searcherExecutor-11941-thread-1) [    ] o.a.s.h.c.SpellCheckComponent Loading spell index for spellchecker: default
   [junit4]   2> 3344952 INFO  (searcherExecutor-11941-thread-1) [    ] o.a.s.c.SolrCore [gettingstarted] Registered new searcher Searcher@111a8af[gettingstarted] main{ExitableDirectoryReader(UninvertingDirectoryReader())}
   [junit4]   2> 3344952 INFO  (qtp2665325-30979) [    ] o.a.s.u.UpdateLog Could not find max version in index or recent updates, using new clock 1574548231644250112
   [junit4]   2> 3344957 INFO  (qtp2665325-30979) [    ] o.a.s.s.HttpSolrCall [admin] webapp=null path=/admin/cores params={name=gettingstarted&action=CREATE&instanceDir=gettingstarted&wt=json} status=0 QTime=752
   [junit4]   2> 3344960 INFO  (TEST-TestSolrCLIRunExample.testSchemalessExample-seed#[F89A5455F9A94B92]) [    ] o.e.j.s.AbstractConnector Stopped ServerConnector@8174be{HTTP/1.1,[http/1.1]}{127.0.0.1:62228}
   [junit4]   2> 3344960 INFO  (TEST-TestSolrCLIRunExample.testSchemalessExample-seed#[F89A5455F9A94B92]) [    ] o.a.s.c.CoreContainer Shutting down CoreContainer instance=32217081
   [junit4]   2> 3344960 INFO  (TEST-TestSolrCLIRunExample.testSchemalessExample-seed#[F89A5455F9A94B92]) [    ] o.a.s.m.SolrMetricManager Closing metric reporters for registry=solr.node, tag=null
   [junit4]   2> 3344964 INFO  (TEST-TestSolrCLIRunExample.testSchemalessExample-seed#[F89A5455F9A94B92]) [    ] o.a.s.m.SolrMetricManager Closing metric reporters for registry=solr.jvm, tag=null
   [junit4]   2> 3344967 INFO  (TEST-TestSolrCLIRunExample.testSchemalessExample-seed#[F89A5455F9A94B92]) [    ] o.a.s.m.SolrMetricManager Closing metric reporters for registry=solr.jetty, tag=null
   [junit4]   2> 3344980 INFO  (coreCloseExecutor-11946-thread-1) [    ] o.a.s.c.SolrCore [gettingstarted]  CLOSING SolrCore org.apache.solr.core.SolrCore@cddd70
   [junit4]   2> 3344982 INFO  (coreCloseExecutor-11946-thread-1) [    ] o.a.s.m.SolrMetricManager Closing metric reporters for registry=solr.core.gettingstarted, tag=13491568
   [junit4]   2> 3344988 INFO  (TEST-TestSolrCLIRunExample.testSchemalessExample-seed#[F89A5455F9A94B92]) [    ] o.e.j.s.h.ContextHandler Stopped o.e.j.s.ServletContextHandler@12f2e55{/solr,null,UNAVAILABLE}
   [junit4]   2> 3344990 INFO  (TEST-TestSolrCLIRunExample.testSchemalessExample-seed#[F89A5455F9A94B92]) [    ] o.a.s.u.TestSolrCLIRunExample Stopped standalone Solr instance running on port 62228
   [junit4]   2> 3344990 INFO  (TEST-TestSolrCLIRunExample.testSchemalessExample-seed#[F89A5455F9A94B92]) [    ] o.a.s.u.TestSolrCLIRunExample Selected port 62248 to start schemaless example Solr instance on ...
   [junit4]   2> 3346025 INFO  (Thread-5799) [    ] o.e.j.s.Server jetty-9.3.14.v20161028
   [junit4]   2> 3346029 INFO  (Thread-5799) [    ] o.e.j.s.h.ContextHandler Started o.e.j.s.ServletContextHandler@1cde862{/solr,null,AVAILABLE}
   [junit4]   2> 3346030 INFO  (Thread-5799) [    ] o.e.j.s.AbstractConnector Started ServerConnector@141ba2a{HTTP/1.1,[http/1.1]}{127.0.0.1:62248}
   [junit4]   2> 3346030 INFO  (Thread-5799) [    ] o.e.j.s.Server Started @3347118ms
   [junit4]   2> 3346030 INFO  (Thread-5799) [    ] o.a.s.c.s.e.JettySolrRunner Jetty properties: {hostContext=/solr, hostPort=62248}
   [junit4]   2> 3346031 ERROR (Thread-5799) [    ] o.a.s.s.StartupLoggingUtils Missing Java Option solr.log.dir. Logging may be missing or incomplete.
   [junit4]   2> 3346031 INFO  (Thread-5799) [    ] o.a.s.s.SolrDispatchFilter  ___      _       Welcome to Apache Solr? version 7.1.0
   [junit4]   2> 3346031 INFO  (Thread-5799) [    ] o.a.s.s.SolrDispatchFilter / __| ___| |_ _   Starting in standalone mode on port 62248
   [junit4]   2> 3346031 INFO  (Thread-5799) [    ] o.a.s.s.SolrDispatchFilter \__ \/ _ \ | '_|  Install dir: null, Default config dir: null
   [junit4]   2> 3346031 INFO  (Thread-5799) [    ] o.a.s.s.SolrDispatchFilter |___/\___/_|_|    Start time: 2017-08-01T16:50:09.541341500Z
   [junit4]   2> 3346032 INFO  (Thread-5799) [    ] o.a.s.c.SolrXmlConfig Loading container configuration from C:\Users\jenkins\workspace\Lucene-Solr-7.x-Windows\solr\build\solr-core\test\J0\temp\solr.util.TestSolrCLIRunExample_F89A5455F9A94B92-001\tempDir-001\schemaless\solr\solr.xml
   [junit4]   2> 3346038 INFO  (Thread-5799) [    ] o.a.s.c.SolrXmlConfig MBean server found: com.sun.jmx.mbeanserver.JmxMBeanServer@7d3d76, but no JMX reporters were configured - adding default JMX reporter.
   [junit4]   2> 3346132 INFO  (Thread-5799) [    ] o.a.s.m.r.SolrJmxReporter JMX monitoring for 'solr.node' (registry 'solr.node') enabled at server: com.sun.jmx.mbeanserver.JmxMBeanServer@7d3d76
   [junit4]   2> 3346137 INFO  (Thread-5799) [    ] o.a.s.m.r.SolrJmxReporter JMX monitoring for 'solr.jvm' (registry 'solr.jvm') enabled at server: com.sun.jmx.mbeanserver.JmxMBeanServer@7d3d76
   [junit4]   2> 3346137 INFO  (Thread-5799) [    ] o.a.s.m.r.SolrJmxReporter JMX monitoring for 'solr.jetty' (registry 'solr.jetty') enabled at server: com.sun.jmx.mbeanserver.JmxMBeanServer@7d3d76
   [junit4]   2> 3346163 INFO  (Thread-5799) [    ] o.a.s.c.CorePropertiesLocator Found 1 core definitions underneath C:\Users\jenkins\workspace\Lucene-Solr-7.x-Windows\solr\build\solr-core\test\J0\temp\solr.util.TestSolrCLIRunExample_F89A5455F9A94B92-001\tempDir-001\schemaless\solr
   [junit4]   2> 3346163 INFO  (Thread-5799) [    ] o.a.s.c.CorePropertiesLocator Cores are: [gettingstarted]
   [junit4]   2> 3346203 WARN  (coreLoadExecutor-11953-thread-1) [    ] o.a.s.c.SolrConfig Couldn't add files from C:\Users\jenkins\workspace\Lucene-Solr-7.x-Windows\solr\build\solr-core\test\J0\temp\solr.util.TestSolrCLIRunExample_F89A5455F9A94B92-001\tempDir-001\schemaless\solr\gettingstarted\..\..\..\..\contrib\extraction\lib filtered by .*\.jar to classpath: C:\Users\jenkins\workspace\Lucene-Solr-7.x-Windows\solr\build\solr-core\test\J0\temp\solr.util.TestSolrCLIRunExample_F89A5455F9A94B92-001\tempDir-001\schemaless\solr\gettingstarted\..\..\..\..\contrib\extraction\lib
   [junit4]   2> 3346204 WARN  (coreLoadExecutor-11953-thread-1) [    ] o.a.s.c.SolrConfig Couldn't add files from C:\Users\jenkins\workspace\Lucene-Solr-7.x-Windows\solr\build\solr-core\test\J0\temp\solr.util.TestSolrCLIRunExample_F89A5455F9A94B92-001\tempDir-001\schemaless\solr\gettingstarted\..\..\..\..\dist filtered by solr-cell-\d.*\.jar to classpath: C:\Users\jenkins\workspace\Lucene-Solr-7.x-Windows\solr\build\solr-core\test\J0\temp\solr.util.TestSolrCLIRunExample_F89A5455F9A94B92-001\tempDir-001\schemaless\solr\gettingstarted\..\..\..\..\dist
   [junit4]   2> 3346204 WARN  (coreLoadExecutor-11953-thread-1) [    ] o.a.s.c.SolrConfig Couldn't add files from C:\Users\jenkins\workspace\Lucene-Solr-7.x-Windows\solr\build\solr-core\test\J0\temp\solr.util.TestSolrCLIRunExample_F89A5455F9A94B92-001\tempDir-001\schemaless\solr\gettingstarted\..\..\..\..\contrib\clustering\lib filtered by .*\.jar to classpath: C:\Users\jenkins\workspace\Lucene-Solr-7.x-Windows\solr\build\solr-core\test\J0\temp\solr.util.TestSolrCLIRunExample_F89A5455F9A94B92-001\tempDir-001\schemaless\solr\gettingstarted\..\..\..\..\contrib\clustering\lib
   [junit4]   2> 3346205 WARN  (coreLoadExecutor-11953-thread-1) [    ] o.a.s.c.SolrConfig Couldn't add files from C:\Users\jenkins\workspace\Lucene-Solr-7.x-Windows\solr\build\solr-core\test\J0\temp\solr.util.TestSolrCLIRunExample_F89A5455F9A94B92-001\tempDir-001\schemaless\solr\gettingstarted\..\..\..\..\dist filtered by solr-clustering-\d.*\.jar to classpath: C:\Users\jenkins\workspace\Lucene-Solr-7.x-Windows\solr\build\solr-core\test\J0\temp\solr.util.TestSolrCLIRunExample_F89A5455F9A94B92-001\tempDir-001\schemaless\solr\gettingstarted\..\..\..\..\dist
   [junit4]   2> 3346206 WARN  (coreLoadExecutor-11953-thread-1) [    ] o.a.s.c.SolrConfig Couldn't add files from C:\Users\jenkins\workspace\Lucene-Solr-7.x-Windows\solr\build\solr-core\test\J0\temp\solr.util.TestSolrCLIRunExample_F89A5455F9A94B92-001\tempDir-001\schemaless\solr\gettingstarted\..\..\..\..\contrib\langid\lib filtered by .*\.jar to classpath: C:\Users\jenkins\workspace\Lucene-Solr-7.x-Windows\solr\build\solr-core\test\J0\temp\solr.util.TestSolrCLIRunExample_F89A5455F9A94B92-001\tempDir-001\schemaless\solr\gettingstarted\..\..\..\..\contrib\langid\lib
   [junit4]   2> 3346207 WARN  (coreLoadExecutor-11953-thread-1) [    ] o.a.s.c.SolrConfig Couldn't add files from C:\Users\jenkins\workspace\Lucene-Solr-7.x-Windows\solr\build\solr-core\test\J0\temp\solr.util.TestSolrCLIRunExample_F89A5455F9A94B92-001\tempDir-001\schemaless\solr\gettingstarted\..\..\..\..\dist filtered by solr-langid-\d.*\.jar to classpath: C:\Users\jenkins\workspace\Lucene-Solr-7.x-Windows\solr\build\solr-core\test\J0\temp\solr.util.TestSolrCLIRunExample_F89A5455F9A94B92-001\tempDir-001\schemaless\solr\gettingstarted\..\..\..\..\dist
   [junit4]   2> 3346208 WARN  (coreLoadExecutor-11953-thread-1) [    ] o.a.s.c.SolrConfig Couldn't add files from C:\Users\jenkins\workspace\Lucene-Solr-7.x-Windows\solr\build\solr-core\test\J0\temp\solr.util.TestSolrCLIRunExample_F89A5455F9A94B92-001\tempDir-001\schemaless\solr\gettingstarted\..\..\..\..\contrib\velocity\lib filtered by .*\.jar to classpath: C:\Users\jenkins\workspace\Lucene-Solr-7.x-Windows\solr\build\solr-core\test\J0\temp\solr.util.TestSolrCLIRunExample_F89A5455F9A94B92-001\tempDir-001\schemaless\solr\gettingstarted\..\..\..\..\contrib\velocity\lib
   [junit4]   2> 3346209 WARN  (coreLoadExecutor-11953-thread-1) [    ] o.a.s.c.SolrConfig Couldn't add files from C:\Users\jenkins\workspace\Lucene-Solr-7.x-Windows\solr\build\solr-core\test\J0\temp\solr.util.TestSolrCLIRunExample_F89A5455F9A94B92-001\tempDir-001\schemaless\solr\gettingstarted\..\..\..\..\dist filtered by solr-velocity-\d.*\.jar to classpath: C:\Users\jenkins\workspace\Lucene-Solr-7.x-Windows\solr\build\solr-core\test\J0\temp\solr.util.TestSolrCLIRunExample_F89A5455F9A94B92-001\tempDir-001\schemaless\solr\gettingstarted\..\..\..\..\dist
   [junit4]   2> 3346219 INFO  (coreLoadExecutor-11953-thread-1) [    ] o.a.s.c.SolrConfig Using Lucene MatchVersion: 7.1.0
   [junit4]   2> 3346260 INFO  (coreLoadExecutor-11953-thread-1) [    ] o.a.s.s.IndexSchema [gettingstarted] Schema name=default-config
   [junit4]   2> 3346663 INFO  (coreLoadExecutor-11953-thread-1) [    ] o.a.s.s.IndexSchema Loaded schema default-config/1.6 with uniqueid field id
   [junit4]   2> 3346744 INFO  (coreLoadExecutor-11953-thread-1) [    ] o.a.s.c.CoreContainer Creating SolrCore 'gettingstarted' using configuration from instancedir C:\Users\jenkins\workspace\Lucene-Solr-7.x-Windows\solr\build\solr-core\test\J0\temp\solr.util.TestSolrCLIRunExample_F89A5455F9A94B92-001\tempDir-001\schemaless\solr\gettingstarted, trusted=true
   [junit4]   2> 3346744 INFO  (coreLoadExecutor-11953-thread-1) [    ] o.a.s.m.r.SolrJmxReporter JMX monitoring for 'solr.core.gettingstarted' (registry 'solr.core.gettingstarted') enabled at server: com.sun.jmx.mbeanserver.JmxMBeanServer@7d3d76
   [junit4]   2> 3346745 INFO  (coreLoadExecutor-11953-thread-1) [    ] o.a.s.c.SolrCore solr.RecoveryStrategy.Builder
   [junit4]   2> 3346745 INFO  (coreLoadExecutor-11953-thread-1) [    ] o.a.s.c.SolrCore [[gettingstarted] ] Opening new SolrCore at [C:\Users\jenkins\workspace\Lucene-Solr-7.x-Windows\solr\build\solr-core\test\J0\temp\solr.util.TestSolrCLIRunExample_F89A5455F9A94B92-001\tempDir-001\schemaless\solr\gettingstarted], dataDir=[C:\Users\jenkins\workspace\Lucene-Solr-7.x-Windows\solr\build\solr-core\test\J0\temp\solr.util.TestSolrCLIRunExample_F89A5455F9A94B92-001\tempDir-001\schemaless\solr\gettingstarted\data\]
   [junit4]   2> 3346753 INFO  (coreLoadExecutor-11953-thread-1) [    ] o.a.s.r.XSLTResponseWriter xsltCacheLifetimeSeconds=5
   [junit4]   2> 3346936 INFO  (coreLoadExecutor-11953-thread-1) [    ] o.a.s.u.UpdateHandler Using UpdateLog implementation: org.apache.solr.update.UpdateLog
   [junit4]   2> 3346936 INFO  (coreLoadExecutor-11953-thread-1) [    ] o.a.s.u.UpdateLog Initializing UpdateLog: dataDir= defaultSyncLevel=FLUSH numRecordsToKeep=100 maxNumLogsToKeep=10 numVersionBuckets=65536
   [junit4]   2> 3346936 INFO  (coreLoadExecutor-11953-thread-1) [    ] o.a.s.u.CommitTracker Hard AutoCommit: if uncommited for 15000ms; 
   [junit4]   2> 3346936 INFO  (coreLoadExecutor-11953-thread-1) [    ] o.a.s.u.CommitTracker Soft AutoCommit: disabled
   [junit4]   2> 3346954 INFO  (coreLoadExecutor-11953-thread-1) [    ] o.a.s.s.SolrIndexSearcher Opening [Searcher@2e1842[gettingstarted] main]
   [junit4]   2> 3346955 INFO  (coreLoadExecutor-11953-thread-1) [    ] o.a.s.r.ManagedResourceStorage File-based storage initialized to use dir: C:\Users\jenkins\workspace\Lucene-Solr-7.x-Windows\solr\build\solr-core\test\J0\temp\solr.util.TestSolrCLIRunExample_F89A5455F9A94B92-001\tempDir-001\schemaless\solr\gettingstarted\conf
   [junit4]   2> 3346956 INFO  (coreLoadExecutor-11953-thread-1) [    ] o.a.s.h.c.SpellCheckComponent Initializing spell checkers
   [junit4]   2> 3346956 INFO  (coreLoadExecutor-11953-thread-1) [    ] o.a.s.s.DirectSolrSpellChecker init: {name=default,field=_text_,classname=solr.DirectSolrSpellChecker,distanceMeasure=internal,accuracy=0.5,maxEdits=2,minPrefix=1,maxInspections=5,minQueryLength=4,maxQueryFrequency=0.01}
   [junit4]   2> 3346958 INFO  (coreLoadExecutor-11953-thread-1) [    ] o.a.s.h.ReplicationHandler Commits will be reserved for  10000
   [junit4]   2> 3346959 INFO  (coreLoadExecutor-11953-thread-1) [    ] o.a.s.u.UpdateLog Could not find max version in index or recent updates, using new clock 1574548233748742144
   [junit4]   2> 3346961 INFO  (searcherExecutor-11954-thread-1) [    ] o.a.s.c.QuerySenderListener QuerySenderListener sending requests to Searcher@2e1842[gettingstarted] main{ExitableDirectoryReader(UninvertingDirectoryReader())}
   [junit4]   2> 3346961 INFO  (searcherExecutor-11954-thread-1) [    ] o.a.s.c.QuerySenderListener QuerySenderListener done.
   [junit4]   2> 3346961 INFO  (searcherExecutor-11954-thread-1) [    ] o.a.s.h.c.SpellCheckComponent Loading spell index for spellchecker: default
   [junit4]   2> 3346963 INFO  (searcherExecutor-11954-thread-1) [    ] o.a.s.c.SolrCore [gettingstarted] Registered new searcher Searcher@2e1842[gettingstarted] main{ExitableDirectoryReader(UninvertingDirectoryReader())}
   [junit4]   2> 3349078 INFO  (qtp25324973-31010) [    ] o.a.s.s.HttpSolrCall [admin] webapp=null path=/admin/info/system params={wt=json} status=0 QTime=40
   [junit4]   2> 3349087 INFO  (qtp25324973-31005) [    ] o.a.s.s.HttpSolrCall [admin] webapp=null path=/admin/cores params={core=gettingstarted&action=STATUS&wt=json} status=0 QTime=1
   [junit4]   2> 3349089 INFO  (TEST-TestSolrCLIRunExample.testSchemalessExample-seed#[F89A5455F9A94B92]) [    ] o.e.j.s.AbstractConnector Stopped ServerConnector@141ba2a{HTTP/1.1,[http/1.1]}{127.0.0.1:62248}
   [junit4]   2> 3349089 INFO  (TEST-TestSolrCLIRunExample.testSchemalessExample-seed#[F89A5455F9A94B92]) [    ] o.a.s.c.CoreContainer Shutting down CoreContainer instance=21724275
   [junit4]   2> 3349090 INFO  (TEST-TestSolrCLIRunExample.testSchemalessExample-seed#[F89A5455F9A94B92]) [    ] o.a.s.m.SolrMetricManager Closing metric reporters for registry=solr.node, tag=null
   [junit4]   2> 3349093 INFO  (TEST-TestSolrCLIRunExample.testSchemalessExample-seed#[F89A5455F9A94B92]) [    ] o.a.s.m.SolrMetricManager Closing metric reporters for registry=solr.jvm, tag=null
   [junit4]   2> 3349096 INFO  (TEST-TestSolrCLIRunExample.testSchemalessExample-seed#[F89A5455F9A94B92]) [    ] o.a.s.m.SolrMetricManager Closing metric reporters for registry=solr.jetty, tag=null
   [junit4]   2> 3349099 INFO  (TEST-TestSolrCLIRunExample.testSchemalessExample-seed#[F89A5455F9A94B92]) [    ] o.a.s.c.TransientSolrCoreCacheDefault Allocating transient cache for 2147483647 transient cores
   [junit4]   2> 3349102 INFO  (coreCloseExecutor-11959-thread-1) [    ] o.a.s.c.SolrCore [gettingstarted]  CLOSING SolrCore org.apache.solr.core.SolrCore@1fbb92e
   [junit4]   2> 3349105 INFO  (coreCloseExecutor-11959-thread-1) [    ] o.a.s.m.SolrMetricManager Closing metric reporters for registry=solr.core.gettingstarted, tag=33274158
   [junit4]   2> 3349111 INFO  (TEST-TestSolrCLIRunExample.testSchemalessExample-seed#[F89A5455F9A94B92]) [    ] o.e.j.s.h.ContextHandler Stopped o.e.j.s.ServletContextHandler@1cde862{/solr,null,UNAVAILABLE}
   [junit4]   2> 3349113 INFO  (TEST-TestSolrCLIRunExample.testSchemalessExample-seed#[F89A5455F9A94B92]) [    ] o.a.s.u.TestSolrCLIRunExample Stopped standalone Solr instance running on port 62248
   [junit4]   2> 3349113 INFO  (TEST-TestSolrCLIRunExample.testSchemalessExample-seed#[F89A5455F9A94B92]) [    ] o.a.s.SolrTestCaseJ4 ###Ending testSchemalessExample
   [junit4]   2> 3349117 INFO  (TEST-TestSolrCLIRunExample.testFailExecuteScript-seed#[F89A5455F9A94B92]) [    ] o.a.s.SolrTestCaseJ4 ###Starting testFailExecuteScript
   [junit4]   2> 
   [junit4]   2> ERROR: Failed to start Solr using command: "C:\Users\jenkins\workspace\Lucene-Solr-7.x-Windows\solr\buil

[...truncated too long message...]

eJettyTest, TermsResponseTest, TestCoreAdmin, TestJavaBinCodec, SolrQueryTest, ModifiableSolrParamsTest, DocumentAnalysisResponseTest, SolrDocumentTest, TestUpdateRequestCodec, FieldAnalysisResponseTest, NamedListTest, GetByIdTest, TestLBHttpSolrClient, StreamExpressionTest]
   [junit4] Completed [135/135 (1!)] on J1 in 80.59s, 93 tests, 1 error, 9 skipped <<< FAILURES!

[...truncated 1 lines...]
   [junit4] JVM J1: stderr was not empty, see: C:\Users\jenkins\workspace\Lucene-Solr-7.x-Windows\solr\build\solr-solrj\test\temp\junit4-J1-20170801_165115_40117284410135949358026.syserr
   [junit4] >>> JVM J1 emitted unexpected output (verbatim) ----
   [junit4] Java HotSpot(TM) Server VM warning: Option UseConcMarkSweepGC was deprecated in version 9.0 and will likely be removed in a future release.
   [junit4] <<< JVM J1: EOF ----

[...truncated 1243 lines...]
   [junit4] JVM J1: stderr was not empty, see: C:\Users\jenkins\workspace\Lucene-Solr-7.x-Windows\solr\build\contrib\solr-analysis-extras\test\temp\junit4-J1-20170801_165545_06918429658562160321361.syserr
   [junit4] >>> JVM J1 emitted unexpected output (verbatim) ----
   [junit4] Java HotSpot(TM) Server VM warning: Option UseConcMarkSweepGC was deprecated in version 9.0 and will likely be removed in a future release.
   [junit4] <<< JVM J1: EOF ----

[...truncated 3 lines...]
   [junit4] JVM J0: stderr was not empty, see: C:\Users\jenkins\workspace\Lucene-Solr-7.x-Windows\solr\build\contrib\solr-analysis-extras\test\temp\junit4-J0-20170801_165545_0698154916265313470876.syserr
   [junit4] >>> JVM J0 emitted unexpected output (verbatim) ----
   [junit4] Java HotSpot(TM) Server VM warning: Option UseConcMarkSweepGC was deprecated in version 9.0 and will likely be removed in a future release.
   [junit4] <<< JVM J0: EOF ----

[...truncated 548 lines...]
   [junit4] JVM J0: stderr was not empty, see: C:\Users\jenkins\workspace\Lucene-Solr-7.x-Windows\solr\build\contrib\solr-analytics\test\temp\junit4-J0-20170801_165617_82015861958743481281654.syserr
   [junit4] >>> JVM J0 emitted unexpected output (verbatim) ----
   [junit4] Java HotSpot(TM) Server VM warning: Option UseConcMarkSweepGC was deprecated in version 9.0 and will likely be removed in a future release.
   [junit4] <<< JVM J0: EOF ----

[...truncated 3 lines...]
   [junit4] JVM J1: stderr was not empty, see: C:\Users\jenkins\workspace\Lucene-Solr-7.x-Windows\solr\build\contrib\solr-analytics\test\temp\junit4-J1-20170801_165617_82018085380627495937248.syserr
   [junit4] >>> JVM J1 emitted unexpected output (verbatim) ----
   [junit4] Java HotSpot(TM) Server VM warning: Option UseConcMarkSweepGC was deprecated in version 9.0 and will likely be removed in a future release.
   [junit4] <<< JVM J1: EOF ----

[...truncated 500 lines...]
   [junit4] JVM J1: stderr was not empty, see: C:\Users\jenkins\workspace\Lucene-Solr-7.x-Windows\solr\build\contrib\solr-clustering\test\temp\junit4-J1-20170801_165715_9156804072318884305642.syserr
   [junit4] >>> JVM J1 emitted unexpected output (verbatim) ----
   [junit4] Java HotSpot(TM) Server VM warning: Option UseConcMarkSweepGC was deprecated in version 9.0 and will likely be removed in a future release.
   [junit4] <<< JVM J1: EOF ----

[...truncated 3 lines...]
   [junit4] JVM J0: stderr was not empty, see: C:\Users\jenkins\workspace\Lucene-Solr-7.x-Windows\solr\build\contrib\solr-clustering\test\temp\junit4-J0-20170801_165715_91515239789587063289057.syserr
   [junit4] >>> JVM J0 emitted unexpected output (verbatim) ----
   [junit4] Java HotSpot(TM) Server VM warning: Option UseConcMarkSweepGC was deprecated in version 9.0 and will likely be removed in a future release.
   [junit4] <<< JVM J0: EOF ----

[...truncated 1130 lines...]
   [junit4] JVM J1: stderr was not empty, see: C:\Users\jenkins\workspace\Lucene-Solr-7.x-Windows\solr\build\contrib\solr-dataimporthandler-extras\test\temp\junit4-J1-20170801_165801_83015627772186664498973.syserr
   [junit4] >>> JVM J1 emitted unexpected output (verbatim) ----
   [junit4] Java HotSpot(TM) Server VM warning: Option UseConcMarkSweepGC was deprecated in version 9.0 and will likely be removed in a future release.
   [junit4] <<< JVM J1: EOF ----

[...truncated 3 lines...]
   [junit4] JVM J0: stderr was not empty, see: C:\Users\jenkins\workspace\Lucene-Solr-7.x-Windows\solr\build\contrib\solr-dataimporthandler-extras\test\temp\junit4-J0-20170801_165801_84414075157471277291602.syserr
   [junit4] >>> JVM J0 emitted unexpected output (verbatim) ----
   [junit4] Java HotSpot(TM) Server VM warning: Option UseConcMarkSweepGC was deprecated in version 9.0 and will likely be removed in a future release.
   [junit4] <<< JVM J0: EOF ----

[...truncated 554 lines...]
   [junit4] JVM J0: stderr was not empty, see: C:\Users\jenkins\workspace\Lucene-Solr-7.x-Windows\solr\build\contrib\solr-dataimporthandler\test\temp\junit4-J0-20170801_165823_530211841431301051024.syserr
   [junit4] >>> JVM J0 emitted unexpected output (verbatim) ----
   [junit4] Java HotSpot(TM) Server VM warning: Option UseConcMarkSweepGC was deprecated in version 9.0 and will likely be removed in a future release.
   [junit4] <<< JVM J0: EOF ----

[...truncated 42 lines...]
   [junit4] JVM J1: stderr was not empty, see: C:\Users\jenkins\workspace\Lucene-Solr-7.x-Windows\solr\build\contrib\solr-dataimporthandler\test\temp\junit4-J1-20170801_165823_5304140439464077644927.syserr
   [junit4] >>> JVM J1 emitted unexpected output (verbatim) ----
   [junit4] Java HotSpot(TM) Server VM warning: Option UseConcMarkSweepGC was deprecated in version 9.0 and will likely be removed in a future release.
   [junit4] <<< JVM J1: EOF ----

[...truncated 504 lines...]
   [junit4] JVM J1: stderr was not empty, see: C:\Users\jenkins\workspace\Lucene-Solr-7.x-Windows\solr\build\contrib\solr-cell\test\temp\junit4-J1-20170801_165911_045865824755942816267.syserr
   [junit4] >>> JVM J1 emitted unexpected output (verbatim) ----
   [junit4] Java HotSpot(TM) Server VM warning: Option UseConcMarkSweepGC was deprecated in version 9.0 and will likely be removed in a future release.
   [junit4] <<< JVM J1: EOF ----

[...truncated 3 lines...]
   [junit4] JVM J0: stderr was not empty, see: C:\Users\jenkins\workspace\Lucene-Solr-7.x-Windows\solr\build\contrib\solr-cell\test\temp\junit4-J0-20170801_165911_04517127154244650896020.syserr
   [junit4] >>> JVM J0 emitted unexpected output (verbatim) ----
   [junit4] Java HotSpot(TM) Server VM warning: Option UseConcMarkSweepGC was deprecated in version 9.0 and will likely be removed in a future release.
   [junit4] <<< JVM J0: EOF ----

[...truncated 506 lines...]
   [junit4] JVM J1: stderr was not empty, see: C:\Users\jenkins\workspace\Lucene-Solr-7.x-Windows\solr\build\contrib\solr-langid\test\temp\junit4-J1-20170801_165939_16111179010290374489391.syserr
   [junit4] >>> JVM J1 emitted unexpected output (verbatim) ----
   [junit4] Java HotSpot(TM) Server VM warning: Option UseConcMarkSweepGC was deprecated in version 9.0 and will likely be removed in a future release.
   [junit4] <<< JVM J1: EOF ----

   [junit4] JVM J0: stderr was not empty, see: C:\Users\jenkins\workspace\Lucene-Solr-7.x-Windows\solr\build\contrib\solr-langid\test\temp\junit4-J0-20170801_165939_16118366109096483177160.syserr
   [junit4] >>> JVM J0 emitted unexpected output (verbatim) ----
   [junit4] Java HotSpot(TM) Server VM warning: Option UseConcMarkSweepGC was deprecated in version 9.0 and will likely be removed in a future release.
   [junit4] <<< JVM J0: EOF ----

[...truncated 595 lines...]
   [junit4] JVM J0: stderr was not empty, see: C:\Users\jenkins\workspace\Lucene-Solr-7.x-Windows\solr\build\contrib\solr-ltr\test\temp\junit4-J0-20170801_170000_6189697409673104524805.syserr
   [junit4] >>> JVM J0 emitted unexpected output (verbatim) ----
   [junit4] Java HotSpot(TM) Server VM warning: Option UseConcMarkSweepGC was deprecated in version 9.0 and will likely be removed in a future release.
   [junit4] <<< JVM J0: EOF ----

[...truncated 3 lines...]
   [junit4] JVM J1: stderr was not empty, see: C:\Users\jenkins\workspace\Lucene-Solr-7.x-Windows\solr\build\contrib\solr-ltr\test\temp\junit4-J1-20170801_170000_6186679727498315867322.syserr
   [junit4] >>> JVM J1 emitted unexpected output (verbatim) ----
   [junit4] Java HotSpot(TM) Server VM warning: Option UseConcMarkSweepGC was deprecated in version 9.0 and will likely be removed in a future release.
   [junit4] <<< JVM J1: EOF ----

[...truncated 538 lines...]
   [junit4] JVM J1: stderr was not empty, see: C:\Users\jenkins\workspace\Lucene-Solr-7.x-Windows\solr\build\contrib\solr-uima\test\temp\junit4-J1-20170801_170055_98311457601211117831988.syserr
   [junit4] >>> JVM J1 emitted unexpected output (verbatim) ----
   [junit4] Java HotSpot(TM) Server VM warning: Option UseConcMarkSweepGC was deprecated in version 9.0 and will likely be removed in a future release.
   [junit4] <<< JVM J1: EOF ----

[...truncated 3 lines...]
   [junit4] JVM J0: stderr was not empty, see: C:\Users\jenkins\workspace\Lucene-Solr-7.x-Windows\solr\build\contrib\solr-uima\test\temp\junit4-J0-20170801_170055_9838169353861279965620.syserr
   [junit4] >>> JVM J0 emitted unexpected output (verbatim) ----
   [junit4] Java HotSpot(TM) Server VM warning: Option UseConcMarkSweepGC was deprecated in version 9.0 and will likely be removed in a future release.
   [junit4] <<< JVM J0: EOF ----

[...truncated 495 lines...]
   [junit4] JVM J0: stderr was not empty, see: C:\Users\jenkins\workspace\Lucene-Solr-7.x-Windows\solr\build\contrib\solr-velocity\test\temp\junit4-J0-20170801_170121_4436158800827221244763.syserr
   [junit4] >>> JVM J0 emitted unexpected output (verbatim) ----
   [junit4] Java HotSpot(TM) Server VM warning: Option UseConcMarkSweepGC was deprecated in version 9.0 and will likely be removed in a future release.
   [junit4] <<< JVM J0: EOF ----

[...truncated 28998 lines...]

Mime
View raw message