lucene-dev mailing list archives

Site index · List index
Message view « Date » · « Thread »
Top « Date » · « Thread »
From Policeman Jenkins Server <jenk...@thetaphi.de>
Subject [JENKINS] Lucene-Solr-7.x-Solaris (64bit/jdk1.8.0) - Build # 113 - Unstable!
Date Mon, 14 Aug 2017 17:43:28 GMT
Build: https://jenkins.thetaphi.de/job/Lucene-Solr-7.x-Solaris/113/
Java: 64bit/jdk1.8.0 -XX:+UseCompressedOops -XX:+UseConcMarkSweepGC

1 tests failed.
FAILED:  org.apache.solr.update.AutoCommitTest.testMaxTime

Error Message:
Exception during query

Stack Trace:
java.lang.RuntimeException: Exception during query
	at __randomizedtesting.SeedInfo.seed([D5F572E7D3D271FA:4F010F054D48EDC6]:0)
	at org.apache.solr.SolrTestCaseJ4.assertQ(SolrTestCaseJ4.java:886)
	at org.apache.solr.update.AutoCommitTest.testMaxTime(AutoCommitTest.java:270)
	at sun.reflect.NativeMethodAccessorImpl.invoke0(Native Method)
	at sun.reflect.NativeMethodAccessorImpl.invoke(NativeMethodAccessorImpl.java:62)
	at sun.reflect.DelegatingMethodAccessorImpl.invoke(DelegatingMethodAccessorImpl.java:43)
	at java.lang.reflect.Method.invoke(Method.java:498)
	at com.carrotsearch.randomizedtesting.RandomizedRunner.invoke(RandomizedRunner.java:1713)
	at com.carrotsearch.randomizedtesting.RandomizedRunner$8.evaluate(RandomizedRunner.java:907)
	at com.carrotsearch.randomizedtesting.RandomizedRunner$9.evaluate(RandomizedRunner.java:943)
	at com.carrotsearch.randomizedtesting.RandomizedRunner$10.evaluate(RandomizedRunner.java:957)
	at com.carrotsearch.randomizedtesting.rules.SystemPropertiesRestoreRule$1.evaluate(SystemPropertiesRestoreRule.java:57)
	at org.apache.lucene.util.TestRuleSetupTeardownChained$1.evaluate(TestRuleSetupTeardownChained.java:49)
	at org.apache.lucene.util.AbstractBeforeAfterRule$1.evaluate(AbstractBeforeAfterRule.java:45)
	at org.apache.lucene.util.TestRuleThreadAndTestName$1.evaluate(TestRuleThreadAndTestName.java:48)
	at org.apache.lucene.util.TestRuleIgnoreAfterMaxFailures$1.evaluate(TestRuleIgnoreAfterMaxFailures.java:64)
	at org.apache.lucene.util.TestRuleMarkFailure$1.evaluate(TestRuleMarkFailure.java:47)
	at com.carrotsearch.randomizedtesting.rules.StatementAdapter.evaluate(StatementAdapter.java:36)
	at com.carrotsearch.randomizedtesting.ThreadLeakControl$StatementRunner.run(ThreadLeakControl.java:368)
	at com.carrotsearch.randomizedtesting.ThreadLeakControl.forkTimeoutingTask(ThreadLeakControl.java:817)
	at com.carrotsearch.randomizedtesting.ThreadLeakControl$3.evaluate(ThreadLeakControl.java:468)
	at com.carrotsearch.randomizedtesting.RandomizedRunner.runSingleTest(RandomizedRunner.java:916)
	at com.carrotsearch.randomizedtesting.RandomizedRunner$5.evaluate(RandomizedRunner.java:802)
	at com.carrotsearch.randomizedtesting.RandomizedRunner$6.evaluate(RandomizedRunner.java:852)
	at com.carrotsearch.randomizedtesting.RandomizedRunner$7.evaluate(RandomizedRunner.java:863)
	at com.carrotsearch.randomizedtesting.rules.StatementAdapter.evaluate(StatementAdapter.java:36)
	at com.carrotsearch.randomizedtesting.rules.SystemPropertiesRestoreRule$1.evaluate(SystemPropertiesRestoreRule.java:57)
	at org.apache.lucene.util.AbstractBeforeAfterRule$1.evaluate(AbstractBeforeAfterRule.java:45)
	at com.carrotsearch.randomizedtesting.rules.StatementAdapter.evaluate(StatementAdapter.java:36)
	at org.apache.lucene.util.TestRuleStoreClassName$1.evaluate(TestRuleStoreClassName.java:41)
	at com.carrotsearch.randomizedtesting.rules.NoShadowingOrOverridesOnMethodsRule$1.evaluate(NoShadowingOrOverridesOnMethodsRule.java:40)
	at com.carrotsearch.randomizedtesting.rules.NoShadowingOrOverridesOnMethodsRule$1.evaluate(NoShadowingOrOverridesOnMethodsRule.java:40)
	at com.carrotsearch.randomizedtesting.rules.StatementAdapter.evaluate(StatementAdapter.java:36)
	at com.carrotsearch.randomizedtesting.rules.StatementAdapter.evaluate(StatementAdapter.java:36)
	at com.carrotsearch.randomizedtesting.rules.StatementAdapter.evaluate(StatementAdapter.java:36)
	at org.apache.lucene.util.TestRuleAssertionsRequired$1.evaluate(TestRuleAssertionsRequired.java:53)
	at org.apache.lucene.util.TestRuleMarkFailure$1.evaluate(TestRuleMarkFailure.java:47)
	at org.apache.lucene.util.TestRuleIgnoreAfterMaxFailures$1.evaluate(TestRuleIgnoreAfterMaxFailures.java:64)
	at org.apache.lucene.util.TestRuleIgnoreTestSuites$1.evaluate(TestRuleIgnoreTestSuites.java:54)
	at com.carrotsearch.randomizedtesting.rules.StatementAdapter.evaluate(StatementAdapter.java:36)
	at com.carrotsearch.randomizedtesting.ThreadLeakControl$StatementRunner.run(ThreadLeakControl.java:368)
	at java.lang.Thread.run(Thread.java:748)
Caused by: java.lang.RuntimeException: REQUEST FAILED: xpath=//result[@numFound=1]
	xml response was: <?xml version="1.0" encoding="UTF-8"?>
<response>
<lst name="responseHeader"><int name="status">0</int><int name="QTime">0</int></lst><result name="response" numFound="0" start="0"></result>
</response>

	request was:q=id:529&qt=&start=0&rows=20&version=2.2
	at org.apache.solr.SolrTestCaseJ4.assertQ(SolrTestCaseJ4.java:879)
	... 40 more




Build Log:
[...truncated 11869 lines...]
   [junit4] Suite: org.apache.solr.update.AutoCommitTest
   [junit4]   2> 2250712 INFO  (SUITE-AutoCommitTest-seed#[D5F572E7D3D271FA]-worker) [    ] o.a.s.SolrTestCaseJ4 SecureRandom sanity checks: test.solr.allowed.securerandom=null & java.security.egd=file:/dev/./urandom
   [junit4]   2> Creating dataDir: /export/home/jenkins/workspace/Lucene-Solr-7.x-Solaris/solr/build/solr-core/test/J1/temp/solr.update.AutoCommitTest_D5F572E7D3D271FA-001/init-core-data-001
   [junit4]   2> 2250712 WARN  (SUITE-AutoCommitTest-seed#[D5F572E7D3D271FA]-worker) [    ] o.a.s.SolrTestCaseJ4 startTrackingSearchers: numOpens=2 numCloses=2
   [junit4]   2> 2250713 INFO  (SUITE-AutoCommitTest-seed#[D5F572E7D3D271FA]-worker) [    ] o.a.s.SolrTestCaseJ4 Using PointFields (NUMERIC_POINTS_SYSPROP=true) w/NUMERIC_DOCVALUES_SYSPROP=true
   [junit4]   2> 2250714 INFO  (SUITE-AutoCommitTest-seed#[D5F572E7D3D271FA]-worker) [    ] o.a.s.SolrTestCaseJ4 Randomized ssl (false) and clientAuth (true) via: @org.apache.solr.util.RandomizeSSL(reason=, value=NaN, ssl=NaN, clientAuth=NaN)
   [junit4]   2> 2250714 INFO  (SUITE-AutoCommitTest-seed#[D5F572E7D3D271FA]-worker) [    ] o.a.s.SolrTestCaseJ4 ####initCore
   [junit4]   2> 2250714 INFO  (SUITE-AutoCommitTest-seed#[D5F572E7D3D271FA]-worker) [    ] o.a.s.c.SolrResourceLoader [null] Added 2 libs to classloader, from paths: [/export/home/jenkins/workspace/Lucene-Solr-7.x-Solaris/solr/core/src/test-files/solr/collection1/lib, /export/home/jenkins/workspace/Lucene-Solr-7.x-Solaris/solr/core/src/test-files/solr/collection1/lib/classes]
   [junit4]   2> 2250738 INFO  (SUITE-AutoCommitTest-seed#[D5F572E7D3D271FA]-worker) [    ] o.a.s.c.SolrConfig Using Lucene MatchVersion: 7.1.0
   [junit4]   2> 2250755 INFO  (SUITE-AutoCommitTest-seed#[D5F572E7D3D271FA]-worker) [    ] o.a.s.s.IndexSchema [null] Schema name=test
   [junit4]   2> 2251078 INFO  (SUITE-AutoCommitTest-seed#[D5F572E7D3D271FA]-worker) [    ] o.a.s.s.IndexSchema Loaded schema test/1.0 with uniqueid field id
   [junit4]   2> 2251211 INFO  (SUITE-AutoCommitTest-seed#[D5F572E7D3D271FA]-worker) [    ] o.a.s.m.r.SolrJmxReporter JMX monitoring for 'solr.node' (registry 'solr.node') enabled at server: com.sun.jmx.mbeanserver.JmxMBeanServer@41000ccb
   [junit4]   2> 2251217 INFO  (SUITE-AutoCommitTest-seed#[D5F572E7D3D271FA]-worker) [    ] o.a.s.m.r.SolrJmxReporter JMX monitoring for 'solr.jvm' (registry 'solr.jvm') enabled at server: com.sun.jmx.mbeanserver.JmxMBeanServer@41000ccb
   [junit4]   2> 2251217 INFO  (SUITE-AutoCommitTest-seed#[D5F572E7D3D271FA]-worker) [    ] o.a.s.m.r.SolrJmxReporter JMX monitoring for 'solr.jetty' (registry 'solr.jetty') enabled at server: com.sun.jmx.mbeanserver.JmxMBeanServer@41000ccb
   [junit4]   2> 2251218 INFO  (coreLoadExecutor-6086-thread-1) [    x:collection1] o.a.s.c.SolrResourceLoader [null] Added 2 libs to classloader, from paths: [/export/home/jenkins/workspace/Lucene-Solr-7.x-Solaris/solr/core/src/test-files/solr/collection1/lib, /export/home/jenkins/workspace/Lucene-Solr-7.x-Solaris/solr/core/src/test-files/solr/collection1/lib/classes]
   [junit4]   2> 2251246 INFO  (coreLoadExecutor-6086-thread-1) [    x:collection1] o.a.s.c.SolrConfig Using Lucene MatchVersion: 7.1.0
   [junit4]   2> 2251261 INFO  (coreLoadExecutor-6086-thread-1) [    x:collection1] o.a.s.s.IndexSchema [collection1] Schema name=test
   [junit4]   2> 2251354 INFO  (coreLoadExecutor-6086-thread-1) [    x:collection1] o.a.s.s.IndexSchema Loaded schema test/1.0 with uniqueid field id
   [junit4]   2> 2251360 INFO  (coreLoadExecutor-6086-thread-1) [    x:collection1] o.a.s.c.CoreContainer Creating SolrCore 'collection1' using configuration from instancedir /export/home/jenkins/workspace/Lucene-Solr-7.x-Solaris/solr/core/src/test-files/solr/collection1, trusted=true
   [junit4]   2> 2251360 INFO  (coreLoadExecutor-6086-thread-1) [    x:collection1] o.a.s.m.r.SolrJmxReporter JMX monitoring for 'solr.core.collection1' (registry 'solr.core.collection1') enabled at server: com.sun.jmx.mbeanserver.JmxMBeanServer@41000ccb
   [junit4]   2> 2251360 INFO  (coreLoadExecutor-6086-thread-1) [    x:collection1] o.a.s.c.SolrCore solr.RecoveryStrategy.Builder
   [junit4]   2> 2251360 INFO  (coreLoadExecutor-6086-thread-1) [    x:collection1] o.a.s.c.SolrCore [[collection1] ] Opening new SolrCore at [/export/home/jenkins/workspace/Lucene-Solr-7.x-Solaris/solr/core/src/test-files/solr/collection1], dataDir=[/export/home/jenkins/workspace/Lucene-Solr-7.x-Solaris/solr/build/solr-core/test/J1/temp/solr.update.AutoCommitTest_D5F572E7D3D271FA-001/init-core-data-001/]
   [junit4]   2> 2251361 INFO  (coreLoadExecutor-6086-thread-1) [    x:collection1] o.a.s.u.RandomMergePolicy RandomMergePolicy wrapping class org.apache.lucene.index.TieredMergePolicy: [TieredMergePolicy: maxMergeAtOnce=17, maxMergeAtOnceExplicit=49, maxMergedSegmentMB=46.69140625, floorSegmentMB=1.716796875, forceMergeDeletesPctAllowed=19.055739232002903, segmentsPerTier=29.0, maxCFSSegmentSizeMB=8.796093022207999E12, noCFSRatio=0.6806962400697583
   [junit4]   2> 2251408 INFO  (coreLoadExecutor-6086-thread-1) [    x:collection1] o.a.s.u.UpdateHandler Using UpdateLog implementation: org.apache.solr.update.UpdateLog
   [junit4]   2> 2251408 INFO  (coreLoadExecutor-6086-thread-1) [    x:collection1] o.a.s.u.UpdateLog Initializing UpdateLog: dataDir= defaultSyncLevel=FLUSH numRecordsToKeep=100 maxNumLogsToKeep=10 numVersionBuckets=65536
   [junit4]   2> 2251409 INFO  (coreLoadExecutor-6086-thread-1) [    x:collection1] o.a.s.u.CommitTracker Hard AutoCommit: disabled
   [junit4]   2> 2251409 INFO  (coreLoadExecutor-6086-thread-1) [    x:collection1] o.a.s.u.CommitTracker Soft AutoCommit: disabled
   [junit4]   2> 2251409 INFO  (coreLoadExecutor-6086-thread-1) [    x:collection1] o.a.s.u.RandomMergePolicy RandomMergePolicy wrapping class org.apache.lucene.index.TieredMergePolicy: [TieredMergePolicy: maxMergeAtOnce=18, maxMergeAtOnceExplicit=26, maxMergedSegmentMB=57.19140625, floorSegmentMB=1.18359375, forceMergeDeletesPctAllowed=14.357922884891579, segmentsPerTier=13.0, maxCFSSegmentSizeMB=8.796093022207999E12, noCFSRatio=0.32268147191468777
   [junit4]   2> 2251409 INFO  (coreLoadExecutor-6086-thread-1) [    x:collection1] o.a.s.s.SolrIndexSearcher Opening [Searcher@c269e69[collection1] main]
   [junit4]   2> 2251410 INFO  (coreLoadExecutor-6086-thread-1) [    x:collection1] o.a.s.h.c.SpellCheckComponent Initializing spell checkers
   [junit4]   2> 2251413 INFO  (coreLoadExecutor-6086-thread-1) [    x:collection1] o.a.s.s.DirectSolrSpellChecker init: {name=direct,classname=DirectSolrSpellChecker,field=lowerfilt,minQueryLength=3}
   [junit4]   2> 2251428 INFO  (coreLoadExecutor-6086-thread-1) [    x:collection1] o.a.s.h.ReplicationHandler Commits will be reserved for  10000
   [junit4]   2> 2251429 INFO  (coreLoadExecutor-6086-thread-1) [    x:collection1] o.a.s.u.UpdateLog Could not find max version in index or recent updates, using new clock 1575725724144238592
   [junit4]   2> 2251429 INFO  (searcherExecutor-6087-thread-1-processing-x:collection1) [    x:collection1] o.a.s.h.c.SpellCheckComponent Loading spell index for spellchecker: default
   [junit4]   2> 2251429 INFO  (searcherExecutor-6087-thread-1-processing-x:collection1) [    x:collection1] o.a.s.h.c.SpellCheckComponent Loading spell index for spellchecker: direct
   [junit4]   2> 2251429 INFO  (searcherExecutor-6087-thread-1-processing-x:collection1) [    x:collection1] o.a.s.h.c.SpellCheckComponent Loading spell index for spellchecker: wordbreak
   [junit4]   2> 2251429 INFO  (searcherExecutor-6087-thread-1-processing-x:collection1) [    x:collection1] o.a.s.h.c.SpellCheckComponent Loading spell index for spellchecker: multipleFields
   [junit4]   2> 2251430 INFO  (searcherExecutor-6087-thread-1-processing-x:collection1) [    x:collection1] o.a.s.h.c.SpellCheckComponent Loading spell index for spellchecker: jarowinkler
   [junit4]   2> 2251430 INFO  (searcherExecutor-6087-thread-1-processing-x:collection1) [    x:collection1] o.a.s.h.c.SpellCheckComponent Loading spell index for spellchecker: external
   [junit4]   2> 2251430 INFO  (searcherExecutor-6087-thread-1-processing-x:collection1) [    x:collection1] o.a.s.h.c.SpellCheckComponent Loading spell index for spellchecker: freq
   [junit4]   2> 2251431 INFO  (searcherExecutor-6087-thread-1-processing-x:collection1) [    x:collection1] o.a.s.h.c.SpellCheckComponent Loading spell index for spellchecker: fqcn
   [junit4]   2> 2251431 INFO  (searcherExecutor-6087-thread-1-processing-x:collection1) [    x:collection1] o.a.s.h.c.SpellCheckComponent Loading spell index for spellchecker: perDict
   [junit4]   2> 2251432 INFO  (SUITE-AutoCommitTest-seed#[D5F572E7D3D271FA]-worker) [    ] o.a.s.SolrTestCaseJ4 ####initCore end
   [junit4]   2> 2251432 INFO  (searcherExecutor-6087-thread-1-processing-x:collection1) [    x:collection1] o.a.s.c.SolrCore [collection1] Registered new searcher Searcher@c269e69[collection1] main{ExitableDirectoryReader(UninvertingDirectoryReader())}
   [junit4]   2> 2251435 INFO  (TEST-AutoCommitTest.testMaxDocs-seed#[D5F572E7D3D271FA]) [    ] o.a.s.SolrTestCaseJ4 ###Starting testMaxDocs
   [junit4]   2> 2251435 INFO  (TEST-AutoCommitTest.testMaxDocs-seed#[D5F572E7D3D271FA]) [    ] o.a.s.u.DirectUpdateHandler2 [collection1] REMOVING ALL DOCUMENTS FROM INDEX
   [junit4]   2> 2251435 INFO  (TEST-AutoCommitTest.testMaxDocs-seed#[D5F572E7D3D271FA]) [    ] o.a.s.s.SolrIndexSearcher Opening [Searcher@2feb1a3d[collection1] realtime]
   [junit4]   2> 2251436 INFO  (TEST-AutoCommitTest.testMaxDocs-seed#[D5F572E7D3D271FA]) [    ] o.a.s.u.p.LogUpdateProcessorFactory [collection1]  webapp=null path=null params={_version_=-9223372036854775807&update.distrib=FROMLEADER&versions=true&wt=json&indent=true}{deleteByQuery=*:* (-9223372036854775807)} 0 0
   [junit4]   2> 2251436 ERROR (TEST-AutoCommitTest.testMaxDocs-seed#[D5F572E7D3D271FA]) [    ] o.a.s.c.CorePropertiesLocator Couldn't load core descriptor from /export/home/jenkins/workspace/Lucene-Solr-7.x-Solaris/solr/core/src/test-files/solr/collection1/core.properties:java.nio.file.NoSuchFileException: /export/home/jenkins/workspace/Lucene-Solr-7.x-Solaris/solr/core/src/test-files/solr/collection1/core.properties
   [junit4]   2> 2251437 INFO  (TEST-AutoCommitTest.testMaxDocs-seed#[D5F572E7D3D271FA]) [    ] o.a.s.c.SolrResourceLoader [null] Added 2 libs to classloader, from paths: [/export/home/jenkins/workspace/Lucene-Solr-7.x-Solaris/solr/core/src/test-files/solr/collection1/lib, /export/home/jenkins/workspace/Lucene-Solr-7.x-Solaris/solr/core/src/test-files/solr/collection1/lib/classes]
   [junit4]   2> 2251477 INFO  (TEST-AutoCommitTest.testMaxDocs-seed#[D5F572E7D3D271FA]) [    ] o.a.s.c.SolrConfig Using Lucene MatchVersion: 7.1.0
   [junit4]   2> 2251503 INFO  (TEST-AutoCommitTest.testMaxDocs-seed#[D5F572E7D3D271FA]) [    ] o.a.s.s.IndexSchema [collection1] Schema name=test
   [junit4]   2> 2251594 INFO  (TEST-AutoCommitTest.testMaxDocs-seed#[D5F572E7D3D271FA]) [    ] o.a.s.s.IndexSchema Loaded schema test/1.0 with uniqueid field id
   [junit4]   2> 2251601 INFO  (TEST-AutoCommitTest.testMaxDocs-seed#[D5F572E7D3D271FA]) [    ] o.a.s.c.CoreContainer Reloading SolrCore 'collection1' using configuration from instancedir /export/home/jenkins/workspace/Lucene-Solr-7.x-Solaris/solr/core/src/test-files/solr/collection1
   [junit4]   2> 2251631 INFO  (TEST-AutoCommitTest.testMaxDocs-seed#[D5F572E7D3D271FA]) [    x:collection1] o.a.s.m.r.SolrJmxReporter JMX monitoring for 'solr.core.collection1' (registry 'solr.core.collection1') enabled at server: com.sun.jmx.mbeanserver.JmxMBeanServer@41000ccb
   [junit4]   2> 2251631 INFO  (TEST-AutoCommitTest.testMaxDocs-seed#[D5F572E7D3D271FA]) [    x:collection1] o.a.s.c.SolrCore [[collection1] ] Opening new SolrCore at [/export/home/jenkins/workspace/Lucene-Solr-7.x-Solaris/solr/core/src/test-files/solr/collection1], dataDir=[/export/home/jenkins/workspace/Lucene-Solr-7.x-Solaris/solr/build/solr-core/test/J1/temp/solr.update.AutoCommitTest_D5F572E7D3D271FA-001/init-core-data-001/]
   [junit4]   2> 2251682 INFO  (TEST-AutoCommitTest.testMaxDocs-seed#[D5F572E7D3D271FA]) [    x:collection1] o.a.s.u.CommitTracker Hard AutoCommit: disabled
   [junit4]   2> 2251682 INFO  (TEST-AutoCommitTest.testMaxDocs-seed#[D5F572E7D3D271FA]) [    x:collection1] o.a.s.u.CommitTracker Soft AutoCommit: disabled
   [junit4]   2> 2251684 INFO  (TEST-AutoCommitTest.testMaxDocs-seed#[D5F572E7D3D271FA]) [    x:collection1] o.a.s.s.SolrIndexSearcher Opening [Searcher@46bd02ee[collection1] main]
   [junit4]   2> 2251684 INFO  (TEST-AutoCommitTest.testMaxDocs-seed#[D5F572E7D3D271FA]) [    x:collection1] o.a.s.h.c.SpellCheckComponent Initializing spell checkers
   [junit4]   2> 2251685 INFO  (TEST-AutoCommitTest.testMaxDocs-seed#[D5F572E7D3D271FA]) [    x:collection1] o.a.s.s.DirectSolrSpellChecker init: {name=direct,classname=DirectSolrSpellChecker,field=lowerfilt,minQueryLength=3}
   [junit4]   2> 2251688 INFO  (TEST-AutoCommitTest.testMaxDocs-seed#[D5F572E7D3D271FA]) [    x:collection1] o.a.s.h.ReplicationHandler Commits will be reserved for  10000
   [junit4]   2> 2251688 INFO  (searcherExecutor-6092-thread-1-processing-x:collection1) [    x:collection1] o.a.s.h.c.SpellCheckComponent Loading spell index for spellchecker: default
   [junit4]   2> 2251688 INFO  (TEST-AutoCommitTest.testMaxDocs-seed#[D5F572E7D3D271FA]) [    x:collection1] o.a.s.u.UpdateLog Could not find max version in index or recent updates, using new clock 1575725724415819776
   [junit4]   2> 2251688 INFO  (searcherExecutor-6092-thread-1-processing-x:collection1) [    x:collection1] o.a.s.h.c.SpellCheckComponent Loading spell index for spellchecker: direct
   [junit4]   2> 2251689 INFO  (searcherExecutor-6092-thread-1-processing-x:collection1) [    x:collection1] o.a.s.h.c.SpellCheckComponent Loading spell index for spellchecker: wordbreak
   [junit4]   2> 2251689 INFO  (searcherExecutor-6092-thread-1-processing-x:collection1) [    x:collection1] o.a.s.h.c.SpellCheckComponent Loading spell index for spellchecker: multipleFields
   [junit4]   2> 2251689 INFO  (searcherExecutor-6092-thread-1-processing-x:collection1) [    x:collection1] o.a.s.h.c.SpellCheckComponent Loading spell index for spellchecker: jarowinkler
   [junit4]   2> 2251690 INFO  (searcherExecutor-6092-thread-1-processing-x:collection1) [    x:collection1] o.a.s.h.c.SpellCheckComponent Loading spell index for spellchecker: external
   [junit4]   2> 2251691 INFO  (searcherExecutor-6092-thread-1-processing-x:collection1) [    x:collection1] o.a.s.h.c.SpellCheckComponent Loading spell index for spellchecker: freq
   [junit4]   2> 2251692 INFO  (searcherExecutor-6092-thread-1-processing-x:collection1) [    x:collection1] o.a.s.h.c.SpellCheckComponent Loading spell index for spellchecker: fqcn
   [junit4]   2> 2251692 INFO  (TEST-AutoCommitTest.testMaxDocs-seed#[D5F572E7D3D271FA]) [    x:collection1] o.a.s.u.RandomMergePolicy RandomMergePolicy wrapping class org.apache.lucene.index.AlcoholicMergePolicy: [AlcoholicMergePolicy: minMergeSize=0, mergeFactor=10, maxMergeSize=805997293, maxMergeSizeForForcedMerge=9223372036854775807, calibrateSizeByDeletes=true, maxMergeDocs=2147483647, maxCFSSegmentSizeMB=8.796093022207999E12, noCFSRatio=0.1]
   [junit4]   2> 2251692 INFO  (searcherExecutor-6092-thread-1-processing-x:collection1) [    x:collection1] o.a.s.h.c.SpellCheckComponent Loading spell index for spellchecker: perDict
   [junit4]   2> 2251692 INFO  (TEST-AutoCommitTest.testMaxDocs-seed#[D5F572E7D3D271FA]) [    x:collection1] o.a.s.u.DefaultSolrCoreState New IndexWriter is ready to be used.
   [junit4]   2> 2251694 INFO  (searcherExecutor-6092-thread-1-processing-x:collection1) [    x:collection1] o.a.s.c.SolrCore [collection1] Registered new searcher Searcher@46bd02ee[collection1] main{ExitableDirectoryReader(UninvertingDirectoryReader())}
   [junit4]   2> 2251695 INFO  (TEST-AutoCommitTest.testMaxDocs-seed#[D5F572E7D3D271FA]) [    x:collection1] o.a.s.s.SolrIndexSearcher Opening [Searcher@7f9ebb7[collection1] main]
   [junit4]   2> 2251695 INFO  (TEST-AutoCommitTest.testMaxDocs-seed#[D5F572E7D3D271FA]) [    x:collection1] o.a.s.c.SolrCore [collection1]  CLOSING SolrCore org.apache.solr.core.SolrCore@5ae779b5
   [junit4]   2> 2251696 INFO  (TEST-AutoCommitTest.testMaxDocs-seed#[D5F572E7D3D271FA]) [    x:collection1] o.a.s.m.SolrMetricManager Closing metric reporters for registry=solr.core.collection1, tag=1525119413
   [junit4]   2> 2251696 INFO  (TEST-AutoCommitTest.testMaxDocs-seed#[D5F572E7D3D271FA]) [    x:collection1] o.a.s.m.r.SolrJmxReporter Closing reporter [org.apache.solr.metrics.reporters.SolrJmxReporter@426ea3: rootName = null, domain = solr.core.collection1, service url = null, agent id = null] for registry solr.core.collection1 / com.codahale.metrics.MetricRegistry@2594b265
   [junit4]   2> 2251697 INFO  (searcherExecutor-6092-thread-1-processing-x:collection1) [    x:collection1] o.a.s.c.SolrCore [collection1] Registered new searcher Searcher@7f9ebb7[collection1] main{ExitableDirectoryReader(UninvertingDirectoryReader())}
   [junit4]   2> 2251713 INFO  (TEST-AutoCommitTest.testMaxDocs-seed#[D5F572E7D3D271FA]) [    x:collection1] o.a.s.u.p.LogUpdateProcessorFactory [collection1] {add=[0 (1575725724439937024)]} 0 2
   [junit4]   2> 2251714 INFO  (TEST-AutoCommitTest.testMaxDocs-seed#[D5F572E7D3D271FA]) [    x:collection1] o.a.s.u.p.LogUpdateProcessorFactory [collection1] {add=[1 (1575725724442034176)]} 0 3
   [junit4]   2> 2251714 INFO  (TEST-AutoCommitTest.testMaxDocs-seed#[D5F572E7D3D271FA]) [    x:collection1] o.a.s.u.p.LogUpdateProcessorFactory [collection1] {add=[2 (1575725724443082752)]} 0 3
   [junit4]   2> 2251714 INFO  (TEST-AutoCommitTest.testMaxDocs-seed#[D5F572E7D3D271FA]) [    x:collection1] o.a.s.u.p.LogUpdateProcessorFactory [collection1] {add=[3 (1575725724443082753)]} 0 4
   [junit4]   2> 2251714 INFO  (TEST-AutoCommitTest.testMaxDocs-seed#[D5F572E7D3D271FA]) [    x:collection1] o.a.s.u.p.LogUpdateProcessorFactory [collection1] {add=[4 (1575725724443082754)]} 0 4
   [junit4]   2> 2251715 INFO  (TEST-AutoCommitTest.testMaxDocs-seed#[D5F572E7D3D271FA]) [    x:collection1] o.a.s.u.p.LogUpdateProcessorFactory [collection1] {add=[5 (1575725724443082755)]} 0 4
   [junit4]   2> 2251715 INFO  (TEST-AutoCommitTest.testMaxDocs-seed#[D5F572E7D3D271FA]) [    x:collection1] o.a.s.u.p.LogUpdateProcessorFactory [collection1] {add=[6 (1575725724444131328)]} 0 4
   [junit4]   2> 2251715 INFO  (TEST-AutoCommitTest.testMaxDocs-seed#[D5F572E7D3D271FA]) [    x:collection1] o.a.s.u.p.LogUpdateProcessorFactory [collection1] {add=[7 (1575725724444131329)]} 0 4
   [junit4]   2> 2251715 INFO  (TEST-AutoCommitTest.testMaxDocs-seed#[D5F572E7D3D271FA]) [    x:collection1] o.a.s.u.p.LogUpdateProcessorFactory [collection1] {add=[8 (1575725724444131330)]} 0 4
   [junit4]   2> 2251715 INFO  (TEST-AutoCommitTest.testMaxDocs-seed#[D5F572E7D3D271FA]) [    x:collection1] o.a.s.u.p.LogUpdateProcessorFactory [collection1] {add=[9 (1575725724444131331)]} 0 5
   [junit4]   2> 2251715 INFO  (TEST-AutoCommitTest.testMaxDocs-seed#[D5F572E7D3D271FA]) [    x:collection1] o.a.s.u.p.LogUpdateProcessorFactory [collection1] {add=[10 (1575725724444131332)]} 0 5
   [junit4]   2> 2251715 INFO  (TEST-AutoCommitTest.testMaxDocs-seed#[D5F572E7D3D271FA]) [    x:collection1] o.a.s.u.p.LogUpdateProcessorFactory [collection1] {add=[11 (1575725724444131333)]} 0 5
   [junit4]   2> 2251715 INFO  (TEST-AutoCommitTest.testMaxDocs-seed#[D5F572E7D3D271FA]) [    x:collection1] o.a.s.u.p.LogUpdateProcessorFactory [collection1] {add=[12 (1575725724444131334)]} 0 5
   [junit4]   2> 2251716 INFO  (TEST-AutoCommitTest.testMaxDocs-seed#[D5F572E7D3D271FA]) [    x:collection1] o.a.s.u.p.LogUpdateProcessorFactory [collection1] {add=[13 (1575725724444131335)]} 0 5
   [junit4]   2> 2251716 INFO  (TEST-AutoCommitTest.testMaxDocs-seed#[D5F572E7D3D271FA]) [    x:collection1] o.a.s.c.S.Request [collection1]  webapp=null path=null params={q=id:1&qt=&start=0&rows=20&version=2.2} hits=0 status=0 QTime=0
   [junit4]   2> 2251719 INFO  (TEST-AutoCommitTest.testMaxDocs-seed#[D5F572E7D3D271FA]) [    x:collection1] o.a.s.u.p.LogUpdateProcessorFactory [collection1] {add=[14 (1575725724447277056)]} 0 9
   [junit4]   2> 2251721 INFO  (commitScheduler-6095-thread-1) [    x:collection1] o.a.s.u.DirectUpdateHandler2 start commit{,optimize=false,openSearcher=true,waitSearcher=true,expungeDeletes=false,softCommit=true,prepareCommit=false}
   [junit4]   2> 2251726 INFO  (commitScheduler-6095-thread-1) [    x:collection1] o.a.s.s.SolrIndexSearcher Opening [Searcher@70d533a[collection1] main]
   [junit4]   2> 2251727 INFO  (commitScheduler-6095-thread-1) [    x:collection1] o.a.s.u.DirectUpdateHandler2 end_commit_flush
   [junit4]   2> 2251728 INFO  (searcherExecutor-6092-thread-1-processing-x:collection1) [    x:collection1] o.a.s.c.SolrCore [collection1] Registered new searcher Searcher@70d533a[collection1] main{ExitableDirectoryReader(UninvertingDirectoryReader(Uninverting(_0(7.1.0):c15)))}
   [junit4]   2> 2251973 INFO  (TEST-AutoCommitTest.testMaxDocs-seed#[D5F572E7D3D271FA]) [    x:collection1] o.a.s.u.p.LogUpdateProcessorFactory [collection1] {add=[15 (1575725724714663936)]} 0 263
   [junit4]   2> 2251973 INFO  (TEST-AutoCommitTest.testMaxDocs-seed#[D5F572E7D3D271FA]) [    x:collection1] o.a.s.c.S.Request [collection1]  webapp=null path=null params={q=id:14&qt=&start=0&rows=20&version=2.2} hits=1 status=0 QTime=0
   [junit4]   2> 2251974 INFO  (TEST-AutoCommitTest.testMaxDocs-seed#[D5F572E7D3D271FA]) [    x:collection1] o.a.s.c.S.Request [collection1]  webapp=null path=null params={q=id:15&qt=&start=0&rows=20&version=2.2} hits=0 status=0 QTime=0
   [junit4]   2> 2251974 INFO  (TEST-AutoCommitTest.testMaxDocs-seed#[D5F572E7D3D271FA]) [    x:collection1] o.a.s.SolrTestCaseJ4 ###Ending testMaxDocs
   [junit4]   2> 2251977 INFO  (TEST-AutoCommitTest.testMaxTime-seed#[D5F572E7D3D271FA]) [    x:collection1] o.a.s.SolrTestCaseJ4 ###Starting testMaxTime
   [junit4]   2> 2251977 INFO  (TEST-AutoCommitTest.testMaxTime-seed#[D5F572E7D3D271FA]) [    x:collection1] o.a.s.u.DirectUpdateHandler2 [collection1] REMOVING ALL DOCUMENTS FROM INDEX
   [junit4]   2> 2251977 INFO  (TEST-AutoCommitTest.testMaxTime-seed#[D5F572E7D3D271FA]) [    x:collection1] o.a.s.s.SolrIndexSearcher Opening [Searcher@641a842c[collection1] realtime]
   [junit4]   2> 2251977 INFO  (TEST-AutoCommitTest.testMaxTime-seed#[D5F572E7D3D271FA]) [    x:collection1] o.a.s.u.p.LogUpdateProcessorFactory [collection1]  webapp=null path=null params={_version_=-9223372036854775807&update.distrib=FROMLEADER&versions=true&wt=json&indent=true}{deleteByQuery=*:* (-9223372036854775807)} 0 0
   [junit4]   2> 2251977 ERROR (TEST-AutoCommitTest.testMaxTime-seed#[D5F572E7D3D271FA]) [    x:collection1] o.a.s.c.CorePropertiesLocator Couldn't load core descriptor from /export/home/jenkins/workspace/Lucene-Solr-7.x-Solaris/solr/core/src/test-files/solr/collection1/core.properties:java.nio.file.NoSuchFileException: /export/home/jenkins/workspace/Lucene-Solr-7.x-Solaris/solr/core/src/test-files/solr/collection1/core.properties
   [junit4]   2> 2251978 INFO  (TEST-AutoCommitTest.testMaxTime-seed#[D5F572E7D3D271FA]) [    x:collection1] o.a.s.c.SolrResourceLoader [null] Added 2 libs to classloader, from paths: [/export/home/jenkins/workspace/Lucene-Solr-7.x-Solaris/solr/core/src/test-files/solr/collection1/lib, /export/home/jenkins/workspace/Lucene-Solr-7.x-Solaris/solr/core/src/test-files/solr/collection1/lib/classes]
   [junit4]   2> 2252007 INFO  (TEST-AutoCommitTest.testMaxTime-seed#[D5F572E7D3D271FA]) [    x:collection1] o.a.s.c.SolrConfig Using Lucene MatchVersion: 7.1.0
   [junit4]   2> 2252026 INFO  (TEST-AutoCommitTest.testMaxTime-seed#[D5F572E7D3D271FA]) [    x:collection1] o.a.s.s.IndexSchema [collection1] Schema name=test
   [junit4]   2> 2252133 INFO  (TEST-AutoCommitTest.testMaxTime-seed#[D5F572E7D3D271FA]) [    x:collection1] o.a.s.s.IndexSchema Loaded schema test/1.0 with uniqueid field id
   [junit4]   2> 2252141 INFO  (TEST-AutoCommitTest.testMaxTime-seed#[D5F572E7D3D271FA]) [    x:collection1] o.a.s.c.CoreContainer Reloading SolrCore 'collection1' using configuration from instancedir /export/home/jenkins/workspace/Lucene-Solr-7.x-Solaris/solr/core/src/test-files/solr/collection1
   [junit4]   2> 2252167 INFO  (TEST-AutoCommitTest.testMaxTime-seed#[D5F572E7D3D271FA]) [    x:collection1] o.a.s.m.r.SolrJmxReporter JMX monitoring for 'solr.core.collection1' (registry 'solr.core.collection1') enabled at server: com.sun.jmx.mbeanserver.JmxMBeanServer@41000ccb
   [junit4]   2> 2252167 INFO  (TEST-AutoCommitTest.testMaxTime-seed#[D5F572E7D3D271FA]) [    x:collection1] o.a.s.c.SolrCore [[collection1] ] Opening new SolrCore at [/export/home/jenkins/workspace/Lucene-Solr-7.x-Solaris/solr/core/src/test-files/solr/collection1], dataDir=[/export/home/jenkins/workspace/Lucene-Solr-7.x-Solaris/solr/build/solr-core/test/J1/temp/solr.update.AutoCommitTest_D5F572E7D3D271FA-001/init-core-data-001/]
   [junit4]   2> 2252228 INFO  (TEST-AutoCommitTest.testMaxTime-seed#[D5F572E7D3D271FA]) [    x:collection1] o.a.s.u.CommitTracker Hard AutoCommit: disabled
   [junit4]   2> 2252228 INFO  (TEST-AutoCommitTest.testMaxTime-seed#[D5F572E7D3D271FA]) [    x:collection1] o.a.s.u.CommitTracker Soft AutoCommit: disabled
   [junit4]   2> 2252229 INFO  (TEST-AutoCommitTest.testMaxTime-seed#[D5F572E7D3D271FA]) [    x:collection1] o.a.s.s.SolrIndexSearcher Opening [Searcher@2526a91f[collection1] main]
   [junit4]   2> 2252230 INFO  (TEST-AutoCommitTest.testMaxTime-seed#[D5F572E7D3D271FA]) [    x:collection1] o.a.s.h.c.SpellCheckComponent Initializing spell checkers
   [junit4]   2> 2252231 INFO  (TEST-AutoCommitTest.testMaxTime-seed#[D5F572E7D3D271FA]) [    x:collection1] o.a.s.s.DirectSolrSpellChecker init: {name=direct,classname=DirectSolrSpellChecker,field=lowerfilt,minQueryLength=3}
   [junit4]   2> 2252233 INFO  (TEST-AutoCommitTest.testMaxTime-seed#[D5F572E7D3D271FA]) [    x:collection1] o.a.s.h.ReplicationHandler Commits will be reserved for  10000
   [junit4]   2> 2252236 INFO  (searcherExecutor-6096-thread-1-processing-x:collection1) [    x:collection1] o.a.s.h.c.SpellCheckComponent Loading spell index for spellchecker: default
   [junit4]   2> 2252236 INFO  (TEST-AutoCommitTest.testMaxTime-seed#[D5F572E7D3D271FA]) [    x:collection1] o.a.s.u.RandomMergePolicy RandomMergePolicy wrapping class org.apache.lucene.index.LogDocMergePolicy: [LogDocMergePolicy: minMergeSize=1000, mergeFactor=23, maxMergeSize=9223372036854775807, maxMergeSizeForForcedMerge=9223372036854775807, calibrateSizeByDeletes=true, maxMergeDocs=2147483647, maxCFSSegmentSizeMB=8.796093022207999E12, noCFSRatio=0.0]
   [junit4]   2> 2252239 INFO  (TEST-AutoCommitTest.testMaxTime-seed#[D5F572E7D3D271FA]) [    x:collection1] o.a.s.u.DefaultSolrCoreState New IndexWriter is ready to be used.
   [junit4]   2> 2252239 INFO  (searcherExecutor-6096-thread-1-processing-x:collection1) [    x:collection1] o.a.s.h.c.SpellCheckComponent Loading spell index for spellchecker: direct
   [junit4]   2> 2252239 INFO  (searcherExecutor-6096-thread-1-processing-x:collection1) [    x:collection1] o.a.s.h.c.SpellCheckComponent Loading spell index for spellchecker: wordbreak
   [junit4]   2> 2252240 INFO  (searcherExecutor-6096-thread-1-processing-x:collection1) [    x:collection1] o.a.s.h.c.SpellCheckComponent Loading spell index for spellchecker: multipleFields
   [junit4]   2> 2252240 INFO  (searcherExecutor-6096-thread-1-processing-x:collection1) [    x:collection1] o.a.s.h.c.SpellCheckComponent Loading spell index for spellchecker: jarowinkler
   [junit4]   2> 2252240 INFO  (searcherExecutor-6096-thread-1-processing-x:collection1) [    x:collection1] o.a.s.h.c.SpellCheckComponent Loading spell index for spellchecker: external
   [junit4]   2> 2252240 INFO  (searcherExecutor-6096-thread-1-processing-x:collection1) [    x:collection1] o.a.s.h.c.SpellCheckComponent Loading spell index for spellchecker: freq
   [junit4]   2> 2252241 INFO  (searcherExecutor-6096-thread-1-processing-x:collection1) [    x:collection1] o.a.s.h.c.SpellCheckComponent Loading spell index for spellchecker: fqcn
   [junit4]   2> 2252241 INFO  (searcherExecutor-6096-thread-1-processing-x:collection1) [    x:collection1] o.a.s.h.c.SpellCheckComponent Loading spell index for spellchecker: perDict
   [junit4]   2> 2252243 INFO  (searcherExecutor-6096-thread-1-processing-x:collection1) [    x:collection1] o.a.s.c.SolrCore [collection1] Registered new searcher Searcher@2526a91f[collection1] main{ExitableDirectoryReader(UninvertingDirectoryReader())}
   [junit4]   2> 2252244 INFO  (TEST-AutoCommitTest.testMaxTime-seed#[D5F572E7D3D271FA]) [    x:collection1] o.a.s.s.SolrIndexSearcher Opening [Searcher@2e76df2b[collection1] main]
   [junit4]   2> 2252244 INFO  (TEST-AutoCommitTest.testMaxTime-seed#[D5F572E7D3D271FA]) [    x:collection1] o.a.s.c.SolrCore [collection1]  CLOSING SolrCore org.apache.solr.core.SolrCore@9398e87
   [junit4]   2> 2252245 INFO  (TEST-AutoCommitTest.testMaxTime-seed#[D5F572E7D3D271FA]) [    x:collection1] o.a.s.m.SolrMetricManager Closing metric reporters for registry=solr.core.collection1, tag=154766983
   [junit4]   2> 2252245 INFO  (TEST-AutoCommitTest.testMaxTime-seed#[D5F572E7D3D271FA]) [    x:collection1] o.a.s.m.r.SolrJmxReporter Closing reporter [org.apache.solr.metrics.reporters.SolrJmxReporter@4b9c6500: rootName = null, domain = solr.core.collection1, service url = null, agent id = null] for registry solr.core.collection1 / com.codahale.metrics.MetricRegistry@2594b265
   [junit4]   2> 2252255 INFO  (TEST-AutoCommitTest.testMaxTime-seed#[D5F572E7D3D271FA]) [    x:collection1] o.a.s.u.p.LogUpdateProcessorFactory [collection1] {add=[529 (1575725725010362368)]} 0 0
   [junit4]   2> 2252256 INFO  (TEST-AutoCommitTest.testMaxTime-seed#[D5F572E7D3D271FA]) [    x:collection1] o.a.s.c.S.Request [collection1]  webapp=null path=null params={q=id:529&qt=&start=0&rows=20&version=2.2} hits=0 status=0 QTime=0
   [junit4]   2> 2252257 INFO  (searcherExecutor-6096-thread-1-processing-x:collection1) [    x:collection1] o.a.s.c.SolrCore [collection1] Registered new searcher Searcher@2e76df2b[collection1] main{ExitableDirectoryReader(UninvertingDirectoryReader())}
   [junit4]   2> 2252509 INFO  (TEST-AutoCommitTest.testMaxTime-seed#[D5F572E7D3D271FA]) [    x:collection1] o.a.s.u.p.LogUpdateProcessorFactory [collection1] {add=[530 (1575725725275652096)]} 0 253
   [junit4]   2> 2252509 INFO  (TEST-AutoCommitTest.testMaxTime-seed#[D5F572E7D3D271FA]) [    x:collection1] o.a.s.c.S.Request [collection1]  webapp=null path=null params={q=id:529&qt=&start=0&rows=20&version=2.2} hits=0 status=0 QTime=0
   [junit4]   2> 2252510 ERROR (TEST-AutoCommitTest.testMaxTime-seed#[D5F572E7D3D271FA]) [    x:collection1] o.a.s.SolrTestCaseJ4 REQUEST FAILED: xpath=//result[@numFound=1]
   [junit4]   2> 	xml response was: <?xml version="1.0" encoding="UTF-8"?>
   [junit4]   2> <response>
   [junit4]   2> <lst name="responseHeader"><int name="status">0</int><int name="QTime">0</int></lst><result name="response" numFound="0" start="0"></result>
   [junit4]   2> </response>
   [junit4]   2> 
   [junit4]   2> 	request was:q=id:529&qt=&start=0&rows=20&version=2.2
   [junit4]   2> 2252510 ERROR (TEST-AutoCommitTest.testMaxTime-seed#[D5F572E7D3D271FA]) [    x:collection1] o.a.s.SolrTestCaseJ4 REQUEST FAILED: q=id:529&qt=&start=0&rows=20&version=2.2:java.lang.RuntimeException: REQUEST FAILED: xpath=//result[@numFound=1]
   [junit4]   2> 	xml response was: <?xml version="1.0" encoding="UTF-8"?>
   [junit4]   2> <response>
   [junit4]   2> <lst name="responseHeader"><int name="status">0</int><int name="QTime">0</int></lst><result name="response" numFound="0" start="0"></result>
   [junit4]   2> </response>
   [junit4]   2> 
   [junit4]   2> 	request was:q=id:529&qt=&start=0&rows=20&version=2.2
   [junit4]   2> 	at org.apache.solr.SolrTestCaseJ4.assertQ(SolrTestCaseJ4.java:879)
   [junit4]   2> 	at org.apache.solr.update.AutoCommitTest.testMaxTime(AutoCommitTest.java:270)
   [junit4]   2> 	at sun.reflect.NativeMethodAccessorImpl.invoke0(Native Method)
   [junit4]   2> 	at sun.reflect.NativeMethodAccessorImpl.invoke(NativeMethodAccessorImpl.java:62)
   [junit4]   2> 	at sun.reflect.DelegatingMethodAccessorImpl.invoke(DelegatingMethodAccessorImpl.java:43)
   [junit4]   2> 	at java.lang.reflect.Method.invoke(Method.java:498)
   [junit4]   2> 	at com.carrotsearch.randomizedtesting.RandomizedRunner.invoke(RandomizedRunner.java:1713)
   [junit4]   2> 	at com.carrotsearch.randomizedtesting.RandomizedRunner$8.evaluate(RandomizedRunner.java:907)
   [junit4]   2> 	at com.carrotsearch.randomizedtesting.RandomizedRunner$9.evaluate(RandomizedRunner.java:943)
   [junit4]   2> 	at com.carrotsearch.randomizedtesting.RandomizedRunner$10.evaluate(RandomizedRunner.java:957)
   [junit4]   2> 	at com.carrotsearch.randomizedtesting.rules.SystemPropertiesRestoreRule$1.evaluate(SystemPropertiesRestoreRule.java:57)
   [junit4]   2> 	at org.apache.lucene.util.TestRuleSetupTeardownChained$1.evaluate(TestRuleSetupTeardownChained.java:49)
   [junit4]   2> 	at org.apache.lucene.util.AbstractBeforeAfterRule$1.evaluate(AbstractBeforeAfterRule.java:45)
   [junit4]   2> 	at org.apache.lucene.util.TestRuleThreadAndTestName$1.evaluate(TestRuleThreadAndTestName.java:48)
   [junit4]   2> 	at org.apache.lucene.util.TestRuleIgnoreAfterMaxFailures$1.evaluate(TestRuleIgnoreAfterMaxFailures.java:64)
   [junit4]   2> 	at org.apache.lucene.util.TestRuleMarkFailure$1.evaluate(TestRuleMarkFailure.java:47)
   [junit4]   2> 	at com.carrotsearch.randomizedtesting.rules.StatementAdapter.evaluate(StatementAdapter.java:36)
   [junit4]   2> 	at com.carrotsearch.randomizedtesting.ThreadLeakControl$StatementRunner.run(ThreadLeakControl.java:368)
   [junit4]   2> 	at com.carrotsearch.randomizedtesting.ThreadLeakControl.forkTimeoutingTask(ThreadLeakControl.java:817)
   [junit4]   2> 	at com.carrotsearch.randomizedtesting.ThreadLeakControl$3.evaluate(ThreadLeakControl.java:468)
   [junit4]   2> 	at com.carrotsearch.randomizedtesting.RandomizedRunner.runSingleTest(RandomizedRunner.java:916)
   [junit4]   2> 	at com.carrotsearch.randomizedtesting.RandomizedRunner$5.evaluate(RandomizedRunner.java:802)
   [junit4]   2> 	at com.carrotsearch.randomizedtesting.RandomizedRunner$6.evaluate(RandomizedRunner.java:852)
   [junit4]   2> 	at com.carrotsearch.randomizedtesting.RandomizedRunner$7.evaluate(RandomizedRunner.java:863)
   [junit4]   2> 	at com.carrotsearch.randomizedtesting.rules.StatementAdapter.evaluate(StatementAdapter.java:36)
   [junit4]   2> 	at com.carrotsearch.randomizedtesting.rules.SystemPropertiesRestoreRule$1.evaluate(SystemPropertiesRestoreRule.java:57)
   [junit4]   2> 	at org.apache.lucene.util.AbstractBeforeAfterRule$1.evaluate(AbstractBeforeAfterRule.java:45)
   [junit4]   2> 	at com.carrotsearch.randomizedtesting.rules.StatementAdapter.evaluate(StatementAdapter.java:36)
   [junit4]   2> 	at org.apache.lucene.util.TestRuleStoreClassName$1.evaluate(TestRuleStoreClassName.java:41)
   [junit4]   2> 	at com.carrotsearch.randomizedtesting.rules.NoShadowingOrOverridesOnMethodsRule$1.evaluate(NoShadowingOrOverridesOnMethodsRule.java:40)
   [junit4]   2> 	at com.carrotsearch.randomizedtesting.rules.NoShadowingOrOverridesOnMethodsRule$1.evaluate(NoShadowingOrOverridesOnMethodsRule.java:40)
   [junit4]   2> 	at com.carrotsearch.randomizedtesting.rules.StatementAdapter.evaluate(StatementAdapter.java:36)
   [junit4]   2> 	at com.carrotsearch.randomizedtesting.rules.StatementAdapter.evaluate(StatementAdapter.java:36)
   [junit4]   2> 	at com.carrotsearch.randomizedtesting.rules.StatementAdapter.evaluate(StatementAdapter.java:36)
   [junit4]   2> 	at org.apache.lucene.util.TestRuleAssertionsRequired$1.evaluate(TestRuleAssertionsRequired.java:53)
   [junit4]   2> 	at org.apache.lucene.util.TestRuleMarkFailure$1.evaluate(TestRuleMarkFailure.java:47)
   [junit4]   2> 	at org.apache.lucene.util.TestRuleIgnoreAfterMaxFailures$1.evaluate(TestRuleIgnoreAfterMaxFailures.java:64)
   [junit4]   2> 	at org.apache.lucene.util.TestRuleIgnoreTestSuites$1.evaluate(TestRuleIgnoreTestSuites.java:54)
   [junit4]   2> 	at com.carrotsearch.randomizedtesting.rules.StatementAdapter.evaluate(StatementAdapter.java:36)
   [junit4]   2> 	at com.carrotsearch.randomizedtesting.ThreadLeakControl$StatementRunner.run(ThreadLeakControl.java:368)
   [junit4]   2> 	at java.lang.Thread.run(Thread.java:748)
   [junit4]   2> 
   [junit4]   2> 2252511 INFO  (TEST-AutoCommitTest.testMaxTime-seed#[D5F572E7D3D271FA]) [    x:collection1] o.a.s.SolrTestCaseJ4 ###Ending testMaxTime
   [junit4]   2> NOTE: reproduce with: ant test  -Dtestcase=AutoCommitTest -Dtests.method=testMaxTime -Dtests.seed=D5F572E7D3D271FA -Dtests.slow=true -Dtests.locale=et -Dtests.timezone=America/Phoenix -Dtests.asserts=true -Dtests.file.encoding=US-ASCII
   [junit4] ERROR   0.54s J1 | AutoCommitTest.testMaxTime <<<
   [junit4]    > Throwable #1: java.lang.RuntimeException: Exception during query
   [junit4]    > 	at __randomizedtesting.SeedInfo.seed([D5F572E7D3D271FA:4F010F054D48EDC6]:0)
   [junit4]    > 	at org.apache.solr.SolrTestCaseJ4.assertQ(SolrTestCaseJ4.java:886)
   [junit4]    > 	at org.apache.solr.update.AutoCommitTest.testMaxTime(AutoCommitTest.java:270)
   [junit4]    > 	at java.lang.Thread.run(Thread.java:748)
   [junit4]    > Caused by: java.lang.RuntimeException: REQUEST FAILED: xpath=//result[@numFound=1]
   [junit4]    > 	xml response was: <?xml version="1.0" encoding="UTF-8"?>
   [junit4]    > <response>
   [junit4]    > <lst name="responseHeader"><int name="status">0</int><int name="QTime">0</int></lst><result name="response" numFound="0" start="0"></result>
   [junit4]    > </response>
   [junit4]    > 	request was:q=id:529&qt=&start=0&rows=20&version=2.2
   [junit4]    > 	at org.apache.solr.SolrTestCaseJ4.assertQ(SolrTestCaseJ4.java:879)
   [junit4]    > 	... 40 more
   [junit4]   2> 2252518 INFO  (TEST-AutoCommitTest.testCommitWithin-seed#[D5F572E7D3D271FA]) [    x:collection1] o.a.s.SolrTestCaseJ4 ###Starting testCommitWithin
   [junit4]   2> 2252518 INFO  (TEST-AutoCommitTest.testCommitWithin-seed#[D5F572E7D3D271FA]) [    x:collection1] o.a.s.u.DirectUpdateHandler2 [collection1] REMOVING ALL DOCUMENTS FROM INDEX
   [junit4]   2> 2252518 INFO  (TEST-AutoCommitTest.testCommitWithin-seed#[D5F572E7D3D271FA]) [    x:collection1] o.a.s.s.SolrIndexSearcher Opening [Searcher@32ec4ad1[collection1] realtime]
   [junit4]   2> 2252519 INFO  (TEST-AutoCommitTest.testCommitWithin-seed#[D5F572E7D3D271FA]) [    x:collection1] o.a.s.u.p.LogUpdateProcessorFactory [collection1]  webapp=null path=null params={_version_=-9223372036854775807&update.distrib=FROMLEADER&versions=true&wt=json&indent=true}{deleteByQuery=*:* (-9223372036854775807)} 0 0
   [junit4]   2> 2252519 ERROR (TEST-AutoCommitTest.testCommitWithin-seed#[D5F572E7D3D271FA]) [    x:collection1] o.a.s.c.CorePropertiesLocator Couldn't load core descriptor from /export/home/jenkins/workspace/Lucene-Solr-7.x-Solaris/solr/core/src/test-files/solr/collection1/core.properties:java.nio.file.NoSuchFileException: /export/home/jenkins/workspace/Lucene-Solr-7.x-Solaris/solr/core/src/test-files/solr/collection1/core.properties
   [junit4]   2> 2252519 INFO  (TEST-AutoCommitTest.testCommitWithin-seed#[D5F572E7D3D271FA]) [    x:collection1] o.a.s.c.SolrResourceLoader [null] Added 2 libs to classloader, from paths: [/export/home/jenkins/workspace/Lucene-Solr-7.x-Solaris/solr/core/src/test-files/solr/collection1/lib, /export/home/jenkins/workspace/Lucene-Solr-7.x-Solaris/solr/core/src/test-files/solr/collection1/lib/classes]
   [junit4]   2> 2252559 INFO  (TEST-AutoCommitTest.testCommitWithin-seed#[D5F572E7D3D271FA]) [    x:collection1] o.a.s.c.SolrConfig Using Lucene MatchVersion: 7.1.0
   [junit4]   2> 2252584 INFO  (TEST-AutoCommitTest.testCommitWithin-seed#[D5F572E7D3D271FA]) [    x:collection1] o.a.s.s.IndexSchema [collection1] Schema name=test
   [junit4]   2> 2252673 INFO  (TEST-AutoCommitTest.testCommitWithin-seed#[D5F572E7D3D271FA]) [    x:collection1] o.a.s.s.IndexSchema Loaded schema test/1.0 with uniqueid field id
   [junit4]   2> 2252679 INFO  (TEST-AutoCommitTest.testCommitWithin-seed#[D5F572E7D3D271FA]) [    x:collection1] o.a.s.c.CoreContainer Reloading SolrCore 'collection1' using configuration from instancedir /export/home/jenkins/workspace/Lucene-Solr-7.x-Solaris/solr/core/src/test-files/solr/collection1
   [junit4]   2> 2252704 INFO  (TEST-AutoCommitTest.testCommitWithin-seed#[D5F572E7D3D271FA]) [    x:collection1] o.a.s.m.r.SolrJmxReporter JMX monitoring for 'solr.core.collection1' (registry 'solr.core.collection1') enabled at server: com.sun.jmx.mbeanserver.JmxMBeanServer@41000ccb
   [junit4]   2> 2252704 INFO  (TEST-AutoCommitTest.testCommitWithin-seed#[D5F572E7D3D271FA]) [    x:collection1] o.a.s.c.SolrCore [[collection1] ] Opening new SolrCore at [/export/home/jenkins/workspace/Lucene-Solr-7.x-Solaris/solr/core/src/test-files/solr/collection1], dataDir=[/export/home/jenkins/workspace/Lucene-Solr-7.x-Solaris/solr/build/solr-core/test/J1/temp/solr.update.AutoCommitTest_D5F572E7D3D271FA-001/init-core-data-001/]
   [junit4]   2> 2252781 INFO  (TEST-AutoCommitTest.testCommitWithin-seed#[D5F572E7D3D271FA]) [    x:collection1] o.a.s.u.CommitTracker Hard AutoCommit: disabled
   [junit4]   2> 2252781 INFO  (TEST-AutoCommitTest.testCommitWithin-seed#[D5F572E7D3D271FA]) [    x:collection1] o.a.s.u.CommitTracker Soft AutoCommit: disabled
   [junit4]   2> 2252783 INFO  (TEST-AutoCommitTest.testCommitWithin-seed#[D5F572E7D3D271FA]) [    x:collection1] o.a.s.s.SolrIndexSearcher Opening [Searcher@7c2c2a2f[collection1] main]
   [junit4]   2> 2252783 INFO  (TEST-AutoCommitTest.testCommitWithin-seed#[D5F572E7D3D271FA]) [    x:collection1] o.a.s.h.c.SpellCheckComponent Initializing spell checkers
   [junit4]   2> 2252784 INFO  (TEST-AutoCommitTest.testCommitWithin-seed#[D5F572E7D3D271FA]) [    x:collection1] o.a.s.s.DirectSolrSpellChecker init: {name=direct,classname=DirectSolrSpellChecker,field=lowerfilt,minQueryLength=3}
   [junit4]   2> 2252788 INFO  (TEST-AutoCommitTest.testCommitWithin-seed#[D5F572E7D3D271FA]) [    x:collection1] o.a.s.h.ReplicationHandler Commits will be reserved for  10000
   [junit4]   2> 2252788 INFO  (searcherExecutor-6100-thread-1-processing-x:collection1) [    x:collection1] o.a.s.h.c.SpellCheckComponent Loading spell index for spellchecker: default
   [junit4]   2> 2252789 INFO  (searcherExecutor-6100-thread-1-processing-x:collection1) [    x:collection1] o.a.s.h.c.SpellCheckComponent Loading spell index for spellchecker: direct
   [junit4]   2> 2252789 INFO  (searcherExecutor-6100-thread-1-processing-x:collection1) [    x:collection1] o.a.s.h.c.SpellCheckComponent Loading spell index for spellchecker: wordbreak
   [junit4]   2> 2252789 INFO  (searcherExecutor-6100-thread-1-processing-x:collection1) [    x:collection1] o.a.s.h.c.SpellCheckComponent Loading spell index for spellchecker: multipleFields
   [junit4]   2> 2252789 INFO  (searcherExecutor-6100-thread-1-processing-x:collection1) [    x:collection1] o.a.s.h.c.SpellCheckComponent Loading spell index for spellchecker: jarowinkler
   [junit4]   2> 2252789 INFO  (searcherExecutor-6100-thread-1-processing-x:collection1) [    x:collection1] o.a.s.h.c.SpellCheckComponent Loading spell index for spellchecker: external
   [junit4]   2> 2252790 INFO  (searcherExecutor-6100-thread-1-processing-x:collection1) [    x:collection1] o.a.s.h.c.SpellCheckComponent Loading spell index for spellchecker: freq
   [junit4]   2> 2252790 INFO  (searcherExecutor-6100-thread-1-processing-x:collection1) [    x:collection1] o.a.s.h.c.SpellCheckComponent Loading spell index for spellchecker: fqcn
   [junit4]   2> 2252790 INFO  (searcherExecutor-6100-thread-1-processing-x:collection1) [    x:collection1] o.a.s.h.c.SpellCheckComponent Loading spell index for spellchecker: perDict
   [junit4]   2> 2252791 INFO  (TEST-AutoCommitTest.testCommitWithin-seed#[D5F572E7D3D271FA]) [    x:collection1] o.a.s.u.RandomMergePolicy RandomMergePolicy wrapping class org.apache.lucene.index.LogDocMergePolicy: [LogDocMergePolicy: minMergeSize=1000, mergeFactor=25, maxMergeSize=9223372036854775807, maxMergeSizeForForcedMerge=9223372036854775807, calibrateSizeByDeletes=true, maxMergeDocs=2147483647, maxCFSSegmentSizeMB=8.796093022207999E12, noCFSRatio=1.0]
   [junit4]   2> 2252791 INFO  (TEST-AutoCommitTest.testCommitWithin-seed#[D5F572E7D3D271FA]) [    x:collection1] o.a.s.u.DefaultSolrCoreState New IndexWriter is ready to be used.
   [junit4]   2> 2252793 INFO  (searcherExecutor-6100-thread-1-processing-x:collection1) [    x:collection1] o.a.s.c.SolrCore [collection1] Registered new searcher Searcher@7c2c2a2f[collection1] main{ExitableDirectoryReader(UninvertingDirectoryReader())}
   [junit4]   2> 2252793 INFO  (TEST-AutoCommitTest.testCommitWithin-seed#[D5F572E7D3D271FA]) [    x:collection1] o.a.s.s.SolrIndexSearcher Opening [Searcher@76ca406b[collection1] main]
   [junit4]   2> 2252793 INFO  (TEST-AutoCommitTest.testCommitWithin-seed#[D5F572E7D3D271FA]) [    x:collection1] o.a.s.c.SolrCore [collection1]  CLOSING SolrCore org.apache.solr.core.SolrCore@537e7b68
   [junit4]   2> 2252794 INFO  (TEST-AutoCommitTest.testCommitWithin-seed#[D5F572E7D3D271FA]) [    x:collection1] o.a.s.m.SolrMetricManager Closing metric reporters for registry=solr.core.collection1, tag=1400798056
   [junit4]   2> 2252794 INFO  (TEST-AutoCommitTest.testCommitWithin-seed#[D5F572E7D3D271FA]) [    x:collection1] o.a.s.m.r.SolrJmxReporter Closing reporter [org.apache.solr.metrics.reporters.SolrJmxReporter@58be48c9: rootName = null, domain = solr.core.collection1, service url = null, agent id = null] for registry solr.core.collection1 / com.codahale.metrics.MetricRegistry@2594b265
   [junit4]   2> 2252795 INFO  (searcherExecutor-6100-thread-1-processing-x:collection1) [    x:collection1] o.a.s.c.SolrCore [collection1] Registered new searcher Searcher@76ca406b[collection1] main{ExitableDirectoryReader(UninvertingDirectoryReader())}
   [junit4]   2> 2252814 INFO  (TEST-AutoCommitTest.testCommitWithin-seed#[D5F572E7D3D271FA]) [    x:collection1] o.a.s.u.p.LogUpdateProcessorFactory [collection1] {add=[529 (1575725725596516352)]} 0 0
   [junit4]   2> 2252815 INFO  (TEST-AutoCommitTest.testCommitWithin-seed#[D5F572E7D3D271FA]) [    x:collection1] o.a.s.c.S.Request [collection1]  webapp=null path=null params={q=id:529&qt=&start=0&rows=20&version=2.2} hits=0 status=0 QTime=0
   [junit4]   2> 2256814 INFO  (commitScheduler-6103-thread-1) [    x:collection1] o.a.s.u.DirectUpdateHandler2 start commit{,optimize=false,openSearcher=true,waitSearcher=true,expungeDeletes=false,softCommit=true,prepareCommit=false}
   [junit4]   2> 2256817 INFO  (commitScheduler-6103-thread-1) [    x:collection1] o.a.s.s.SolrIndexSearcher Opening [Searcher@efe52b5[collection1] main]
   [junit4]   2> 2256818 INFO  (commitScheduler-6103-thread-1) [    x:collection1] o.a.s.u.DirectUpdateHandler2 end_commit_flush
   [junit4]   2> 2256821 INFO  (searcherExecutor-6100-thread-1-processing-x:collection1) [    x:collection1] o.a.s.c.SolrCore [collection1] Registered new searcher Searcher@efe52b5[collection1] main{ExitableDirectoryReader(UninvertingDirectoryReader(Uninverting(_3(7.1.0):c1)))}
   [junit4]   2> 2256853 INFO  (TEST-AutoCommitTest.testCommitWithin-seed#[D5F572E7D3D271FA]) [    x:collection1] o.a.s.u.p.LogUpdateProcessorFactory [collection1] {add=[530 (1575725729831714816)]} 0 4041
   [junit4]   2> 2256853 INFO  (TEST-AutoCommitTest.testCommitWithin-seed#[D5F572E7D3D271FA]) [    x:collection1] o.a.s.c.S.Request [collection1]  webapp=null path=null params={q=id:530&qt=&start=0&rows=20&version=2.2} hits=0 status=0 QTime=0
   [junit4]   2> 2256854 INFO  (TEST-AutoCommitTest.testCommitWithin-seed#[D5F572E7D3D271FA]) [    x:collection1] o.a.s.u.p.LogUpdateProcessorFactory [collection1] {delete=[529 (-1575725729832763392)]} 0 4042
   [junit4]   2> 2256854 INFO  (TEST-AutoCommitTest.testCommitWithin-seed#[D5F572E7D3D271FA]) [    x:collection1] o.a.s.c.S.Request [collection1]  webapp=null path=null params={q=id:529&qt=&start=0&rows=20&version=2.2} hits=1 status=0 QTime=0
   [junit4]   2> 2258854 INFO  (commitScheduler-6103-thread-1) [    x:collection1] o.a.s.u.DirectUpdateHandler2 start commit{,optimize=false,openSearcher=true,waitSearcher=true,expungeDeletes=false,softCommit=true,prepareCommit=false}
   [junit4]   2> 2258856 INFO  (commitScheduler-6103-thread-1) [    x:collection1] o.a.s.s.SolrIndexSearcher Opening [Searcher@35eb6fa9[collection1] main]
   [junit4]   2> 2258857 INFO  (commitScheduler-6103-thread-1) [    x:collection1] o.a.s.u.DirectUpdateHandler2 end_commit_flush
   [junit4]   2> 2258858 INFO  (searcherExecutor-6100-thread-1-processing-x:collection1) [    x:collection1] o.a.s.c.SolrCore [collection1] Registered new searcher Searcher@35eb6fa9[collection1] main{ExitableDirectoryReader(UninvertingDirectoryReader(Uninverting(_4(7.1.0):c1)))}
   [junit4]   2> 2258863 INFO  (TEST-AutoCommitTest.testCommitWithin-seed#[D5F572E7D3D271FA]) [    x:collection1] o.a.s.c.S.Request [collection1]  webapp=null path=null params={q=id:529&qt=&start=0&rows=20&version=2.2} hits=0 status=0 QTime=0
   [junit4]   2> 2258863 INFO  (TEST-AutoCommitTest.testCommitWithin-seed#[D5F572E7D3D271FA]) [    x:collection1] o.a.s.c.S.Request [collection1]  webapp=null path=null params={q=id:530&qt=&start=0&rows=20&version=2.2} hits=1 status=0 QTime=0
   [junit4]   2> 2258864 INFO  (TEST-AutoCommitTest.testCommitWithin-seed#[D5F572E7D3D271FA]) [    x:collection1] o.a.s.u.p.LogUpdateProcessorFactory [collection1] {add=[500 (1575725731940401152)]} 0 6053
   [junit4]   2> 2258864 INFO  (TEST-AutoCommitTest.testCommitWithin-seed#[D5F572E7D3D271FA]) [    x:collection1] o.a.s.u.p.LogUpdateProcessorFactory [collection1] {add=[500 (1575725731940401153)]} 0 6053
   [junit4]   2> 2258864 INFO  (TEST-AutoCommitTest.testCommitWithin-seed#[D5F572E7D3D271FA]) [    x:collection1] o.a.s.u.p.LogUpdateProcessorFactory [collection1] {add=[500 (1575725731940401154)]} 0 6053
   [junit4]   2> 2258864 INFO  (TEST-AutoCommitTest.testCommitWithin-seed#[D5F572E7D3D271FA]) [    x:collection1] o.a.s.u.p.LogUpdateProcessorFactory [collection1] {add=[500 (1575725731940401155)]} 0 6053
   [junit4]   2> 2258864 INFO  (TEST-AutoCommitTest.testCommitWithin-seed#[D5F572E7D3D271FA]) [    x:collection1] o.a.s.u.p.LogUpdateProcessorFactory [collection1] {add=[500 (1575725731940401156)]} 0 6053
   [junit4]   2> 2258864 INFO  (TEST-AutoCommitTest.testCommitWithin-seed#[D5F572E7D3D271FA]) [    x:collection1] o.a.s.u.p.LogUpdateProcessorFactory [collection1] {add=[500 (1575725731940401157)]} 0 6053
   [junit4]   2> 2258865 INFO  (TEST-AutoCommitTest.testCommitWithin-seed#[D5F572E7D3D271FA]) [    x:collection1] o.a.s.u.p.LogUpdateProcessorFactory [collection1] {add=[500 (1575725731940401158)]} 0 6053
   [junit4]   2> 2258865 INFO  (TEST-AutoCommitTest.testCommitWithin-seed#[D5F572E7D3D271FA]) [    x:collection1] o.a.s.u.p.LogUpdateProcessorFactory [collection1] {add=[500 (1575725731941449728)]} 0 6053
   [junit4]   2> 2258865 INFO  (TEST-AutoCommitTest.testCommitWithin-seed#[D5F572E7D3D271FA]) [    x:collection1] o.a.s.u.p.LogUpdateProcessorFactory [collection1] {add=[500 (1575725731941449729)]} 0 6054
   [junit4]   2> 2258865 INFO  (TEST-AutoCommitTest.testCommitWithin-seed#[D5F572E7D3D271FA]) [    x:collection1] o.a.s.u.p.LogUpdateProcessorFactory [collection1] {add=[500 (1575725731941449730)]} 0 6054
   [junit4]   2> 2258865 INFO  (TEST-AutoCommitTest.testCommitWithin-seed#[D5F572E7D3D271FA]) [    x:collection1] o.a.s.c.S.Request [collection1]  webapp=null path=null params={q=id:500&qt=&start=0&rows=20&version=2.2} hits=0 status=0 QTime=0
   [junit4]   2> 2258865 INFO  (TEST-AutoCommitTest.testCommitWithin-seed#[D5F572E7D3D271FA]) [    x:collection1] o.a.s.u.p.LogUpdateProcessorFactory [collection1] {delete=[530 (-1575725731941449731)]} 0 6054
   [junit4]   2> 2258865 INFO  (TEST-AutoCommitTest.testCommitWithin-seed#[D5F572E7D3D271FA]) [    x:collection1] o.a.s.u.p.LogUpdateProcessorFactory [collection1] {delete=[530 (-1575725731941449732)]} 0 6054
   [junit4]   2> 2258865 INFO  (TEST-AutoCommitTest.testCommitWithin-seed#[D5F572E7D3D271FA]) [    x:collection1] o.a.s.u.p.LogUpdateProcessorFactory [collection1] {delete=[530 (-1575725731941449733)]} 0 6054
   [junit4]   2> 2258866 INFO  (TEST-AutoCommitTest.testCommitWithin-seed#[D5F572E7D3D271FA]) [    x:collection1] o.a.s.u.p.LogUpdateProcessorFactory [collection1] {delete=[530 (-1575725731942498304)]} 0 6054
   [junit4]   2> 2258866 INFO  (TEST-AutoCommitTest.testCommitWithin-seed#[D5F572E7D3D271FA]) [    x:collection1] o.a.s.u.p.LogUpdateProcessorFactory [collection1] {delete=[530 (-1575725731942498305)]} 0 6055
   [junit4]   2> 2258866 INFO  (TEST-AutoCommitTest.testCommitWithin-seed#[D5F572E7D3D271FA]) [    x:collection1] o.a.s.u.p.LogUpdateProcessorFactory [collection1] {delete=[530 (-1575725731942498306)]} 0 6055
   [junit4]   2> 2258866 INFO  (TEST-AutoCommitTest.testCommitWithin-seed#[D5F572E7D3D271FA]) [    x:collection1] o.a.s.u.p.LogUpdateProcessorFactory [collection1] {delete=[530 (-1575725731942498307)]} 0 6055
   [junit4]   2> 2258866 INFO  (TEST-AutoCommitTest.testCommitWithin-seed#[D5F572E7D3D271FA]) [    x:collection1] o.a.s.u.p.LogUpdateProcessorFactory [collection1] {delete=[530 (-1575725731942498308)]} 0 6055
   [junit4]   2> 2258866 INFO  (TEST-AutoCommitTest.testCommitWithin-seed#[D5F572E7D3D271FA]) [    x:collection1] o.a.s.u.p.LogUpdateProcessorFactory [collection1] {delete=[530 (-1575725731942498309)]} 0 6055
   [junit4]   2> 2258866 INFO  (TEST-AutoCommitTest.testCommitWithin-seed#[D5F572E7D3D271FA]) [    x:collection1] o.a.s.u.p.LogUpdateProcessorFactory [collection1] {delete=[530 (-1575725731942498310)]} 0 6055
   [junit4]   2> 2258866 INFO  (TEST-AutoCommitTest.testCommitWithin-seed#[D5F572E7D3D271FA]) [    x:collection1] o.a.s.c.S.Request [collection1]  webapp=null path=null params={q=id:530&qt=&start=0&rows=20&version=2.2} hits=1 status=0 QTime=0
   [junit4]   2> 2259873 INFO  (commitScheduler-6103-thread-1) [    x:collection1] o.a.s.u.DirectUpdateHandler2 start commit{,optimize=false,openSearcher=true,waitSearcher=true,expungeDeletes=false,softCommit=true,prepareCommit=false}
   [junit4]   2> 2259875 INFO  (commitScheduler-6103-thread-1) [    x:collection1] o.a.s.s.SolrIndexSearcher Opening [Searcher@1d09e8aa[collection1] main]
   [junit4]   2> 2259875 INFO  (commitScheduler-6103-thread-1) [    x:collection1] o.a.s.u.DirectUpdateHandler2 end_commit_flush
   [junit4]   2> 2259876 INFO  (searcherExecutor-6100-thread-1-processing-x:collection1) [    x:collection1] o.a.s.c.SolrCore [collection1] Registered new searcher Searcher@1d09e8aa[collection1] main{ExitableDirectoryReader(UninvertingDirectoryReader(Uninverting(_5(7.1.0):c10/9:delGen=1)))}
   [junit4]   2> 2260123 INFO  (TEST-AutoCommitTest.testCommitWithin-seed#[D5F572E7D3D271FA]) [    x:collection1] o.a.s.c.S.Request [collection1]  webapp=null path=null params={q=id:500&qt=&start=0&rows=20&version=2.2} hits=1 status=0 QTime=0
   [junit4]   2> 2260124 INFO  (TEST-AutoCommitTest.testCommitWithin-seed#[D5F572E7D3D271FA]) [    x:collection1] o.a.s.c.S.Request [collection1]  webapp=null path=null params={q=id:530&qt=&start=0&rows=20&version=2.2} hits=0 status=0 QTime=0
   [junit4]   2> 2260124 INFO  (TEST-AutoCommitTest.testCommitWithin-seed#[D5F572E7D3D271FA]) [    x:collection1] o.a.s.SolrTestCaseJ4 ###Ending testCommitWithin
   [junit4]   2> 2260124 INFO  (SUITE-AutoCommitTest-seed#[D5F572E7D3D271FA]-worker) [    x:collection1] o.a.s.SolrTestCaseJ4 ###deleteCore
   [junit4]   2> 2260124 INFO  (SUITE-AutoCommitTest-seed#[D5F572E7D3D271FA]-worker) [    x:collection1] o.a.s.c.CoreContainer Shutting down CoreContainer instance=2129759447
   [junit4]   2> 2260124 INFO  (SUITE-AutoCommitTest-seed#[D5F572E7D3D271FA]-worker) [    x:collection1] o.a.s.m.SolrMetricManager Closing metric reporters for registry=solr.node, tag=null
   [junit4]   2> 2260124 INFO  (SUITE-AutoCommitTest-seed#[D5F572E7D3D271FA]-worker) [    x:collection1] o.a.s.m.r.SolrJmxReporter Closing reporter [org.apache.solr.metrics.reporters.SolrJmxReporter@2b15ecc7: rootName = null, domain = solr.node, service url = null, agent id = null] for registry solr.node / com.codahale.metrics.MetricRegistry@f260e5d
   [junit4]   2> 2260127 INFO  (SUITE-AutoCommitTest-seed#[D5F572E7D3D271FA]-worker) [    x:collection1] o.a.s.m.SolrMetricManager Closing metric reporters for registry=solr.jvm, tag=null
   [junit4]   2> 2260127 INFO  (SUITE-AutoCommitTest-seed#[D5F572E7D3D271FA]-worker) [    x:collection1] o.a.s.m.r.SolrJmxReporter Closing reporter [org.apache.solr.metrics.reporters.SolrJmxReporter@3a8213fe: rootName = null, domain = solr.jvm, service url = null, agent id = null] for registry solr.jvm / com.codahale.metrics.MetricRegistry@1f1e7662
   [junit4]   2> 2260130 INFO  (SUITE-AutoCommitTest-seed#[D5F572E7D3D271FA]-worker) [    x:collection1] o.a.s.m.SolrMetricManager Closing metric reporters for registry=solr.jetty, tag=null
   [junit4]   2> 2260130 INFO  (SUITE-AutoCommitTest-seed#[D5F572E7D3D271FA]-worker) [    x:collection1] o.a.s.m.r.SolrJmxReporter Closing reporter [org.apache.solr.metrics.reporters.SolrJmxReporter@40376ca7: rootName = null, domain = solr.jetty, service url = null, agent id = null] for registry solr.jetty / com.codahale.metrics.MetricRegistry@29818d36
   [junit4]   2> 2260130 INFO  (SUITE-AutoCommitTest-seed#[D5F572E7D3D271FA]-worker) [    x:collection1] o.a.s.c.TransientSolrCoreCacheDefault Allocating transient cache for 2147483647 transient cores
   [junit4]   2> 2260130 INFO  (coreCloseExecutor-6104-thread-1-processing-x:collection1) [    x:collection1] o.a.s.c.SolrCore [collection1]  CLOSING SolrCore org.apache.solr.core.SolrCore@c05427e
   [junit4]   2> 2260130 INFO  (coreCloseExecutor-6104-thread-1-processing-x:collection1) [    x:collection1] o.a.s.u.DirectUpdateHandler2 Committing on IndexWriter close.
   [junit4]   2> 2260130 INFO  (coreCloseExecutor-6104-thread-1-processing-x:collection1) [    x:collection1] o.a.s.u.SolrIndexWriter Calling setCommitData with IW:org.apache.solr.update.SolrIndexWriter@b61cc8 commitCommandVersion:0
   [junit4]   2> 2260131 INFO  (coreCloseExecutor-6104-thread-1-processing-x:collection1) [    x:collection1] o.a.s.m.SolrMetricManager Closing metric reporters for registry=solr.core.collection1, tag=201671294
   [junit4]   2> 2260132 INFO  (coreCloseExecutor-6104-thread-1-processing-x:collection1) [    x:collection1] o.a.s.m.r.SolrJmxReporter Closing reporter [org.apache.solr.metrics.reporters.SolrJmxReporter@2d52b7f9: rootName = null, domain = solr.core.collection1, service url = null, agent id = null] for registry solr.core.collection1 / com.codahale.metrics.MetricRegistry@2594b265
   [junit4]   2> NOTE: leaving temporary files on disk at: /export/home/jenkins/workspace/Lucene-Solr-7.x-Solaris/solr/build/solr-core/test/J1/temp/solr.update.AutoCommitTest_D5F572E7D3D271FA-001
   [junit4]   2> NOTE: test params are: codec=Asserting(Lucene70): {field_t=FSTOrd50, multiDefault=PostingsFormat(name=Asserting), subject=PostingsFormat(name=Asserting), id=BlockTreeOrds(blocksize=128), text=FSTOrd50}, docValues:{range_facet_l_dv=DocValuesFormat(name=Direct), _version_=DocValuesFormat(name=Memory), intDefault=DocValuesFormat(name=Memory), id_i1=DocValuesFormat(name=Lucene70), range_facet_i_dv=DocValuesFormat(name=Memory), intDvoDefault=DocValuesFormat(name=Asserting), range_facet_l=DocValuesFormat(name=Memory), timestamp=DocValuesFormat(name=Memory)}, maxPointsInLeafNode=1451, maxMBSortInHeap=7.3431576877275875, sim=RandomSimilarity(queryNorm=false): {}, locale=et, timezone=America/Phoenix
   [junit4]   2> NOTE: SunOS 5.11 amd64/Oracle Corporation 1.8.0_141 (64-bit)/cpus=3,threads=1,free=172298568,total=369598464
   [junit4]   2> NOTE: All tests run in this JVM: [TestCharFilters, TestShardHandlerFactory, ConvertedLegacyTest, TestMergePolicyConfig, FileBasedSpellCheckerTest, TestLRUStatsCache, TestFastWriter, TestClusterStateMutator, DistributedSuggestComponentTest, PropertiesRequestHandlerTest, TestQueryTypes, TestRTGBase, MultiThreadedOCPTest, DocumentBuilderTest, HdfsNNFailoverTest, TestIntervalFaceting, ActionThrottleTest, TestDistributedStatsComponentCardinality, TestHdfsCloudBackupRestore, ForceLeaderTest, CollectionTooManyReplicasTest, LeaderElectionContextKeyTest, BlockJoinFacetSimpleTest, SubstringBytesRefFilterTest, EnumFieldTest, TestSolr4Spatial, TemplateUpdateProcessorTest, SynonymTokenizerTest, TestPrepRecovery, IndexSchemaRuntimeFieldTest, MergeStrategyTest, TestRandomCollapseQParserPlugin, TestFastOutputStream, TestDFISimilarityFactory, TestFieldResource, TestFileDictionaryLookup, StatelessScriptUpdateProcessorFactoryTest, TestSortByMinMaxFunction, TestRandomRequestDistribution, SearchHandlerTest, ExternalFileFieldSortTest, DataDrivenBlockJoinTest, ShardRoutingCustomTest, TestExceedMaxTermLength, MetricUtilsTest, BlockDirectoryTest, TestJoin, TestComplexPhraseQParserPlugin, TestPullReplicaErrorHandling, TestSolrFieldCacheBean, CleanupOldIndexTest, SpellingQueryConverterTest, CursorMarkTest, EchoParamsTest, TestRawTransformer, TestGraphMLResponseWriter, TestSolrCloudWithHadoopAuthPlugin, DistributedVersionInfoTest, MoveReplicaHDFSUlogDirTest, TestAnalyzedSuggestions, DistributedMLTComponentTest, TolerantUpdateProcessorTest, TestMultiWordSynonyms, TestFiltering, FullHLLTest, BlobRepositoryCloudTest, TestNumericTerms32, SolrCoreCheckLockOnStartupTest, BitVectorTest, SolrGraphiteReporterTest, CoreSorterTest, ZkNodePropsTest, TestSchemaManager, JsonLoaderTest, TestSolrConfigHandler, BadIndexSchemaTest, SortSpecParsingTest, TestRandomFaceting, ZkSolrClientTest, TestSystemCollAutoCreate, TestStressCloudBlindAtomicUpdates, TestPolicyCloud, MetricsConfigTest, BasicDistributedZk2Test, CollectionsAPIDistributedZkTest, SchemaVersionSpecificBehaviorTest, VMParamsZkACLAndCredentialsProvidersTest, TestDefaultStatsCache, PreAnalyzedFieldManagedSchemaCloudTest, TestMacroExpander, TestCollationField, TestCloudJSONFacetJoinDomain, UpdateRequestProcessorFactoryTest, TestPartialUpdateDeduplication, JSONWriterTest, DistribJoinFromCollectionTest, FileUtilsTest, TestApiFramework, IgnoreCommitOptimizeUpdateProcessorFactoryTest, HdfsSyncSliceTest, TestFieldCacheSortRandom, TestStressUserVersions, TermsComponentTest, TestReRankQParserPlugin, TestLMJelinekMercerSimilarityFactory, TestRecovery, AnalysisErrorHandlingTest, TestDelegationWithHadoopAuth, TestDocTermOrds, TestNumericRangeQuery64, QueryResultKeyTest, TestAnalyzeInfixSuggestions, TestCollapseQParserPlugin, TestSQLHandler, TestLegacyNumericUtils, TestFieldTypeResource, TestSimpleQParserPlugin, TestQueryUtils, ShufflingReplicaListTransformerTest, TestHdfsBackupRestoreCore, TestExportWriter, PluginInfoTest, RequestLoggingTest, OutOfBoxZkACLAndCredentialsProvidersTest, DistribCursorPagingTest, DocumentAnalysisRequestHandlerTest, TestManagedResource, BadComponentTest, TestReplicaProperties, SuggesterFSTTest, LeaderFailureAfterFreshStartTest, LeaderElectionIntegrationTest, RuleEngineTest, HdfsChaosMonkeySafeLeaderTest, TestSolrConfigHandlerCloud, HLLUtilTest, TestStressLucene, ReplaceNodeTest, CacheHeaderTest, StatsComponentTest, TestConfigOverlay, TestManagedSynonymFilterFactory, OverseerCollectionConfigSetProcessorTest, ConjunctionSolrSpellCheckerTest, TestGraphTermsQParserPlugin, TestDistributedMissingSort, TestSolr4Spatial2, AsyncCallRequestStatusResponseTest, TestInPlaceUpdatesDistrib, OverseerRolesTest, TestXmlQParser, TestSuggestSpellingConverter, TermVectorComponentTest, TestOverriddenPrefixQueryForCustomFieldType, TestCloudSearcherWarming, TestScoreJoinQPNoScore, InfixSuggestersTest, TestConfigSetsAPI, TestReqParamsAPI, TestReloadDeadlock, FullSolrCloudDistribCmdsTest, TestLuceneMatchVersion, SolrMetricsIntegrationTest, AutoCommitTest]
   [junit4] Completed [355/729 (1!)] on J1 in 9.44s, 3 tests, 1 error <<< FAILURES!

[...truncated 44611 lines...]

Mime
View raw message