lucene-dev mailing list archives

Site index · List index
Message view « Date » · « Thread »
Top « Date » · « Thread »
From Policeman Jenkins Server <jenk...@thetaphi.de>
Subject [JENKINS-EA] Lucene-Solr-master-Windows (32bit/jdk-9-ea+181) - Build # 6830 - Still Unstable!
Date Fri, 18 Aug 2017 16:42:24 GMT
Build: https://jenkins.thetaphi.de/job/Lucene-Solr-master-Windows/6830/
Java: 32bit/jdk-9-ea+181 -server -XX:+UseG1GC --illegal-access=deny

3 tests failed.
FAILED:  org.apache.solr.cloud.CdcrBootstrapTest.testBootstrapWithContinousIndexingOnSourceCluster

Error Message:
Document mismatch on target after sync expected:<2000> but was:<1100>

Stack Trace:
java.lang.AssertionError: Document mismatch on target after sync expected:<2000> but was:<1100>
	at __randomizedtesting.SeedInfo.seed([2A5B12C1609DFB81:FE1E599887CB487A]:0)
	at org.junit.Assert.fail(Assert.java:93)
	at org.junit.Assert.failNotEquals(Assert.java:647)
	at org.junit.Assert.assertEquals(Assert.java:128)
	at org.junit.Assert.assertEquals(Assert.java:472)
	at org.apache.solr.cloud.CdcrBootstrapTest.testBootstrapWithContinousIndexingOnSourceCluster(CdcrBootstrapTest.java:309)
	at java.base/jdk.internal.reflect.NativeMethodAccessorImpl.invoke0(Native Method)
	at java.base/jdk.internal.reflect.NativeMethodAccessorImpl.invoke(NativeMethodAccessorImpl.java:62)
	at java.base/jdk.internal.reflect.DelegatingMethodAccessorImpl.invoke(DelegatingMethodAccessorImpl.java:43)
	at java.base/java.lang.reflect.Method.invoke(Method.java:564)
	at com.carrotsearch.randomizedtesting.RandomizedRunner.invoke(RandomizedRunner.java:1713)
	at com.carrotsearch.randomizedtesting.RandomizedRunner$8.evaluate(RandomizedRunner.java:907)
	at com.carrotsearch.randomizedtesting.RandomizedRunner$9.evaluate(RandomizedRunner.java:943)
	at com.carrotsearch.randomizedtesting.RandomizedRunner$10.evaluate(RandomizedRunner.java:957)
	at com.carrotsearch.randomizedtesting.rules.SystemPropertiesRestoreRule$1.evaluate(SystemPropertiesRestoreRule.java:57)
	at org.apache.lucene.util.TestRuleSetupTeardownChained$1.evaluate(TestRuleSetupTeardownChained.java:49)
	at org.apache.lucene.util.AbstractBeforeAfterRule$1.evaluate(AbstractBeforeAfterRule.java:45)
	at org.apache.lucene.util.TestRuleThreadAndTestName$1.evaluate(TestRuleThreadAndTestName.java:48)
	at org.apache.lucene.util.TestRuleIgnoreAfterMaxFailures$1.evaluate(TestRuleIgnoreAfterMaxFailures.java:64)
	at org.apache.lucene.util.TestRuleMarkFailure$1.evaluate(TestRuleMarkFailure.java:47)
	at com.carrotsearch.randomizedtesting.rules.StatementAdapter.evaluate(StatementAdapter.java:36)
	at com.carrotsearch.randomizedtesting.ThreadLeakControl$StatementRunner.run(ThreadLeakControl.java:368)
	at com.carrotsearch.randomizedtesting.ThreadLeakControl.forkTimeoutingTask(ThreadLeakControl.java:817)
	at com.carrotsearch.randomizedtesting.ThreadLeakControl$3.evaluate(ThreadLeakControl.java:468)
	at com.carrotsearch.randomizedtesting.RandomizedRunner.runSingleTest(RandomizedRunner.java:916)
	at com.carrotsearch.randomizedtesting.RandomizedRunner$5.evaluate(RandomizedRunner.java:802)
	at com.carrotsearch.randomizedtesting.RandomizedRunner$6.evaluate(RandomizedRunner.java:852)
	at com.carrotsearch.randomizedtesting.RandomizedRunner$7.evaluate(RandomizedRunner.java:863)
	at com.carrotsearch.randomizedtesting.rules.StatementAdapter.evaluate(StatementAdapter.java:36)
	at com.carrotsearch.randomizedtesting.rules.SystemPropertiesRestoreRule$1.evaluate(SystemPropertiesRestoreRule.java:57)
	at org.apache.lucene.util.AbstractBeforeAfterRule$1.evaluate(AbstractBeforeAfterRule.java:45)
	at com.carrotsearch.randomizedtesting.rules.StatementAdapter.evaluate(StatementAdapter.java:36)
	at org.apache.lucene.util.TestRuleStoreClassName$1.evaluate(TestRuleStoreClassName.java:41)
	at com.carrotsearch.randomizedtesting.rules.NoShadowingOrOverridesOnMethodsRule$1.evaluate(NoShadowingOrOverridesOnMethodsRule.java:40)
	at com.carrotsearch.randomizedtesting.rules.NoShadowingOrOverridesOnMethodsRule$1.evaluate(NoShadowingOrOverridesOnMethodsRule.java:40)
	at com.carrotsearch.randomizedtesting.rules.StatementAdapter.evaluate(StatementAdapter.java:36)
	at com.carrotsearch.randomizedtesting.rules.StatementAdapter.evaluate(StatementAdapter.java:36)
	at org.apache.lucene.util.TestRuleAssertionsRequired$1.evaluate(TestRuleAssertionsRequired.java:53)
	at org.apache.lucene.util.TestRuleMarkFailure$1.evaluate(TestRuleMarkFailure.java:47)
	at org.apache.lucene.util.TestRuleIgnoreAfterMaxFailures$1.evaluate(TestRuleIgnoreAfterMaxFailures.java:64)
	at org.apache.lucene.util.TestRuleIgnoreTestSuites$1.evaluate(TestRuleIgnoreTestSuites.java:54)
	at com.carrotsearch.randomizedtesting.rules.StatementAdapter.evaluate(StatementAdapter.java:36)
	at com.carrotsearch.randomizedtesting.ThreadLeakControl$StatementRunner.run(ThreadLeakControl.java:368)
	at java.base/java.lang.Thread.run(Thread.java:844)


FAILED:  junit.framework.TestSuite.org.apache.solr.handler.component.SuggestComponentTest

Error Message:
Could not remove the following files (in the order of attempts):    C:\Users\jenkins\workspace\Lucene-Solr-master-Windows\solr\build\solr-core\test\J1\temp\solr.handler.component.SuggestComponentTest_2A5B12C1609DFB81-001\init-core-data-001: java.nio.file.AccessDeniedException: C:\Users\jenkins\workspace\Lucene-Solr-master-Windows\solr\build\solr-core\test\J1\temp\solr.handler.component.SuggestComponentTest_2A5B12C1609DFB81-001\init-core-data-001    C:\Users\jenkins\workspace\Lucene-Solr-master-Windows\solr\build\solr-core\test\J1\temp\solr.handler.component.SuggestComponentTest_2A5B12C1609DFB81-001: java.nio.file.DirectoryNotEmptyException: C:\Users\jenkins\workspace\Lucene-Solr-master-Windows\solr\build\solr-core\test\J1\temp\solr.handler.component.SuggestComponentTest_2A5B12C1609DFB81-001 

Stack Trace:
java.io.IOException: Could not remove the following files (in the order of attempts):
   C:\Users\jenkins\workspace\Lucene-Solr-master-Windows\solr\build\solr-core\test\J1\temp\solr.handler.component.SuggestComponentTest_2A5B12C1609DFB81-001\init-core-data-001: java.nio.file.AccessDeniedException: C:\Users\jenkins\workspace\Lucene-Solr-master-Windows\solr\build\solr-core\test\J1\temp\solr.handler.component.SuggestComponentTest_2A5B12C1609DFB81-001\init-core-data-001
   C:\Users\jenkins\workspace\Lucene-Solr-master-Windows\solr\build\solr-core\test\J1\temp\solr.handler.component.SuggestComponentTest_2A5B12C1609DFB81-001: java.nio.file.DirectoryNotEmptyException: C:\Users\jenkins\workspace\Lucene-Solr-master-Windows\solr\build\solr-core\test\J1\temp\solr.handler.component.SuggestComponentTest_2A5B12C1609DFB81-001

	at __randomizedtesting.SeedInfo.seed([2A5B12C1609DFB81]:0)
	at org.apache.lucene.util.IOUtils.rm(IOUtils.java:329)
	at org.apache.lucene.util.TestRuleTemporaryFilesCleanup.afterAlways(TestRuleTemporaryFilesCleanup.java:216)
	at com.carrotsearch.randomizedtesting.rules.TestRuleAdapter$1.afterAlways(TestRuleAdapter.java:31)
	at com.carrotsearch.randomizedtesting.rules.StatementAdapter.evaluate(StatementAdapter.java:43)
	at com.carrotsearch.randomizedtesting.rules.StatementAdapter.evaluate(StatementAdapter.java:36)
	at org.apache.lucene.util.TestRuleAssertionsRequired$1.evaluate(TestRuleAssertionsRequired.java:53)
	at org.apache.lucene.util.TestRuleMarkFailure$1.evaluate(TestRuleMarkFailure.java:47)
	at org.apache.lucene.util.TestRuleIgnoreAfterMaxFailures$1.evaluate(TestRuleIgnoreAfterMaxFailures.java:64)
	at org.apache.lucene.util.TestRuleIgnoreTestSuites$1.evaluate(TestRuleIgnoreTestSuites.java:54)
	at com.carrotsearch.randomizedtesting.rules.StatementAdapter.evaluate(StatementAdapter.java:36)
	at com.carrotsearch.randomizedtesting.ThreadLeakControl$StatementRunner.run(ThreadLeakControl.java:368)
	at java.base/java.lang.Thread.run(Thread.java:844)


FAILED:  org.apache.solr.cloud.HttpPartitionTest.test

Error Message:
Doc with id=1 not found in http://127.0.0.1:60249/collMinRf_1x3 due to: Path not found: /id; rsp={doc=null}

Stack Trace:
java.lang.AssertionError: Doc with id=1 not found in http://127.0.0.1:60249/collMinRf_1x3 due to: Path not found: /id; rsp={doc=null}
	at __randomizedtesting.SeedInfo.seed([2A5B12C1609DFB81:A20F2D1BCE619679]:0)
	at org.junit.Assert.fail(Assert.java:93)
	at org.junit.Assert.assertTrue(Assert.java:43)
	at org.apache.solr.cloud.HttpPartitionTest.assertDocExists(HttpPartitionTest.java:603)
	at org.apache.solr.cloud.HttpPartitionTest.assertDocsExistInAllReplicas(HttpPartitionTest.java:558)
	at org.apache.solr.cloud.HttpPartitionTest.testMinRf(HttpPartitionTest.java:249)
	at org.apache.solr.cloud.HttpPartitionTest.test(HttpPartitionTest.java:127)
	at java.base/jdk.internal.reflect.NativeMethodAccessorImpl.invoke0(Native Method)
	at java.base/jdk.internal.reflect.NativeMethodAccessorImpl.invoke(NativeMethodAccessorImpl.java:62)
	at java.base/jdk.internal.reflect.DelegatingMethodAccessorImpl.invoke(DelegatingMethodAccessorImpl.java:43)
	at java.base/java.lang.reflect.Method.invoke(Method.java:564)
	at com.carrotsearch.randomizedtesting.RandomizedRunner.invoke(RandomizedRunner.java:1713)
	at com.carrotsearch.randomizedtesting.RandomizedRunner$8.evaluate(RandomizedRunner.java:907)
	at com.carrotsearch.randomizedtesting.RandomizedRunner$9.evaluate(RandomizedRunner.java:943)
	at com.carrotsearch.randomizedtesting.RandomizedRunner$10.evaluate(RandomizedRunner.java:957)
	at org.apache.solr.BaseDistributedSearchTestCase$ShardsRepeatRule$ShardsFixedStatement.callStatement(BaseDistributedSearchTestCase.java:993)
	at org.apache.solr.BaseDistributedSearchTestCase$ShardsRepeatRule$ShardsStatement.evaluate(BaseDistributedSearchTestCase.java:968)
	at com.carrotsearch.randomizedtesting.rules.SystemPropertiesRestoreRule$1.evaluate(SystemPropertiesRestoreRule.java:57)
	at org.apache.lucene.util.TestRuleSetupTeardownChained$1.evaluate(TestRuleSetupTeardownChained.java:49)
	at org.apache.lucene.util.AbstractBeforeAfterRule$1.evaluate(AbstractBeforeAfterRule.java:45)
	at org.apache.lucene.util.TestRuleThreadAndTestName$1.evaluate(TestRuleThreadAndTestName.java:48)
	at org.apache.lucene.util.TestRuleIgnoreAfterMaxFailures$1.evaluate(TestRuleIgnoreAfterMaxFailures.java:64)
	at org.apache.lucene.util.TestRuleMarkFailure$1.evaluate(TestRuleMarkFailure.java:47)
	at com.carrotsearch.randomizedtesting.rules.StatementAdapter.evaluate(StatementAdapter.java:36)
	at com.carrotsearch.randomizedtesting.ThreadLeakControl$StatementRunner.run(ThreadLeakControl.java:368)
	at com.carrotsearch.randomizedtesting.ThreadLeakControl.forkTimeoutingTask(ThreadLeakControl.java:817)
	at com.carrotsearch.randomizedtesting.ThreadLeakControl$3.evaluate(ThreadLeakControl.java:468)
	at com.carrotsearch.randomizedtesting.RandomizedRunner.runSingleTest(RandomizedRunner.java:916)
	at com.carrotsearch.randomizedtesting.RandomizedRunner$5.evaluate(RandomizedRunner.java:802)
	at com.carrotsearch.randomizedtesting.RandomizedRunner$6.evaluate(RandomizedRunner.java:852)
	at com.carrotsearch.randomizedtesting.RandomizedRunner$7.evaluate(RandomizedRunner.java:863)
	at com.carrotsearch.randomizedtesting.rules.StatementAdapter.evaluate(StatementAdapter.java:36)
	at com.carrotsearch.randomizedtesting.rules.SystemPropertiesRestoreRule$1.evaluate(SystemPropertiesRestoreRule.java:57)
	at org.apache.lucene.util.AbstractBeforeAfterRule$1.evaluate(AbstractBeforeAfterRule.java:45)
	at com.carrotsearch.randomizedtesting.rules.StatementAdapter.evaluate(StatementAdapter.java:36)
	at org.apache.lucene.util.TestRuleStoreClassName$1.evaluate(TestRuleStoreClassName.java:41)
	at com.carrotsearch.randomizedtesting.rules.NoShadowingOrOverridesOnMethodsRule$1.evaluate(NoShadowingOrOverridesOnMethodsRule.java:40)
	at com.carrotsearch.randomizedtesting.rules.NoShadowingOrOverridesOnMethodsRule$1.evaluate(NoShadowingOrOverridesOnMethodsRule.java:40)
	at com.carrotsearch.randomizedtesting.rules.StatementAdapter.evaluate(StatementAdapter.java:36)
	at com.carrotsearch.randomizedtesting.rules.StatementAdapter.evaluate(StatementAdapter.java:36)
	at org.apache.lucene.util.TestRuleAssertionsRequired$1.evaluate(TestRuleAssertionsRequired.java:53)
	at org.apache.lucene.util.TestRuleMarkFailure$1.evaluate(TestRuleMarkFailure.java:47)
	at org.apache.lucene.util.TestRuleIgnoreAfterMaxFailures$1.evaluate(TestRuleIgnoreAfterMaxFailures.java:64)
	at org.apache.lucene.util.TestRuleIgnoreTestSuites$1.evaluate(TestRuleIgnoreTestSuites.java:54)
	at com.carrotsearch.randomizedtesting.rules.StatementAdapter.evaluate(StatementAdapter.java:36)
	at com.carrotsearch.randomizedtesting.ThreadLeakControl$StatementRunner.run(ThreadLeakControl.java:368)
	at java.base/java.lang.Thread.run(Thread.java:844)




Build Log:
[...truncated 11049 lines...]
   [junit4] Suite: org.apache.solr.cloud.HttpPartitionTest
   [junit4]   2> 325777 INFO  (SUITE-HttpPartitionTest-seed#[2A5B12C1609DFB81]-worker) [    ] o.a.s.SolrTestCaseJ4 SecureRandom sanity checks: test.solr.allowed.securerandom=null & java.security.egd=file:/dev/./urandom
   [junit4]   2> Creating dataDir: C:\Users\jenkins\workspace\Lucene-Solr-master-Windows\solr\build\solr-core\test\J1\temp\solr.cloud.HttpPartitionTest_2A5B12C1609DFB81-001\init-core-data-001
   [junit4]   2> 325778 WARN  (SUITE-HttpPartitionTest-seed#[2A5B12C1609DFB81]-worker) [    ] o.a.s.SolrTestCaseJ4 startTrackingSearchers: numOpens=9 numCloses=9
   [junit4]   2> 325779 INFO  (SUITE-HttpPartitionTest-seed#[2A5B12C1609DFB81]-worker) [    ] o.a.s.SolrTestCaseJ4 Using TrieFields (NUMERIC_POINTS_SYSPROP=false) w/NUMERIC_DOCVALUES_SYSPROP=true
   [junit4]   2> 325782 INFO  (SUITE-HttpPartitionTest-seed#[2A5B12C1609DFB81]-worker) [    ] o.a.s.SolrTestCaseJ4 Randomized ssl (false) and clientAuth (false) via: @org.apache.solr.SolrTestCaseJ4$SuppressSSL(bugUrl="https://issues.apache.org/jira/browse/SOLR-5776")
   [junit4]   2> 325782 INFO  (SUITE-HttpPartitionTest-seed#[2A5B12C1609DFB81]-worker) [    ] o.a.s.BaseDistributedSearchTestCase Setting hostContext system property: /
   [junit4]   2> 325785 INFO  (TEST-HttpPartitionTest.test-seed#[2A5B12C1609DFB81]) [    ] o.a.s.c.ZkTestServer STARTING ZK TEST SERVER
   [junit4]   2> 325786 INFO  (Thread-945) [    ] o.a.s.c.ZkTestServer client port:0.0.0.0/0.0.0.0:0
   [junit4]   2> 325786 INFO  (Thread-945) [    ] o.a.s.c.ZkTestServer Starting server
   [junit4]   2> 325792 ERROR (Thread-945) [    ] o.a.z.s.ZooKeeperServer ZKShutdownHandler is not registered, so ZooKeeper server won't take any action on ERROR or SHUTDOWN server state changes
   [junit4]   2> 325886 INFO  (TEST-HttpPartitionTest.test-seed#[2A5B12C1609DFB81]) [    ] o.a.s.c.ZkTestServer start zk server on port:60217
   [junit4]   2> 325917 INFO  (TEST-HttpPartitionTest.test-seed#[2A5B12C1609DFB81]) [    ] o.a.s.c.AbstractZkTestCase put C:\Users\jenkins\workspace\Lucene-Solr-master-Windows\solr\core\src\test-files\solr\collection1\conf\solrconfig-tlog.xml to /configs/conf1/solrconfig.xml
   [junit4]   2> 325920 INFO  (TEST-HttpPartitionTest.test-seed#[2A5B12C1609DFB81]) [    ] o.a.s.c.AbstractZkTestCase put C:\Users\jenkins\workspace\Lucene-Solr-master-Windows\solr\core\src\test-files\solr\collection1\conf\schema.xml to /configs/conf1/schema.xml
   [junit4]   2> 325922 INFO  (TEST-HttpPartitionTest.test-seed#[2A5B12C1609DFB81]) [    ] o.a.s.c.AbstractZkTestCase put C:\Users\jenkins\workspace\Lucene-Solr-master-Windows\solr\core\src\test-files\solr\collection1\conf\solrconfig.snippet.randomindexconfig.xml to /configs/conf1/solrconfig.snippet.randomindexconfig.xml
   [junit4]   2> 325924 INFO  (TEST-HttpPartitionTest.test-seed#[2A5B12C1609DFB81]) [    ] o.a.s.c.AbstractZkTestCase put C:\Users\jenkins\workspace\Lucene-Solr-master-Windows\solr\core\src\test-files\solr\collection1\conf\stopwords.txt to /configs/conf1/stopwords.txt
   [junit4]   2> 325926 INFO  (TEST-HttpPartitionTest.test-seed#[2A5B12C1609DFB81]) [    ] o.a.s.c.AbstractZkTestCase put C:\Users\jenkins\workspace\Lucene-Solr-master-Windows\solr\core\src\test-files\solr\collection1\conf\protwords.txt to /configs/conf1/protwords.txt
   [junit4]   2> 325928 INFO  (TEST-HttpPartitionTest.test-seed#[2A5B12C1609DFB81]) [    ] o.a.s.c.AbstractZkTestCase put C:\Users\jenkins\workspace\Lucene-Solr-master-Windows\solr\core\src\test-files\solr\collection1\conf\currency.xml to /configs/conf1/currency.xml
   [junit4]   2> 325930 INFO  (TEST-HttpPartitionTest.test-seed#[2A5B12C1609DFB81]) [    ] o.a.s.c.AbstractZkTestCase put C:\Users\jenkins\workspace\Lucene-Solr-master-Windows\solr\core\src\test-files\solr\collection1\conf\enumsConfig.xml to /configs/conf1/enumsConfig.xml
   [junit4]   2> 325932 INFO  (TEST-HttpPartitionTest.test-seed#[2A5B12C1609DFB81]) [    ] o.a.s.c.AbstractZkTestCase put C:\Users\jenkins\workspace\Lucene-Solr-master-Windows\solr\core\src\test-files\solr\collection1\conf\open-exchange-rates.json to /configs/conf1/open-exchange-rates.json
   [junit4]   2> 325934 INFO  (TEST-HttpPartitionTest.test-seed#[2A5B12C1609DFB81]) [    ] o.a.s.c.AbstractZkTestCase put C:\Users\jenkins\workspace\Lucene-Solr-master-Windows\solr\core\src\test-files\solr\collection1\conf\mapping-ISOLatin1Accent.txt to /configs/conf1/mapping-ISOLatin1Accent.txt
   [junit4]   2> 325936 INFO  (TEST-HttpPartitionTest.test-seed#[2A5B12C1609DFB81]) [    ] o.a.s.c.AbstractZkTestCase put C:\Users\jenkins\workspace\Lucene-Solr-master-Windows\solr\core\src\test-files\solr\collection1\conf\old_synonyms.txt to /configs/conf1/old_synonyms.txt
   [junit4]   2> 325938 INFO  (TEST-HttpPartitionTest.test-seed#[2A5B12C1609DFB81]) [    ] o.a.s.c.AbstractZkTestCase put C:\Users\jenkins\workspace\Lucene-Solr-master-Windows\solr\core\src\test-files\solr\collection1\conf\synonyms.txt to /configs/conf1/synonyms.txt
   [junit4]   2> 325940 INFO  (TEST-HttpPartitionTest.test-seed#[2A5B12C1609DFB81]) [    ] o.a.s.c.AbstractFullDistribZkTestBase Will use TLOG replicas unless explicitly asked otherwise
   [junit4]   2> 326365 INFO  (TEST-HttpPartitionTest.test-seed#[2A5B12C1609DFB81]) [    ] o.e.j.s.Server jetty-9.3.20.v20170531
   [junit4]   2> 326366 INFO  (TEST-HttpPartitionTest.test-seed#[2A5B12C1609DFB81]) [    ] o.e.j.s.h.ContextHandler Started o.e.j.s.ServletContextHandler@d22279{/,null,AVAILABLE}
   [junit4]   2> 326370 INFO  (TEST-HttpPartitionTest.test-seed#[2A5B12C1609DFB81]) [    ] o.e.j.s.AbstractConnector Started ServerConnector@1d5930f{HTTP/1.1,[http/1.1]}{127.0.0.1:60225}
   [junit4]   2> 326370 INFO  (TEST-HttpPartitionTest.test-seed#[2A5B12C1609DFB81]) [    ] o.e.j.s.Server Started @327242ms
   [junit4]   2> 326370 INFO  (TEST-HttpPartitionTest.test-seed#[2A5B12C1609DFB81]) [    ] o.a.s.c.s.e.JettySolrRunner Jetty properties: {hostContext=/, solr.data.dir=C:\Users\jenkins\workspace\Lucene-Solr-master-Windows\solr\build\solr-core\test\J1\temp\solr.cloud.HttpPartitionTest_2A5B12C1609DFB81-001\tempDir-001/control/data, hostPort=60224, coreRootDirectory=C:\Users\jenkins\workspace\Lucene-Solr-master-Windows\solr\build\solr-core\test\J1\temp\solr.cloud.HttpPartitionTest_2A5B12C1609DFB81-001\control-001\cores, replicaType=NRT}
   [junit4]   2> 326370 ERROR (TEST-HttpPartitionTest.test-seed#[2A5B12C1609DFB81]) [    ] o.a.s.s.StartupLoggingUtils Missing Java Option solr.log.dir. Logging may be missing or incomplete.
   [junit4]   2> 326370 INFO  (TEST-HttpPartitionTest.test-seed#[2A5B12C1609DFB81]) [    ] o.a.s.s.SolrDispatchFilter  ___      _       Welcome to Apache Solr™ version 8.0.0
   [junit4]   2> 326370 INFO  (TEST-HttpPartitionTest.test-seed#[2A5B12C1609DFB81]) [    ] o.a.s.s.SolrDispatchFilter / __| ___| |_ _   Starting in cloud mode on port null
   [junit4]   2> 326370 INFO  (TEST-HttpPartitionTest.test-seed#[2A5B12C1609DFB81]) [    ] o.a.s.s.SolrDispatchFilter \__ \/ _ \ | '_|  Install dir: null, Default config dir: null
   [junit4]   2> 326370 INFO  (TEST-HttpPartitionTest.test-seed#[2A5B12C1609DFB81]) [    ] o.a.s.s.SolrDispatchFilter |___/\___/_|_|    Start time: 2017-08-18T15:30:48.888317900Z
   [junit4]   2> 326374 WARN  (NIOServerCxn.Factory:0.0.0.0/0.0.0.0:0) [    ] o.a.z.s.NIOServerCnxn caught end of stream exception
   [junit4]   2> EndOfStreamException: Unable to read additional data from client sessionid 0x15df5f7dd750002, likely client has closed socket
   [junit4]   2> 	at org.apache.zookeeper.server.NIOServerCnxn.doIO(NIOServerCnxn.java:239)
   [junit4]   2> 	at org.apache.zookeeper.server.NIOServerCnxnFactory.run(NIOServerCnxnFactory.java:203)
   [junit4]   2> 	at java.base/java.lang.Thread.run(Thread.java:844)
   [junit4]   2> 326375 INFO  (TEST-HttpPartitionTest.test-seed#[2A5B12C1609DFB81]) [    ] o.a.s.s.SolrDispatchFilter Loading solr.xml from SolrHome (not found in ZooKeeper)
   [junit4]   2> 326375 INFO  (TEST-HttpPartitionTest.test-seed#[2A5B12C1609DFB81]) [    ] o.a.s.c.SolrXmlConfig Loading container configuration from C:\Users\jenkins\workspace\Lucene-Solr-master-Windows\solr\build\solr-core\test\J1\temp\solr.cloud.HttpPartitionTest_2A5B12C1609DFB81-001\control-001\solr.xml
   [junit4]   2> 326381 INFO  (TEST-HttpPartitionTest.test-seed#[2A5B12C1609DFB81]) [    ] o.a.s.c.SolrXmlConfig MBean server found: com.sun.jmx.mbeanserver.JmxMBeanServer@148b87, but no JMX reporters were configured - adding default JMX reporter.
   [junit4]   2> 326384 INFO  (TEST-HttpPartitionTest.test-seed#[2A5B12C1609DFB81]) [    ] o.a.s.c.ZkContainer Zookeeper client=127.0.0.1:60217/solr
   [junit4]   2> 326499 INFO  (TEST-HttpPartitionTest.test-seed#[2A5B12C1609DFB81]) [    ] o.a.s.c.Overseer Overseer (id=null) closing
   [junit4]   2> 326499 INFO  (TEST-HttpPartitionTest.test-seed#[2A5B12C1609DFB81]) [    ] o.a.s.c.OverseerElectionContext I am going to be the leader 127.0.0.1:60224_
   [junit4]   2> 326499 INFO  (TEST-HttpPartitionTest.test-seed#[2A5B12C1609DFB81]) [    ] o.a.s.c.Overseer Overseer (id=98505211793178628-127.0.0.1:60224_-n_0000000000) starting
   [junit4]   2> 326507 INFO  (TEST-HttpPartitionTest.test-seed#[2A5B12C1609DFB81]) [    ] o.a.s.c.ZkController Register node as live in ZooKeeper:/live_nodes/127.0.0.1:60224_
   [junit4]   2> 326509 INFO  (OverseerStateUpdate-98505211793178628-127.0.0.1:60224_-n_0000000000) [    ] o.a.s.c.c.ZkStateReader Updated live nodes from ZooKeeper... (0) -> (1)
   [junit4]   2> 326668 INFO  (TEST-HttpPartitionTest.test-seed#[2A5B12C1609DFB81]) [    ] o.a.s.m.r.SolrJmxReporter JMX monitoring for 'solr.node' (registry 'solr.node') enabled at server: com.sun.jmx.mbeanserver.JmxMBeanServer@148b87
   [junit4]   2> 326677 INFO  (TEST-HttpPartitionTest.test-seed#[2A5B12C1609DFB81]) [    ] o.a.s.m.r.SolrJmxReporter JMX monitoring for 'solr.jvm' (registry 'solr.jvm') enabled at server: com.sun.jmx.mbeanserver.JmxMBeanServer@148b87
   [junit4]   2> 326678 INFO  (TEST-HttpPartitionTest.test-seed#[2A5B12C1609DFB81]) [    ] o.a.s.m.r.SolrJmxReporter JMX monitoring for 'solr.jetty' (registry 'solr.jetty') enabled at server: com.sun.jmx.mbeanserver.JmxMBeanServer@148b87
   [junit4]   2> 326680 INFO  (TEST-HttpPartitionTest.test-seed#[2A5B12C1609DFB81]) [    ] o.a.s.c.CorePropertiesLocator Found 0 core definitions underneath C:\Users\jenkins\workspace\Lucene-Solr-master-Windows\solr\build\solr-core\test\J1\temp\solr.cloud.HttpPartitionTest_2A5B12C1609DFB81-001\control-001\cores
   [junit4]   2> 326704 INFO  (TEST-HttpPartitionTest.test-seed#[2A5B12C1609DFB81]) [    ] o.a.s.c.c.ZkStateReader Updated live nodes from ZooKeeper... (0) -> (1)
   [junit4]   2> 326706 INFO  (TEST-HttpPartitionTest.test-seed#[2A5B12C1609DFB81]) [    ] o.a.s.c.s.i.ZkClientClusterStateProvider Cluster at 127.0.0.1:60217/solr ready
   [junit4]   2> 326707 INFO  (SocketProxy-Acceptor-60224) [    ] o.a.s.c.SocketProxy accepted Socket[addr=/127.0.0.1,port=60240,localport=60224], receiveBufferSize:65536
   [junit4]   2> 326709 INFO  (SocketProxy-Acceptor-60224) [    ] o.a.s.c.SocketProxy proxy connection Socket[addr=/127.0.0.1,port=60225,localport=60241], receiveBufferSize=65536
   [junit4]   2> 326715 INFO  (qtp7533610-3443) [    ] o.a.s.h.a.CollectionsHandler Invoked Collection Action :create with params replicationFactor=1&collection.configName=conf1&name=control_collection&nrtReplicas=1&action=CREATE&numShards=1&createNodeSet=127.0.0.1:60224_&wt=javabin&version=2 and sendToOCPQueue=true
   [junit4]   2> 326718 INFO  (OverseerThreadFactory-1465-thread-1) [    ] o.a.s.c.CreateCollectionCmd Create collection control_collection
   [junit4]   2> 326826 INFO  (SocketProxy-Acceptor-60224) [    ] o.a.s.c.SocketProxy accepted Socket[addr=/127.0.0.1,port=60242,localport=60224], receiveBufferSize:65536
   [junit4]   2> 326826 INFO  (SocketProxy-Acceptor-60224) [    ] o.a.s.c.SocketProxy proxy connection Socket[addr=/127.0.0.1,port=60225,localport=60243], receiveBufferSize=65536
   [junit4]   2> 326830 INFO  (qtp7533610-3450) [    ] o.a.s.h.a.CoreAdminOperation core create command qt=/admin/cores&collection.configName=conf1&newCollection=true&name=control_collection_shard1_replica_n1&action=CREATE&numShards=1&collection=control_collection&shard=shard1&wt=javabin&version=2&replicaType=NRT
   [junit4]   2> 326830 INFO  (qtp7533610-3450) [    ] o.a.s.c.TransientSolrCoreCacheDefault Allocating transient cache for 4 transient cores
   [junit4]   2> 326938 INFO  (zkCallback-537-thread-1) [    ] o.a.s.c.c.ZkStateReader A cluster state change: [WatchedEvent state:SyncConnected type:NodeDataChanged path:/collections/control_collection/state.json] for collection [control_collection] has occurred - updating... (live nodes size: [1])
   [junit4]   2> 327849 INFO  (qtp7533610-3450) [    ] o.a.s.c.SolrConfig Using Lucene MatchVersion: 8.0.0
   [junit4]   2> 327865 INFO  (qtp7533610-3450) [    ] o.a.s.s.IndexSchema [control_collection_shard1_replica_n1] Schema name=test
   [junit4]   2> 327972 INFO  (qtp7533610-3450) [    ] o.a.s.s.IndexSchema Loaded schema test/1.0 with uniqueid field id
   [junit4]   2> 327993 INFO  (qtp7533610-3450) [    ] o.a.s.c.CoreContainer Creating SolrCore 'control_collection_shard1_replica_n1' using configuration from collection control_collection, trusted=true
   [junit4]   2> 327993 INFO  (qtp7533610-3450) [    ] o.a.s.m.r.SolrJmxReporter JMX monitoring for 'solr.core.control_collection.shard1.replica_n1' (registry 'solr.core.control_collection.shard1.replica_n1') enabled at server: com.sun.jmx.mbeanserver.JmxMBeanServer@148b87
   [junit4]   2> 327994 INFO  (qtp7533610-3450) [    ] o.a.s.c.SolrCore solr.RecoveryStrategy.Builder
   [junit4]   2> 327994 INFO  (qtp7533610-3450) [    ] o.a.s.c.SolrCore [[control_collection_shard1_replica_n1] ] Opening new SolrCore at [C:\Users\jenkins\workspace\Lucene-Solr-master-Windows\solr\build\solr-core\test\J1\temp\solr.cloud.HttpPartitionTest_2A5B12C1609DFB81-001\control-001\cores\control_collection_shard1_replica_n1], dataDir=[C:\Users\jenkins\workspace\Lucene-Solr-master-Windows\solr\build\solr-core\test\J1\temp\solr.cloud.HttpPartitionTest_2A5B12C1609DFB81-001\control-001\cores\control_collection_shard1_replica_n1\data\]
   [junit4]   2> 327997 INFO  (qtp7533610-3450) [    ] o.a.s.u.RandomMergePolicy RandomMergePolicy wrapping class org.apache.lucene.index.LogByteSizeMergePolicy: [LogByteSizeMergePolicy: minMergeSize=1677721, mergeFactor=24, maxMergeSize=2147483648, maxMergeSizeForForcedMerge=9223372036854775807, calibrateSizeByDeletes=false, maxMergeDocs=2147483647, maxCFSSegmentSizeMB=8.796093022207999E12, noCFSRatio=1.0]
   [junit4]   2> 327998 WARN  (qtp7533610-3450) [    ] o.a.s.c.RequestHandlers INVALID paramSet a in requestHandler {type = requestHandler,name = /dump,class = DumpRequestHandler,attributes = {initParams=a, name=/dump, class=DumpRequestHandler},args = {defaults={a=A,b=B}}}
   [junit4]   2> 328078 INFO  (qtp7533610-3450) [    ] o.a.s.u.UpdateHandler Using UpdateLog implementation: org.apache.solr.update.UpdateLog
   [junit4]   2> 328078 INFO  (qtp7533610-3450) [    ] o.a.s.u.UpdateLog Initializing UpdateLog: dataDir= defaultSyncLevel=FLUSH numRecordsToKeep=100 maxNumLogsToKeep=10 numVersionBuckets=65536
   [junit4]   2> 328080 INFO  (qtp7533610-3450) [    ] o.a.s.u.CommitTracker Hard AutoCommit: disabled
   [junit4]   2> 328080 INFO  (qtp7533610-3450) [    ] o.a.s.u.CommitTracker Soft AutoCommit: disabled
   [junit4]   2> 328082 INFO  (qtp7533610-3450) [    ] o.a.s.u.RandomMergePolicy RandomMergePolicy wrapping class org.apache.lucene.index.LogDocMergePolicy: [LogDocMergePolicy: minMergeSize=1000, mergeFactor=40, maxMergeSize=9223372036854775807, maxMergeSizeForForcedMerge=9223372036854775807, calibrateSizeByDeletes=false, maxMergeDocs=2147483647, maxCFSSegmentSizeMB=8.796093022207999E12, noCFSRatio=1.0]
   [junit4]   2> 328082 INFO  (qtp7533610-3450) [    ] o.a.s.s.SolrIndexSearcher Opening [Searcher@c18e2c[control_collection_shard1_replica_n1] main]
   [junit4]   2> 328083 INFO  (qtp7533610-3450) [    ] o.a.s.r.ManagedResourceStorage Configured ZooKeeperStorageIO with znodeBase: /configs/conf1
   [junit4]   2> 328083 INFO  (qtp7533610-3450) [    ] o.a.s.r.ManagedResourceStorage Loaded null at path _rest_managed.json using ZooKeeperStorageIO:path=/configs/conf1
   [junit4]   2> 328085 INFO  (qtp7533610-3450) [    ] o.a.s.h.ReplicationHandler Commits will be reserved for  10000
   [junit4]   2> 328086 INFO  (searcherExecutor-1468-thread-1) [    ] o.a.s.c.SolrCore [control_collection_shard1_replica_n1] Registered new searcher Searcher@c18e2c[control_collection_shard1_replica_n1] main{ExitableDirectoryReader(UninvertingDirectoryReader())}
   [junit4]   2> 328086 INFO  (qtp7533610-3450) [    ] o.a.s.u.UpdateLog Could not find max version in index or recent updates, using new clock 1576083391097339904
   [junit4]   2> 328092 INFO  (qtp7533610-3450) [    ] o.a.s.c.ShardLeaderElectionContext Enough replicas found to continue.
   [junit4]   2> 328092 INFO  (qtp7533610-3450) [    ] o.a.s.c.ShardLeaderElectionContext I may be the new leader - try and sync
   [junit4]   2> 328092 INFO  (qtp7533610-3450) [    ] o.a.s.c.SyncStrategy Sync replicas to http://127.0.0.1:60224/control_collection_shard1_replica_n1/
   [junit4]   2> 328092 INFO  (qtp7533610-3450) [    ] o.a.s.c.SyncStrategy Sync Success - now sync replicas to me
   [junit4]   2> 328092 INFO  (qtp7533610-3450) [    ] o.a.s.c.SyncStrategy http://127.0.0.1:60224/control_collection_shard1_replica_n1/ has no replicas
   [junit4]   2> 328092 INFO  (qtp7533610-3450) [    ] o.a.s.c.ShardLeaderElectionContext Found all replicas participating in election, clear LIR
   [junit4]   2> 328097 INFO  (qtp7533610-3450) [    ] o.a.s.c.ShardLeaderElectionContext I am the new leader: http://127.0.0.1:60224/control_collection_shard1_replica_n1/ shard1
   [junit4]   2> 328201 INFO  (zkCallback-537-thread-1) [    ] o.a.s.c.c.ZkStateReader A cluster state change: [WatchedEvent state:SyncConnected type:NodeDataChanged path:/collections/control_collection/state.json] for collection [control_collection] has occurred - updating... (live nodes size: [1])
   [junit4]   2> 328253 INFO  (qtp7533610-3450) [    ] o.a.s.c.ZkController I am the leader, no recovery necessary
   [junit4]   2> 328254 INFO  (qtp7533610-3450) [    ] o.a.s.s.HttpSolrCall [admin] webapp=null path=/admin/cores params={qt=/admin/cores&collection.configName=conf1&newCollection=true&name=control_collection_shard1_replica_n1&action=CREATE&numShards=1&collection=control_collection&shard=shard1&wt=javabin&version=2&replicaType=NRT} status=0 QTime=1424
   [junit4]   2> 328259 INFO  (qtp7533610-3443) [    ] o.a.s.h.a.CollectionsHandler Wait for new collection to be active for at most 30 seconds. Check all shard replicas
   [junit4]   2> 328358 INFO  (zkCallback-537-thread-1) [    ] o.a.s.c.c.ZkStateReader A cluster state change: [WatchedEvent state:SyncConnected type:NodeDataChanged path:/collections/control_collection/state.json] for collection [control_collection] has occurred - updating... (live nodes size: [1])
   [junit4]   2> 328719 INFO  (OverseerCollectionConfigSetProcessor-98505211793178628-127.0.0.1:60224_-n_0000000000) [    ] o.a.s.c.OverseerTaskQueue Response ZK path: /overseer/collection-queue-work/qnr-0000000000 doesn't exist.  Requestor may have disconnected from ZooKeeper
   [junit4]   2> 329259 INFO  (qtp7533610-3443) [    ] o.a.s.s.HttpSolrCall [admin] webapp=null path=/admin/collections params={replicationFactor=1&collection.configName=conf1&name=control_collection&nrtReplicas=1&action=CREATE&numShards=1&createNodeSet=127.0.0.1:60224_&wt=javabin&version=2} status=0 QTime=2544
   [junit4]   2> 329260 WARN  (NIOServerCxn.Factory:0.0.0.0/0.0.0.0:0) [    ] o.a.z.s.NIOServerCnxn caught end of stream exception
   [junit4]   2> EndOfStreamException: Unable to read additional data from client sessionid 0x15df5f7dd750005, likely client has closed socket
   [junit4]   2> 	at org.apache.zookeeper.server.NIOServerCnxn.doIO(NIOServerCnxn.java:239)
   [junit4]   2> 	at org.apache.zookeeper.server.NIOServerCnxnFactory.run(NIOServerCnxnFactory.java:203)
   [junit4]   2> 	at java.base/java.lang.Thread.run(Thread.java:844)
   [junit4]   2> 329267 INFO  (TEST-HttpPartitionTest.test-seed#[2A5B12C1609DFB81]) [    ] o.a.s.c.c.ZkStateReader Updated live nodes from ZooKeeper... (0) -> (1)
   [junit4]   2> 329268 INFO  (TEST-HttpPartitionTest.test-seed#[2A5B12C1609DFB81]) [    ] o.a.s.c.s.i.ZkClientClusterStateProvider Cluster at 127.0.0.1:60217/solr ready
   [junit4]   2> 329268 INFO  (TEST-HttpPartitionTest.test-seed#[2A5B12C1609DFB81]) [    ] o.a.s.c.ChaosMonkey monkey: init - expire sessions:false cause connection loss:false
   [junit4]   2> 329269 INFO  (SocketProxy-Acceptor-60224) [    ] o.a.s.c.SocketProxy accepted Socket[addr=/127.0.0.1,port=60247,localport=60224], receiveBufferSize:65536
   [junit4]   2> 329269 INFO  (SocketProxy-Acceptor-60224) [    ] o.a.s.c.SocketProxy proxy connection Socket[addr=/127.0.0.1,port=60225,localport=60248], receiveBufferSize=65536
   [junit4]   2> 329271 INFO  (qtp7533610-3447) [    ] o.a.s.h.a.CollectionsHandler Invoked Collection Action :create with params replicationFactor=1&collection.configName=conf1&name=collection1&nrtReplicas=1&action=CREATE&numShards=2&createNodeSet=&stateFormat=2&wt=javabin&version=2 and sendToOCPQueue=true
   [junit4]   2> 329273 INFO  (OverseerThreadFactory-1465-thread-2) [    ] o.a.s.c.CreateCollectionCmd Create collection collection1
   [junit4]   2> 329274 WARN  (OverseerThreadFactory-1465-thread-2) [    ] o.a.s.c.CreateCollectionCmd It is unusual to create a collection (collection1) without cores.
   [junit4]   2> 329479 INFO  (qtp7533610-3447) [    ] o.a.s.h.a.CollectionsHandler Wait for new collection to be active for at most 30 seconds. Check all shard replicas
   [junit4]   2> 329480 INFO  (qtp7533610-3447) [    ] o.a.s.s.HttpSolrCall [admin] webapp=null path=/admin/collections params={replicationFactor=1&collection.configName=conf1&name=collection1&nrtReplicas=1&action=CREATE&numShards=2&createNodeSet=&stateFormat=2&wt=javabin&version=2} status=0 QTime=208
   [junit4]   2> 329894 INFO  (TEST-HttpPartitionTest.test-seed#[2A5B12C1609DFB81]) [    ] o.a.s.c.AbstractFullDistribZkTestBase create jetty 1 in directory C:\Users\jenkins\workspace\Lucene-Solr-master-Windows\solr\build\solr-core\test\J1\temp\solr.cloud.HttpPartitionTest_2A5B12C1609DFB81-001\shard-1-001 of type TLOG
   [junit4]   2> 329895 INFO  (TEST-HttpPartitionTest.test-seed#[2A5B12C1609DFB81]) [    ] o.e.j.s.Server jetty-9.3.20.v20170531
   [junit4]   2> 329895 INFO  (TEST-HttpPartitionTest.test-seed#[2A5B12C1609DFB81]) [    ] o.e.j.s.h.ContextHandler Started o.e.j.s.ServletContextHandler@c360f3{/,null,AVAILABLE}
   [junit4]   2> 329896 INFO  (TEST-HttpPartitionTest.test-seed#[2A5B12C1609DFB81]) [    ] o.e.j.s.AbstractConnector Started ServerConnector@1722365{HTTP/1.1,[http/1.1]}{127.0.0.1:60250}
   [junit4]   2> 329896 INFO  (TEST-HttpPartitionTest.test-seed#[2A5B12C1609DFB81]) [    ] o.e.j.s.Server Started @330769ms
   [junit4]   2> 329896 INFO  (TEST-HttpPartitionTest.test-seed#[2A5B12C1609DFB81]) [    ] o.a.s.c.s.e.JettySolrRunner Jetty properties: {hostContext=/, solrconfig=solrconfig.xml, solr.data.dir=C:\Users\jenkins\workspace\Lucene-Solr-master-Windows\solr\build\solr-core\test\J1\temp\solr.cloud.HttpPartitionTest_2A5B12C1609DFB81-001\tempDir-001/jetty1, hostPort=60249, coreRootDirectory=C:\Users\jenkins\workspace\Lucene-Solr-master-Windows\solr\build\solr-core\test\J1\temp\solr.cloud.HttpPartitionTest_2A5B12C1609DFB81-001\shard-1-001\cores, replicaType=TLOG}
   [junit4]   2> 329899 ERROR (TEST-HttpPartitionTest.test-seed#[2A5B12C1609DFB81]) [    ] o.a.s.s.StartupLoggingUtils Missing Java Option solr.log.dir. Logging may be missing or incomplete.
   [junit4]   2> 329899 INFO  (TEST-HttpPartitionTest.test-seed#[2A5B12C1609DFB81]) [    ] o.a.s.s.SolrDispatchFilter  ___      _       Welcome to Apache Solr™ version 8.0.0
   [junit4]   2> 329899 INFO  (TEST-HttpPartitionTest.test-seed#[2A5B12C1609DFB81]) [    ] o.a.s.s.SolrDispatchFilter / __| ___| |_ _   Starting in cloud mode on port null
   [junit4]   2> 329899 INFO  (TEST-HttpPartitionTest.test-seed#[2A5B12C1609DFB81]) [    ] o.a.s.s.SolrDispatchFilter \__ \/ _ \ | '_|  Install dir: null, Default config dir: null
   [junit4]   2> 329899 INFO  (TEST-HttpPartitionTest.test-seed#[2A5B12C1609DFB81]) [    ] o.a.s.s.SolrDispatchFilter |___/\___/_|_|    Start time: 2017-08-18T15:30:52.417778700Z
   [junit4]   2> 329904 INFO  (TEST-HttpPartitionTest.test-seed#[2A5B12C1609DFB81]) [    ] o.a.s.s.SolrDispatchFilter Loading solr.xml from SolrHome (not found in ZooKeeper)
   [junit4]   2> 329905 INFO  (TEST-HttpPartitionTest.test-seed#[2A5B12C1609DFB81]) [    ] o.a.s.c.SolrXmlConfig Loading container configuration from C:\Users\jenkins\workspace\Lucene-Solr-master-Windows\solr\build\solr-core\test\J1\temp\solr.cloud.HttpPartitionTest_2A5B12C1609DFB81-001\shard-1-001\solr.xml
   [junit4]   2> 329910 INFO  (TEST-HttpPartitionTest.test-seed#[2A5B12C1609DFB81]) [    ] o.a.s.c.SolrXmlConfig MBean server found: com.sun.jmx.mbeanserver.JmxMBeanServer@148b87, but no JMX reporters were configured - adding default JMX reporter.
   [junit4]   2> 329914 INFO  (TEST-HttpPartitionTest.test-seed#[2A5B12C1609DFB81]) [    ] o.a.s.c.ZkContainer Zookeeper client=127.0.0.1:60217/solr
   [junit4]   2> 329932 INFO  (TEST-HttpPartitionTest.test-seed#[2A5B12C1609DFB81]) [    ] o.a.s.c.c.ZkStateReader Updated live nodes from ZooKeeper... (0) -> (1)
   [junit4]   2> 329935 INFO  (TEST-HttpPartitionTest.test-seed#[2A5B12C1609DFB81]) [    ] o.a.s.c.Overseer Overseer (id=null) closing
   [junit4]   2> 329937 INFO  (TEST-HttpPartitionTest.test-seed#[2A5B12C1609DFB81]) [    ] o.a.s.c.ZkController Register node as live in ZooKeeper:/live_nodes/127.0.0.1:60249_
   [junit4]   2> 329941 INFO  (zkCallback-537-thread-1) [    ] o.a.s.c.c.ZkStateReader Updated live nodes from ZooKeeper... (1) -> (2)
   [junit4]   2> 329941 INFO  (zkCallback-549-thread-1) [    ] o.a.s.c.c.ZkStateReader Updated live nodes from ZooKeeper... (1) -> (2)
   [junit4]   2> 329941 INFO  (zkCallback-544-thread-1) [    ] o.a.s.c.c.ZkStateReader Updated live nodes from ZooKeeper... (1) -> (2)
   [junit4]   2> 330257 INFO  (TEST-HttpPartitionTest.test-seed#[2A5B12C1609DFB81]) [    ] o.a.s.m.r.SolrJmxReporter JMX monitoring for 'solr.node' (registry 'solr.node') enabled at server: com.sun.jmx.mbeanserver.JmxMBeanServer@148b87
   [junit4]   2> 330267 INFO  (TEST-HttpPartitionTest.test-seed#[2A5B12C1609DFB81]) [    ] o.a.s.m.r.SolrJmxReporter JMX monitoring for 'solr.jvm' (registry 'solr.jvm') enabled at server: com.sun.jmx.mbeanserver.JmxMBeanServer@148b87
   [junit4]   2> 330268 INFO  (TEST-HttpPartitionTest.test-seed#[2A5B12C1609DFB81]) [    ] o.a.s.m.r.SolrJmxReporter JMX monitoring for 'solr.jetty' (registry 'solr.jetty') enabled at server: com.sun.jmx.mbeanserver.JmxMBeanServer@148b87
   [junit4]   2> 330270 INFO  (TEST-HttpPartitionTest.test-seed#[2A5B12C1609DFB81]) [    ] o.a.s.c.CorePropertiesLocator Found 0 core definitions underneath C:\Users\jenkins\workspace\Lucene-Solr-master-Windows\solr\build\solr-core\test\J1\temp\solr.cloud.HttpPartitionTest_2A5B12C1609DFB81-001\shard-1-001\cores
   [junit4]   2> 330298 INFO  (qtp7533610-3453) [    ] o.a.s.h.a.CollectionsHandler Invoked Collection Action :addreplica with params node=127.0.0.1:60249_&action=ADDREPLICA&collection=collection1&shard=shard2&type=TLOG&wt=javabin&version=2 and sendToOCPQueue=true
   [junit4]   2> 330303 INFO  (OverseerCollectionConfigSetProcessor-98505211793178628-127.0.0.1:60224_-n_0000000000) [    ] o.a.s.c.OverseerTaskQueue Response ZK path: /overseer/collection-queue-work/qnr-0000000002 doesn't exist.  Requestor may have disconnected from ZooKeeper
   [junit4]   2> 330304 INFO  (OverseerThreadFactory-1465-thread-3) [    ] o.a.s.c.AddReplicaCmd Node Identified 127.0.0.1:60249_ for creating new replica
   [junit4]   2> 330308 INFO  (SocketProxy-Acceptor-60249) [    ] o.a.s.c.SocketProxy accepted Socket[addr=/127.0.0.1,port=60262,localport=60249], receiveBufferSize:65536
   [junit4]   2> 330308 INFO  (SocketProxy-Acceptor-60249) [    ] o.a.s.c.SocketProxy proxy connection Socket[addr=/127.0.0.1,port=60250,localport=60263], receiveBufferSize=65536
   [junit4]   2> 330312 INFO  (qtp15960360-3502) [    ] o.a.s.h.a.CoreAdminOperation core create command qt=/admin/cores&collection.configName=conf1&name=collection1_shard2_replica_t41&action=CREATE&collection=collection1&shard=shard2&wt=javabin&version=2&replicaType=TLOG
   [junit4]   2> 330312 INFO  (qtp15960360-3502) [    ] o.a.s.c.TransientSolrCoreCacheDefault Allocating transient cache for 4 transient cores
   [junit4]   2> 330418 INFO  (zkCallback-549-thread-1) [    ] o.a.s.c.c.ZkStateReader A cluster state change: [WatchedEvent state:SyncConnected type:NodeDataChanged path:/collections/collection1/state.json] for collection [collection1] has occurred - updating... (live nodes size: [2])
   [junit4]   2> 331332 INFO  (qtp15960360-3502) [    ] o.a.s.c.SolrConfig Using Lucene MatchVersion: 8.0.0
   [junit4]   2> 331356 INFO  (qtp15960360-3502) [    ] o.a.s.s.IndexSchema [collection1_shard2_replica_t41] Schema name=test
   [junit4]   2> 331458 INFO  (qtp15960360-3502) [    ] o.a.s.s.IndexSchema Loaded schema test/1.0 with uniqueid field id
   [junit4]   2> 331482 INFO  (qtp15960360-3502) [    ] o.a.s.c.CoreContainer Creating SolrCore 'collection1_shard2_replica_t41' using configuration from collection collection1, trusted=true
   [junit4]   2> 331484 INFO  (qtp15960360-3502) [    ] o.a.s.m.r.SolrJmxReporter JMX monitoring for 'solr.core.collection1.shard2.replica_t41' (registry 'solr.core.collection1.shard2.replica_t41') enabled at server: com.sun.jmx.mbeanserver.JmxMBeanServer@148b87
   [junit4]   2> 331484 INFO  (qtp15960360-3502) [    ] o.a.s.c.SolrCore solr.RecoveryStrategy.Builder
   [junit4]   2> 331484 INFO  (qtp15960360-3502) [    ] o.a.s.c.SolrCore [[collection1_shard2_replica_t41] ] Opening new SolrCore at [C:\Users\jenkins\workspace\Lucene-Solr-master-Windows\solr\build\solr-core\test\J1\temp\solr.cloud.HttpPartitionTest_2A5B12C1609DFB81-001\shard-1-001\cores\collection1_shard2_replica_t41], dataDir=[C:\Users\jenkins\workspace\Lucene-Solr-master-Windows\solr\build\solr-core\test\J1\temp\solr.cloud.HttpPartitionTest_2A5B12C1609DFB81-001\shard-1-001\cores\collection1_shard2_replica_t41\data\]
   [junit4]   2> 331488 INFO  (qtp15960360-3502) [    ] o.a.s.u.RandomMergePolicy RandomMergePolicy wrapping class org.apache.lucene.index.LogByteSizeMergePolicy: [LogByteSizeMergePolicy: minMergeSize=1677721, mergeFactor=24, maxMergeSize=2147483648, maxMergeSizeForForcedMerge=9223372036854775807, calibrateSizeByDeletes=false, maxMergeDocs=2147483647, maxCFSSegmentSizeMB=8.796093022207999E12, noCFSRatio=1.0]
   [junit4]   2> 331492 WARN  (qtp15960360-3502) [    ] o.a.s.c.RequestHandlers INVALID paramSet a in requestHandler {type = requestHandler,name = /dump,class = DumpRequestHandler,attributes = {initParams=a, name=/dump, class=DumpRequestHandler},args = {defaults={a=A,b=B}}}
   [junit4]   2> 331637 INFO  (qtp15960360-3502) [    ] o.a.s.u.UpdateHandler Using UpdateLog implementation: org.apache.solr.update.UpdateLog
   [junit4]   2> 331638 INFO  (qtp15960360-3502) [    ] o.a.s.u.UpdateLog Initializing UpdateLog: dataDir= defaultSyncLevel=FLUSH numRecordsToKeep=100 maxNumLogsToKeep=10 numVersionBuckets=65536
   [junit4]   2> 331641 INFO  (qtp15960360-3502) [    ] o.a.s.u.CommitTracker Hard AutoCommit: disabled
   [junit4]   2> 331641 INFO  (qtp15960360-3502) [    ] o.a.s.u.CommitTracker Soft AutoCommit: disabled
   [junit4]   2> 331642 INFO  (qtp15960360-3502) [    ] o.a.s.u.RandomMergePolicy RandomMergePolicy wrapping class org.apache.lucene.index.LogDocMergePolicy: [LogDocMergePolicy: minMergeSize=1000, mergeFactor=40, maxMergeSize=9223372036854775807, maxMergeSizeForForcedMerge=9223372036854775807, calibrateSizeByDeletes=false, maxMergeDocs=2147483647, maxCFSSegmentSizeMB=8.796093022207999E12, noCFSRatio=1.0]
   [junit4]   2> 331643 INFO  (qtp15960360-3502) [    ] o.a.s.s.SolrIndexSearcher Opening [Searcher@343204[collection1_shard2_replica_t41] main]
   [junit4]   2> 331644 INFO  (qtp15960360-3502) [    ] o.a.s.r.ManagedResourceStorage Configured ZooKeeperStorageIO with znodeBase: /configs/conf1
   [junit4]   2> 331645 INFO  (qtp15960360-3502) [    ] o.a.s.r.ManagedResourceStorage Loaded null at path _rest_managed.json using ZooKeeperStorageIO:path=/configs/conf1
   [junit4]   2> 331645 INFO  (qtp15960360-3502) [    ] o.a.s.h.ReplicationHandler Commits will be reserved for  10000
   [junit4]   2> 331648 INFO  (searcherExecutor-1479-thread-1) [    ] o.a.s.c.SolrCore [collection1_shard2_replica_t41] Registered new searcher Searcher@343204[collection1_shard2_replica_t41] main{ExitableDirectoryReader(UninvertingDirectoryReader())}
   [junit4]   2> 331648 INFO  (qtp15960360-3502) [    ] o.a.s.u.UpdateLog Could not find max version in index or recent updates, using new clock 1576083394832367616
   [junit4]   2> 331657 INFO  (qtp15960360-3502) [    ] o.a.s.c.ShardLeaderElectionContext Enough replicas found to continue.
   [junit4]   2> 331657 INFO  (qtp15960360-3502) [    ] o.a.s.c.ShardLeaderElectionContext I may be the new leader - try and sync
   [junit4]   2> 331657 INFO  (qtp15960360-3502) [    ] o.a.s.c.SyncStrategy Sync replicas to http://127.0.0.1:60249/collection1_shard2_replica_t41/
   [junit4]   2> 331657 INFO  (qtp15960360-3502) [    ] o.a.s.c.SyncStrategy Sync Success - now sync replicas to me
   [junit4]   2> 331657 INFO  (qtp15960360-3502) [    ] o.a.s.c.SyncStrategy http://127.0.0.1:60249/collection1_shard2_replica_t41/ has no replicas
   [junit4]   2> 331657 INFO  (qtp15960360-3502) [    ] o.a.s.c.ShardLeaderElectionContext Found all replicas participating in election, clear LIR
   [junit4]   2> 331657 INFO  (qtp15960360-3502) [    ] o.a.s.c.ZkController collection1_shard2_replica_t41 stopping background replication from leader
   [junit4]   2> 331662 INFO  (qtp15960360-3502) [    ] o.a.s.c.ShardLeaderElectionContext I am the new leader: http://127.0.0.1:60249/collection1_shard2_replica_t41/ shard2
   [junit4]   2> 331767 INFO  (zkCallback-549-thread-1) [    ] o.a.s.c.c.ZkStateReader A cluster state change: [WatchedEvent state:SyncConnected type:NodeDataChanged path:/collections/collection1/state.json] for collection [collection1] has occurred - updating... (live nodes size: [2])
   [junit4]   2> 331817 INFO  (qtp15960360-3502) [    ] o.a.s.c.ZkController I am the leader, no recovery necessary
   [junit4]   2> 331818 INFO  (qtp15960360-3502) [    ] o.a.s.s.HttpSolrCall [admin] webapp=null path=/admin/cores params={qt=/admin/cores&collection.configName=conf1&name=collection1_shard2_replica_t41&action=CREATE&collection=collection1&shard=shard2&wt=javabin&version=2&replicaType=TLOG} status=0 QTime=1507
   [junit4]   2> 331823 INFO  (qtp7533610-3453) [    ] o.a.s.s.HttpSolrCall [admin] webapp=null path=/admin/collections params={node=127.0.0.1:60249_&action=ADDREPLICA&collection=collection1&shard=shard2&type=TLOG&wt=javabin&version=2} status=0 QTime=1522
   [junit4]   2> 331924 INFO  (zkCallback-549-thread-1) [    ] o.a.s.c.c.ZkStateReader A cluster state change: [WatchedEvent state:SyncConnected type:NodeDataChanged path:/collections/collection1/state.json] for collection [collection1] has occurred - updating... (live nodes size: [2])
   [junit4]   2> 332305 INFO  (OverseerCollectionConfigSetProcessor-98505211793178628-127.0.0.1:60224_-n_0000000000) [    ] o.a.s.c.OverseerTaskQueue Response ZK path: /overseer/collection-queue-work/qnr-0000000004 doesn't exist.  Requestor may have disconnected from ZooKeeper
   [junit4]   2> 332322 INFO  (TEST-HttpPartitionTest.test-seed#[2A5B12C1609DFB81]) [    ] o.a.s.c.AbstractFullDistribZkTestBase create jetty 2 in directory C:\Users\jenkins\workspace\Lucene-Solr-master-Windows\solr\build\solr-core\test\J1\temp\solr.cloud.HttpPartitionTest_2A5B12C1609DFB81-001\shard-2-001 of type TLOG
   [junit4]   2> 332323 INFO  (TEST-HttpPartitionTest.test-seed#[2A5B12C1609DFB81]) [    ] o.e.j.s.Server jetty-9.3.20.v20170531
   [junit4]   2> 332324 INFO  (TEST-HttpPartitionTest.test-seed#[2A5B12C1609DFB81]) [    ] o.e.j.s.h.ContextHandler Started o.e.j.s.ServletContextHandler@17c8a8f{/,null,AVAILABLE}
   [junit4]   2> 332324 INFO  (TEST-HttpPartitionTest.test-seed#[2A5B12C1609DFB81]) [    ] o.e.j.s.AbstractConnector Started ServerConnector@bba3bd{HTTP/1.1,[http/1.1]}{127.0.0.1:60265}
   [junit4]   2> 332324 INFO  (TEST-HttpPartitionTest.test-seed#[2A5B12C1609DFB81]) [    ] o.e.j.s.Server Started @333197ms
   [junit4]   2> 332324 INFO  (TEST-HttpPartitionTest.test-seed#[2A5B12C1609DFB81]) [    ] o.a.s.c.s.e.JettySolrRunner Jetty properties: {hostContext=/, solrconfig=solrconfig.xml, solr.data.dir=C:\Users\jenkins\workspace\Lucene-Solr-master-Windows\solr\build\solr-core\test\J1\temp\solr.cloud.HttpPartitionTest_2A5B12C1609DFB81-001\tempDir-001/jetty2, hostPort=60264, coreRootDirectory=C:\Users\jenkins\workspace\Lucene-Solr-master-Windows\solr\build\solr-core\test\J1\temp\solr.cloud.HttpPartitionTest_2A5B12C1609DFB81-001\shard-2-001\cores, replicaType=TLOG}
   [junit4]   2> 332324 ERROR (TEST-HttpPartitionTest.test-seed#[2A5B12C1609DFB81]) [    ] o.a.s.s.StartupLoggingUtils Missing Java Option solr.log.dir. Logging may be missing or incomplete.
   [junit4]   2> 332325 INFO  (TEST-HttpPartitionTest.test-seed#[2A5B12C1609DFB81]) [    ] o.a.s.s.SolrDispatchFilter  ___      _       Welcome to Apache Solr™ version 8.0.0
   [junit4]   2> 332325 INFO  (TEST-HttpPartitionTest.test-seed#[2A5B12C1609DFB81]) [    ] o.a.s.s.SolrDispatchFilter / __| ___| |_ _   Starting in cloud mode on port null
   [junit4]   2> 332325 INFO  (TEST-HttpPartitionTest.test-seed#[2A5B12C1609DFB81]) [    ] o.a.s.s.SolrDispatchFilter \__ \/ _ \ | '_|  Install dir: null, Default config dir: null
   [junit4]   2> 332327 INFO  (TEST-HttpPartitionTest.test-seed#[2A5B12C1609DFB81]) [    ] o.a.s.s.SolrDispatchFilter |___/\___/_|_|    Start time: 2017-08-18T15:30:54.843813100Z
   [junit4]   2> 332330 INFO  (TEST-HttpPartitionTest.test-seed#[2A5B12C1609DFB81]) [    ] o.a.s.s.SolrDispatchFilter Loading solr.xml from SolrHome (not found in ZooKeeper)
   [junit4]   2> 332330 INFO  (TEST-HttpPartitionTest.test-seed#[2A5B12C1609DFB81]) [    ] o.a.s.c.SolrXmlConfig Loading container configuration from C:\Users\jenkins\workspace\Lucene-Solr-master-Windows\solr\build\solr-core\test\J1\temp\solr.cloud.HttpPartitionTest_2A5B12C1609DFB81-001\shard-2-001\solr.xml
   [junit4]   2> 332334 INFO  (TEST-HttpPartitionTest.test-seed#[2A5B12C1609DFB81]) [    ] o.a.s.c.SolrXmlConfig MBean server found: com.sun.jmx.mbeanserver.JmxMBeanServer@148b87, but no JMX reporters were configured - adding default JMX reporter.
   [junit4]   2> 332338 INFO  (TEST-HttpPartitionTest.test-seed#[2A5B12C1609DFB81]) [    ] o.a.s.c.ZkContainer Zookeeper client=127.0.0.1:60217/solr
   [junit4]   2> 332341 WARN  (NIOServerCxn.Factory:0.0.0.0/0.0.0.0:0) [    ] o.a.z.s.NIOServerCnxn caught end of stream exception
   [junit4]   2> EndOfStreamException: Unable to read additional data from client sessionid 0x15df5f7dd75000b, likely client has closed socket
   [junit4]   2> 	at org.apache.zookeeper.server.NIOServerCnxn.doIO(NIOServerCnxn.java:239)
   [junit4]   2> 	at org.apache.zookeeper.server.NIOServerCnxnFactory.run(NIOServerCnxnFactory.java:203)
   [junit4]   2> 	at java.base/java.lang.Thread.run(Thread.java:844)
   [junit4]   2> 332349 INFO  (TEST-HttpPartitionTest.test-seed#[2A5B12C1609DFB81]) [    ] o.a.s.c.c.ZkStateReader Updated live nodes from ZooKeeper... (0) -> (2)
   [junit4]   2> 332350 INFO  (TEST-HttpPartitionTest.test-seed#[2A5B12C1609DFB81]) [    ] o.a.s.c.Overseer Overseer (id=null) closing
   [junit4]   2> 332355 INFO  (TEST-HttpPartitionTest.test-seed#[2A5B12C1609DFB81]) [    ] o.a.s.c.ZkController Register node as live in ZooKeeper:/live_nodes/127.0.0.1:60264_
   [junit4]   2> 332357 INFO  (zkCallback-549-thread-1) [    ] o.a.s.c.c.ZkStateReader Updated live nodes from ZooKeeper... (2) -> (3)
   [junit4]   2> 332357 INFO  (zkCallback-544-thread-1) [    ] o.a.s.c.c.ZkStateReader Updated live nodes from ZooKeeper... (2) -> (3)
   [junit4]   2> 332357 INFO  (zkCallback-537-thread-1) [    ] o.a.s.c.c.ZkStateReader Updated live nodes from ZooKeeper... (2) -> (3)
   [junit4]   2> 332357 INFO  (zkCallback-555-thread-1) [    ] o.a.s.c.c.ZkStateReader Updated live nodes from ZooKeeper... (2) -> (3)
   [junit4]   2> 332504 INFO  (TEST-HttpPartitionTest.test-seed#[2A5B12C1609DFB81]) [    ] o.a.s.m.r.SolrJmxReporter JMX monitoring for 'solr.node' (registry 'solr.node') enabled at server: com.sun.jmx.mbeanserver.JmxMBeanServer@148b87
   [junit4]   2> 332517 INFO  (TEST-HttpPartitionTest.test-seed#[2A5B12C1609DFB81]) [    ] o.a.s.m.r.SolrJmxReporter JMX monitoring for 'solr.jvm' (registry 'solr.jvm') enabled at server: com.sun.jmx.mbeanserver.JmxMBeanServer@148b87
   [junit4]   2> 332517 INFO  (TEST-HttpPartitionTest.test-seed#[2A5B12C1609DFB81]) [    ] o.a.s.m.r.SolrJmxReporter JMX monitoring for 'solr.jetty' (registry 'solr.jetty') enabled at server: com.sun.jmx.mbeanserver.JmxMBeanServer@148b87
   [junit4]   2> 332520 INFO  (TEST-HttpPartitionTest.test-seed#[2A5B12C1609DFB81]) [    ] o.a.s.c.CorePropertiesLocator Found 0 core definitions underneath C:\Users\jenkins\workspace\Lucene-Solr-master-Windows\solr\build\solr-core\test\J1\temp\solr.cloud.HttpPartitionTest_2A5B12C1609DFB81-001\shard-2-001\cores
   [junit4]   2> 332562 INFO  (SocketProxy-Acceptor-60264) [    ] o.a.s.c.SocketProxy accepted Socket[addr=/127.0.0.1,port=60277,localport=60264], receiveBufferSize:65536
   [junit4]   2> 332563 INFO  (SocketProxy-Acceptor-60264) [    ] o.a.s.c.SocketProxy proxy connection Socket[addr=/127.0.0.1,port=60265,localport=60278], receiveBufferSize=65536
   [junit4]   2> 332567 INFO  (qtp29357846-3534) [    ] o.a.s.h.a.CollectionsHandler Invoked Collection Action :addreplica with params node=127.0.0.1:60264_&action=ADDREPLICA&collection=collection1&shard=shard1&type=TLOG&wt=javabin&version=2 and sendToOCPQueue=true
   [junit4]   2> 332573 INFO  (OverseerThreadFactory-1465-thread-4) [    ] o.a.s.c.AddReplicaCmd Node Identified 127.0.0.1:60264_ for creating new replica
   [junit4]   2> 332576 INFO  (SocketProxy-Acceptor-60264) [    ] o.a.s.c.SocketProxy accepted Socket[addr=/127.0.0.1,port=60279,localport=60264], receiveBufferSize:65536
   [junit4]   2> 332576 INFO  (SocketProxy-Acceptor-60264) [    ] o.a.s.c.SocketProxy proxy connection Socket[addr=/127.0.0.1,port=60265,localport=60280], receiveBufferSize=65536
   [junit4]   2> 332578 INFO  (qtp29357846-3533) [    ] o.a.s.h.a.CoreAdminOperation core create command qt=/admin/cores&collection.configName=conf1&name=collection1_shard1_replica_t43&action=CREATE&collection=collection1&shard=shard1&wt=javabin&version=2&replicaType=TLOG
   [junit4]   2> 332578 INFO  (qtp29357846-3533) [    ] o.a.s.c.TransientSolrCoreCacheDefault Allocating transient cache for 4 transient cores
   [junit4]   2> 332689 INFO  (zkCallback-549-thread-1) [    ] o.a.s.c.c.ZkStateReader A cluster state change: [WatchedEvent state:SyncConnected type:NodeDataChanged path:/collections/collection1/state.json] for collection [collection1] has occurred - updating... (live nodes size: [3])
   [junit4]   2> 332689 INFO  (zkCallback-555-thread-1) [    ] o.a.s.c.c.ZkStateReader A cluster state change: [WatchedEvent state:SyncConnected type:NodeDataChanged path:/collections/collection1/state.json] for collection [collection1] has occurred - updating... (live nodes size: [3])
   [junit4]   2> 333602 INFO  (qtp29357846-3533) [    ] o.a.s.c.SolrConfig Using Lucene MatchVersion: 8.0.0
   [junit4]   2> 333625 INFO  (qtp29357846-3533) [    ] o.a.s.s.IndexSchema [collection1_shard1_replica_t43] Schema name=test
   [junit4]   2> 333852 INFO  (qtp29357846-3533) [    ] o.a.s.s.IndexSchema Loaded schema test/1.0 with uniqueid field id
   [junit4]   2> 333888 INFO  (qtp29357846-3533) [    ] o.a.s.c.CoreContainer Creating SolrCore 'collection1_shard1_replica_t43' using configuration from collection collection1, trusted=true
   [junit4]   2> 333889 INFO  (qtp29357846-3533) [    ] o.a.s.m.r.SolrJmxReporter JMX monitoring for 'solr.core.collection1.shard1.replica_t43' (registry 'solr.core.collection1.shard1.replica_t43') enabled at server: com.sun.jmx.mbeanserver.JmxMBeanServer@148b87
   [junit4]   2> 333889 INFO  (qtp29357846-3533) [    ] o.a.s.c.SolrCore solr.RecoveryStrategy.Builder
   [junit4]   2> 333889 INFO  (qtp29357846-3533) [    ] o.a.s.c.SolrCore [[collection1_shard1_replica_t43] ] Opening new SolrCore at [C:\Users\jenkins\workspace\Lucene-Solr-master-Windows\solr\build\solr-core\test\J1\temp\solr.cloud.HttpPartitionTest_2A5B12C1609DFB81-001\shard-2-001\cores\collection1_shard1_replica_t43], dataDir=[C:\Users\jenkins\workspace\Lucene-Solr-master-Windows\solr\build\solr-core\test\J1\temp\solr.cloud.HttpPartitionTest_2A5B12C1609DFB81-001\shard-2-001\cores\collection1_shard1_replica_t43\data\]
   [junit4]   2> 333894 INFO  (qtp29357846-3533) [    ] o.a.s.u.RandomMergePolicy RandomMergePolicy wrapping class org.apache.lucene.index.LogByteSizeMergePolicy: [LogByteSizeMergePolicy: minMergeSize=1677721, mergeFactor=24, maxMergeSize=2147483648, maxMergeSizeForForcedMerge=9223372036854775807, calibrateSizeByDeletes=false, maxMergeDocs=2147483647, maxCFSSegmentSizeMB=8.796093022207999E12, noCFSRatio=1.0]
   [junit4]   2> 333898 WARN  (qtp29357846-3533) [    ] o.a.s.c.RequestHandlers INVALID paramSet a in requestHandler {type = requestHandler,name = /dump,class = DumpRequestHandler,attributes = {initParams=a, name=/dump, class=DumpRequestHandler},args = {defaults={a=A,b=B}}}
   [junit4]   2> 334020 INFO  (qtp29357846-3533) [    ] o.a.s.u.UpdateHandler Using UpdateLog implementation: org.apache.solr.update.UpdateLog
   [junit4]   2> 334020 INFO  (qtp29357846-3533) [    ] o.a.s.u.UpdateLog Initializing UpdateLog: dataDir= defaultSyncLevel=FLUSH numRecordsToKeep=100 maxNumLogsToKeep=10 numVersionBuckets=65536
   [junit4]   2> 334023 INFO  (qtp29357846-3533) [    ] o.a.s.u.CommitTracker Hard AutoCommit: disabled
   [junit4]   2> 334023 INFO  (qtp29357846-3533) [    ] o.a.s.u.CommitTracker Soft AutoCommit: disabled
   [junit4]   2> 334024 INFO  (qtp29357846-3533) [    ] o.a.s.u.RandomMergePolicy RandomMergePolicy wrapping class org.apache.lucene.index.LogDocMergePolicy: [LogDocMergePolicy: minMergeSize=1000, mergeFactor=40, maxMergeSize=9223372036854775807, maxMergeSizeForForcedMerge=9223372036854775807, calibrateSizeByDeletes=false, maxMergeDocs=2147483647, maxCFSSegmentSizeMB=8.796093022207999E12, noCFSRatio=1.0]
   [junit4]   2> 334025 INFO  (qtp29357846-3533) [    ] o.a.s.s.SolrIndexSearcher Opening [Searcher@1ff69e3[collection1_shard1_replica_t43] main]
   [junit4]   2> 334027 INFO  (qtp29357846-3533) [    ] o.a.s.r.ManagedResourceStorage Configured ZooKeeperStorageIO with znodeBase: /configs/conf1
   [junit4]   2> 334027 INFO  (qtp29357846-3533) [    ] o.a.s.r.ManagedResourceStorage Loaded null at path _rest_managed.json using ZooKeeperStorageIO:path=/configs/conf1
   [junit4]   2> 334028 INFO  (qtp29357846-3533) [    ] o.a.s.h.ReplicationHandler Commits will be reserved for  10000
   [junit4]   2> 334029 INFO  (qtp29357846-3533) [    ] o.a.s.u.UpdateLog Could not find max version in index or recent updates, using new clock 1576083397329027072
   [junit4]   2> 334030 INFO  (searcherExecutor-1490-thread-1) [    ] o.a.s.c.SolrCore [collection1_shard1_replica_t43] Registered new searcher Searcher@1ff69e3[collection1_shard1_replica_t43] main{ExitableDirectoryReader(UninvertingDirectoryReader())}
   [junit4]   2> 334041 INFO  (qtp29357846-3533) [    ] o.a.s.c.ShardLeaderElectionContext Enough replicas found to continue.
   [junit4]   2> 334041 INFO  (qtp29357846-3533) [    ] o.a.s.c.ShardLeaderElectionContext I may be the new leader - try and sync
   [junit4]   2> 334041 INFO  (qtp29357846-3533) [    ] o.a.s.c.SyncStrategy Sync replicas to http://127.0.0.1:60264/collection1_shard1_replica_t43/
   [junit4]   2> 334041 INFO  (qtp29357846-3533) [    ] o.a.s.c.SyncStrategy Sync Success - now sync replicas to me
   [junit4]   2> 334041 INFO  (qtp29357846-3533) [    ] o.a.s.c.SyncStrategy http://127.0.0.1:60264/collection1_shard1_replica_t43/ has no replicas
   [junit4]   2> 334042 INFO  (qtp29357846-3533) [    ] o.a.s.c.ShardLeaderElectionContext Found all replicas participating in election, clear LIR
   [junit4]   2> 334042 INFO  (qtp29357846-3533) [    ] o.a.s.c.ZkController collection1_shard1_replica_t43 stopping background replication from leader
   [junit4]   2> 334047 INFO  (qtp29357846-3533) [    ] o.a.s.c.ShardLeaderElectionContext I am the new leader: http://127.0.0.1:60264/collection1_shard1_replica_t43/ shard1
   [junit4]   2> 334154 INFO  (zkCallback-549-thread-1) [    ] o.a.s.c.c.ZkStateReader A cluster state change: [WatchedEvent state:SyncConnected type:NodeDataChanged path:/collections/collection1/state.json] for collection [collection1] has occurred - updating... (live nodes size: [3])
   [junit4]   2> 334154 INFO  (zkCallback-555-thread-1) [    ] o.a.s.c.c.ZkStateReader A cluster state change: [WatchedEvent state:SyncConnected type:NodeDataChanged path:/collections/collection1/state.json] for collection [collection1] has occurred - updating... (live nodes size: [3])
   [junit4]   2> 334202 INFO  (qtp29357846-3533) [    ] o.a.s.c.ZkController I am the leader, no recovery necessary
   [junit4]   2> 334203 INFO  (qtp29357846-3533) [    ] o.a.s.s.HttpSolrCall [admin] webapp=null path=/admin/cores params={qt=/admin/cores&collection.configName=conf1&name=collection1_shard1_replica_t43&action=CREATE&collection=collection1&shard=shard1&wt=javabin&version=2&replicaType=TLOG} status=0 QTime=1624
   [junit4]   2> 334207 INFO  (qtp29357846-3534) [    ] o.a.s.s.HttpSolrCall [admin] webapp=null path=/admin/collections params={node=127.0.0.1:60264_&action=ADDREPLICA&collection=collection1&shard=shard1&type=TLOG&wt=javabin&version=2} status=0 QTime=1640
   [junit4]   2> 334308 INFO  (zkCallback-549-thread-1) [    ] o.a.s.c.c.ZkStateReader A cluster state change: [WatchedEvent state:SyncConnected type:NodeDataChanged path:/collections/collection1/state.json] for collection [collection1] has occurred - updating... (live nodes size: [3])
   [junit4]   2> 334308 INFO  (zkCallback-555-thread-1) [    ] o.a.s.c.c.ZkStateReader A cluster state change: [WatchedEvent state:SyncConnected type:NodeDataChanged path:/collections/collection1/state.json] for collection [collection1] has occurred - updating... (live nodes size: [3])
   [junit4]   2> 334573 INFO  (OverseerCollectionConfigSetProcessor-98505211793178628-127.0.0.1:60224_-n_0000000000) [    ] o.a.s.c.OverseerTaskQueue Response ZK path: /overseer/collection-queue-work/qnr-0000000006 doesn't exist.  Requestor may have disconnected from ZooKeeper
   [junit4]   2> 334700 INFO  (TEST-HttpPartitionTest.test-seed#[2A5B12C1609DFB81]) [    ] o.a.s.c.AbstractFullDistribZkTestBase create jetty 3 in directory C:\Users\jenkins\workspace\Lucene-Solr-master-Windows\solr\build\solr-core\test\J1\temp\solr.cloud.HttpPartitionTest_2A5B12C1609DFB81-001\shard-3-001 of type TLOG
   [junit4]   2> 334701 INFO  (TEST-HttpPartitionTest.test-seed#[2A5B12C1609DFB81]) [    ] o.e.j.s.Server jetty-9.3.20.v20170531
   [junit4]   2> 334702 INFO  (TEST-HttpPartitionTest.test-seed#[2A5B12C1609DFB81]) [    ] o.e.j.s.h.ContextHandler Started o.e.j.s.ServletContextHandler@1489fc2{/,null,AVAILABLE}
   [junit4]   2> 334703 INFO  (TEST-HttpPartitionTest.test-seed#[2A5B12C1609DFB81]) [    ] o.e.j.s.AbstractConnector Started ServerConnector@11db393{HTTP/1.1,[http/1.1]}{127.0.0.1:60282}
   [junit4]   2> 334704 INFO  (TEST-HttpPartitionTest.test-seed#[2A5B12C1609DFB81]) [    ] o.e.j.s.Server Started @335576ms
   [junit4]   2> 334704 INFO  (TEST-HttpPartitionTest.test-seed#[2A5B12C1609DFB81]) [    ] o.a.s.c.s.e.JettySolrRunner Jetty properties: {hostContext=/, solrconfig=solrconfig.xml, solr.data.dir=C:\Users\jenkins\workspace\Lucene-Solr-master-Windows\solr\build\solr-core\test\J1\temp\solr.cloud.HttpPartitionTest_2A5B12C1609DFB81-001\tempDir-001/jetty3, hostPort=60281, coreRootDirectory=C:\Users\jenkins\workspace\Lucene-Solr-master-Windows\solr\build\solr-core\test\J1\temp\solr.cloud.HttpPartitionTest_2A5B12C1609DFB81-001\shard-3-001\cores, replicaType=TLOG}
   [junit4]   2> 334704 ERROR (TEST-HttpPartitionTest.test-seed#[2A5B12C1609DFB81]) [    ] o.a.s.s.StartupLoggingUtils Missing Java Option solr.log.dir. Logging may be missing or incomplete.
   [junit4]   2> 334704 INFO  (TEST-HttpPartitionTest.test-seed#[2A5B12C1609DFB81]) [    ] o.a.s.s.SolrDispatchFilter  ___      _       Welcome to Apache Solr™ version 8.0.0
   [junit4]   2> 334704 INFO  (TEST-HttpPartitionTest.test-seed#[2A5B12C1609DFB81]) [    ] o.a.s.s.SolrDispatchFilter / __| ___| |_ _   Starting in cloud mode on port null
   [junit4]   2> 334704 INFO  (TEST-HttpPartitionTest.test-seed#[2A5B12C1609DFB81]) [    ] o.a.s.s.SolrDispatchFilter \__ \/ _ \ | '_|  Install dir: null, Default config dir: null
   [junit4]   2> 334705 INFO  (TEST-HttpPartitionTest.test-seed#[2A5B12C1609DFB81]) [    ] o.a.s.s.SolrDispatchFilter |___/\___/_|_|    Start time: 2017-08-18T15:30:57.223543500Z
   [junit4]   2> 334714 INFO  (TEST-HttpPartitionTest.test-seed#[2A5B12C1609DFB81]) [    ] o.a.s.s.SolrDispatchFilter Loading solr.xml from SolrHome (not found in ZooKeeper)
   [junit4]   2> 334714 INFO  (TEST-HttpPartitionTest.test-seed#[2A5B12C1609DFB81]) [    ] o.a.s.c.SolrXmlConfig Loading container configuration from C:\Users\jenkins\workspace\Lucene-Solr-master-Windows\solr\build\solr-core\test\J1\temp\solr.cloud.HttpPartitionTest_2A5B12C1609DFB81-001\shard-3-001\solr.xml
   [junit4]   2> 334743 INFO  (TEST-HttpPartitionTest.test-seed#[2A5B12C1609DFB81]) [    ] o.a.s.c.SolrXmlConfig MBean server found: com.sun.jmx.mbeanserver.JmxMBeanServer@148b87, but no JMX reporters were configured - adding default JMX reporter.
   [junit4]   2> 334751 INFO  (TEST-HttpPartitionTest.test-seed#[2A5B12C1609DFB81]) [    ] o.a.s.c.ZkContainer Zookeeper client=127.0.0.1:60217/solr
   [junit4]   2> 334756 WARN  (NIOServerCxn.Factory:0.0.0.0/0.0.0.0:0) [    ] o.a.z.s.NIOServerCnxn caught end of stream exception
   [junit4]   2> EndOfStreamException: Unable to read additional data from client sessionid 0x15df5f7dd75000e, likely client has closed socket
   [junit4]   2> 	at org.apache.zookeeper.server.NIOServerCnxn.doIO(NIOServerCnxn.java:239)
   [junit4]   2> 	at org.apache.zookeeper.server.NIOServerCnxnFactory.run(NIOServerCnxnFactory.java:203)
   [junit4]   2> 	at java.base/java.lang.Thread.run(Thread.java:844)
   [junit4]   2> 334768 INFO  (TEST-HttpPartitionTest.test-seed#[2A5B12C1609DFB81]) [    ] o.a.s.c.c.ZkStateReader Updated live nodes from ZooKeeper... (0) -> (3)
   [junit4]   2> 334772 INFO  (TEST-HttpPartitionTest.test-seed#[2A5B12C1609DFB81]) [    ] o.a.s.c.Overseer Overseer (id=null) closing
   [junit4]   2> 334775 INFO  (TEST-HttpPartitionTest.test-seed#[2A5B12C1609DFB81]) [    ] o.a.s.c.ZkController Register node as live in ZooKeeper:/live_nodes/127.0.0.1:60281_
   [junit4]   2> 334779 INFO  (zkCallback-549-thread-1) [    ] o.a.s.c.c.ZkStateReader Updated live nodes from ZooKeeper... (3) -> (4)
   [junit4]   2> 334779 INFO  (zkCallback-544-thread-1) [    ] o.a.s.c.c.ZkStateReader Updated live nodes from ZooKeeper... (3) -> (4)
   [junit4]   2> 334779 INFO  (zkCallback-555-thread-1) [    ] o.a.s.c.c.ZkStateReader Updated live nodes from ZooKeeper... (3) -> (4)
   [junit4]   2> 334780 INFO  (zkCallback-537-thread-1) [    ] o.a.s.c.c.ZkStateReader Updated live nodes from ZooKeeper... (3) -> (4)
   [junit4]   2> 334780 INFO  (zkCallback-561-thread-1) [    ] o.a.s.c.c.ZkStateReader Updated live nodes from ZooKeeper... (3) -> (4)
   [junit4]   2> 334963 INFO  (TEST-HttpPartitionTest.test-seed#[2A5B12C1609DFB81]) [    ] o.a.s.m.r.SolrJmxReporter JMX monitoring for 'solr.node' (registry 'solr.node') enabled at server: com.sun.jmx.mbeanserver.JmxMBeanServer@148b87
   [junit4]   2> 334978 INFO  (TEST-HttpPartitionTest.test-seed#[2A5B12C1609DFB81]) [    ] o.a.s.m.r.SolrJmxReporter JMX monitoring for 'solr.jvm' (registry 'solr.jvm') enabled at server: com.sun.jmx.mbeanserver.JmxMBeanServer@148b87
   [junit4]   2> 334979 INFO  (TEST-HttpPartitionTest.test-seed#[2A5B12C1609DFB81]) [    ] o.a.s.m.r.SolrJmxReporter JMX monitoring for 'solr.jetty' (registry 'solr.jetty') enabled at server: com.sun.jmx.mbeanserver.JmxMBeanServer@148b87
   [junit4]   2> 334983 INFO  (TEST-HttpPartitionTest.test-seed#[2A5B12C1609DFB81]) [    ] o.a.s.c.CorePropertiesLocator Found 0 core definitions underneath C:\Users\jenkins\workspace\Lucene-Solr-master-Windows\solr\build\solr-core\test\J1\temp\solr.cloud.HttpPartitionTest_2A5B12C1609DFB81-001\shard-3-001\cores
   [junit4]   2> 335048 INFO  (qtp29357846-3531) [    ] o.a.s.h.a.CollectionsHandler Invoked Collection Action :addreplica with params node=127.0.0.1:60281_&action=ADDREPLICA&collection=collection1&shard=shard2&type=TLOG&wt=javabin&version=2 and sendToOCPQueue=true
   [junit4]   2> 335057 INFO  (OverseerThreadFactory-1465-thread-5) [    ] o.a.s.c.AddReplicaCmd Node Identified 127.0.0.1:60281_ for creating new replica
   [junit4]   2> 335067 INFO  (SocketProxy-Acceptor-60281) [    ] o.a.s.c.SocketProxy accepted Socket[addr=/127.0.0.1,port=60294,localport=60281], receiveBufferSize:65536
   [junit4]   2> 335067 INFO  (SocketProxy-Acceptor-60281) [    ] o.a.s.c.SocketProxy proxy connection Socket[addr=/127.0.0.1,port=60282,localport=60295], receiveBufferSize=65536
   [junit4]   2> 335071 INFO  (qtp27060057-3567) [    ] o.a.s.h.a.CoreAdminOperation core create command qt=/admin/cores&collection.configName=conf1&name=collection1_shard2_replica_t45&action=CREATE&collection=collection1&shard=shard2&wt=javabin&version=2&replicaType=TLOG
   [junit4]   2> 335072 INFO  (qtp27060057-3567) [    ] o.a.s.c.TransientSolrCoreCacheDefault Allocating transient cache for 4 transient cores
   [junit4]   2> 335179 INFO  (zkCallback-549-thread-1) [    ] o.a.s.c.c.ZkStateReader A cluster state change: [WatchedEvent state:SyncConnected type:NodeDataChanged path:/collections/collection1/state.json] for collection [collection1] has occurred - updating... (live nodes size: [4])
   [junit4]   2> 335179 INFO  (zkCallback-561-thread-1) [    ] o.a.s.c.c.ZkStateReader A cluster state change: [WatchedEvent state:SyncConnected type:NodeDataChanged path:/collections/collection1/state.json] for collection [collection1] has occurred - updating... (live nodes size: [4])
   [junit4]   2> 335179 INFO  (zkCallback-555-thread-1) [    ] o.a.s.c.c.ZkStateReader A cluster state change: [WatchedEvent state:SyncConnected type:NodeDataChanged path:/collections/collection1/state.json] for collection [collection1] has occurred - updating... (live nodes size: [4])
   [junit4]   2> 336106 INFO  (qtp27060057-3567) [    ] o.a.s.c.SolrConfig Using Lucene MatchVersion: 8.0.0
   [junit4]   2> 336129 INFO  (qtp27060057-3567) [    ] o.a.s.s.IndexSchema [collection1_shard2_replica_t45] Schema name=test
   [junit4]   2> 336250 INFO  (qtp27060057-3567) [    ] o.a.s.s.IndexSchema Loaded schema test/1.0 with uniqueid field id
   [junit4]   2> 336319 INFO  (qtp27060057-3567) [    ] o.a.s.c.CoreContainer Creating SolrCore 'collection1_shard2_replica_t45' using configuration from collection collection1, trusted=true
   [junit4]   2> 336319 INFO  (qtp27060057-3567) [    ] o.a.s.m.r.SolrJmxReporter JMX monitoring for 'solr.core.collection1.shard2.replica_t45' (registry 'solr.core.collection1.shard2.replica_t45') enabled at server: com.sun.jmx.mbeanserver.JmxMBeanServer@148b87
   [junit4]   2> 336319 INFO  (qtp27060057-3567) [    ] o.a.s.c.SolrCore solr.RecoveryStrategy.Builder
   [junit4]   2> 336319 INFO  (qtp27060057-3567) [    ] o.a.s.c.SolrCore [[collection1_shard2_replica_t45] ] Opening new SolrCore at [C:\Users\jenkins\workspace\Lucene-Solr-master-Windows\solr\build\solr-core\test\J1\temp\solr.cloud.HttpPartitionTest_2A5B12C1609DFB81-001\shard-3-001\cores\collection1_shard2_replica_t45], dataDir=[C:\Users\jenkins\workspace\Lucene-Solr-master-Windows\solr\build\solr-core\test\J1\temp\solr.cloud.HttpPartitionTest_2A5B12C1609DFB81-001\shard-3-001\cores\collection1_shard2_replica_t45\data\]
   [junit4]   2> 336326 INFO  (qtp27060057-3567) [    ] o.a.s.u.RandomMergePolicy RandomMergePolicy wrapping class org.apache.lucene.index.LogByteSizeMergePolicy: [LogByteSizeMergePolicy: minMergeSize=1677721, mergeFactor=24, maxMergeSize=2147483648, maxMergeSizeForForcedMerge=9223372036854775807, calibrateSizeByDeletes=false, maxMergeDocs=2147483647, maxCFSSegmentSizeMB=8.796093022207999E12, noCFSRatio=1.0]
   [junit4]   2> 336330 WARN  (qtp27060057-3567) [    ] o.a.s.c.RequestHandlers INVALID paramSet a in requestHandler {type = requestHandler,name = /dump,class = DumpRequestHandler,attributes = {initParams=a, name=/dump, class=DumpRequestHandler},args = {defaults={a=A,b=B}}}
   [junit4]   2> 336515 INFO  (qtp27060057-3567) [    ] o.a.s.u.UpdateHandler Using UpdateLog implementation: org.apache.solr.update.UpdateLog
   [junit4]   2> 336516 INFO  (qtp27060057-3567) [    ] o.a.s.u.UpdateLog Initializing UpdateLog: dataDir= defaultSyncLevel=FLUSH numRecordsToKeep=100 maxNumLogsToKeep=10 numVersionBuckets=65536
   [junit4]   2> 336519 INFO  (qtp27060057-3567) [    ] o.a.s.u.CommitTracker Hard AutoCommit: disabled
   [junit4]   2> 336519 INFO  (qtp27060057-3567) [    ] o.a.s.u.CommitTracker Soft AutoCommit: disabled
   [junit4]   2> 336543 INFO  (qtp27060057-3567) [    ] o.a.s.u.RandomMergePolicy RandomMergePolicy wrapping class org.apache.lucene.index.LogDocMergePolicy: [LogDocMergePolicy: minMergeSize=1000, mergeFactor=40, maxMergeSize=9223372036854775807, maxMergeSizeForForcedMerge=9223372036854775807, calibrateSizeByDeletes=false, maxMergeDocs=2147483647, maxCFSSegmentSizeMB=8.796093022207999E12, noCFSRatio=1.0]
   [junit4]   2> 336543 INFO  (qtp27060057-3567) [    ] o.a.s.s.SolrIndexSearcher Opening [Searcher@c684a5[collection1_shard2_replica_t45] main]
   [junit4]   2> 336545 INFO  (qtp27060057-3567) [    ] o.a.s.r.ManagedResourceStorage Configured ZooKeeperStorageIO with znodeBase: /configs/conf1
   [junit4]   2> 336545 INFO  (qtp27060057-3567) [    ] o.a.s.r.ManagedResourceStorage Loaded null at path _rest_managed.json using ZooKeeperStorageIO:path=/configs/conf1
   [junit4]   2> 336546 INFO  (qtp27060057-3567) [    ] o.a.s.h.ReplicationHandler Commits will be reserved for  10000
   [junit4]   2> 336549 INFO  (searcherExecutor-1501-thread-1) [    ] o.a.s.c.SolrCore [collection1_shard2_replica_t45] Registered new searcher Searcher@c684a5[collection1_shard2_replica_t45] main{ExitableDirectoryReader(UninvertingDirectoryReader())}
   [junit4]   2> 336549 INFO  (qtp27060057-3567) [    ] o.a.s.u.UpdateLog Could not find max version in index or recent updates, using new clock 1576083399971438592
   [junit4]   2> 336555 INFO  (qtp27060057-3567) [    ] o.a.s.c.ZkController Core needs to recover:collection1_shard2_replica_t45
   [junit4]   2> 336556 INFO  (updateExecutor-558-thread-1) [    ] o.a.s.u.DefaultSolrCoreState Running recovery
   [junit4]   2> 336556 INFO  (qtp27060057-3567) [    ] o.a.s.s.HttpSolrCall [admin] webapp=null path=/admin/cores params={qt=/admin/cores&collection.configName=conf1&name=collection1_shard2_replica_t45&action=CREATE&collection=collection1&shard=shard2&wt=javabin&version=2&replicaType=TLOG} status=0 QTime=1485
   [junit4]   2> 336557 INFO  (recoveryExecutor-559-thread-1) [    ] o.a.s.c.RecoveryStrategy Starting recovery process. recoveringAfterStartup=true
   [junit4]   2> 336562 INFO  (qtp29357846-3531) [    ] o.a.s.s.HttpSolrCall [admin] webapp=null path=/admin/collections params={node=127.0.0.1:60281_&action=ADDREPLICA&collection=collection1&shard=shard2&type=TLOG&wt=javabin&version=2} status=0 QTime=1514
   [junit4]   2> 336566 INFO  (recoveryExecutor-559-thread-1) [    ] o.a.s.c.RecoveryStrategy ###### startupVersions=[[]]
   [junit4]   2> 336567 INFO  (recoveryExecutor-559-thread-1) [    ] o.a.s.c.ZkController collection1_shard2_replica_t45 stopping background replication from leader
   [junit4]   2> 336567 INFO  (recoveryExecutor-559-thread-1) [    ] o.a.s.c.RecoveryStrategy Begin buffering updates. core=[collection1_shard2_replica_t45]
   [junit4]   2> 336567 INFO  (recoveryExecutor-559-thread-1) [    ] o.a.s.u.UpdateLog Starting to buffer updates. FSUpdateLog{state=ACTIVE, tlog=null}
   [junit4]   2> 336567 INFO  (recoveryExecutor-559-thread-1) [    ] o.a.s.c.RecoveryStrategy Publishing state of core [collection1_shard2_replica_t45] as recovering, leader is [http://127.0.0.1:60249/collection1_shard2_replica_t41/] and I am [http://127.0.0.1:60281/collection1_shard2_replica_t45/]
   [junit4]   2> 336571 INFO  (TEST-HttpPartitionTest.test-seed#[2A5B12C1609DFB81]) [    ] o.a.s.SolrTestCaseJ4 ###Starting test
   [junit4]   2> 336571 INFO  (recoveryExecutor-559-thread-1) [    ] o.a.s.c.RecoveryStrategy Sending prep recovery command to [http://127.0.0.1:60249]; [WaitForState: action=PREPRECOVERY&core=collection1_shard2_replica_t41&nodeName=127.0.0.1:60281_&coreNodeName=core_node46&state=recovering&checkLive=true&onlyIfLeader=true&onlyIfLeaderActive=true]
   [junit4]   2> 336571 INFO  (TEST-HttpPartitionTest.test-seed#[2A5B12C1609DFB81]) [    ] o.a.s.c.AbstractFullDistribZkTestBase Wait for recoveries to finish - wait 30000 for each attempt
   [junit4]   2> 336571 INFO  (TEST-HttpPartitionTest.test-seed#[2A5B12C1609DFB81]) [    ] o.a.s.c.AbstractDistribZkTestBase Wait for recoveries to finish - collection: collection1 failOnTimeout:true timeout (sec):30000
   [junit4]   2> 336573 INFO  (SocketProxy-Acceptor-60249) [    ] o.a.s.c.SocketProxy accepted Socket[addr=/127.0.0.1,port=60296,localport=60249], receiveBufferSize:65536
   [junit4]   2> 336574 INFO  (SocketProxy-Acceptor-60249) [    ] o.a.s.c.SocketProxy proxy connection Socket[addr=/127.0.0.1,port=60250,localport=60297], receiveBufferSize=65536
   [junit4]   2> 336577 INFO  (qtp15960360-3499) [    ] o.a.s.h.a.PrepRecoveryOp Going to wait for coreNodeName: core_node46, state: recovering, checkLive: true, onlyIfLeader: true, onlyIfLeaderActive: true, maxTime: 183 s
   [junit4]   2> 336578 INFO  (qtp15960360-3499) [    ] o.a.s.h.a.PrepRecoveryOp In WaitForState(recovering): collection=collection1, shard=shard2, thisCore=collection1_shard2_replica_t41, leaderDoesNotNeedRecovery=false, isLeader? true, live=true, checkLive=true, currentState=down, localState=active, nodeName=127.0.0.1:60281_, coreNodeName=core_node46, onlyIfActiveCheckResult=false, nodeProps: core_node46:{"core":"collection1_shard2_replica_t45","base_url":"http://127.0.0.1:60281","node_name":"127.0.0.1:60281_","state":"down","type":"TLOG"}
   [junit4]   2> 336674 INFO  (zkCallback-549-thread-1) [    ] o.a.s.c.c.ZkStateReader A cluster state change: [WatchedEvent state:SyncConnected type:NodeDataChanged path:/collections/collection1/state.json] for collection [collection1] has occurred - updating... (live nodes size: [4])
   [junit4]   2> 336674 INFO  (zkCallback-561-thread-1) [    ] o.a.s.c.c.ZkStateReader A cluster state change: [WatchedEvent state:SyncConnected type:NodeDataChanged path:/collections/collection1/state.json] for collection [collection1] has occurred - updating... (live nodes size: [4])
   [junit4]   2> 336674 INFO  (zkCallback-555-thread-1) [    ] o.a.s.c.c.ZkStateReader A cluster state change: [WatchedEvent state:SyncConnected type:NodeDataChanged path:/collections/collection1/state.json] for collection [collection1] has occurred - updating... (live nodes size: [4])
   [junit4]   2> 337056 INFO  (OverseerCollectionConfigSetProcessor-98505211793178628-127.0.0.1:60224_-n_0000000000) [    ] o.a.s.c.OverseerTaskQueue Response ZK path: /overseer/collection-queue-work/qnr-0000000008 doesn't exist.  Requestor may have disconnected from ZooKeeper
   [junit4]   2> 337579 INFO  (qtp15960360-3499) [    ] o.a.s.h.a.PrepRecoveryOp In WaitForState(recovering): collection=collection1, shard=shard2, thisCore=collection1_shard2_replica_t41, leaderDoesNotNeedRecovery=false, isLeader? true, live=true, checkLive=true, currentState=recovering, localState=active, nodeName=127.0.0.1:60281_, coreNodeName=core_node46, onlyIfActiveCheckResult=false, nodeProps: core_node46:{"core":"collection1_shard2_replica_t45","base_url":"http://127.0.0.1:60281","node_name":"127.0.0.1:60281_","state":"recovering","type":"TLOG"}
   [junit4]   2> 337579 INFO  (qtp15960360-3499) [    ] o.a.s.h.a.PrepRecoveryOp Waited coreNodeName: core_node46, state: recovering, checkLive: true, onlyIfLeader: true for: 1 seconds.
   [junit4]   2> 337579 INFO  (qtp15960360-3499) [    ] o.a.s.s.HttpSolrCall [admin] webapp=null path=/admin/cores params={nodeName=127.0.0.1:60281_&onlyIfLeaderActive=true&core=collection1_shard2_replica_t41&coreNodeName=core_node46&action=PREPRECOVERY&checkLive=true&state=recovering&onlyIfLeader=true&wt=javabin&version=2} status=0 QTime=1002
   [junit4]   2> 338080 INFO  (recoveryExecutor-559-thread-1) [    ] o.a.s.c.RecoveryStrategy Starting Replication Recovery.
   [junit4]   2> 338080 INFO  (recoveryExecutor-559-thread-1) [    ] o.a.s.c.RecoveryStrategy Attempting to replicate from [http://127.0.0.1:60249/collection1_shard2_replica_t41/].
   [junit4]   2> 338083 INFO  (SocketProxy-Acceptor-60249) [    ] o.a.s.c.SocketProxy accepted Socket[addr=/127.0.0.1,port=60298,localport=60249], receiveBufferSize:65536
   [junit4]   2> 338084 INFO  (SocketProxy-Acceptor-60249) [    ] o.a.s.c.SocketProxy proxy connection Socket[addr=/127.0.0.1,port=60250,localport=60299], receiveBufferSize=65536
   [junit4]   2> 338086 INFO  (qtp15960360-3497) [    ] o.a.s.u.DirectUpdateHandler2 start commit{_version_=1576083401583099904,optimize=false,openSearcher=false,waitSearcher=true,expungeDeletes=false,softCommit=false,prepareCommit=false}
   [junit4]   2> 338088 INFO  (qtp15960360-3497) [    ] o.a.s.u.DirectUpdateHandler2 No uncommitted changes. Skipping IW.commit.
   [junit4]   2> 338088 INFO  (qtp15960360-3497) [    ] o.a.s.u.DirectUpdateHandler2 end_commit_flush
   [junit4]   2> 338089 INFO  (qtp15960360-3497) [    ] o.a.s.u.p.LogUpdateProcessorFactory [collection1_shard2_replica_t41]  webapp= path=/update params={waitSearcher=true&openSearcher=false&commit=true&softCommit=false&commit_end_point=true&wt=javabin&version=2}{commit=} 0 2
   [junit4]   2> 338092 INFO  (SocketProxy-Acceptor-60249) [    ] o.a.s.c.SocketProxy accepted Socket[addr=/127.0.0.1,port=60300,localport=60249], receiveBufferSize:65536
   [junit4]   2> 338092 INFO  (SocketProxy-Acceptor-60249) [    ] o.a.s.c.SocketProxy proxy connection Socket[addr=/127.0.0.1,port=60250,localport=60301], receiveBufferSize=65536
   [junit4]   2> 338097 INFO  (qtp15960360-3502) [    ] o.a.s.c.S.Request [collection1_shard2_replica_t41]  webapp= path=/replication params={qt=/replication&wt=javabin&version=2&command=indexversion} status=0 QTime=0
   [junit4]   2> 338097 INFO  (recoveryExecutor-559-thread-1) [    ] o.a.s.h.IndexFetcher Master's generation: 1
   [junit4]   2> 338097 INFO  (recoveryExecutor-559-thread-1) [    ] o.a.s.h.IndexFetcher Master's version: 0
   [junit4]   2> 338098 INFO  (recoveryExecutor-559-thread-1) [    ] o.a.s.h.IndexFetcher Slave's generation: 1
   [junit4]   2> 338098 INFO  (recoveryExecutor-559-thread-1) [    ] o.a.s.h.IndexFetcher Slave's version: 0
   [junit4]   2> 338098 INFO  (recoveryExecutor-559-thread-1) [    ] o.a.s.c.RecoveryStrategy Replication Recovery was successful.
   [junit4]   2> 338098 INFO  (recoveryExecutor-559-thread-1) [    ] o.a.s.c.RecoveryStrategy Registering as Active after recovery.
   [junit4]   2> 338098 INFO  (recoveryExecutor-559-thread-1) [    ] o.a.s.c.ZkController collection1_shard2_replica_t45 starting background replication from leader
   [junit4]   2> 338098 INFO  (recoveryExecutor-559-thread-1) [    ] o.a.s.c.ReplicateFromLeader Will start replication from leader with poll interval: 00:00:03
   [junit4]   2> 338102 INFO  (recoveryExecutor-559-thread-1) [    ] o.a.s.h.ReplicationHandler Poll scheduled at an interval of 3000ms
   [junit4]   2> 338104 INFO  (recoveryExecutor-559-thread-1) [    ] o.a.s.c.RecoveryStrategy Updating version bucket highest from index after successful recovery.
   [junit4]   2> 338104 INFO  (recoveryExecutor-559-thread-1) [    ] o.a.s.u.UpdateLog Could not find max version in index or recent updates, using new clock 1576083401601974272
   [junit4]   2> 338105 INFO  (recoveryExecutor-559-thread-1) [    ] o.a.s.c.RecoveryStrategy Finished recovery process, successful=[true]
   [junit4]   2> 338210 INFO  (zkCallback-549-thread-1) [    ] o.a.s.c.c.ZkStateReader A cluster state change: [WatchedEvent state:SyncConnected type:NodeDataChanged path:/collections/collection1/state.json] for collection [collection1] has occurred - updating... (live nodes size: [4])
   [junit4]   2> 338210 INFO  (zkCallback-555-thread-1) [    ] o.a.s.c.c.ZkStateReader A cluster state change: [WatchedEvent state:SyncConnected type:NodeDataChanged path:/collections/collection1/state.json] for collection [collection1] has occurred - updating... (live nodes size: [4])
   [junit4]   2> 338212 INFO  (zkCallback-561-thread-1) [    ] o.a.s.c.c.ZkStateReader A cluster state change: [WatchedEvent state:SyncConnected type:NodeDataChanged path:/collections/collection1/state.json] for collection [collection1] has occurred - updating... (live nodes size: [4])
   [junit4]   2> 338578 INFO  (TEST-HttpPartitionTest.test-seed#[2A5B12C1609DFB81]) [    ] o.a.s.c.AbstractDistribZkTestBase Recoveries finished - collection: collection1
   [junit4]   2> 338580 INFO  (qtp7533610-3448) [    ] o.a.s.u.DirectUpdateHandler2 start commit{_version_=1576083402101096448,optimize=false,openSearcher=true,waitSearcher=true,expungeDeletes=false,softCommit=false,prepareCommit=false}
   [junit4]   2> 338580 INFO  (qtp7533610-3448) [    ] o.a.s.u.DirectUpdateHandler2 No uncommitted changes. Skipping IW.commit.
   [junit4]   2> 338581 INFO  (qtp7533610-3448) [    ] o.a.s.u.DirectUpdateHandler2 end_commit_flush
   [junit4]   2> 338581 INFO  (qtp7533610-3448) [    ] o.a.s.u.p.LogUpdateProcessorFactory [control_collection_shard1_replica_n1]  webapp= path=/update params={waitSearcher=true&commit=true&softCommit=false&wt=javabin&version=2}{commit=} 0 1
   [junit4]   2> 338586 INFO  (SocketProxy-Acceptor-60264) [    ] o.a.s.c.SocketProxy accepted Socket[addr=/127.0.0.1,port=60303,localport=60264], receiveBufferSize:65536
   [junit4]   2> 338586 INFO  (SocketProxy-Acceptor-60281) [    ] o.a.s.c.SocketProxy accepted Socket[addr=/127.0.0.1,port=60304,localport=60281], receiveBufferSize:65536
   [junit4]   2> 338586 INFO  (SocketProxy-Acceptor-60264) [    ] o.a.s.c.SocketProxy proxy connection Socket[addr=/127.0.0.1,port=60265,localport=60305], receiveBufferSize=65536
   [junit4]   2> 338586 INFO  (SocketProxy-Acceptor-60281) [    ] o.a.s.c.SocketProxy proxy connection Socket[addr=/127.0.0.1,port=60282,localport=60306], receiveBufferSize=65536
   [junit4]   2> 338587 INFO  (SocketProxy-Acceptor-60249) [    ] o.a.s.c.SocketProxy accepted Socket[addr=/127.0.0.1,port=60307,localport=60249], receiveBufferSize:65536
   [junit4]   2> 338587 INFO  (SocketProxy-Acceptor-60249) [    ] o.a.s.c.SocketProxy proxy connection Socket[addr=/127.0.0.1,port=60250,localport=60308], receiveBufferSize=65536
   [junit4]   2> 338590 INFO  (qtp15960360-3500) [    ] o.a.s.u.DirectUpdateHandler2 start commit{_version_=1576083402111582208,optimize=false,openSearcher=true,waitSearcher=true,expungeDeletes=false,softCommit=false,prepareCommit=false}
   [junit4]   2> 338590 INFO  (qtp29357846-3529) [    ] o.a.s.u.DirectUpdateHandler2 start commit{_version_=1576083402111582208,optimize=false,openSearcher=true,waitSearcher=true,expungeDeletes=false,softCommit=false,prepareCommit=false}
   [junit4]   2> 338591 INFO  (qtp15960360-3500) [    ] o.a.s.u.DirectUpdateHandler2 No uncommitted changes. Skipping IW.commit.
   [junit4]   2> 338591 INFO  (qtp27060057-3568) [    ] o.a.s.u.TestInjection Start waiting for replica in sync with leader
   [junit4]   2> 338591 INFO  (qtp29357846-3529) [    ] o.a.s.u.DirectUpdateHandler2 No uncommitted changes. Skipping IW.commit.
   [junit4]   2> 338591 INFO  (qtp15960360-3500) [    ] o.a.s.u.DirectUpdateHandler2 end_commit_flush
   [junit4]   2> 338591 INFO  (qtp15960360-3500) [    ] o.a.s.u.p.LogUpdateProcessorFactory [collection1_shard2_replica_t41]  webapp= path=/update params={update.distrib=FROMLEADER&waitSearcher=true&openSearcher=true&commit=true&softCommit=false&distrib.from=http://127.0.0.1:60264/collection1_shard1_replica_t43/&commit_end_point=true&wt=javabin&version=2&expungeDeletes=false}{commit=} 0 1
   [junit4]   2> 338593 IN

[...truncated too long message...]

er@36133b: rootName = null, domain = solr.jvm, service url = null, agent id = null] for registry solr.jvm / com.codahale.metrics.MetricRegistry@d16230
   [junit4]   2> 2889086 INFO  (SUITE-SuggestComponentTest-seed#[2A5B12C1609DFB81]-worker) [    ] o.a.s.m.SolrMetricManager Closing metric reporters for registry=solr.jetty, tag=null
   [junit4]   2> 2889087 INFO  (SUITE-SuggestComponentTest-seed#[2A5B12C1609DFB81]-worker) [    ] o.a.s.m.r.SolrJmxReporter Closing reporter [org.apache.solr.metrics.reporters.SolrJmxReporter@1a9b02b: rootName = null, domain = solr.jetty, service url = null, agent id = null] for registry solr.jetty / com.codahale.metrics.MetricRegistry@1e42f1e
   [junit4]   2> 2889087 INFO  (SUITE-SuggestComponentTest-seed#[2A5B12C1609DFB81]-worker) [    ] o.a.s.c.TransientSolrCoreCacheDefault Allocating transient cache for 2147483647 transient cores
   [junit4]   2> 2889088 INFO  (coreCloseExecutor-11336-thread-1) [    ] o.a.s.c.SolrCore [collection1]  CLOSING SolrCore org.apache.solr.core.SolrCore@1d68e50
   [junit4]   2> 2889088 INFO  (coreCloseExecutor-11336-thread-1) [    ] o.a.s.m.SolrMetricManager Closing metric reporters for registry=solr.core.collection1, tag=30838352
   [junit4]   2> 2889088 INFO  (coreCloseExecutor-11336-thread-1) [    ] o.a.s.m.r.SolrJmxReporter Closing reporter [org.apache.solr.metrics.reporters.SolrJmxReporter@248c01: rootName = null, domain = solr.core.collection1, service url = null, agent id = null] for registry solr.core.collection1 / com.codahale.metrics.MetricRegistry@d7b3eb
   [junit4]   2> 2889126 INFO  (SUITE-SuggestComponentTest-seed#[2A5B12C1609DFB81]-worker) [    ] o.a.s.SolrTestCaseJ4 ------------------------------------------------------- Done waiting for tracked resources to be released
   [junit4]   2> NOTE: test params are: codec=Asserting(Lucene70), sim=RandomSimilarity(queryNorm=true): {}, locale=bs-Latn-BA, timezone=Pacific/Guadalcanal
   [junit4]   2> NOTE: Windows 10 10.0 x86/Oracle Corporation 9 (32-bit)/cpus=3,threads=1,free=430862400,total=536870912
   [junit4]   2> NOTE: All tests run in this JVM: [TestDistributedGrouping, TestSimpleTrackingShardHandler, TestUseDocValuesAsStored2, CleanupOldIndexTest, TestMissingGroups, AssignBackwardCompatibilityTest, TestQueryTypes, JavabinLoaderTest, TestStreamBody, CollectionReloadTest, HdfsCollectionsAPIDistributedZkTest, SystemInfoHandlerTest, TestConfig, TestSolr4Spatial, TestFreeTextSuggestions, TestManagedSchemaAPI, ShardRoutingCustomTest, TestImplicitCoreProperties, QueryEqualityTest, TestLRUCache, TestCrossCoreJoin, TestSQLHandlerNonCloud, ResponseHeaderTest, ZkNodePropsTest, TestLeaderInitiatedRecoveryThread, TestCollectionsAPIViaSolrCloudCluster, TestJsonFacets, TestPerFieldSimilarity, ReplicaListTransformerTest, TriLevelCompositeIdRoutingTest, ClassificationUpdateProcessorFactoryTest, TestLeaderElectionWithEmptyReplica, TestLMJelinekMercerSimilarityFactory, TestFastOutputStream, OpenCloseCoreStressTest, JsonLoaderTest, TestDistribIDF, TestSha256AuthenticationProvider, VersionInfoTest, CopyFieldTest, TestUnifiedSolrHighlighter, StatelessScriptUpdateProcessorFactoryTest, HttpPartitionTest, TestSubQueryTransformer, ForceLeaderTest, CreateCollectionCleanupTest, TestTlogReplica, TestConfigSetsAPIExclusivity, TestZkAclsWithHadoopAuth, AddBlockUpdateTest, SolrGangliaReporterTest, TestRequestForwarding, SolrIndexConfigTest, TestCloudInspectUtil, LargeFieldTest, TestNumericTokenStream, TestAnalyzedSuggestions, StatsReloadRaceTest, TestOrdValues, DocumentBuilderTest, PolyFieldTest, TestRandomFlRTGCloud, HdfsLockFactoryTest, BJQParserTest, TestStandardQParsers, CoreAdminCreateDiscoverTest, TestRandomFaceting, TestHdfsUpdateLog, OverriddenZkACLAndCredentialsProvidersTest, TestRecoveryHdfs, TestFieldCache, SpellingQueryConverterTest, FileUtilsTest, LeaderElectionIntegrationTest, TestSolrDeletionPolicy1, SolrRequestParserTest, SolrShardReporterTest, TestScoreJoinQPScore, MBeansHandlerTest, TestFastLRUCache, SpellCheckCollatorTest, DistributedQueryElevationComponentTest, TestPartialUpdateDeduplication, ActionThrottleTest, DocValuesMissingTest, TestCryptoKeys, TestLegacyFieldReuse, TestBulkSchemaAPI, FieldMutatingUpdateProcessorTest, NodeMutatorTest, TestMergePolicyConfig, SpellCheckComponentTest, TestSerializedLuceneMatchVersion, TestSolrJ, GraphQueryTest, DocExpirationUpdateProcessorFactoryTest, PKIAuthenticationIntegrationTest, TestDistributedMissingSort, TestFilteredDocIdSet, TestCloudRecovery, StressHdfsTest, HLLSerializationTest, BufferStoreTest, TestSimpleTextCodec, PreAnalyzedFieldTest, CloudMLTQParserTest, TestFieldCacheVsDocValues, HdfsRecoverLeaseTest, HdfsBasicDistributedZk2Test, IndexSchemaRuntimeFieldTest, TestSolrIndexConfig, V2ApiIntegrationTest, TestCloudPivotFacet, TestTolerantUpdateProcessorRandomCloud, AsyncCallRequestStatusResponseTest, ManagedSchemaRoundRobinCloudTest, SolrCoreMetricManagerTest, TestAuthenticationFramework, TestValueSourceCache, CurrencyFieldTypeTest, TestFieldCacheSort, LukeRequestHandlerTest, CollectionsAPIDistributedZkTest, TestHashQParserPlugin, DistributedFacetPivotWhiteBoxTest, AutoScalingHandlerTest, TestClassicSimilarityFactory, TestNonDefinedSimilarityFactory, TestExpandComponent, TestStressLucene, CollectionTooManyReplicasTest, TestShortCircuitedRequests, SparseHLLTest, CoreMergeIndexesAdminHandlerTest, DistribCursorPagingTest, SolrCloudExampleTest, PeerSyncWithIndexFingerprintCachingTest, SignatureUpdateProcessorFactoryTest, TestLuceneMatchVersion, DistributedExpandComponentTest, FullSolrCloudDistribCmdsTest, DocumentAnalysisRequestHandlerTest, SearchHandlerTest, TestCSVLoader, DistributedVersionInfoTest, TestJavabinTupleStreamParser, TestDocSet, OverseerModifyCollectionTest, TestFieldCollectionResource, CdcrBootstrapTest, TestCollationField, TestRangeQuery, RulesTest, CacheHeaderTest, DebugComponentTest, TestFieldTypeCollectionResource, TestExactStatsCache, TestSolrConfigHandlerConcurrent, TestLegacyNumericRangeQueryBuilder, SolrCmdDistributorTest, TestQueryUtils, ZkSolrClientTest, TestBadConfig, TestBM25SimilarityFactory, TestLockTree, TestManagedSynonymGraphFilterFactory, SuggesterFSTTest, SpellCheckCollatorWithCollapseTest, ImplicitSnitchTest, MoveReplicaTest, TestFastWriter, BadComponentTest, HdfsThreadLeakTest, BlockCacheTest, SmileWriterTest, DistributedIntervalFacetingTest, ChaosMonkeySafeLeaderTest, BasicDistributedZk2Test, OverseerTest, BasicZkTest, RecoveryZkTest, TestZkChroot, ZkCLITest, TestDistributedSearch, AutoCommitTest, TestFaceting, TestRecovery, TermVectorComponentDistributedTest, TestJoin, DistributedTermsComponentTest, StatsComponentTest, BadIndexSchemaTest, ConvertedLegacyTest, TestSort, DirectUpdateHandlerTest, HighlighterTest, SoftAutoCommitTest, TestCoreDiscovery, TestFoldingMultitermQuery, SuggesterTSTTest, TestTrie, WordBreakSolrSpellCheckerTest, SolrCoreCheckLockOnStartupTest, TestPseudoReturnFields, TestWordDelimiterFilterFactory, TestRemoteStreaming, XsltUpdateRequestHandlerTest, TestWriterPerf, PrimitiveFieldTypeTest, FileBasedSpellCheckerTest, XmlUpdateRequestHandlerTest, MoreLikeThisHandlerTest, TestSolrQueryParser, LoggingHandlerTest, IndexSchemaTest, UpdateRequestProcessorFactoryTest, UniqFieldsUpdateProcessorFactoryTest, PingRequestHandlerTest, NumericFieldsTest, MinimalSchemaTest, ExternalFileFieldSortTest, TestPostingsSolrHighlighter, DirectSolrConnectionTest, TestCodecSupport, ResourceLoaderTest, OpenExchangeRatesOrgProviderTest, PluginInfoTest, ChaosMonkeyNothingIsSafeTest, ChaosMonkeySafeLeaderWithPullReplicasTest, CollectionsAPISolrJTest, DeleteStatusTest, DistributedQueueTest, LeaderFailoverAfterPartitionTest, MissingSegmentRecoveryTest, MoveReplicaHDFSTest, MoveReplicaHDFSUlogDirTest, OverseerStatusTest, PeerSyncReplicationTest, RemoteQueryErrorTest, ReplaceNodeTest, SSLMigrationTest, SaslZkACLProviderTest, ShardSplitTest, TestPullReplica, TestReplicaProperties, TestSSLRandomization, TestSegmentSorting, TestStressInPlaceUpdates, TestDynamicLoading, TestReplicationHandlerBackup, TestRestoreCore, V2StandaloneTest, InfoHandlerTest, MetricsHandlerTest, PropertiesRequestHandlerTest, SecurityConfHandlerTest, TestCollectionAPIs, TestCoreAdminApis, DistributedDebugComponentTest, DistributedFacetExistsSmallTest, DistributedFacetPivotLargeTest, DistributedFacetPivotSmallAdvancedTest, DistributedFacetPivotSmallTest, DistributedQueryComponentCustomSortTest, DistributedSuggestComponentTest, SuggestComponentTest]
   [junit4]   2> NOTE: reproduce with: ant test  -Dtestcase=SuggestComponentTest -Dtests.seed=2A5B12C1609DFB81 -Dtests.slow=true -Dtests.locale=bs-Latn-BA -Dtests.timezone=Pacific/Guadalcanal -Dtests.asserts=true -Dtests.file.encoding=Cp1252
   [junit4] ERROR   0.00s J1 | SuggestComponentTest (suite) <<<
   [junit4]    > Throwable #1: java.io.IOException: Could not remove the following files (in the order of attempts):
   [junit4]    >    C:\Users\jenkins\workspace\Lucene-Solr-master-Windows\solr\build\solr-core\test\J1\temp\solr.handler.component.SuggestComponentTest_2A5B12C1609DFB81-001\init-core-data-001: java.nio.file.AccessDeniedException: C:\Users\jenkins\workspace\Lucene-Solr-master-Windows\solr\build\solr-core\test\J1\temp\solr.handler.component.SuggestComponentTest_2A5B12C1609DFB81-001\init-core-data-001
   [junit4]    >    C:\Users\jenkins\workspace\Lucene-Solr-master-Windows\solr\build\solr-core\test\J1\temp\solr.handler.component.SuggestComponentTest_2A5B12C1609DFB81-001: java.nio.file.DirectoryNotEmptyException: C:\Users\jenkins\workspace\Lucene-Solr-master-Windows\solr\build\solr-core\test\J1\temp\solr.handler.component.SuggestComponentTest_2A5B12C1609DFB81-001
   [junit4]    > 	at __randomizedtesting.SeedInfo.seed([2A5B12C1609DFB81]:0)
   [junit4]    > 	at org.apache.lucene.util.IOUtils.rm(IOUtils.java:329)
   [junit4]    > 	at java.base/java.lang.Thread.run(Thread.java:844)
   [junit4] Completed [611/730 (3!)] on J1 in 8.51s, 12 tests, 1 error <<< FAILURES!

[...truncated 36854 lines...]

Mime
View raw message