lucene-dev mailing list archives

Site index · List index
Message view « Date » · « Thread »
Top « Date » · « Thread »
From Policeman Jenkins Server <jenk...@thetaphi.de>
Subject [JENKINS] Lucene-Solr-7.0-Linux (64bit/jdk1.8.0_144) - Build # 179 - Unstable!
Date Thu, 10 Aug 2017 19:37:28 GMT
Build: https://jenkins.thetaphi.de/job/Lucene-Solr-7.0-Linux/179/
Java: 64bit/jdk1.8.0_144 -XX:+UseCompressedOops -XX:+UseG1GC

1 tests failed.
FAILED:  junit.framework.TestSuite.org.apache.solr.cloud.TestSolrCloudWithSecureImpersonation

Error Message:
2 threads leaked from SUITE scope at org.apache.solr.cloud.TestSolrCloudWithSecureImpersonation:     1) Thread[id=15422, name=jetty-launcher-1445-thread-2-EventThread, state=TIMED_WAITING, group=TGRP-TestSolrCloudWithSecureImpersonation]         at sun.misc.Unsafe.park(Native Method)         at java.util.concurrent.locks.LockSupport.parkNanos(LockSupport.java:215)         at java.util.concurrent.locks.AbstractQueuedSynchronizer.doAcquireSharedNanos(AbstractQueuedSynchronizer.java:1037)         at java.util.concurrent.locks.AbstractQueuedSynchronizer.tryAcquireSharedNanos(AbstractQueuedSynchronizer.java:1328)         at java.util.concurrent.CountDownLatch.await(CountDownLatch.java:277)         at org.apache.curator.CuratorZookeeperClient.internalBlockUntilConnectedOrTimedOut(CuratorZookeeperClient.java:323)         at org.apache.curator.RetryLoop.callWithRetry(RetryLoop.java:105)         at org.apache.curator.framework.imps.GetDataBuilderImpl.pathInForeground(GetDataBuilderImpl.java:288)         at org.apache.curator.framework.imps.GetDataBuilderImpl.forPath(GetDataBuilderImpl.java:279)         at org.apache.curator.framework.imps.GetDataBuilderImpl.forPath(GetDataBuilderImpl.java:41)         at org.apache.curator.framework.recipes.shared.SharedValue.readValue(SharedValue.java:244)         at org.apache.curator.framework.recipes.shared.SharedValue.access$100(SharedValue.java:44)         at org.apache.curator.framework.recipes.shared.SharedValue$1.process(SharedValue.java:61)         at org.apache.curator.framework.imps.NamespaceWatcher.process(NamespaceWatcher.java:67)         at org.apache.zookeeper.ClientCnxn$EventThread.processEvent(ClientCnxn.java:530)         at org.apache.zookeeper.ClientCnxn$EventThread.run(ClientCnxn.java:505)    2) Thread[id=15421, name=jetty-launcher-1445-thread-1-EventThread, state=TIMED_WAITING, group=TGRP-TestSolrCloudWithSecureImpersonation]         at sun.misc.Unsafe.park(Native Method)         at java.util.concurrent.locks.LockSupport.parkNanos(LockSupport.java:215)         at java.util.concurrent.locks.AbstractQueuedSynchronizer.doAcquireSharedNanos(AbstractQueuedSynchronizer.java:1037)         at java.util.concurrent.locks.AbstractQueuedSynchronizer.tryAcquireSharedNanos(AbstractQueuedSynchronizer.java:1328)         at java.util.concurrent.CountDownLatch.await(CountDownLatch.java:277)         at org.apache.curator.CuratorZookeeperClient.internalBlockUntilConnectedOrTimedOut(CuratorZookeeperClient.java:323)         at org.apache.curator.RetryLoop.callWithRetry(RetryLoop.java:105)         at org.apache.curator.framework.imps.GetDataBuilderImpl.pathInForeground(GetDataBuilderImpl.java:288)         at org.apache.curator.framework.imps.GetDataBuilderImpl.forPath(GetDataBuilderImpl.java:279)         at org.apache.curator.framework.imps.GetDataBuilderImpl.forPath(GetDataBuilderImpl.java:41)         at org.apache.curator.framework.recipes.shared.SharedValue.readValue(SharedValue.java:244)         at org.apache.curator.framework.recipes.shared.SharedValue.access$100(SharedValue.java:44)         at org.apache.curator.framework.recipes.shared.SharedValue$1.process(SharedValue.java:61)         at org.apache.curator.framework.imps.NamespaceWatcher.process(NamespaceWatcher.java:67)         at org.apache.zookeeper.ClientCnxn$EventThread.processEvent(ClientCnxn.java:530)         at org.apache.zookeeper.ClientCnxn$EventThread.run(ClientCnxn.java:505)

Stack Trace:
com.carrotsearch.randomizedtesting.ThreadLeakError: 2 threads leaked from SUITE scope at org.apache.solr.cloud.TestSolrCloudWithSecureImpersonation: 
   1) Thread[id=15422, name=jetty-launcher-1445-thread-2-EventThread, state=TIMED_WAITING, group=TGRP-TestSolrCloudWithSecureImpersonation]
        at sun.misc.Unsafe.park(Native Method)
        at java.util.concurrent.locks.LockSupport.parkNanos(LockSupport.java:215)
        at java.util.concurrent.locks.AbstractQueuedSynchronizer.doAcquireSharedNanos(AbstractQueuedSynchronizer.java:1037)
        at java.util.concurrent.locks.AbstractQueuedSynchronizer.tryAcquireSharedNanos(AbstractQueuedSynchronizer.java:1328)
        at java.util.concurrent.CountDownLatch.await(CountDownLatch.java:277)
        at org.apache.curator.CuratorZookeeperClient.internalBlockUntilConnectedOrTimedOut(CuratorZookeeperClient.java:323)
        at org.apache.curator.RetryLoop.callWithRetry(RetryLoop.java:105)
        at org.apache.curator.framework.imps.GetDataBuilderImpl.pathInForeground(GetDataBuilderImpl.java:288)
        at org.apache.curator.framework.imps.GetDataBuilderImpl.forPath(GetDataBuilderImpl.java:279)
        at org.apache.curator.framework.imps.GetDataBuilderImpl.forPath(GetDataBuilderImpl.java:41)
        at org.apache.curator.framework.recipes.shared.SharedValue.readValue(SharedValue.java:244)
        at org.apache.curator.framework.recipes.shared.SharedValue.access$100(SharedValue.java:44)
        at org.apache.curator.framework.recipes.shared.SharedValue$1.process(SharedValue.java:61)
        at org.apache.curator.framework.imps.NamespaceWatcher.process(NamespaceWatcher.java:67)
        at org.apache.zookeeper.ClientCnxn$EventThread.processEvent(ClientCnxn.java:530)
        at org.apache.zookeeper.ClientCnxn$EventThread.run(ClientCnxn.java:505)
   2) Thread[id=15421, name=jetty-launcher-1445-thread-1-EventThread, state=TIMED_WAITING, group=TGRP-TestSolrCloudWithSecureImpersonation]
        at sun.misc.Unsafe.park(Native Method)
        at java.util.concurrent.locks.LockSupport.parkNanos(LockSupport.java:215)
        at java.util.concurrent.locks.AbstractQueuedSynchronizer.doAcquireSharedNanos(AbstractQueuedSynchronizer.java:1037)
        at java.util.concurrent.locks.AbstractQueuedSynchronizer.tryAcquireSharedNanos(AbstractQueuedSynchronizer.java:1328)
        at java.util.concurrent.CountDownLatch.await(CountDownLatch.java:277)
        at org.apache.curator.CuratorZookeeperClient.internalBlockUntilConnectedOrTimedOut(CuratorZookeeperClient.java:323)
        at org.apache.curator.RetryLoop.callWithRetry(RetryLoop.java:105)
        at org.apache.curator.framework.imps.GetDataBuilderImpl.pathInForeground(GetDataBuilderImpl.java:288)
        at org.apache.curator.framework.imps.GetDataBuilderImpl.forPath(GetDataBuilderImpl.java:279)
        at org.apache.curator.framework.imps.GetDataBuilderImpl.forPath(GetDataBuilderImpl.java:41)
        at org.apache.curator.framework.recipes.shared.SharedValue.readValue(SharedValue.java:244)
        at org.apache.curator.framework.recipes.shared.SharedValue.access$100(SharedValue.java:44)
        at org.apache.curator.framework.recipes.shared.SharedValue$1.process(SharedValue.java:61)
        at org.apache.curator.framework.imps.NamespaceWatcher.process(NamespaceWatcher.java:67)
        at org.apache.zookeeper.ClientCnxn$EventThread.processEvent(ClientCnxn.java:530)
        at org.apache.zookeeper.ClientCnxn$EventThread.run(ClientCnxn.java:505)
	at __randomizedtesting.SeedInfo.seed([2F42D06909ABDBC]:0)




Build Log:
[...truncated 12654 lines...]
   [junit4] Suite: org.apache.solr.cloud.TestSolrCloudWithSecureImpersonation
   [junit4]   2> Creating dataDir: /home/jenkins/workspace/Lucene-Solr-7.0-Linux/solr/build/solr-core/test/J0/temp/solr.cloud.TestSolrCloudWithSecureImpersonation_2F42D06909ABDBC-001/init-core-data-001
   [junit4]   2> 2405037 WARN  (SUITE-TestSolrCloudWithSecureImpersonation-seed#[2F42D06909ABDBC]-worker) [    ] o.a.s.SolrTestCaseJ4 startTrackingSearchers: numOpens=71 numCloses=71
   [junit4]   2> 2405037 INFO  (SUITE-TestSolrCloudWithSecureImpersonation-seed#[2F42D06909ABDBC]-worker) [    ] o.a.s.SolrTestCaseJ4 Using PointFields (NUMERIC_POINTS_SYSPROP=true) w/NUMERIC_DOCVALUES_SYSPROP=true
   [junit4]   2> 2405038 INFO  (SUITE-TestSolrCloudWithSecureImpersonation-seed#[2F42D06909ABDBC]-worker) [    ] o.a.s.SolrTestCaseJ4 Randomized ssl (true) and clientAuth (false) via: @org.apache.solr.util.RandomizeSSL(reason=, value=NaN, ssl=NaN, clientAuth=NaN)
   [junit4]   2> 2405137 INFO  (SUITE-TestSolrCloudWithSecureImpersonation-seed#[2F42D06909ABDBC]-worker) [    ] o.a.s.c.MiniSolrCloudCluster Starting cluster of 2 servers in /home/jenkins/workspace/Lucene-Solr-7.0-Linux/solr/build/solr-core/test/J0/temp/solr.cloud.TestSolrCloudWithSecureImpersonation_2F42D06909ABDBC-001/tempDir-001
   [junit4]   2> 2405137 INFO  (SUITE-TestSolrCloudWithSecureImpersonation-seed#[2F42D06909ABDBC]-worker) [    ] o.a.s.c.ZkTestServer STARTING ZK TEST SERVER
   [junit4]   2> 2405137 INFO  (Thread-2483) [    ] o.a.s.c.ZkTestServer client port:0.0.0.0/0.0.0.0:0
   [junit4]   2> 2405137 INFO  (Thread-2483) [    ] o.a.s.c.ZkTestServer Starting server
   [junit4]   2> 2405141 ERROR (Thread-2483) [    ] o.a.z.s.ZooKeeperServer ZKShutdownHandler is not registered, so ZooKeeper server won't take any action on ERROR or SHUTDOWN server state changes
   [junit4]   2> 2405237 INFO  (SUITE-TestSolrCloudWithSecureImpersonation-seed#[2F42D06909ABDBC]-worker) [    ] o.a.s.c.ZkTestServer start zk server on port:39113
   [junit4]   2> 2405243 INFO  (jetty-launcher-1445-thread-1) [    ] o.e.j.s.Server jetty-9.3.14.v20161028
   [junit4]   2> 2405254 INFO  (jetty-launcher-1445-thread-2) [    ] o.e.j.s.Server jetty-9.3.14.v20161028
   [junit4]   2> 2405261 INFO  (jetty-launcher-1445-thread-1) [    ] o.e.j.s.h.ContextHandler Started o.e.j.s.ServletContextHandler@7b246002{/solr,null,AVAILABLE}
   [junit4]   2> 2405261 INFO  (jetty-launcher-1445-thread-2) [    ] o.e.j.s.h.ContextHandler Started o.e.j.s.ServletContextHandler@101859f8{/solr,null,AVAILABLE}
   [junit4]   2> 2405262 INFO  (jetty-launcher-1445-thread-2) [    ] o.e.j.s.AbstractConnector Started ServerConnector@700cd07a{SSL,[ssl, http/1.1]}{127.0.0.1:40833}
   [junit4]   2> 2405262 INFO  (jetty-launcher-1445-thread-2) [    ] o.e.j.s.Server Started @2407261ms
   [junit4]   2> 2405262 INFO  (jetty-launcher-1445-thread-2) [    ] o.a.s.c.s.e.JettySolrRunner Jetty properties: {hostContext=/solr, hostPort=40833}
   [junit4]   2> 2405262 ERROR (jetty-launcher-1445-thread-2) [    ] o.a.s.s.StartupLoggingUtils Missing Java Option solr.log.dir. Logging may be missing or incomplete.
   [junit4]   2> 2405262 INFO  (jetty-launcher-1445-thread-2) [    ] o.a.s.s.SolrDispatchFilter  ___      _       Welcome to Apache Solr™ version 7.0.0
   [junit4]   2> 2405262 INFO  (jetty-launcher-1445-thread-2) [    ] o.a.s.s.SolrDispatchFilter / __| ___| |_ _   Starting in cloud mode on port null
   [junit4]   2> 2405262 INFO  (jetty-launcher-1445-thread-2) [    ] o.a.s.s.SolrDispatchFilter \__ \/ _ \ | '_|  Install dir: null, Default config dir: null
   [junit4]   2> 2405262 INFO  (jetty-launcher-1445-thread-2) [    ] o.a.s.s.SolrDispatchFilter |___/\___/_|_|    Start time: 2017-08-10T19:17:20.408Z
   [junit4]   2> 2405270 INFO  (jetty-launcher-1445-thread-1) [    ] o.e.j.s.AbstractConnector Started ServerConnector@7222561{SSL,[ssl, http/1.1]}{127.0.0.1:46295}
   [junit4]   2> 2405270 INFO  (jetty-launcher-1445-thread-1) [    ] o.e.j.s.Server Started @2407269ms
   [junit4]   2> 2405270 INFO  (jetty-launcher-1445-thread-1) [    ] o.a.s.c.s.e.JettySolrRunner Jetty properties: {hostContext=/solr, hostPort=46295}
   [junit4]   2> 2405270 ERROR (jetty-launcher-1445-thread-1) [    ] o.a.s.s.StartupLoggingUtils Missing Java Option solr.log.dir. Logging may be missing or incomplete.
   [junit4]   2> 2405270 INFO  (jetty-launcher-1445-thread-1) [    ] o.a.s.s.SolrDispatchFilter  ___      _       Welcome to Apache Solr™ version 7.0.0
   [junit4]   2> 2405270 INFO  (jetty-launcher-1445-thread-1) [    ] o.a.s.s.SolrDispatchFilter / __| ___| |_ _   Starting in cloud mode on port null
   [junit4]   2> 2405270 INFO  (jetty-launcher-1445-thread-1) [    ] o.a.s.s.SolrDispatchFilter \__ \/ _ \ | '_|  Install dir: null, Default config dir: null
   [junit4]   2> 2405270 INFO  (jetty-launcher-1445-thread-1) [    ] o.a.s.s.SolrDispatchFilter |___/\___/_|_|    Start time: 2017-08-10T19:17:20.416Z
   [junit4]   2> 2405287 INFO  (jetty-launcher-1445-thread-1) [    ] o.a.s.s.SolrDispatchFilter solr.xml found in ZooKeeper. Loading...
   [junit4]   2> 2405292 INFO  (jetty-launcher-1445-thread-2) [    ] o.a.s.s.SolrDispatchFilter solr.xml found in ZooKeeper. Loading...
   [junit4]   2> 2405298 INFO  (jetty-launcher-1445-thread-1) [    ] o.a.s.c.ZkContainer Zookeeper client=127.0.0.1:39113/solr
   [junit4]   2> 2405306 INFO  (jetty-launcher-1445-thread-2) [    ] o.a.s.c.ZkContainer Zookeeper client=127.0.0.1:39113/solr
   [junit4]   2> 2405359 INFO  (jetty-launcher-1445-thread-2) [n:127.0.0.1:40833_solr    ] o.a.s.c.Overseer Overseer (id=null) closing
   [junit4]   2> 2405359 INFO  (jetty-launcher-1445-thread-2) [n:127.0.0.1:40833_solr    ] o.a.s.c.OverseerElectionContext I am going to be the leader 127.0.0.1:40833_solr
   [junit4]   2> 2405360 INFO  (jetty-launcher-1445-thread-2) [n:127.0.0.1:40833_solr    ] o.a.s.c.Overseer Overseer (id=98460804073652230-127.0.0.1:40833_solr-n_0000000000) starting
   [junit4]   2> 2405369 INFO  (jetty-launcher-1445-thread-1) [n:127.0.0.1:46295_solr    ] o.a.s.c.Overseer Overseer (id=null) closing
   [junit4]   2> 2405369 INFO  (jetty-launcher-1445-thread-1) [n:127.0.0.1:46295_solr    ] o.a.s.c.ZkController Register node as live in ZooKeeper:/live_nodes/127.0.0.1:46295_solr
   [junit4]   2> 2405376 INFO  (jetty-launcher-1445-thread-2) [n:127.0.0.1:40833_solr    ] o.a.s.c.ZkController Register node as live in ZooKeeper:/live_nodes/127.0.0.1:40833_solr
   [junit4]   2> 2405391 INFO  (zkCallback-1457-thread-1-processing-n:127.0.0.1:40833_solr) [n:127.0.0.1:40833_solr    ] o.a.s.c.c.ZkStateReader Updated live nodes from ZooKeeper... (0) -> (2)
   [junit4]   2> 2405398 INFO  (zkCallback-1456-thread-1-processing-n:127.0.0.1:46295_solr) [n:127.0.0.1:46295_solr    ] o.a.s.c.c.ZkStateReader Updated live nodes from ZooKeeper... (0) -> (2)
   [junit4]   2> 2405419 INFO  (jetty-launcher-1445-thread-2) [n:127.0.0.1:40833_solr    ] o.a.s.c.CoreContainer Initializing authentication plugin: org.apache.solr.security.HttpParamDelegationTokenPlugin
   [junit4]   2> 2405423 WARN  (jetty-launcher-1445-thread-2) [n:127.0.0.1:40833_solr    ] o.a.s.c.s.i.Krb5HttpClientBuilder org.apache.solr.client.solrj.impl.Krb5HttpClientBuilder is configured without specifying system property 'java.security.auth.login.config'
   [junit4]   2> 2405427 INFO  (jetty-launcher-1445-thread-2) [n:127.0.0.1:40833_solr    ] o.a.s.s.KerberosPlugin Params: {solr.kerberos.impersonator.user.noGroups.hosts=*, solr.kerberos.impersonator.user.bogusGroup.groups=__some_bogus_group, token.valid=30, cookie.domain=127.0.0.1, solr.kerberos.impersonator.user.anyHostAnyUser.groups=*, solr.kerberos.impersonator.user.bogusGroup.hosts=*, solr.kerberos.impersonator.user.anyHostAnyUser.hosts=*, token.validity=36000, solr.kerberos.impersonator.user.noHosts.groups=*, type=kerberos, solr.kerberos.impersonator.user.localHostAnyGroup.groups=*, delegation-token.token-kind=solr-dt, solr.kerberos.impersonator.user.wrongHost.hosts=1.1.1.1.1.1, cookie.path=/, zk-dt-secret-manager.znodeWorkingPath=solr/security/zkdtsm, solr.kerberos.impersonator.user.localHostAnyGroup.hosts=localhost.localdomain,localhost,127.0.0.1, signer.secret.provider.zookeeper.path=/token, solr.kerberos.impersonator.user.anyHostUsersGroup.groups=jenkins, zk-dt-secret-manager.enable=true, solr.kerberos.impersonator.user.wrongHost.groups=*, kerberos.name.rules=DEFAULT, signer.secret.provider=zookeeper, solr.kerberos.impersonator.user.anyHostUsersGroup.hosts=*}
   [junit4]   2> 2405476 INFO  (jetty-launcher-1445-thread-1) [n:127.0.0.1:46295_solr    ] o.a.s.c.CoreContainer Initializing authentication plugin: org.apache.solr.security.HttpParamDelegationTokenPlugin
   [junit4]   2> 2405476 WARN  (jetty-launcher-1445-thread-1) [n:127.0.0.1:46295_solr    ] o.a.s.c.s.i.Krb5HttpClientBuilder org.apache.solr.client.solrj.impl.Krb5HttpClientBuilder is configured without specifying system property 'java.security.auth.login.config'
   [junit4]   2> 2405476 INFO  (jetty-launcher-1445-thread-1) [n:127.0.0.1:46295_solr    ] o.a.s.s.KerberosPlugin Params: {solr.kerberos.impersonator.user.noGroups.hosts=*, solr.kerberos.impersonator.user.bogusGroup.groups=__some_bogus_group, token.valid=30, cookie.domain=127.0.0.1, solr.kerberos.impersonator.user.anyHostAnyUser.groups=*, solr.kerberos.impersonator.user.bogusGroup.hosts=*, solr.kerberos.impersonator.user.anyHostAnyUser.hosts=*, token.validity=36000, solr.kerberos.impersonator.user.noHosts.groups=*, type=kerberos, solr.kerberos.impersonator.user.localHostAnyGroup.groups=*, delegation-token.token-kind=solr-dt, solr.kerberos.impersonator.user.wrongHost.hosts=1.1.1.1.1.1, cookie.path=/, zk-dt-secret-manager.znodeWorkingPath=solr/security/zkdtsm, solr.kerberos.impersonator.user.localHostAnyGroup.hosts=localhost.localdomain,localhost,127.0.0.1, signer.secret.provider.zookeeper.path=/token, solr.kerberos.impersonator.user.anyHostUsersGroup.groups=jenkins, zk-dt-secret-manager.enable=true, solr.kerberos.impersonator.user.wrongHost.groups=*, kerberos.name.rules=DEFAULT, signer.secret.provider=zookeeper, solr.kerberos.impersonator.user.anyHostUsersGroup.hosts=*}
   [junit4]   2> 2405491 INFO  (jetty-launcher-1445-thread-1) [n:127.0.0.1:46295_solr    ] o.a.c.f.i.CuratorFrameworkImpl Starting
   [junit4]   2> 2405491 INFO  (jetty-launcher-1445-thread-2) [n:127.0.0.1:40833_solr    ] o.a.c.f.i.CuratorFrameworkImpl Starting
   [junit4]   2> 2405505 INFO  (jetty-launcher-1445-thread-1-EventThread) [n:127.0.0.1:46295_solr    ] o.a.c.f.s.ConnectionStateManager State change: CONNECTED
   [junit4]   2> 2405505 INFO  (jetty-launcher-1445-thread-2-EventThread) [n:127.0.0.1:40833_solr    ] o.a.c.f.s.ConnectionStateManager State change: CONNECTED
   [junit4]   2> 2405605 WARN  (jetty-launcher-1445-thread-2) [n:127.0.0.1:40833_solr    ] o.a.s.c.s.i.Krb5HttpClientBuilder org.apache.solr.client.solrj.impl.Krb5HttpClientBuilder is configured without specifying system property 'java.security.auth.login.config'
   [junit4]   2> 2405605 WARN  (jetty-launcher-1445-thread-1) [n:127.0.0.1:46295_solr    ] o.a.s.c.s.i.Krb5HttpClientBuilder org.apache.solr.client.solrj.impl.Krb5HttpClientBuilder is configured without specifying system property 'java.security.auth.login.config'
   [junit4]   2> 2405634 INFO  (jetty-launcher-1445-thread-2) [n:127.0.0.1:40833_solr    ] o.a.s.m.r.SolrJmxReporter JMX monitoring for 'solr_40833.solr.node' (registry 'solr.node') enabled at server: com.sun.jmx.mbeanserver.JmxMBeanServer@5f0a2837
   [junit4]   2> 2405635 INFO  (jetty-launcher-1445-thread-1) [n:127.0.0.1:46295_solr    ] o.a.s.m.r.SolrJmxReporter JMX monitoring for 'solr_46295.solr.node' (registry 'solr.node') enabled at server: com.sun.jmx.mbeanserver.JmxMBeanServer@5f0a2837
   [junit4]   2> 2405637 INFO  (jetty-launcher-1445-thread-2) [n:127.0.0.1:40833_solr    ] o.a.s.m.r.SolrJmxReporter JMX monitoring for 'solr_40833.solr.jvm' (registry 'solr.jvm') enabled at server: com.sun.jmx.mbeanserver.JmxMBeanServer@5f0a2837
   [junit4]   2> 2405637 INFO  (jetty-launcher-1445-thread-2) [n:127.0.0.1:40833_solr    ] o.a.s.m.r.SolrJmxReporter JMX monitoring for 'solr_40833.solr.jetty' (registry 'solr.jetty') enabled at server: com.sun.jmx.mbeanserver.JmxMBeanServer@5f0a2837
   [junit4]   2> 2405638 INFO  (jetty-launcher-1445-thread-1) [n:127.0.0.1:46295_solr    ] o.a.s.m.r.SolrJmxReporter JMX monitoring for 'solr_46295.solr.jvm' (registry 'solr.jvm') enabled at server: com.sun.jmx.mbeanserver.JmxMBeanServer@5f0a2837
   [junit4]   2> 2405638 INFO  (jetty-launcher-1445-thread-2) [n:127.0.0.1:40833_solr    ] o.a.s.c.CorePropertiesLocator Found 0 core definitions underneath /home/jenkins/workspace/Lucene-Solr-7.0-Linux/solr/build/solr-core/test/J0/temp/solr.cloud.TestSolrCloudWithSecureImpersonation_2F42D06909ABDBC-001/tempDir-001/node2/.
   [junit4]   2> 2405638 INFO  (jetty-launcher-1445-thread-1) [n:127.0.0.1:46295_solr    ] o.a.s.m.r.SolrJmxReporter JMX monitoring for 'solr_46295.solr.jetty' (registry 'solr.jetty') enabled at server: com.sun.jmx.mbeanserver.JmxMBeanServer@5f0a2837
   [junit4]   2> 2405638 INFO  (jetty-launcher-1445-thread-1) [n:127.0.0.1:46295_solr    ] o.a.s.c.CorePropertiesLocator Found 0 core definitions underneath /home/jenkins/workspace/Lucene-Solr-7.0-Linux/solr/build/solr-core/test/J0/temp/solr.cloud.TestSolrCloudWithSecureImpersonation_2F42D06909ABDBC-001/tempDir-001/node1/.
   [junit4]   2> 2405669 INFO  (TEST-TestSolrCloudWithSecureImpersonation.testProxyValidateGroup-seed#[2F42D06909ABDBC]) [    ] o.a.s.SolrTestCaseJ4 ###Starting testProxyValidateGroup
   [junit4]   2> 2405714 INFO  (qtp1435758087-15387) [n:127.0.0.1:40833_solr    ] o.a.s.h.a.CollectionsHandler Invoked Collection Action :list with params doAs=jenkins&action=LIST&wt=javabin&version=2 and sendToOCPQueue=true
   [junit4]   2> 2405714 INFO  (qtp1435758087-15387) [n:127.0.0.1:40833_solr    ] o.a.s.s.HttpSolrCall [admin] webapp=null path=/admin/collections params={doAs=jenkins&action=LIST&wt=javabin&version=2} status=0 QTime=0
   [junit4]   2> 2405723 WARN  (TEST-TestSolrCloudWithSecureImpersonation.testProxyValidateGroup-seed#[2F42D06909ABDBC]) [    ] o.a.h.c.p.ResponseProcessCookies Invalid cookie header: "Set-Cookie: hadoop.auth="u=anyHostUsersGroup&p=anyHostUsersGroup&t=test&e=1502428640843&s=VQuKU6lr4Nv5XFHUiI5WtotMNFo="; Path=/; Domain=127.0.0.1; Expires= , 11-   -2017 05:17:20 GMT; Secure; HttpOnly". Invalid 'expires' attribute: , 11- -2017 05:17:20 GMT
   [junit4]   2> 2405723 INFO  (TEST-TestSolrCloudWithSecureImpersonation.testProxyValidateGroup-seed#[2F42D06909ABDBC]) [    ] o.a.s.SolrTestCaseJ4 ###Ending testProxyValidateGroup
   [junit4]   2> 2405737 INFO  (TEST-TestSolrCloudWithSecureImpersonation.testProxyNullProxyUser-seed#[2F42D06909ABDBC]) [    ] o.a.s.SolrTestCaseJ4 ###Starting testProxyNullProxyUser
   [junit4]   2> 2405738 INFO  (qtp1435758087-15389) [    ] o.a.s.s.SolrDispatchFilter Error authenticating
   [junit4]   2> java.lang.IllegalArgumentException: userName is NULL, empty or contains a '&'
   [junit4]   2> 	at org.apache.hadoop.security.authentication.util.AuthToken.checkForIllegalArgument(AuthToken.java:87)
   [junit4]   2> 	at org.apache.hadoop.security.authentication.util.AuthToken.<init>(AuthToken.java:70)
   [junit4]   2> 	at org.apache.hadoop.security.authentication.server.AuthenticationToken.<init>(AuthenticationToken.java:58)
   [junit4]   2> 	at org.apache.solr.security.HttpParamDelegationTokenPlugin$HttpParamDelegationTokenAuthenticationHandler$HttpParamAuthenticationHandler.authenticate(HttpParamDelegationTokenPlugin.java:213)
   [junit4]   2> 	at org.apache.hadoop.security.token.delegation.web.DelegationTokenAuthenticationHandler.authenticate(DelegationTokenAuthenticationHandler.java:348)
   [junit4]   2> 	at org.apache.solr.security.RequestContinuesRecorderAuthenticationHandler.authenticate(RequestContinuesRecorderAuthenticationHandler.java:69)
   [junit4]   2> 	at org.apache.hadoop.security.authentication.server.AuthenticationFilter.doFilter(AuthenticationFilter.java:519)
   [junit4]   2> 	at org.apache.solr.security.DelegationTokenKerberosFilter.doFilter(DelegationTokenKerberosFilter.java:134)
   [junit4]   2> 	at org.apache.solr.security.HttpParamDelegationTokenPlugin$HttpParamToRequestFilter.doFilter(HttpParamDelegationTokenPlugin.java:245)
   [junit4]   2> 	at org.apache.solr.security.KerberosPlugin.doAuthenticate(KerberosPlugin.java:243)
   [junit4]   2> 	at org.apache.solr.servlet.SolrDispatchFilter.authenticateRequest(SolrDispatchFilter.java:447)
   [junit4]   2> 	at org.apache.solr.servlet.SolrDispatchFilter.doFilter(SolrDispatchFilter.java:343)
   [junit4]   2> 	at org.apache.solr.servlet.SolrDispatchFilter.doFilter(SolrDispatchFilter.java:322)
   [junit4]   2> 	at org.eclipse.jetty.servlet.ServletHandler$CachedChain.doFilter(ServletHandler.java:1699)
   [junit4]   2> 	at org.apache.solr.client.solrj.embedded.JettySolrRunner$DebugFilter.doFilter(JettySolrRunner.java:139)
   [junit4]   2> 	at org.eclipse.jetty.servlet.ServletHandler$CachedChain.doFilter(ServletHandler.java:1699)
   [junit4]   2> 	at org.eclipse.jetty.servlet.ServletHandler.doHandle(ServletHandler.java:582)
   [junit4]   2> 	at org.eclipse.jetty.server.session.SessionHandler.doHandle(SessionHandler.java:224)
   [junit4]   2> 	at org.eclipse.jetty.server.handler.ContextHandler.doHandle(ContextHandler.java:1180)
   [junit4]   2> 	at org.eclipse.jetty.servlet.ServletHandler.doScope(ServletHandler.java:512)
   [junit4]   2> 	at org.eclipse.jetty.server.session.SessionHandler.doScope(SessionHandler.java:185)
   [junit4]   2> 	at org.eclipse.jetty.server.handler.ContextHandler.doScope(ContextHandler.java:1112)
   [junit4]   2> 	at org.eclipse.jetty.server.handler.ScopedHandler.handle(ScopedHandler.java:141)
   [junit4]   2> 	at org.eclipse.jetty.server.handler.gzip.GzipHandler.handle(GzipHandler.java:462)
   [junit4]   2> 	at org.eclipse.jetty.server.handler.HandlerWrapper.handle(HandlerWrapper.java:134)
   [junit4]   2> 	at org.eclipse.jetty.server.Server.handle(Server.java:534)
   [junit4]   2> 	at org.eclipse.jetty.server.HttpChannel.handle(HttpChannel.java:320)
   [junit4]   2> 	at org.eclipse.jetty.server.HttpConnection.onFillable(HttpConnection.java:251)
   [junit4]   2> 	at org.eclipse.jetty.io.AbstractConnection$ReadCallback.succeeded(AbstractConnection.java:273)
   [junit4]   2> 	at org.eclipse.jetty.io.FillInterest.fillable(FillInterest.java:95)
   [junit4]   2> 	at org.eclipse.jetty.io.ssl.SslConnection.onFillable(SslConnection.java:202)
   [junit4]   2> 	at org.eclipse.jetty.io.AbstractConnection$ReadCallback.succeeded(AbstractConnection.java:273)
   [junit4]   2> 	at org.eclipse.jetty.io.FillInterest.fillable(FillInterest.java:95)
   [junit4]   2> 	at org.eclipse.jetty.io.SelectChannelEndPoint$2.run(SelectChannelEndPoint.java:93)
   [junit4]   2> 	at org.eclipse.jetty.util.thread.strategy.ExecuteProduceConsume.executeProduceConsume(ExecuteProduceConsume.java:303)
   [junit4]   2> 	at org.eclipse.jetty.util.thread.strategy.ExecuteProduceConsume.produceConsume(ExecuteProduceConsume.java:148)
   [junit4]   2> 	at org.eclipse.jetty.util.thread.strategy.ExecuteProduceConsume.run(ExecuteProduceConsume.java:136)
   [junit4]   2> 	at org.eclipse.jetty.util.thread.QueuedThreadPool.runJob(QueuedThreadPool.java:671)
   [junit4]   2> 	at org.eclipse.jetty.util.thread.QueuedThreadPool$2.run(QueuedThreadPool.java:589)
   [junit4]   2> 	at java.lang.Thread.run(Thread.java:748)
   [junit4]   2> 2405738 WARN  (qtp1435758087-15389) [    ] o.e.j.s.ServletHandler /solr/admin/collections
   [junit4]   2> org.apache.solr.common.SolrException: Error during request authentication, 
   [junit4]   2> 	at org.apache.solr.servlet.SolrDispatchFilter.authenticateRequest(SolrDispatchFilter.java:453)
   [junit4]   2> 	at org.apache.solr.servlet.SolrDispatchFilter.doFilter(SolrDispatchFilter.java:343)
   [junit4]   2> 	at org.apache.solr.servlet.SolrDispatchFilter.doFilter(SolrDispatchFilter.java:322)
   [junit4]   2> 	at org.eclipse.jetty.servlet.ServletHandler$CachedChain.doFilter(ServletHandler.java:1699)
   [junit4]   2> 	at org.apache.solr.client.solrj.embedded.JettySolrRunner$DebugFilter.doFilter(JettySolrRunner.java:139)
   [junit4]   2> 	at org.eclipse.jetty.servlet.ServletHandler$CachedChain.doFilter(ServletHandler.java:1699)
   [junit4]   2> 	at org.eclipse.jetty.servlet.ServletHandler.doHandle(ServletHandler.java:582)
   [junit4]   2> 	at org.eclipse.jetty.server.session.SessionHandler.doHandle(SessionHandler.java:224)
   [junit4]   2> 	at org.eclipse.jetty.server.handler.ContextHandler.doHandle(ContextHandler.java:1180)
   [junit4]   2> 	at org.eclipse.jetty.servlet.ServletHandler.doScope(ServletHandler.java:512)
   [junit4]   2> 	at org.eclipse.jetty.server.session.SessionHandler.doScope(SessionHandler.java:185)
   [junit4]   2> 	at org.eclipse.jetty.server.handler.ContextHandler.doScope(ContextHandler.java:1112)
   [junit4]   2> 	at org.eclipse.jetty.server.handler.ScopedHandler.handle(ScopedHandler.java:141)
   [junit4]   2> 	at org.eclipse.jetty.server.handler.gzip.GzipHandler.handle(GzipHandler.java:462)
   [junit4]   2> 	at org.eclipse.jetty.server.handler.HandlerWrapper.handle(HandlerWrapper.java:134)
   [junit4]   2> 	at org.eclipse.jetty.server.Server.handle(Server.java:534)
   [junit4]   2> 	at org.eclipse.jetty.server.HttpChannel.handle(HttpChannel.java:320)
   [junit4]   2> 	at org.eclipse.jetty.server.HttpConnection.onFillable(HttpConnection.java:251)
   [junit4]   2> 	at org.eclipse.jetty.io.AbstractConnection$ReadCallback.succeeded(AbstractConnection.java:273)
   [junit4]   2> 	at org.eclipse.jetty.io.FillInterest.fillable(FillInterest.java:95)
   [junit4]   2> 	at org.eclipse.jetty.io.ssl.SslConnection.onFillable(SslConnection.java:202)
   [junit4]   2> 	at org.eclipse.jetty.io.AbstractConnection$ReadCallback.succeeded(AbstractConnection.java:273)
   [junit4]   2> 	at org.eclipse.jetty.io.FillInterest.fillable(FillInterest.java:95)
   [junit4]   2> 	at org.eclipse.jetty.io.SelectChannelEndPoint$2.run(SelectChannelEndPoint.java:93)
   [junit4]   2> 	at org.eclipse.jetty.util.thread.strategy.ExecuteProduceConsume.executeProduceConsume(ExecuteProduceConsume.java:303)
   [junit4]   2> 	at org.eclipse.jetty.util.thread.strategy.ExecuteProduceConsume.produceConsume(ExecuteProduceConsume.java:148)
   [junit4]   2> 	at org.eclipse.jetty.util.thread.strategy.ExecuteProduceConsume.run(ExecuteProduceConsume.java:136)
   [junit4]   2> 	at org.eclipse.jetty.util.thread.QueuedThreadPool.runJob(QueuedThreadPool.java:671)
   [junit4]   2> 	at org.eclipse.jetty.util.thread.QueuedThreadPool$2.run(QueuedThreadPool.java:589)
   [junit4]   2> 	at java.lang.Thread.run(Thread.java:748)
   [junit4]   2> Caused by: java.lang.IllegalArgumentException: userName is NULL, empty or contains a '&'
   [junit4]   2> 	at org.apache.hadoop.security.authentication.util.AuthToken.checkForIllegalArgument(AuthToken.java:87)
   [junit4]   2> 	at org.apache.hadoop.security.authentication.util.AuthToken.<init>(AuthToken.java:70)
   [junit4]   2> 	at org.apache.hadoop.security.authentication.server.AuthenticationToken.<init>(AuthenticationToken.java:58)
   [junit4]   2> 	at org.apache.solr.security.HttpParamDelegationTokenPlugin$HttpParamDelegationTokenAuthenticationHandler$HttpParamAuthenticationHandler.authenticate(HttpParamDelegationTokenPlugin.java:213)
   [junit4]   2> 	at org.apache.hadoop.security.token.delegation.web.DelegationTokenAuthenticationHandler.authenticate(DelegationTokenAuthenticationHandler.java:348)
   [junit4]   2> 	at org.apache.solr.security.RequestContinuesRecorderAuthenticationHandler.authenticate(RequestContinuesRecorderAuthenticationHandler.java:69)
   [junit4]   2> 	at org.apache.hadoop.security.authentication.server.AuthenticationFilter.doFilter(AuthenticationFilter.java:519)
   [junit4]   2> 	at org.apache.solr.security.DelegationTokenKerberosFilter.doFilter(DelegationTokenKerberosFilter.java:134)
   [junit4]   2> 	at org.apache.solr.security.HttpParamDelegationTokenPlugin$HttpParamToRequestFilter.doFilter(HttpParamDelegationTokenPlugin.java:245)
   [junit4]   2> 	at org.apache.solr.security.KerberosPlugin.doAuthenticate(KerberosPlugin.java:243)
   [junit4]   2> 	at org.apache.solr.servlet.SolrDispatchFilter.authenticateRequest(SolrDispatchFilter.java:447)
   [junit4]   2> 	... 29 more
   [junit4]   2> 2405739 INFO  (TEST-TestSolrCloudWithSecureImpersonation.testProxyNullProxyUser-seed#[2F42D06909ABDBC]) [    ] o.a.s.SolrTestCaseJ4 ###Ending testProxyNullProxyUser
   [junit4]   2> 2405747 INFO  (TEST-TestSolrCloudWithSecureImpersonation.testProxyNoConfigHosts-seed#[2F42D06909ABDBC]) [    ] o.a.s.SolrTestCaseJ4 ###Starting testProxyNoConfigHosts
   [junit4]   2> 2405767 WARN  (TEST-TestSolrCloudWithSecureImpersonation.testProxyNoConfigHosts-seed#[2F42D06909ABDBC]) [    ] o.a.h.c.p.ResponseProcessCookies Invalid cookie header: "Set-Cookie: hadoop.auth="u=noHosts&p=noHosts&t=test&e=1502428640895&s=wXGPj2ksXleFjICZdKPD8V6Ff6k="; Path=/; Domain=127.0.0.1; Expires= , 11-   -2017 05:17:20 GMT; Secure; HttpOnly". Invalid 'expires' attribute: , 11- -2017 05:17:20 GMT
   [junit4]   2> 2405767 INFO  (TEST-TestSolrCloudWithSecureImpersonation.testProxyNoConfigHosts-seed#[2F42D06909ABDBC]) [    ] o.a.s.SolrTestCaseJ4 ###Ending testProxyNoConfigHosts
   [junit4]   2> 2405774 INFO  (TEST-TestSolrCloudWithSecureImpersonation.testProxyValidateAnyHostAnyUser-seed#[2F42D06909ABDBC]) [    ] o.a.s.SolrTestCaseJ4 ###Starting testProxyValidateAnyHostAnyUser
   [junit4]   2> 2405775 INFO  (qtp1435758087-15379) [n:127.0.0.1:40833_solr    ] o.a.s.h.a.CollectionsHandler Invoked Collection Action :list with params doAs=bar&action=LIST&wt=javabin&version=2 and sendToOCPQueue=true
   [junit4]   2> 2405775 INFO  (qtp1435758087-15379) [n:127.0.0.1:40833_solr    ] o.a.s.s.HttpSolrCall [admin] webapp=null path=/admin/collections params={doAs=bar&action=LIST&wt=javabin&version=2} status=0 QTime=0
   [junit4]   2> 2405776 WARN  (TEST-TestSolrCloudWithSecureImpersonation.testProxyValidateAnyHostAnyUser-seed#[2F42D06909ABDBC]) [    ] o.a.h.c.p.ResponseProcessCookies Invalid cookie header: "Set-Cookie: hadoop.auth="u=anyHostAnyUser&p=anyHostAnyUser&t=test&e=1502428640921&s=RLrmcJ8UEeRxyulXPQrX6/p351g="; Path=/; Domain=127.0.0.1; Expires= , 11-   -2017 05:17:20 GMT; Secure; HttpOnly". Invalid 'expires' attribute: , 11- -2017 05:17:20 GMT
   [junit4]   2> 2405776 INFO  (TEST-TestSolrCloudWithSecureImpersonation.testProxyValidateAnyHostAnyUser-seed#[2F42D06909ABDBC]) [    ] o.a.s.SolrTestCaseJ4 ###Ending testProxyValidateAnyHostAnyUser
   [junit4]   2> 2405785 INFO  (TEST-TestSolrCloudWithSecureImpersonation.testProxyInvalidProxyUser-seed#[2F42D06909ABDBC]) [    ] o.a.s.SolrTestCaseJ4 ###Starting testProxyInvalidProxyUser
   [junit4]   2> 2405789 WARN  (TEST-TestSolrCloudWithSecureImpersonation.testProxyInvalidProxyUser-seed#[2F42D06909ABDBC]) [    ] o.a.h.c.p.ResponseProcessCookies Invalid cookie header: "Set-Cookie: hadoop.auth="u=bar&p=bar&t=test&e=1502428640931&s=EWlx/ZNUOoG7VHIWWGdieNRecU0="; Path=/; Domain=127.0.0.1; Expires= , 11-   -2017 05:17:20 GMT; Secure; HttpOnly". Invalid 'expires' attribute: , 11- -2017 05:17:20 GMT
   [junit4]   2> 2405790 INFO  (TEST-TestSolrCloudWithSecureImpersonation.testProxyInvalidProxyUser-seed#[2F42D06909ABDBC]) [    ] o.a.s.SolrTestCaseJ4 ###Ending testProxyInvalidProxyUser
   [junit4]   2> 2405801 INFO  (TEST-TestSolrCloudWithSecureImpersonation.testProxyNoConfigGroups-seed#[2F42D06909ABDBC]) [    ] o.a.s.SolrTestCaseJ4 ###Starting testProxyNoConfigGroups
   [junit4]   2> 2405804 WARN  (TEST-TestSolrCloudWithSecureImpersonation.testProxyNoConfigGroups-seed#[2F42D06909ABDBC]) [    ] o.a.h.c.p.ResponseProcessCookies Invalid cookie header: "Set-Cookie: hadoop.auth="u=noGroups&p=noGroups&t=test&e=1502428640948&s=cBQ+j8+qqWZSMa9S4NyXBhiWuko="; Path=/; Domain=127.0.0.1; Expires= , 11-   -2017 05:17:20 GMT; Secure; HttpOnly". Invalid 'expires' attribute: , 11- -2017 05:17:20 GMT
   [junit4]   2> 2405804 INFO  (TEST-TestSolrCloudWithSecureImpersonation.testProxyNoConfigGroups-seed#[2F42D06909ABDBC]) [    ] o.a.s.SolrTestCaseJ4 ###Ending testProxyNoConfigGroups
   [junit4]   2> 2405816 INFO  (TEST-TestSolrCloudWithSecureImpersonation.testProxyValidateHost-seed#[2F42D06909ABDBC]) [    ] o.a.s.SolrTestCaseJ4 ###Starting testProxyValidateHost
   [junit4]   2> 2405817 INFO  (qtp1435758087-15377) [n:127.0.0.1:40833_solr    ] o.a.s.h.a.CollectionsHandler Invoked Collection Action :list with params doAs=bar&action=LIST&wt=javabin&version=2 and sendToOCPQueue=true
   [junit4]   2> 2405817 INFO  (qtp1435758087-15377) [n:127.0.0.1:40833_solr    ] o.a.s.s.HttpSolrCall [admin] webapp=null path=/admin/collections params={doAs=bar&action=LIST&wt=javabin&version=2} status=0 QTime=0
   [junit4]   2> 2405817 WARN  (TEST-TestSolrCloudWithSecureImpersonation.testProxyValidateHost-seed#[2F42D06909ABDBC]) [    ] o.a.h.c.p.ResponseProcessCookies Invalid cookie header: "Set-Cookie: hadoop.auth="u=localHostAnyGroup&p=localHostAnyGroup&t=test&e=1502428640962&s=6ifZNdvdvEpqMHXvcuomrSACGbw="; Path=/; Domain=127.0.0.1; Expires= , 11-   -2017 05:17:20 GMT; Secure; HttpOnly". Invalid 'expires' attribute: , 11- -2017 05:17:20 GMT
   [junit4]   2> 2405818 INFO  (TEST-TestSolrCloudWithSecureImpersonation.testProxyValidateHost-seed#[2F42D06909ABDBC]) [    ] o.a.s.SolrTestCaseJ4 ###Ending testProxyValidateHost
   [junit4]   2> 2405830 INFO  (TEST-TestSolrCloudWithSecureImpersonation.testProxyInvalidGroup-seed#[2F42D06909ABDBC]) [    ] o.a.s.SolrTestCaseJ4 ###Starting testProxyInvalidGroup
   [junit4]   2> 2405835 WARN  (qtp1435758087-15379) [n:127.0.0.1:40833_solr    ] o.a.h.s.ShellBasedUnixGroupsMapping got exception trying to get groups for user bar: id: ‘bar’: no such user
   [junit4]   2> 
   [junit4]   2> 2405836 WARN  (qtp1435758087-15379) [n:127.0.0.1:40833_solr    ] o.a.h.s.UserGroupInformation No groups available for user bar
   [junit4]   2> 2405838 WARN  (TEST-TestSolrCloudWithSecureImpersonation.testProxyInvalidGroup-seed#[2F42D06909ABDBC]) [    ] o.a.h.c.p.ResponseProcessCookies Invalid cookie header: "Set-Cookie: hadoop.auth="u=bogusGroup&p=bogusGroup&t=test&e=1502428640976&s=hsta/Mla1PlsL8YLpUqQaEQfAms="; Path=/; Domain=127.0.0.1; Expires= , 11-   -2017 05:17:20 GMT; Secure; HttpOnly". Invalid 'expires' attribute: , 11- -2017 05:17:20 GMT
   [junit4]   2> 2405838 INFO  (TEST-TestSolrCloudWithSecureImpersonation.testProxyInvalidGroup-seed#[2F42D06909ABDBC]) [    ] o.a.s.SolrTestCaseJ4 ###Ending testProxyInvalidGroup
   [junit4]   2> 2405853 INFO  (TEST-TestSolrCloudWithSecureImpersonation.testProxyWrongHost-seed#[2F42D06909ABDBC]) [    ] o.a.s.SolrTestCaseJ4 ###Starting testProxyWrongHost
   [junit4]   2> 2405868 WARN  (TEST-TestSolrCloudWithSecureImpersonation.testProxyWrongHost-seed#[2F42D06909ABDBC]) [    ] o.a.h.c.p.ResponseProcessCookies Invalid cookie header: "Set-Cookie: hadoop.auth="u=wrongHost&p=wrongHost&t=test&e=1502428641000&s=W4Q9ZnabByRkmyaMsbUNMFTr8M0="; Path=/; Domain=127.0.0.1; Expires= , 11-   -2017 05:17:21 GMT; Secure; HttpOnly". Invalid 'expires' attribute: , 11- -2017 05:17:21 GMT
   [junit4]   2> 2405868 INFO  (TEST-TestSolrCloudWithSecureImpersonation.testProxyWrongHost-seed#[2F42D06909ABDBC]) [    ] o.a.s.SolrTestCaseJ4 ###Ending testProxyWrongHost
   [junit4]   2> 2405901 INFO  (TEST-TestSolrCloudWithSecureImpersonation.testProxyInvalidRemote-seed#[2F42D06909ABDBC]) [    ] o.a.s.SolrTestCaseJ4 ###Starting testProxyInvalidRemote
   [junit4]   2> 2405907 WARN  (TEST-TestSolrCloudWithSecureImpersonation.testProxyInvalidRemote-seed#[2F42D06909ABDBC]) [    ] o.a.h.c.p.ResponseProcessCookies Invalid cookie header: "Set-Cookie: hadoop.auth="u=localHostAnyGroup&p=localHostAnyGroup&t=test&e=1502428641047&s=clcr32oA9aHN5nJLgBSRIGK2CLE="; Path=/; Domain=127.0.0.1; Expires= , 11-   -2017 05:17:21 GMT; Secure; HttpOnly". Invalid 'expires' attribute: , 11- -2017 05:17:21 GMT
   [junit4]   2> 2405907 INFO  (TEST-TestSolrCloudWithSecureImpersonation.testProxyInvalidRemote-seed#[2F42D06909ABDBC]) [    ] o.a.s.SolrTestCaseJ4 ###Ending testProxyInvalidRemote
   [junit4]   2> 2405920 INFO  (TEST-TestSolrCloudWithSecureImpersonation.testForwarding-seed#[2F42D06909ABDBC]) [    ] o.a.s.SolrTestCaseJ4 ###Starting testForwarding
   [junit4]   2> 2406108 INFO  (TEST-TestSolrCloudWithSecureImpersonation.testForwarding-seed#[2F42D06909ABDBC]) [    ] o.a.s.c.c.ZkStateReader Updated live nodes from ZooKeeper... (0) -> (2)
   [junit4]   2> 2406108 INFO  (TEST-TestSolrCloudWithSecureImpersonation.testForwarding-seed#[2F42D06909ABDBC]) [    ] o.a.s.c.s.i.ZkClientClusterStateProvider Cluster at 127.0.0.1:39113/solr ready
   [junit4]   2> 2406111 INFO  (qtp1435758087-15381) [n:127.0.0.1:40833_solr    ] o.a.s.h.a.CollectionsHandler Invoked Collection Action :create with params pullReplicas=0&replicationFactor=1&collection.configName=conf1&maxShardsPerNode=1&name=forwardingCollection&nrtReplicas=1&action=CREATE&numShards=1&tlogReplicas=0&wt=javabin&version=2 and sendToOCPQueue=true
   [junit4]   2> 2406118 INFO  (OverseerThreadFactory-5019-thread-1-processing-n:127.0.0.1:40833_solr) [n:127.0.0.1:40833_solr    ] o.a.s.c.CreateCollectionCmd Create collection forwardingCollection
   [junit4]   2> 2406222 INFO  (OverseerStateUpdate-98460804073652230-127.0.0.1:40833_solr-n_0000000000) [n:127.0.0.1:40833_solr    ] o.a.s.c.o.SliceMutator createReplica() {
   [junit4]   2>   "operation":"ADDREPLICA",
   [junit4]   2>   "collection":"forwardingCollection",
   [junit4]   2>   "shard":"shard1",
   [junit4]   2>   "core":"forwardingCollection_shard1_replica_n1",
   [junit4]   2>   "state":"down",
   [junit4]   2>   "base_url":"https://127.0.0.1:46295/solr",
   [junit4]   2>   "type":"NRT"} 
   [junit4]   2> 2406442 INFO  (qtp1647544006-15386) [n:127.0.0.1:46295_solr    ] o.a.s.h.a.CoreAdminOperation core create command qt=/admin/cores&coreNodeName=core_node1&collection.configName=conf1&newCollection=true&name=forwardingCollection_shard1_replica_n1&action=CREATE&numShards=1&collection=forwardingCollection&shard=shard1&wt=javabin&version=2&replicaType=NRT
   [junit4]   2> 2406443 INFO  (qtp1647544006-15386) [n:127.0.0.1:46295_solr    ] o.a.s.c.TransientSolrCoreCacheDefault Allocating transient cache for 2147483647 transient cores
   [junit4]   2> 2406545 INFO  (zkCallback-1456-thread-1-processing-n:127.0.0.1:46295_solr) [n:127.0.0.1:46295_solr    ] o.a.s.c.c.ZkStateReader A cluster state change: [WatchedEvent state:SyncConnected type:NodeDataChanged path:/collections/forwardingCollection/state.json] for collection [forwardingCollection] has occurred - updating... (live nodes size: [2])
   [junit4]   2> 2406545 INFO  (zkCallback-1456-thread-2-processing-n:127.0.0.1:46295_solr) [n:127.0.0.1:46295_solr    ] o.a.s.c.c.ZkStateReader A cluster state change: [WatchedEvent state:SyncConnected type:NodeDataChanged path:/collections/forwardingCollection/state.json] for collection [forwardingCollection] has occurred - updating... (live nodes size: [2])
   [junit4]   2> 2407455 INFO  (qtp1647544006-15386) [n:127.0.0.1:46295_solr c:forwardingCollection s:shard1 r:core_node1 x:forwardingCollection_shard1_replica_n1] o.a.s.c.SolrConfig Using Lucene MatchVersion: 7.0.0
   [junit4]   2> 2407470 INFO  (qtp1647544006-15386) [n:127.0.0.1:46295_solr c:forwardingCollection s:shard1 r:core_node1 x:forwardingCollection_shard1_replica_n1] o.a.s.s.IndexSchema [forwardingCollection_shard1_replica_n1] Schema name=test
   [junit4]   2> 2407557 INFO  (qtp1647544006-15386) [n:127.0.0.1:46295_solr c:forwardingCollection s:shard1 r:core_node1 x:forwardingCollection_shard1_replica_n1] o.a.s.s.IndexSchema Loaded schema test/1.0 with uniqueid field id
   [junit4]   2> 2407565 INFO  (qtp1647544006-15386) [n:127.0.0.1:46295_solr c:forwardingCollection s:shard1 r:core_node1 x:forwardingCollection_shard1_replica_n1] o.a.s.c.CoreContainer Creating SolrCore 'forwardingCollection_shard1_replica_n1' using configuration from collection forwardingCollection, trusted=true
   [junit4]   2> 2407566 INFO  (qtp1647544006-15386) [n:127.0.0.1:46295_solr c:forwardingCollection s:shard1 r:core_node1 x:forwardingCollection_shard1_replica_n1] o.a.s.m.r.SolrJmxReporter JMX monitoring for 'solr_46295.solr.core.forwardingCollection.shard1.replica_n1' (registry 'solr.core.forwardingCollection.shard1.replica_n1') enabled at server: com.sun.jmx.mbeanserver.JmxMBeanServer@5f0a2837
   [junit4]   2> 2407566 INFO  (qtp1647544006-15386) [n:127.0.0.1:46295_solr c:forwardingCollection s:shard1 r:core_node1 x:forwardingCollection_shard1_replica_n1] o.a.s.c.SolrCore solr.RecoveryStrategy.Builder
   [junit4]   2> 2407566 INFO  (qtp1647544006-15386) [n:127.0.0.1:46295_solr c:forwardingCollection s:shard1 r:core_node1 x:forwardingCollection_shard1_replica_n1] o.a.s.c.SolrCore [[forwardingCollection_shard1_replica_n1] ] Opening new SolrCore at [/home/jenkins/workspace/Lucene-Solr-7.0-Linux/solr/build/solr-core/test/J0/temp/solr.cloud.TestSolrCloudWithSecureImpersonation_2F42D06909ABDBC-001/tempDir-001/node1/forwardingCollection_shard1_replica_n1], dataDir=[/home/jenkins/workspace/Lucene-Solr-7.0-Linux/solr/build/solr-core/test/J0/temp/solr.cloud.TestSolrCloudWithSecureImpersonation_2F42D06909ABDBC-001/tempDir-001/node1/./forwardingCollection_shard1_replica_n1/data/]
   [junit4]   2> 2407568 INFO  (qtp1647544006-15386) [n:127.0.0.1:46295_solr c:forwardingCollection s:shard1 r:core_node1 x:forwardingCollection_shard1_replica_n1] o.a.s.u.RandomMergePolicy RandomMergePolicy wrapping class org.apache.lucene.index.TieredMergePolicy: [TieredMergePolicy: maxMergeAtOnce=44, maxMergeAtOnceExplicit=27, maxMergedSegmentMB=0.9609375, floorSegmentMB=1.0712890625, forceMergeDeletesPctAllowed=1.6169579633553666, segmentsPerTier=15.0, maxCFSSegmentSizeMB=8.796093022207999E12, noCFSRatio=0.7195073844797157
   [junit4]   2> 2407605 INFO  (qtp1647544006-15386) [n:127.0.0.1:46295_solr c:forwardingCollection s:shard1 r:core_node1 x:forwardingCollection_shard1_replica_n1] o.a.s.u.UpdateHandler Using UpdateLog implementation: org.apache.solr.update.UpdateLog
   [junit4]   2> 2407605 INFO  (qtp1647544006-15386) [n:127.0.0.1:46295_solr c:forwardingCollection s:shard1 r:core_node1 x:forwardingCollection_shard1_replica_n1] o.a.s.u.UpdateLog Initializing UpdateLog: dataDir= defaultSyncLevel=FLUSH numRecordsToKeep=100 maxNumLogsToKeep=10 numVersionBuckets=65536
   [junit4]   2> 2407606 INFO  (qtp1647544006-15386) [n:127.0.0.1:46295_solr c:forwardingCollection s:shard1 r:core_node1 x:forwardingCollection_shard1_replica_n1] o.a.s.u.CommitTracker Hard AutoCommit: disabled
   [junit4]   2> 2407606 INFO  (qtp1647544006-15386) [n:127.0.0.1:46295_solr c:forwardingCollection s:shard1 r:core_node1 x:forwardingCollection_shard1_replica_n1] o.a.s.u.CommitTracker Soft AutoCommit: disabled
   [junit4]   2> 2407606 INFO  (qtp1647544006-15386) [n:127.0.0.1:46295_solr c:forwardingCollection s:shard1 r:core_node1 x:forwardingCollection_shard1_replica_n1] o.a.s.u.RandomMergePolicy RandomMergePolicy wrapping class org.apache.lucene.index.TieredMergePolicy: [TieredMergePolicy: maxMergeAtOnce=19, maxMergeAtOnceExplicit=34, maxMergedSegmentMB=81.44140625, floorSegmentMB=2.1884765625, forceMergeDeletesPctAllowed=6.000743291653192, segmentsPerTier=14.0, maxCFSSegmentSizeMB=8.796093022207999E12, noCFSRatio=0.15116834547506902
   [junit4]   2> 2407607 INFO  (qtp1647544006-15386) [n:127.0.0.1:46295_solr c:forwardingCollection s:shard1 r:core_node1 x:forwardingCollection_shard1_replica_n1] o.a.s.s.SolrIndexSearcher Opening [Searcher@5175f3df[forwardingCollection_shard1_replica_n1] main]
   [junit4]   2> 2407608 INFO  (qtp1647544006-15386) [n:127.0.0.1:46295_solr c:forwardingCollection s:shard1 r:core_node1 x:forwardingCollection_shard1_replica_n1] o.a.s.h.c.SpellCheckComponent Initializing spell checkers
   [junit4]   2> 2407626 INFO  (qtp1647544006-15386) [n:127.0.0.1:46295_solr c:forwardingCollection s:shard1 r:core_node1 x:forwardingCollection_shard1_replica_n1] o.a.s.s.DirectSolrSpellChecker init: {name=direct,classname=DirectSolrSpellChecker,field=lowerfilt,minQueryLength=3}
   [junit4]   2> 2407683 INFO  (qtp1647544006-15386) [n:127.0.0.1:46295_solr c:forwardingCollection s:shard1 r:core_node1 x:forwardingCollection_shard1_replica_n1] o.a.s.h.ReplicationHandler Commits will be reserved for  10000
   [junit4]   2> 2407683 INFO  (qtp1647544006-15386) [n:127.0.0.1:46295_solr c:forwardingCollection s:shard1 r:core_node1 x:forwardingCollection_shard1_replica_n1] o.a.s.u.UpdateLog Could not find max version in index or recent updates, using new clock 1575372867847061504
   [junit4]   2> 2407684 INFO  (searcherExecutor-5024-thread-1-processing-n:127.0.0.1:46295_solr x:forwardingCollection_shard1_replica_n1 s:shard1 c:forwardingCollection r:core_node1) [n:127.0.0.1:46295_solr c:forwardingCollection s:shard1 r:core_node1 x:forwardingCollection_shard1_replica_n1] o.a.s.h.c.SpellCheckComponent Loading spell index for spellchecker: default
   [junit4]   2> 2407685 INFO  (searcherExecutor-5024-thread-1-processing-n:127.0.0.1:46295_solr x:forwardingCollection_shard1_replica_n1 s:shard1 c:forwardingCollection r:core_node1) [n:127.0.0.1:46295_solr c:forwardingCollection s:shard1 r:core_node1 x:forwardingCollection_shard1_replica_n1] o.a.s.h.c.SpellCheckComponent Loading spell index for spellchecker: direct
   [junit4]   2> 2407685 INFO  (searcherExecutor-5024-thread-1-processing-n:127.0.0.1:46295_solr x:forwardingCollection_shard1_replica_n1 s:shard1 c:forwardingCollection r:core_node1) [n:127.0.0.1:46295_solr c:forwardingCollection s:shard1 r:core_node1 x:forwardingCollection_shard1_replica_n1] o.a.s.h.c.SpellCheckComponent Loading spell index for spellchecker: wordbreak
   [junit4]   2> 2407685 INFO  (searcherExecutor-5024-thread-1-processing-n:127.0.0.1:46295_solr x:forwardingCollection_shard1_replica_n1 s:shard1 c:forwardingCollection r:core_node1) [n:127.0.0.1:46295_solr c:forwardingCollection s:shard1 r:core_node1 x:forwardingCollection_shard1_replica_n1] o.a.s.h.c.SpellCheckComponent Loading spell index for spellchecker: multipleFields
   [junit4]   2> 2407685 INFO  (searcherExecutor-5024-thread-1-processing-n:127.0.0.1:46295_solr x:forwardingCollection_shard1_replica_n1 s:shard1 c:forwardingCollection r:core_node1) [n:127.0.0.1:46295_solr c:forwardingCollection s:shard1 r:core_node1 x:forwardingCollection_shard1_replica_n1] o.a.s.h.c.SpellCheckComponent Loading spell index for spellchecker: jarowinkler
   [junit4]   2> 2407685 INFO  (searcherExecutor-5024-thread-1-processing-n:127.0.0.1:46295_solr x:forwardingCollection_shard1_replica_n1 s:shard1 c:forwardingCollection r:core_node1) [n:127.0.0.1:46295_solr c:forwardingCollection s:shard1 r:core_node1 x:forwardingCollection_shard1_replica_n1] o.a.s.h.c.SpellCheckComponent Loading spell index for spellchecker: external
   [junit4]   2> 2407686 INFO  (searcherExecutor-5024-thread-1-processing-n:127.0.0.1:46295_solr x:forwardingCollection_shard1_replica_n1 s:shard1 c:forwardingCollection r:core_node1) [n:127.0.0.1:46295_solr c:forwardingCollection s:shard1 r:core_node1 x:forwardingCollection_shard1_replica_n1] o.a.s.h.c.SpellCheckComponent Loading spell index for spellchecker: freq
   [junit4]   2> 2407686 INFO  (searcherExecutor-5024-thread-1-processing-n:127.0.0.1:46295_solr x:forwardingCollection_shard1_replica_n1 s:shard1 c:forwardingCollection r:core_node1) [n:127.0.0.1:46295_solr c:forwardingCollection s:shard1 r:core_node1 x:forwardingCollection_shard1_replica_n1] o.a.s.h.c.SpellCheckComponent Loading spell index for spellchecker: fqcn
   [junit4]   2> 2407686 INFO  (searcherExecutor-5024-thread-1-processing-n:127.0.0.1:46295_solr x:forwardingCollection_shard1_replica_n1 s:shard1 c:forwardingCollection r:core_node1) [n:127.0.0.1:46295_solr c:forwardingCollection s:shard1 r:core_node1 x:forwardingCollection_shard1_replica_n1] o.a.s.h.c.SpellCheckComponent Loading spell index for spellchecker: perDict
   [junit4]   2> 2407687 INFO  (searcherExecutor-5024-thread-1-processing-n:127.0.0.1:46295_solr x:forwardingCollection_shard1_replica_n1 s:shard1 c:forwardingCollection r:core_node1) [n:127.0.0.1:46295_solr c:forwardingCollection s:shard1 r:core_node1 x:forwardingCollection_shard1_replica_n1] o.a.s.c.SolrCore [forwardingCollection_shard1_replica_n1] Registered new searcher Searcher@5175f3df[forwardingCollection_shard1_replica_n1] main{ExitableDirectoryReader(UninvertingDirectoryReader())}
   [junit4]   2> 2407717 INFO  (qtp1647544006-15386) [n:127.0.0.1:46295_solr c:forwardingCollection s:shard1 r:core_node1 x:forwardingCollection_shard1_replica_n1] o.a.s.c.ShardLeaderElectionContext Enough replicas found to continue.
   [junit4]   2> 2407717 INFO  (qtp1647544006-15386) [n:127.0.0.1:46295_solr c:forwardingCollection s:shard1 r:core_node1 x:forwardingCollection_shard1_replica_n1] o.a.s.c.ShardLeaderElectionContext I may be the new leader - try and sync
   [junit4]   2> 2407718 INFO  (qtp1647544006-15386) [n:127.0.0.1:46295_solr c:forwardingCollection s:shard1 r:core_node1 x:forwardingCollection_shard1_replica_n1] o.a.s.c.SyncStrategy Sync replicas to https://127.0.0.1:46295/solr/forwardingCollection_shard1_replica_n1/
   [junit4]   2> 2407718 INFO  (qtp1647544006-15386) [n:127.0.0.1:46295_solr c:forwardingCollection s:shard1 r:core_node1 x:forwardingCollection_shard1_replica_n1] o.a.s.c.SyncStrategy Sync Success - now sync replicas to me
   [junit4]   2> 2407718 INFO  (qtp1647544006-15386) [n:127.0.0.1:46295_solr c:forwardingCollection s:shard1 r:core_node1 x:forwardingCollection_shard1_replica_n1] o.a.s.c.SyncStrategy https://127.0.0.1:46295/solr/forwardingCollection_shard1_replica_n1/ has no replicas
   [junit4]   2> 2407718 INFO  (qtp1647544006-15386) [n:127.0.0.1:46295_solr c:forwardingCollection s:shard1 r:core_node1 x:forwardingCollection_shard1_replica_n1] o.a.s.c.ShardLeaderElectionContext Found all replicas participating in election, clear LIR
   [junit4]   2> 2407720 INFO  (qtp1647544006-15386) [n:127.0.0.1:46295_solr c:forwardingCollection s:shard1 r:core_node1 x:forwardingCollection_shard1_replica_n1] o.a.s.c.ShardLeaderElectionContext I am the new leader: https://127.0.0.1:46295/solr/forwardingCollection_shard1_replica_n1/ shard1
   [junit4]   2> 2407822 INFO  (zkCallback-1456-thread-1-processing-n:127.0.0.1:46295_solr) [n:127.0.0.1:46295_solr    ] o.a.s.c.c.ZkStateReader A cluster state change: [WatchedEvent state:SyncConnected type:NodeDataChanged path:/collections/forwardingCollection/state.json] for collection [forwardingCollection] has occurred - updating... (live nodes size: [2])
   [junit4]   2> 2407822 INFO  (zkCallback-1456-thread-2-processing-n:127.0.0.1:46295_solr) [n:127.0.0.1:46295_solr    ] o.a.s.c.c.ZkStateReader A cluster state change: [WatchedEvent state:SyncConnected type:NodeDataChanged path:/collections/forwardingCollection/state.json] for collection [forwardingCollection] has occurred - updating... (live nodes size: [2])
   [junit4]   2> 2407872 INFO  (qtp1647544006-15386) [n:127.0.0.1:46295_solr c:forwardingCollection s:shard1 r:core_node1 x:forwardingCollection_shard1_replica_n1] o.a.s.c.ZkController I am the leader, no recovery necessary
   [junit4]   2> 2407874 INFO  (qtp1647544006-15386) [n:127.0.0.1:46295_solr c:forwardingCollection s:shard1 r:core_node1 x:forwardingCollection_shard1_replica_n1] o.a.s.s.HttpSolrCall [admin] webapp=null path=/admin/cores params={qt=/admin/cores&coreNodeName=core_node1&collection.configName=conf1&newCollection=true&name=forwardingCollection_shard1_replica_n1&action=CREATE&numShards=1&collection=forwardingCollection&shard=shard1&wt=javabin&version=2&replicaType=NRT} status=0 QTime=1431
   [junit4]   2> 2407878 WARN  (httpShardExecutor-5017-thread-1-processing-n:127.0.0.1:40833_solr [https:////127.0.0.1:46295//solr] https:////127.0.0.1:46295//solr) [n:127.0.0.1:40833_solr    ] o.a.h.c.p.ResponseProcessCookies Invalid cookie header: "Set-Cookie: hadoop.auth="u=$&p=$&t=test&e=1502428641588&s=ij1y5Itif1RWFHODjDGtVt5tTXw="; Path=/; Domain=127.0.0.1; Expires= , 11-   -2017 05:17:21 GMT; Secure; HttpOnly". Invalid 'expires' attribute: , 11- -2017 05:17:21 GMT
   [junit4]   2> 2407882 INFO  (qtp1435758087-15381) [n:127.0.0.1:40833_solr    ] o.a.s.h.a.CollectionsHandler Wait for new collection to be active for at most 30 seconds. Check all shard replicas
   [junit4]   2> 2407975 INFO  (zkCallback-1456-thread-1-processing-n:127.0.0.1:46295_solr) [n:127.0.0.1:46295_solr    ] o.a.s.c.c.ZkStateReader A cluster state change: [WatchedEvent state:SyncConnected type:NodeDataChanged path:/collections/forwardingCollection/state.json] for collection [forwardingCollection] has occurred - updating... (live nodes size: [2])
   [junit4]   2> 2407975 INFO  (zkCallback-1456-thread-2-processing-n:127.0.0.1:46295_solr) [n:127.0.0.1:46295_solr    ] o.a.s.c.c.ZkStateReader A cluster state change: [WatchedEvent state:SyncConnected type:NodeDataChanged path:/collections/forwardingCollection/state.json] for collection [forwardingCollection] has occurred - updating... (live nodes size: [2])
   [junit4]   2> 2408120 INFO  (OverseerCollectionConfigSetProcessor-98460804073652230-127.0.0.1:40833_solr-n_0000000000) [n:127.0.0.1:40833_solr    ] o.a.s.c.OverseerTaskQueue Response ZK path: /overseer/collection-queue-work/qnr-0000000000 doesn't exist.  Requestor may have disconnected from ZooKeeper
   [junit4]   2> 2408883 INFO  (qtp1435758087-15381) [n:127.0.0.1:40833_solr    ] o.a.s.s.HttpSolrCall [admin] webapp=null path=/admin/collections params={pullReplicas=0&replicationFactor=1&collection.configName=conf1&maxShardsPerNode=1&name=forwardingCollection&nrtReplicas=1&action=CREATE&numShards=1&tlogReplicas=0&wt=javabin&version=2} status=0 QTime=2772
   [junit4]   2> 2408883 WARN  (TEST-TestSolrCloudWithSecureImpersonation.testForwarding-seed#[2F42D06909ABDBC]) [    ] o.a.h.c.p.ResponseProcessCookies Invalid cookie header: "Set-Cookie: hadoop.auth="u=user&p=user&t=test&e=1502428641256&s=x+2G6WgevT5DdJH+TaWXH1+f6DE="; Path=/; Domain=127.0.0.1; Expires= , 11-   -2017 05:17:21 GMT; Secure; HttpOnly". Invalid 'expires' attribute: , 11- -2017 05:17:21 GMT
   [junit4]   2> 2408883 INFO  (TEST-TestSolrCloudWithSecureImpersonation.testForwarding-seed#[2F42D06909ABDBC]) [    ] o.a.s.c.AbstractDistribZkTestBase Wait for recoveries to finish - collection: forwardingCollection failOnTimeout:true timeout (sec):100
   [junit4]   2> 2408883 INFO  (TEST-TestSolrCloudWithSecureImpersonation.testForwarding-seed#[2F42D06909ABDBC]) [    ] o.a.s.c.AbstractDistribZkTestBase Recoveries finished - collection: forwardingCollection
   [junit4]   2> 2408886 INFO  (qtp1435758087-15387) [n:127.0.0.1:40833_solr    ] o.a.s.c.TransientSolrCoreCacheDefault Allocating transient cache for 2147483647 transient cores
   [junit4]   2> 2408889 INFO  (qtp1647544006-15386) [n:127.0.0.1:46295_solr c:forwardingCollection s:shard1 r:core_node1 x:forwardingCollection_shard1_replica_n1] o.a.s.c.S.Request [forwardingCollection_shard1_replica_n1]  webapp=/solr path=/select params={q=*:*&wt=javabin&version=2} hits=0 status=0 QTime=0
   [junit4]   2> 2408890 WARN  (qtp1435758087-15387) [n:127.0.0.1:40833_solr    ] o.a.h.c.p.ResponseProcessCookies Invalid cookie header: "Set-Cookie: hadoop.auth="u=$&p=$&t=test&e=1502428644035&s=vvZpQIOdyfSRtG+LnN8Br63TdXw="; Path=/; Domain=127.0.0.1; Expires= , 11-   -2017 05:17:24 GMT; Secure; HttpOnly". Invalid 'expires' attribute: , 11- -2017 05:17:24 GMT
   [junit4]   2> 2408890 WARN  (TEST-TestSolrCloudWithSecureImpersonation.testForwarding-seed#[2F42D06909ABDBC]) [    ] o.a.h.c.p.ResponseProcessCookies Invalid cookie header: "Set-Cookie: hadoop.auth="u=user&p=user&t=test&e=1502428644032&s=2H5KS/DO8tgC6wrFkdIBZ849DH0="; Path=/; Domain=127.0.0.1; Expires= , 11-   -2017 05:17:24 GMT; Secure; HttpOnly". Invalid 'expires' attribute: , 11- -2017 05:17:24 GMT
   [junit4]   2> 2408890 WARN  (TEST-TestSolrCloudWithSecureImpersonation.testForwarding-seed#[2F42D06909ABDBC]) [    ] o.a.h.c.p.ResponseProcessCookies Invalid cookie header: "Set-Cookie: hadoop.auth="u=$&p=$&t=test&e=1502428644035&s=vvZpQIOdyfSRtG+LnN8Br63TdXw="; Path=/; Domain=127.0.0.1; Expires= , 11-   -2017 05:17:24 GMT; Secure; HttpOnly". Invalid 'expires' attribute: , 11- -2017 05:17:24 GMT
   [junit4]   2> 2408893 INFO  (qtp1647544006-15384) [n:127.0.0.1:46295_solr c:forwardingCollection s:shard1 r:core_node1 x:forwardingCollection_shard1_replica_n1] o.a.s.c.S.Request [forwardingCollection_shard1_replica_n1]  webapp=/solr path=/select params={q=*:*&wt=javabin&version=2} hits=0 status=0 QTime=0
   [junit4]   2> 2408894 WARN  (TEST-TestSolrCloudWithSecureImpersonation.testForwarding-seed#[2F42D06909ABDBC]) [    ] o.a.h.c.p.ResponseProcessCookies Invalid cookie header: "Set-Cookie: hadoop.auth="u=user&p=user&t=test&e=1502428644039&s=Lkuj2k2c/SVJDVM/XUk/77nRFUU="; Path=/; Domain=127.0.0.1; Expires= , 11-   -2017 05:17:24 GMT; Secure; HttpOnly". Invalid 'expires' attribute: , 11- -2017 05:17:24 GMT
   [junit4]   2> 2408894 INFO  (TEST-TestSolrCloudWithSecureImpersonation.testForwarding-seed#[2F42D06909ABDBC]) [    ] o.a.s.SolrTestCaseJ4 ###Ending testForwarding
   [junit4]   2> 2408903 INFO  (TEST-TestSolrCloudWithSecureImpersonation.testProxyUnknownRemote-seed#[2F42D06909ABDBC]) [    ] o.a.s.SolrTestCaseJ4 ###Starting testProxyUnknownRemote
   [junit4]   2> 2419340 WARN  (jetty-launcher-1445-thread-1-SendThread(127.0.0.1:39113)) [n:127.0.0.1:46295_solr    ] o.a.z.ClientCnxn Client session timed out, have not heard from server in 13725ms for sessionid 0x15dcd94631c0007
   [junit4]   2> 2419340 WARN  (jetty-launcher-1445-thread-2-SendThread(127.0.0.1:39113)) [n:127.0.0.1:40833_solr    ] o.a.z.ClientCnxn Client session timed out, have not heard from server in 13725ms for sessionid 0x15dcd94631c0008
   [junit4]   2> 2419341 WARN  (TEST-TestSolrCloudWithSecureImpersonation.testForwarding-seed#[2F42D06909ABDBC]-SendThread(127.0.0.1:39113)) [    ] o.a.z.ClientCnxn Client session timed out, have not heard from server in 10456ms for sessionid 0x15dcd94631c000b
   [junit4]   2> 2419341 WARN  (NIOServerCxn.Factory:0.0.0.0/0.0.0.0:0) [    ] o.a.z.s.NIOServerCnxn caught end of stream exception
   [junit4]   2> EndOfStreamException: Unable to read additional data from client sessionid 0x15dcd94631c0007, likely client has closed socket
   [junit4]   2> 	at org.apache.zookeeper.server.NIOServerCnxn.doIO(NIOServerCnxn.java:239)
   [junit4]   2> 	at org.apache.zookeeper.server.NIOServerCnxnFactory.run(NIOServerCnxnFactory.java:203)
   [junit4]   2> 	at java.lang.Thread.run(Thread.java:748)
   [junit4]   2> 2419341 WARN  (NIOServerCxn.Factory:0.0.0.0/0.0.0.0:0) [    ] o.a.z.s.NIOServerCnxn caught end of stream exception
   [junit4]   2> EndOfStreamException: Unable to read additional data from client sessionid 0x15dcd94631c0008, likely client has closed socket
   [junit4]   2> 	at org.apache.zookeeper.server.NIOServerCnxn.doIO(NIOServerCnxn.java:239)
   [junit4]   2> 	at org.apache.zookeeper.server.NIOServerCnxnFactory.run(NIOServerCnxnFactory.java:203)
   [junit4]   2> 	at java.lang.Thread.run(Thread.java:748)
   [junit4]   2> 2419341 WARN  (NIOServerCxn.Factory:0.0.0.0/0.0.0.0:0) [    ] o.a.z.s.NIOServerCnxn caught end of stream exception
   [junit4]   2> EndOfStreamException: Unable to read additional data from client sessionid 0x15dcd94631c000b, likely client has closed socket
   [junit4]   2> 	at org.apache.zookeeper.server.NIOServerCnxn.doIO(NIOServerCnxn.java:239)
   [junit4]   2> 	at org.apache.zookeeper.server.NIOServerCnxnFactory.run(NIOServerCnxnFactory.java:203)
   [junit4]   2> 	at java.lang.Thread.run(Thread.java:748)
   [junit4]   2> 2419343 WARN  (TEST-TestSolrCloudWithSecureImpersonation.testProxyUnknownRemote-seed#[2F42D06909ABDBC]) [    ] o.a.h.c.p.ResponseProcessCookies Invalid cookie header: "Set-Cookie: hadoop.auth="u=localHostAnyGroup&p=localHostAnyGroup&t=test&e=1502428644049&s=XM/XtVUAPKH4KXhKexsVL/p29Vo="; Path=/; Domain=127.0.0.1; Expires= , 11-   -2017 05:17:24 GMT; Secure; HttpOnly". Invalid 'expires' attribute: , 11- -2017 05:17:24 GMT
   [junit4]   2> 2419343 INFO  (TEST-TestSolrCloudWithSecureImpersonation.testProxyUnknownRemote-seed#[2F42D06909ABDBC]) [    ] o.a.s.SolrTestCaseJ4 ###Ending testProxyUnknownRemote
   [junit4]   2> 2419441 INFO  (jetty-launcher-1445-thread-2-EventThread) [n:127.0.0.1:40833_solr    ] o.a.c.f.s.ConnectionStateManager State change: SUSPENDED
   [junit4]   2> 2419441 INFO  (jetty-launcher-1445-thread-1-EventThread) [n:127.0.0.1:46295_solr    ] o.a.c.f.s.ConnectionStateManager State change: SUSPENDED
   [junit4]   2> 2419445 INFO  (jetty-closer-1446-thread-1) [    ] o.e.j.s.AbstractConnector Stopped ServerConnector@700cd07a{SSL,[ssl, http/1.1]}{127.0.0.1:0}
   [junit4]   2> 2419445 INFO  (jetty-closer-1446-thread-1) [    ] o.a.s.c.CoreContainer Shutting down CoreContainer instance=804995532
   [junit4]   2> 2419445 INFO  (jetty-closer-1446-thread-2) [    ] o.e.j.s.AbstractConnector Stopped ServerConnector@7222561{SSL,[ssl, http/1.1]}{127.0.0.1:0}
   [junit4]   2> 2419445 INFO  (jetty-closer-1446-thread-1) [    ] o.a.s.m.SolrMetricManager Closing metric reporters for registry=solr.node, tag=null
   [junit4]   2> 2419445 INFO  (jetty-closer-1446-thread-2) [    ] o.a.s.c.CoreContainer Shutting down CoreContainer instance=94089071
   [junit4]   2> 2419445 INFO  (jetty-closer-1446-thread-2) [    ] o.a.s.m.SolrMetricManager Closing metric reporters for registry=solr.node, tag=null
   [junit4]   2> 2419447 INFO  (jetty-closer-1446-thread-1) [    ] o.a.s.m.SolrMetricManager Closing metric reporters for registry=solr.jvm, tag=null
   [junit4]   2> 2419447 INFO  (jetty-closer-1446-thread-2) [    ] o.a.s.m.SolrMetricManager Closing metric reporters for registry=solr.jvm, tag=null
   [junit4]   2> 2419448 INFO  (jetty-closer-1446-thread-1) [    ] o.a.s.m.SolrMetricManager Closing metric reporters for registry=solr.jetty, tag=null
   [junit4]   2> 2419448 INFO  (jetty-closer-1446-thread-2) [    ] o.a.s.m.SolrMetricManager Closing metric reporters for registry=solr.jetty, tag=null
   [junit4]   2> 2419449 INFO  (jetty-closer-1446-thread-2) [    ] o.a.s.m.SolrMetricManager Closing metric reporters for registry=solr.cluster, tag=null
   [junit4]   2> 2419449 INFO  (jetty-closer-1446-thread-1) [    ] o.a.s.m.SolrMetricManager Closing metric reporters for registry=solr.cluster, tag=null
   [junit4]   2> 2419450 INFO  (coreCloseExecutor-5029-thread-1) [n:127.0.0.1:46295_solr c:forwardingCollection s:shard1 r:core_node1 x:forwardingCollection_shard1_replica_n1] o.a.s.c.SolrCore [forwardingCollection_shard1_replica_n1]  CLOSING SolrCore org.apache.solr.core.SolrCore@55a840d7
   [junit4]   2> 2419450 INFO  (jetty-closer-1446-thread-1) [    ] o.a.s.c.Overseer Overseer (id=98460804073652230-127.0.0.1:40833_solr-n_0000000000) closing
   [junit4]   2> 2419450 INFO  (OverseerStateUpdate-98460804073652230-127.0.0.1:40833_solr-n_0000000000) [n:127.0.0.1:40833_solr    ] o.a.s.c.Overseer Overseer Loop exiting : 127.0.0.1:40833_solr
   [junit4]   2> 2419450 INFO  (coreCloseExecutor-5029-thread-1) [n:127.0.0.1:46295_solr c:forwardingCollection s:shard1 r:core_node1 x:forwardingCollection_shard1_replica_n1] o.a.s.m.SolrMetricManager Closing metric reporters for registry=solr.core.forwardingCollection.shard1.replica_n1, tag=1437090007
   [junit4]   2> 2419451 INFO  (zkCallback-1456-thread-2-processing-n:127.0.0.1:46295_solr) [n:127.0.0.1:46295_solr    ] o.a.s.c.c.ZkStateReader Updated live nodes from ZooKeeper... (2) -> (1)
   [junit4]   2> 2419451 INFO  (zkCallback-1456-thread-1-processing-n:127.0.0.1:46295_solr) [n:127.0.0.1:46295_solr    ] o.a.s.c.OverseerElectionContext I am going to be the leader 127.0.0.1:46295_solr
   [junit4]   2> 2419451 ERROR (Thread[Thread-2501,5,TGRP-TestSolrCloudWithSecureImpersonation]) [n:127.0.0.1:40833_solr    ] o.a.h.s.t.d.AbstractDelegationTokenSecretManager ExpiredTokenRemover received java.lang.InterruptedException: sleep interrupted
   [junit4]   2> 2419453 INFO  (coreCloseExecutor-5029-thread-1) [n:127.0.0.1:46295_solr c:forwardingCollection s:shard1 r:core_node1 x:forwardingCollection_shard1_replica_n1] o.a.s.m.SolrMetricManager Closing metric reporters for registry=solr.collection.forwardingCollection.shard1.leader, tag=1437090007
   [junit4]   2> 2419454 WARN  (zkCallback-1456-thread-1-processing-n:127.0.0.1:46295_solr) [n:127.0.0.1:46295_solr    ] o.a.s.c.c.ZkStateReader ZooKeeper watch triggered, but Solr cannot talk to ZK: [KeeperErrorCode = Session expired for /live_nodes]
   [junit4]   2> 2419454 ERROR (Thread[Thread-2500,5,TGRP-TestSolrCloudWithSecureImpersonation]) [n:127.0.0.1:46295_solr    ] o.a.h.s.t.d.AbstractDelegationTokenSecretManager ExpiredTokenRemover received java.lang.InterruptedException: sleep interrupted
   [junit4]   2> 2420355 INFO  (jetty-closer-1446-thread-2) [    ] o.e.j.s.h.ContextHandler Stopped o.e.j.s.ServletContextHandler@7b246002{/solr,null,UNAVAILABLE}
   [junit4]   2> 2420390 INFO  (jetty-closer-1446-thread-1) [    ] o.e.j.s.h.ContextHandler Stopped o.e.j.s.ServletContextHandler@101859f8{/solr,null,UNAVAILABLE}
   [junit4]   2> 2420390 ERROR (SUITE-TestSolrCloudWithSecureImpersonation-seed#[2F42D06909ABDBC]-worker) [    ] o.a.z.s.ZooKeeperServer ZKShutdownHandler is not registered, so ZooKeeper server won't take any action on ERROR or SHUTDOWN server state changes
   [junit4]   2> 2420390 INFO  (SUITE-TestSolrCloudWithSecureImpersonation-seed#[2F42D06909ABDBC]-worker) [    ] o.a.s.c.ZkTestServer connecting to 127.0.0.1:39113 39113
   [junit4]   2> 2425745 INFO  (Thread-2483) [    ] o.a.s.c.ZkTestServer connecting to 127.0.0.1:39113 39113
   [junit4]   2> 2425746 WARN  (Thread-2483) [    ] o.a.s.c.ZkTestServer Watch limit violations: 
   [junit4]   2> Maximum concurrent create/delete watches above limit:
   [junit4]   2> 
   [junit4]   2> 	3	/solr/aliases.json
   [junit4]   2> 	2	/solr/security.json
   [junit4]   2> 
   [junit4]   2> Maximum concurrent data watches above limit:
   [junit4]   2> 
   [junit4]   2> 	5	/solr/collections/forwardingCollection/state.json
   [junit4]   2> 	4	/solr/security/zkdtsm/ZKDTSMRoot/ZKDTSMKeyIdRoot
   [junit4]   2> 	3	/solr/clusterstate.json
   [junit4]   2> 	3	/solr/clusterprops.json
   [junit4]   2> 	2	/solr/security/zkdtsm/ZKDTSMRoot/ZKDTSMMasterKeyRoot/DK_1
   [junit4]   2> 	2	/solr/security/zkdtsm/ZKDTSMRoot/ZKDTSMMasterKeyRoot/DK_3
   [junit4]   2> 	2	/solr/security/zkdtsm/ZKDTSMRoot/ZKDTSMMasterKeyRoot/DK_2
   [junit4]   2> 	2	/solr/security/zkdtsm/ZKDTSMRoot/ZKDTSMMasterKeyRoot/DK_4
   [junit4]   2> 	2	/solr/security/zkdtsm/ZKDTSMRoot/ZKDTSMSeqNumRoot
   [junit4]   2> 
   [junit4]   2> Maximum concurrent children watches above limit:
   [junit4]   2> 
   [junit4]   2> 	3	/solr/live_nodes
   [junit4]   2> 	3	/solr/collections
   [junit4]   2> 	2	/solr/security/zkdtsm/ZKDTSMRoot/ZKDTSMMasterKeyRoot
   [junit4]   2> 	2	/solr/security/zkdtsm/ZKDTSMRoot/ZKDTSMTokensRoot
   [junit4]   2> 
   [junit4]   2> 2425760 INFO  (SUITE-TestSolrCloudWithSecureImpersonation-seed#[2F42D06909ABDBC]-worker) [    ] o.a.s.SolrTestCaseJ4 ------------------------------------------------------- Done waiting for tracked resources to be released
   [junit4]   2> Aug 10, 2017 7:17:40 PM com.carrotsearch.randomizedtesting.ThreadLeakControl checkThreadLeaks
   [junit4]   2> WARNING: Will linger awaiting termination of 2 leaked thread(s).
   [junit4]   2> Aug 10, 2017 7:18:00 PM com.carrotsearch.randomizedtesting.ThreadLeakControl checkThreadLeaks
   [junit4]   2> SEVERE: 2 threads leaked from SUITE scope at org.apache.solr.cloud.TestSolrCloudWithSecureImpersonation: 
   [junit4]   2>    1) Thread[id=15422, name=jetty-launcher-1445-thread-2-EventThread, state=TIMED_WAITING, group=TGRP-TestSolrCloudWithSecureImpersonation]
   [junit4]   2>         at sun.misc.Unsafe.park(Native Method)
   [junit4]   2>         at java.util.concurrent.locks.LockSupport.parkNanos(LockSupport.java:215)
   [junit4]   2>         at java.util.concurrent.locks.AbstractQueuedSynchronizer.doAcquireSharedNanos(AbstractQueuedSynchronizer.java:1037)
   [junit4]   2>         at java.util.concurrent.locks.AbstractQueuedSynchronizer.tryAcquireSharedNanos(AbstractQueuedSynchronizer.java:1328)
   [junit4]   2>         at java.util.concurrent.CountDownLatch.await(CountDownLatch.java:277)
   [junit4]   2>         at org.apache.curator.CuratorZookeeperClient.internalBlockUntilConnectedOrTimedOut(CuratorZookeeperClient.java:323)
   [junit4]   2>         at org.apache.curator.RetryLoop.callWithRetry(RetryLoop.java:105)
   [junit4]   2>         at org.apache.curator.framework.imps.GetDataBuilderImpl.pathInForeground(GetDataBuilderImpl.java:288)
   [junit4]   2>         at org.apache.curator.framework.imps.GetDataBuilderImpl.forPath(GetDataBuilderImpl.java:279)
   [junit4]   2>         at org.apache.curator.framework.imps.GetDataBuilderImpl.forPath(GetDataBuilderImpl.java:41)
   [junit4]   2>         at org.apache.curator.framework.recipes.shared.SharedValue.readValue(SharedValue.java:244)
   [junit4]   2>         at org.apache.curator.framework.recipes.shared.SharedValue.access$100(SharedValue.java:44)
   [junit4]   2>         at org.apache.curator.framework.recipes.shared.SharedValue$1.process(SharedValue.java:61)
   [junit4]   2>         at org.apache.curator.framework.imps.NamespaceWatcher.process(NamespaceWatcher.java:67)
   [junit4]   2>         at org.apache.zookeeper.ClientCnxn$EventThread.processEvent(ClientCnxn.java:530)
   [junit4]   2>         at org.apache.zookeeper.ClientCnxn$EventThread.run(ClientCnxn.java:505)
   [junit4]   2>    2) Thread[id=15421, name=jetty-launcher-1445-thread-1-EventThread, state=TIMED_WAITING, group=TGRP-TestSolrCloudWithSecureImpersonation]
   [junit4]   2>         at sun.misc.Unsafe.park(Native Method)
   [junit4]   2>         at java.util.concurrent.locks.LockSupport.parkNanos(LockSupport.java:215)
   [junit4]   2>         at java.util.concurrent.locks.AbstractQueuedSynchronizer.doAcquireSharedNanos(AbstractQueuedSynchronizer.java:1037)
   [junit4]   2>         at java.util.concurrent.locks.AbstractQueuedSynchronizer.tryAcquireSharedNanos(AbstractQueuedSynchronizer.java:1328)
   [junit4]   2>         at java.util.concurrent.CountDownLatch.await(CountDownLatch.java:277)
   [junit4]   2>         at org.apache.curator.CuratorZookeeperClient.internalBlockUntilConnectedOrTimedOut(CuratorZookeeperClient.java:323)
   [junit4]   2>         at org.apache.curator.RetryLoop.callWithRetry(RetryLoop.java:105)
   [junit4]   2>         at org.apache.curator.framework.imps.GetDataBuilderImpl.pathInForeground(GetDataBuilderImpl.java:288)
   [junit4]   2>         at org.apache.curator.framework.imps.GetDataBuilderImpl.forPath(GetDataBuilderImpl.java:279)
   [junit4]   2>         at org.apache.curator.framework.imps.GetDataBuilderImpl.forPath(GetDataBuilderImpl.java:41)
   [junit4]   2>         at org.apache.curator.framework.recipes.shared.SharedValue.readValue(SharedValue.java:244)
   [junit4]   2>         at org.apache.curator.framework.recipes.shared.SharedValue.access$100(SharedValue.java:44)
   [junit4]   2>         at org.apache.curator.framework.recipes.shared.SharedValue$1.process(SharedValue.java:61)
   [junit4]   2>         at org.apache.curator.framework.imps.NamespaceWatcher.process(NamespaceWatcher.java:67)
   [junit4]   2>         at org.apache.zookeeper.ClientCnxn$EventThread.processEvent(ClientCnxn.java:530)
   [junit4]   2>         at org.apache.zookeeper.ClientCnxn$EventThread.run(ClientCnxn.java:505)
   [junit4]   2> Aug 10, 2017 7:18:00 PM com.carrotsearch.randomizedtesting.ThreadLeakControl tryToInterruptAll
   [junit4]   2> INFO: Starting to interrupt leaked threads:
   [junit4]   2>    1) Thread[id=15422, name=jetty-launcher-1445-thread-2-EventThread, state=TIMED_WAITING, group=TGRP-TestSolrCloudWithSecureImpersonation]
   [junit4]   2>    2) Thread[id=15421, name=jetty-launcher-1445-thread-1-EventThread, state=TIMED_WAITING, group=TGRP-TestSolrCloudWithSecureImpersonation]
   [junit4]   2> 2445820 ERROR (jetty-launcher-1445-thread-1-EventThread) [n:127.0.0.1:46295_solr    ] o.a.c.f.i.CuratorFrameworkImpl Watcher exception
   [junit4]   2> java.lang.InterruptedException
   [junit4]   2> 	at java.util.concurrent.locks.AbstractQueuedSynchronizer.doAcquireSharedNanos(AbstractQueuedSynchronizer.java:1039)
   [junit4]   2> 	at java.util.concurrent.locks.AbstractQueuedSynchronizer.tryAcquireSharedNanos(AbstractQueuedSynchronizer.java:1328)
   [junit4]   2> 	at java.util.concurrent.CountDownLatch.await(CountDownLatch.java:277)
   [junit4]   2> 	at org.apache.curator.CuratorZookeeperClient.internalBlockUntilConnectedOrTimedOut(CuratorZookeeperClient.java:323)
   [junit4]   2> 	at org.apache.curator.RetryLoop.callWithRetry(RetryLoop.java:105)
   [junit4]   2> 	at org.apache.curator.framework.imps.GetDataBuilderImpl.pathInForeground(GetDataBuilderImpl.java:288)
   [junit4]   2> 	at org.apache.curator.framework.imps.GetDataBuilderImpl.forPath(GetDataBuilderImpl.java:279)
   [junit4]   2> 	at org.apache.curator.framework.imps.GetDataBuilderImpl.forPath(GetDataBuilderImpl.java:41)
   [junit4]   2> 	at org.apache.curator.framework.recipes.shared.SharedValue.readValue(SharedValue.java:244)
   [junit4]   2> 	at org.apache.curator.framework.recipes.shared.SharedValue.access$100(SharedValue.java:44)
   [junit4]   2> 	at org.apache.curator.framework.recipes.shared.SharedValue$1.process(SharedValue.java:61)
   [junit4]   2> 	at org.apache.curator.framework.imps.NamespaceWatcher.process(NamespaceWatcher.java:67)
   [junit4]   2> 	at org.apache.zookeeper.ClientCnxn$EventThread.processEvent(ClientCnxn.java:530)
   [junit4]   2> 	at org.apache.zookeeper.ClientCnxn$EventThread.run(ClientCnxn.java:505)
   [junit4]   2> 2445820 ERROR (jetty-launcher-1445-thread-2-EventThread) [n:127.0.0.1:40833_solr    ] o.a.c.f.i.CuratorFrameworkImpl Watcher exception
   [junit4]   2> java.lang.InterruptedException
   [junit4]   2> 	at java.util.concurrent.locks.AbstractQueuedSynchronizer.doAcquireSharedNanos(AbstractQueuedSynchronizer.java:1039)
   [junit4]   2> 	at java.util.concurrent.locks.AbstractQueuedSynchronizer.tryAcquireSharedNanos(AbstractQueuedSynchronizer.java:1328)
   [junit4]   2> 	at java.util.concurrent.CountDownLatch.await(CountDownLatch.java:277)
   [junit4]   2> 	at org.apache.curator.CuratorZookeeperClient.internalBlockUntilConnectedOrTimedOut(CuratorZookeeperClient.java:323)
   [junit4]   2> 	at org.apache.curator.RetryLoop.callWithRetry(RetryLoop.java:105)
   [junit4]   2> 	at org.apache.curator.framework.imps.GetDataBuilderImpl.pathInForeground(GetDataBuilderImpl.java:288)
   [junit4]   2> 	at org.apache.curator.framework.imps.GetDataBuilderImpl.forPath(GetDataBuilderImpl.java:279)
   [junit4]   2> 	at org.apache.curator.framework.imps.GetDataBuilderImpl.forPath(GetDataBuilderImpl.java:41)
   [junit4]   2> 	at org.apache.curator.framework.recipes.shared.SharedValue.readValue(SharedValue.java:244)
   [junit4]   2> 	at org.apache.curator.framework.recipes.shared.SharedValue.access$100(SharedValue.java:44)
   [junit4]   2> 	at org.apache.curator.framework.recipes.shared.SharedValue$1.process(SharedValue.java:61)
   [junit4]   2> 	at org.apache.curator.framework.imps.NamespaceWatcher.process(NamespaceWatcher.java:67)
   [junit4]   2> 	at org.apache.zookeeper.ClientCnxn$EventThread.processEvent(ClientCnxn.java:530)
   [junit4]   2> 	at org.apache.zookeeper.ClientCnxn$EventThread.run(ClientCnxn.java:505)
   [junit4]   2> Aug 10, 2017 7:18:00 PM com.carrotsearch.randomizedtesting.ThreadLeakControl tryToInterruptAll
   [junit4]   2> INFO: All leaked threads terminated.
   [junit4]   2> NOTE: test params are: codec=Asserting(Lucene70), sim=RandomSimilarity(queryNorm=false): {}, locale=he-IL, timezone=Asia/Dushanbe
   [junit4]   2> NOTE: Linux 4.10.0-27-generic amd64/Oracle Corporation 1.8.0_144 (64-bit)/cpus=8,threads=1,free=318525656,total=536870912
   [junit4]   2> NOTE: All tests run in this JVM: [TestFastOutputStream, TestSolr4Spatial, SSLMigrationTest, TestAuthenticationFramework, SolrIndexSplitterTest, CollectionTooManyReplicasTest, TestRealTimeGet, TestInPlaceUpdatesDistrib, IgnoreCommitOptimizeUpdateProcessorFactoryTest, HighlighterConfigTest, AssignTest, TestMaxScoreQueryParser, AddBlockUpdateTest, TestAnalyzeInfixSuggestions, SolrIndexConfigTest, BitVectorTest, LeaderFailureAfterFreshStartTest, TestTolerantUpdateProcessorRandomCloud, DistributedSpellCheckComponentTest, AtomicUpdatesTest, SolrCLIZkUtilsTest, UUIDFieldTest, DistributedQueryElevationComponentTest, LeaderElectionIntegrationTest, SharedFSAutoReplicaFailoverTest, TestOmitPositions, ResponseHeaderTest, DistributedSuggestComponentTest, ConfigureRecoveryStrategyTest, BlockJoinFacetDistribTest, TestPrepRecovery, TestLocalFSCloudBackupRestore, MoveReplicaHDFSUlogDirTest, TestClusterStateMutator, TestSolrConfigHandler, SortSpecParsingTest, SolrMetricReporterTest, TestSolrQueryParser, TestConfigSetProperties, OverseerCollectionConfigSetProcessorTest, ZkNodePropsTest, TestLazyCores, LargeFieldTest, DeleteShardTest, TestConfigsApi, TestOrdValues, TestSolrDeletionPolicy1, DefaultValueUpdateProcessorTest, HdfsUnloadDistributedZkTest, WordBreakSolrSpellCheckerTest, TestManagedSynonymFilterFactory, TestSmileRequest, TestScoreJoinQPNoScore, TestIBSimilarityFactory, TestFieldCacheReopen, SolrRequestParserTest, TestPHPSerializedResponseWriter, TestIndexingPerformance, DeleteLastCustomShardedReplicaTest, HttpPartitionTest, TestSolrFieldCacheBean, TestMaxTokenLenTokenizer, BinaryUpdateRequestHandlerTest, TestRangeQuery, HdfsBasicDistributedZk2Test, TestJoin, SolrCoreTest, TestFreeTextSuggestions, TestComponentsName, TestLMDirichletSimilarityFactory, MBeansHandlerTest, ImplicitSnitchTest, UpdateParamsTest, TestInfoStreamLogging, IndexBasedSpellCheckerTest, DocumentAnalysisRequestHandlerTest, BasicZkTest, SpellingQueryConverterTest, TestLegacyFieldReuse, ChaosMonkeySafeLeaderWithPullReplicasTest, SuggestComponentContextFilterQueryTest, BasicDistributedZkTest, MigrateRouteKeyTest, ReplicationFactorTest, TestUnifiedSolrHighlighter, TestExtendedDismaxParser, ConcurrentDeleteAndCreateCollectionTest, StatsReloadRaceTest, TestSolrQueryResponse, CdcrRequestHandlerTest, TestDocSet, TestGeoJSONResponseWriter, V2StandaloneTest, TestDocumentBuilder, TestSolrCLIRunExample, FieldMutatingUpdateProcessorTest, TestBlobHandler, SolrCloudReportersTest, GraphQueryTest, TestCryptoKeys, NodeMutatorTest, TestAuthorizationFramework, TestEmbeddedSolrServerConstructors, TestCSVLoader, TestReplicationHandlerBackup, TolerantUpdateProcessorTest, DateRangeFieldTest, BasicAuthIntegrationTest, EchoParamsTest, TestConfig, TestReplicationHandler, CdcrBootstrapTest, TestSolrCloudWithSecureImpersonation]
   [junit4]   2> NOTE: reproduce with: ant test  -Dtestcase=TestSolrCloudWithSecureImpersonation -Dtests.seed=2F42D06909ABDBC -Dtests.multiplier=3 -Dtests.slow=true -Dtests.locale=he-IL -Dtests.timezone=Asia/Dushanbe -Dtests.asserts=true -Dtests.file.encoding=UTF-8
   [junit4] ERROR   0.00s J0 | TestSolrCloudWithSecureImpersonation (suite) <<<
   [junit4]    > Throwable #1: com.carrotsearch.randomizedtesting.ThreadLeakError: 2 threads leaked from SUITE scope at org.apache.solr.cloud.TestSolrCloudWithSecureImpersonation: 
   [junit4]    >    1) Thread[id=15422, name=jetty-launcher-1445-thread-2-EventThread, state=TIMED_WAITING, group=TGRP-TestSolrCloudWithSecureImpersonation]
   [junit4]    >         at sun.misc.Unsafe.park(Native Method)
   [junit4]    >         at java.util.concurrent.locks.LockSupport.parkNanos(LockSupport.java:215)
   [junit4]    >         at java.util.concurrent.locks.AbstractQueuedSynchronizer.doAcquireSharedNanos(AbstractQueuedSynchronizer.java:1037)
   [junit4]    >         at java.util.concurrent.locks.AbstractQueuedSynchronizer.tryAcquireSharedNanos(AbstractQueuedSynchronizer.java:1328)
   [junit4]    >         at java.util.concurrent.CountDownLatch.await(CountDownLatch.java:277)
   [junit4]    >         at org.apache.curator.CuratorZookeeperClient.internalBlockUntilConnectedOrTimedOut(CuratorZookeeperClient.java:323)
   [junit4]    >         at org.apache.curator.RetryLoop.callWithRetry(RetryLoop.java:105)
   [junit4]    >         at org.apache.curator.framework.imps.GetDataBuilderImpl.pathInForeground(GetDataBuilderImpl.java:288)
   [junit4]    >         at org.apache.curator.framework.imps.GetDataBuilderImpl.forPath(GetDataBuilderImpl.java:279)
   [junit4]    >         at org.apache.curator.framework.imps.GetDataBuilderImpl.forPath(GetDataBuilderImpl.java:41)
   [junit4]    >         at org.apache.curator.framework.recipes.shared.SharedValue.readValue(SharedValue.java:244)
   [junit4]    >         at org.apache.curator.framework.recipes.shared.SharedValue.access$100(SharedValue.java:44)
   [junit4]    >         at org.apache.curator.framework.recipes.shared.SharedValue$1.process(SharedValue.java:61)
   [junit4]    >         at org.apache.curator.framework.imps.NamespaceWatcher.process(NamespaceWatcher.java:67)
   [junit4]    >         at org.apache.zookeeper.ClientCnxn$EventThread.processEvent(ClientCnxn.java:530)
   [junit4]    >         at org.apache.zookeeper.ClientCnxn$EventThread.run(ClientCnxn.java:505)
   [junit4]    >    2) Thread[id=15421, name=jetty-launcher-1445-thread-1-EventThread, state=TIMED_WAITING, group=TGRP-TestSolrCloudWithSecureImpersonation]
   [junit4]    >         at sun.misc.Unsafe.park(Native Method)
   [junit4]    >         at java.util.concurrent.locks.LockSupport.parkNanos(LockSupport.java:215)
   [junit4]    >         at java.util.concurrent.locks.AbstractQueuedSynchronizer.doAcquireSharedNanos(AbstractQueuedSynchronizer.java:1037)
   [junit4]    >         at java.util.concurrent.locks.AbstractQueuedSynchronizer.tryAcquireSharedNanos(AbstractQueuedSynchronizer.java:1328)
   [junit4]    >         at java.util.concurrent.CountDownLatch.await(CountDownLatch.java:277)
   [junit4]    >         at org.apache.curator.CuratorZookeeperClient.internalBlockUntilConnectedOrTimedOut(CuratorZookeeperClient.java:323)
   [junit4]    >         at org.apache.curator.RetryLoop.callWithRetry(RetryLoop.java:105)
   [junit4]    >         at org.apache.curator.framework.imps.GetDataBuilderImpl.pathInForeground(GetDataBuilderImpl.java:288)
   [junit4]    >         at org.apache.curator.framework.imps.GetDataBuilderImpl.forPath(GetDataBuilderImpl.java:279)
   [junit4]    >         at org.apache.curator.framework.imps.GetDataBuilderImpl.forPath(GetDataBuilderImpl.java:41)
   [junit4]    >         at org.apache.curator.framework.recipes.shared.SharedValue.readValue(SharedValue.java:244)
   [junit4]    >         at org.apache.curator.framework.recipes.shared.SharedValue.access$100(SharedValue.java:44)
   [junit4]    >         at org.apache.curator.framework.recipes.shared.SharedValue$1.process(SharedValue.java:61)
   [junit4]    >         at org.apache.curator.framework.imps.NamespaceWatcher.process(NamespaceWatcher.java:67)
   [junit4]    >         at org.apache.zookeeper.ClientCnxn$EventThread.processEvent(ClientCnxn.java:530)
   [junit4]    >         at org.apache.zookeeper.ClientCnxn$EventThread.run(ClientCnxn.java:505)
   [junit4]    > 	at __randomizedtesting.SeedInfo.seed([2F42D06909ABDBC]:0)
   [junit4] Completed [554/728 (1!)] on J0 in 40.79s, 12 tests, 1 error <<< FAILURES!

[...truncated 43962 lines...]

Mime
View raw message