lucene-dev mailing list archives

Site index · List index
Message view « Date » · « Thread »
Top « Date » · « Thread »
From Policeman Jenkins Server <jenk...@thetaphi.de>
Subject [JENKINS] Lucene-Solr-7.0-Linux (32bit/jdk1.8.0_141) - Build # 145 - Unstable!
Date Fri, 04 Aug 2017 21:53:23 GMT
Build: https://jenkins.thetaphi.de/job/Lucene-Solr-7.0-Linux/145/
Java: 32bit/jdk1.8.0_141 -client -XX:+UseParallelGC

2 tests failed.
FAILED:  junit.framework.TestSuite.org.apache.solr.cloud.TestSolrCloudWithSecureImpersonation

Error Message:
2 threads leaked from SUITE scope at org.apache.solr.cloud.TestSolrCloudWithSecureImpersonation:     1) Thread[id=15047, name=jetty-launcher-3160-thread-1-EventThread, state=TIMED_WAITING, group=TGRP-TestSolrCloudWithSecureImpersonation]         at sun.misc.Unsafe.park(Native Method)         at java.util.concurrent.locks.LockSupport.parkNanos(LockSupport.java:215)         at java.util.concurrent.locks.AbstractQueuedSynchronizer.doAcquireSharedNanos(AbstractQueuedSynchronizer.java:1037)         at java.util.concurrent.locks.AbstractQueuedSynchronizer.tryAcquireSharedNanos(AbstractQueuedSynchronizer.java:1328)         at java.util.concurrent.CountDownLatch.await(CountDownLatch.java:277)         at org.apache.curator.CuratorZookeeperClient.internalBlockUntilConnectedOrTimedOut(CuratorZookeeperClient.java:323)         at org.apache.curator.RetryLoop.callWithRetry(RetryLoop.java:105)         at org.apache.curator.framework.imps.GetDataBuilderImpl.pathInForeground(GetDataBuilderImpl.java:288)         at org.apache.curator.framework.imps.GetDataBuilderImpl.forPath(GetDataBuilderImpl.java:279)         at org.apache.curator.framework.imps.GetDataBuilderImpl.forPath(GetDataBuilderImpl.java:41)         at org.apache.curator.framework.recipes.shared.SharedValue.readValue(SharedValue.java:244)         at org.apache.curator.framework.recipes.shared.SharedValue.access$100(SharedValue.java:44)         at org.apache.curator.framework.recipes.shared.SharedValue$1.process(SharedValue.java:61)         at org.apache.curator.framework.imps.NamespaceWatcher.process(NamespaceWatcher.java:67)         at org.apache.zookeeper.ClientCnxn$EventThread.processEvent(ClientCnxn.java:530)         at org.apache.zookeeper.ClientCnxn$EventThread.run(ClientCnxn.java:505)    2) Thread[id=15045, name=jetty-launcher-3160-thread-2-EventThread, state=TIMED_WAITING, group=TGRP-TestSolrCloudWithSecureImpersonation]         at sun.misc.Unsafe.park(Native Method)         at java.util.concurrent.locks.LockSupport.parkNanos(LockSupport.java:215)         at java.util.concurrent.locks.AbstractQueuedSynchronizer.doAcquireSharedNanos(AbstractQueuedSynchronizer.java:1037)         at java.util.concurrent.locks.AbstractQueuedSynchronizer.tryAcquireSharedNanos(AbstractQueuedSynchronizer.java:1328)         at java.util.concurrent.CountDownLatch.await(CountDownLatch.java:277)         at org.apache.curator.CuratorZookeeperClient.internalBlockUntilConnectedOrTimedOut(CuratorZookeeperClient.java:323)         at org.apache.curator.RetryLoop.callWithRetry(RetryLoop.java:105)         at org.apache.curator.framework.imps.GetDataBuilderImpl.pathInForeground(GetDataBuilderImpl.java:288)         at org.apache.curator.framework.imps.GetDataBuilderImpl.forPath(GetDataBuilderImpl.java:279)         at org.apache.curator.framework.imps.GetDataBuilderImpl.forPath(GetDataBuilderImpl.java:41)         at org.apache.curator.framework.recipes.shared.SharedValue.readValue(SharedValue.java:244)         at org.apache.curator.framework.recipes.shared.SharedValue.access$100(SharedValue.java:44)         at org.apache.curator.framework.recipes.shared.SharedValue$1.process(SharedValue.java:61)         at org.apache.curator.framework.imps.NamespaceWatcher.process(NamespaceWatcher.java:67)         at org.apache.zookeeper.ClientCnxn$EventThread.processEvent(ClientCnxn.java:530)         at org.apache.zookeeper.ClientCnxn$EventThread.run(ClientCnxn.java:505)

Stack Trace:
com.carrotsearch.randomizedtesting.ThreadLeakError: 2 threads leaked from SUITE scope at org.apache.solr.cloud.TestSolrCloudWithSecureImpersonation: 
   1) Thread[id=15047, name=jetty-launcher-3160-thread-1-EventThread, state=TIMED_WAITING, group=TGRP-TestSolrCloudWithSecureImpersonation]
        at sun.misc.Unsafe.park(Native Method)
        at java.util.concurrent.locks.LockSupport.parkNanos(LockSupport.java:215)
        at java.util.concurrent.locks.AbstractQueuedSynchronizer.doAcquireSharedNanos(AbstractQueuedSynchronizer.java:1037)
        at java.util.concurrent.locks.AbstractQueuedSynchronizer.tryAcquireSharedNanos(AbstractQueuedSynchronizer.java:1328)
        at java.util.concurrent.CountDownLatch.await(CountDownLatch.java:277)
        at org.apache.curator.CuratorZookeeperClient.internalBlockUntilConnectedOrTimedOut(CuratorZookeeperClient.java:323)
        at org.apache.curator.RetryLoop.callWithRetry(RetryLoop.java:105)
        at org.apache.curator.framework.imps.GetDataBuilderImpl.pathInForeground(GetDataBuilderImpl.java:288)
        at org.apache.curator.framework.imps.GetDataBuilderImpl.forPath(GetDataBuilderImpl.java:279)
        at org.apache.curator.framework.imps.GetDataBuilderImpl.forPath(GetDataBuilderImpl.java:41)
        at org.apache.curator.framework.recipes.shared.SharedValue.readValue(SharedValue.java:244)
        at org.apache.curator.framework.recipes.shared.SharedValue.access$100(SharedValue.java:44)
        at org.apache.curator.framework.recipes.shared.SharedValue$1.process(SharedValue.java:61)
        at org.apache.curator.framework.imps.NamespaceWatcher.process(NamespaceWatcher.java:67)
        at org.apache.zookeeper.ClientCnxn$EventThread.processEvent(ClientCnxn.java:530)
        at org.apache.zookeeper.ClientCnxn$EventThread.run(ClientCnxn.java:505)
   2) Thread[id=15045, name=jetty-launcher-3160-thread-2-EventThread, state=TIMED_WAITING, group=TGRP-TestSolrCloudWithSecureImpersonation]
        at sun.misc.Unsafe.park(Native Method)
        at java.util.concurrent.locks.LockSupport.parkNanos(LockSupport.java:215)
        at java.util.concurrent.locks.AbstractQueuedSynchronizer.doAcquireSharedNanos(AbstractQueuedSynchronizer.java:1037)
        at java.util.concurrent.locks.AbstractQueuedSynchronizer.tryAcquireSharedNanos(AbstractQueuedSynchronizer.java:1328)
        at java.util.concurrent.CountDownLatch.await(CountDownLatch.java:277)
        at org.apache.curator.CuratorZookeeperClient.internalBlockUntilConnectedOrTimedOut(CuratorZookeeperClient.java:323)
        at org.apache.curator.RetryLoop.callWithRetry(RetryLoop.java:105)
        at org.apache.curator.framework.imps.GetDataBuilderImpl.pathInForeground(GetDataBuilderImpl.java:288)
        at org.apache.curator.framework.imps.GetDataBuilderImpl.forPath(GetDataBuilderImpl.java:279)
        at org.apache.curator.framework.imps.GetDataBuilderImpl.forPath(GetDataBuilderImpl.java:41)
        at org.apache.curator.framework.recipes.shared.SharedValue.readValue(SharedValue.java:244)
        at org.apache.curator.framework.recipes.shared.SharedValue.access$100(SharedValue.java:44)
        at org.apache.curator.framework.recipes.shared.SharedValue$1.process(SharedValue.java:61)
        at org.apache.curator.framework.imps.NamespaceWatcher.process(NamespaceWatcher.java:67)
        at org.apache.zookeeper.ClientCnxn$EventThread.processEvent(ClientCnxn.java:530)
        at org.apache.zookeeper.ClientCnxn$EventThread.run(ClientCnxn.java:505)
	at __randomizedtesting.SeedInfo.seed([809F94C0A4272EA5]:0)


FAILED:  org.apache.solr.cloud.TestPullReplica.testKillLeader

Error Message:
Replica core_node2 not up to date after 10 seconds expected:<1> but was:<0>

Stack Trace:
java.lang.AssertionError: Replica core_node2 not up to date after 10 seconds expected:<1> but was:<0>
	at __randomizedtesting.SeedInfo.seed([809F94C0A4272EA5:C9896074C69CBAF3]:0)
	at org.junit.Assert.fail(Assert.java:93)
	at org.junit.Assert.failNotEquals(Assert.java:647)
	at org.junit.Assert.assertEquals(Assert.java:128)
	at org.junit.Assert.assertEquals(Assert.java:472)
	at org.apache.solr.cloud.TestPullReplica.waitForNumDocsInAllReplicas(TestPullReplica.java:510)
	at org.apache.solr.cloud.TestPullReplica.doTestNoLeader(TestPullReplica.java:458)
	at org.apache.solr.cloud.TestPullReplica.testKillLeader(TestPullReplica.java:290)
	at sun.reflect.NativeMethodAccessorImpl.invoke0(Native Method)
	at sun.reflect.NativeMethodAccessorImpl.invoke(NativeMethodAccessorImpl.java:62)
	at sun.reflect.DelegatingMethodAccessorImpl.invoke(DelegatingMethodAccessorImpl.java:43)
	at java.lang.reflect.Method.invoke(Method.java:498)
	at com.carrotsearch.randomizedtesting.RandomizedRunner.invoke(RandomizedRunner.java:1713)
	at com.carrotsearch.randomizedtesting.RandomizedRunner$8.evaluate(RandomizedRunner.java:907)
	at com.carrotsearch.randomizedtesting.RandomizedRunner$9.evaluate(RandomizedRunner.java:943)
	at com.carrotsearch.randomizedtesting.RandomizedRunner$10.evaluate(RandomizedRunner.java:957)
	at com.carrotsearch.randomizedtesting.rules.SystemPropertiesRestoreRule$1.evaluate(SystemPropertiesRestoreRule.java:57)
	at org.apache.lucene.util.TestRuleSetupTeardownChained$1.evaluate(TestRuleSetupTeardownChained.java:49)
	at org.apache.lucene.util.AbstractBeforeAfterRule$1.evaluate(AbstractBeforeAfterRule.java:45)
	at org.apache.lucene.util.TestRuleThreadAndTestName$1.evaluate(TestRuleThreadAndTestName.java:48)
	at org.apache.lucene.util.TestRuleIgnoreAfterMaxFailures$1.evaluate(TestRuleIgnoreAfterMaxFailures.java:64)
	at org.apache.lucene.util.TestRuleMarkFailure$1.evaluate(TestRuleMarkFailure.java:47)
	at com.carrotsearch.randomizedtesting.rules.StatementAdapter.evaluate(StatementAdapter.java:36)
	at com.carrotsearch.randomizedtesting.ThreadLeakControl$StatementRunner.run(ThreadLeakControl.java:368)
	at com.carrotsearch.randomizedtesting.ThreadLeakControl.forkTimeoutingTask(ThreadLeakControl.java:817)
	at com.carrotsearch.randomizedtesting.ThreadLeakControl$3.evaluate(ThreadLeakControl.java:468)
	at com.carrotsearch.randomizedtesting.RandomizedRunner.runSingleTest(RandomizedRunner.java:916)
	at com.carrotsearch.randomizedtesting.RandomizedRunner$5.evaluate(RandomizedRunner.java:802)
	at com.carrotsearch.randomizedtesting.RandomizedRunner$6.evaluate(RandomizedRunner.java:852)
	at com.carrotsearch.randomizedtesting.RandomizedRunner$7.evaluate(RandomizedRunner.java:863)
	at com.carrotsearch.randomizedtesting.rules.StatementAdapter.evaluate(StatementAdapter.java:36)
	at com.carrotsearch.randomizedtesting.rules.SystemPropertiesRestoreRule$1.evaluate(SystemPropertiesRestoreRule.java:57)
	at org.apache.lucene.util.AbstractBeforeAfterRule$1.evaluate(AbstractBeforeAfterRule.java:45)
	at com.carrotsearch.randomizedtesting.rules.StatementAdapter.evaluate(StatementAdapter.java:36)
	at org.apache.lucene.util.TestRuleStoreClassName$1.evaluate(TestRuleStoreClassName.java:41)
	at com.carrotsearch.randomizedtesting.rules.NoShadowingOrOverridesOnMethodsRule$1.evaluate(NoShadowingOrOverridesOnMethodsRule.java:40)
	at com.carrotsearch.randomizedtesting.rules.NoShadowingOrOverridesOnMethodsRule$1.evaluate(NoShadowingOrOverridesOnMethodsRule.java:40)
	at com.carrotsearch.randomizedtesting.rules.StatementAdapter.evaluate(StatementAdapter.java:36)
	at com.carrotsearch.randomizedtesting.rules.StatementAdapter.evaluate(StatementAdapter.java:36)
	at com.carrotsearch.randomizedtesting.rules.StatementAdapter.evaluate(StatementAdapter.java:36)
	at org.apache.lucene.util.TestRuleAssertionsRequired$1.evaluate(TestRuleAssertionsRequired.java:53)
	at org.apache.lucene.util.TestRuleMarkFailure$1.evaluate(TestRuleMarkFailure.java:47)
	at org.apache.lucene.util.TestRuleIgnoreAfterMaxFailures$1.evaluate(TestRuleIgnoreAfterMaxFailures.java:64)
	at org.apache.lucene.util.TestRuleIgnoreTestSuites$1.evaluate(TestRuleIgnoreTestSuites.java:54)
	at com.carrotsearch.randomizedtesting.rules.StatementAdapter.evaluate(StatementAdapter.java:36)
	at com.carrotsearch.randomizedtesting.ThreadLeakControl$StatementRunner.run(ThreadLeakControl.java:368)
	at java.lang.Thread.run(Thread.java:748)




Build Log:
[...truncated 11712 lines...]
   [junit4] Suite: org.apache.solr.cloud.TestSolrCloudWithSecureImpersonation
   [junit4]   2> Creating dataDir: /home/jenkins/workspace/Lucene-Solr-7.0-Linux/solr/build/solr-core/test/J0/temp/solr.cloud.TestSolrCloudWithSecureImpersonation_809F94C0A4272EA5-001/init-core-data-001
   [junit4]   2> 822240 WARN  (SUITE-TestSolrCloudWithSecureImpersonation-seed#[809F94C0A4272EA5]-worker) [    ] o.a.s.SolrTestCaseJ4 startTrackingSearchers: numOpens=23 numCloses=23
   [junit4]   2> 822242 INFO  (SUITE-TestSolrCloudWithSecureImpersonation-seed#[809F94C0A4272EA5]-worker) [    ] o.a.s.SolrTestCaseJ4 Using PointFields (NUMERIC_POINTS_SYSPROP=true) w/NUMERIC_DOCVALUES_SYSPROP=true
   [junit4]   2> 822243 INFO  (SUITE-TestSolrCloudWithSecureImpersonation-seed#[809F94C0A4272EA5]-worker) [    ] o.a.s.SolrTestCaseJ4 Randomized ssl (true) and clientAuth (false) via: @org.apache.solr.util.RandomizeSSL(reason=, ssl=NaN, value=NaN, clientAuth=NaN)
   [junit4]   2> 822268 INFO  (SUITE-TestSolrCloudWithSecureImpersonation-seed#[809F94C0A4272EA5]-worker) [    ] o.a.s.c.MiniSolrCloudCluster Starting cluster of 2 servers in /home/jenkins/workspace/Lucene-Solr-7.0-Linux/solr/build/solr-core/test/J0/temp/solr.cloud.TestSolrCloudWithSecureImpersonation_809F94C0A4272EA5-001/tempDir-001
   [junit4]   2> 822268 INFO  (SUITE-TestSolrCloudWithSecureImpersonation-seed#[809F94C0A4272EA5]-worker) [    ] o.a.s.c.ZkTestServer STARTING ZK TEST SERVER
   [junit4]   2> 822268 INFO  (Thread-1815) [    ] o.a.s.c.ZkTestServer client port:0.0.0.0/0.0.0.0:0
   [junit4]   2> 822268 INFO  (Thread-1815) [    ] o.a.s.c.ZkTestServer Starting server
   [junit4]   2> 822271 ERROR (Thread-1815) [    ] o.a.z.s.ZooKeeperServer ZKShutdownHandler is not registered, so ZooKeeper server won't take any action on ERROR or SHUTDOWN server state changes
   [junit4]   2> 822369 INFO  (SUITE-TestSolrCloudWithSecureImpersonation-seed#[809F94C0A4272EA5]-worker) [    ] o.a.s.c.ZkTestServer start zk server on port:40213
   [junit4]   2> 822377 INFO  (jetty-launcher-3160-thread-2) [    ] o.e.j.s.Server jetty-9.3.14.v20161028
   [junit4]   2> 822377 INFO  (jetty-launcher-3160-thread-1) [    ] o.e.j.s.Server jetty-9.3.14.v20161028
   [junit4]   2> 822378 INFO  (jetty-launcher-3160-thread-1) [    ] o.e.j.s.h.ContextHandler Started o.e.j.s.ServletContextHandler@1540dba{/solr,null,AVAILABLE}
   [junit4]   2> 822378 INFO  (jetty-launcher-3160-thread-2) [    ] o.e.j.s.h.ContextHandler Started o.e.j.s.ServletContextHandler@17fa210{/solr,null,AVAILABLE}
   [junit4]   2> 822379 INFO  (jetty-launcher-3160-thread-1) [    ] o.e.j.s.AbstractConnector Started ServerConnector@1839169{SSL,[ssl, http/1.1]}{127.0.0.1:42649}
   [junit4]   2> 822379 INFO  (jetty-launcher-3160-thread-2) [    ] o.e.j.s.AbstractConnector Started ServerConnector@615da7{SSL,[ssl, http/1.1]}{127.0.0.1:40531}
   [junit4]   2> 822379 INFO  (jetty-launcher-3160-thread-1) [    ] o.e.j.s.Server Started @823283ms
   [junit4]   2> 822379 INFO  (jetty-launcher-3160-thread-2) [    ] o.e.j.s.Server Started @823283ms
   [junit4]   2> 822379 INFO  (jetty-launcher-3160-thread-1) [    ] o.a.s.c.s.e.JettySolrRunner Jetty properties: {hostContext=/solr, hostPort=42649}
   [junit4]   2> 822379 INFO  (jetty-launcher-3160-thread-2) [    ] o.a.s.c.s.e.JettySolrRunner Jetty properties: {hostContext=/solr, hostPort=40531}
   [junit4]   2> 822380 ERROR (jetty-launcher-3160-thread-2) [    ] o.a.s.s.StartupLoggingUtils Missing Java Option solr.log.dir. Logging may be missing or incomplete.
   [junit4]   2> 822380 ERROR (jetty-launcher-3160-thread-1) [    ] o.a.s.s.StartupLoggingUtils Missing Java Option solr.log.dir. Logging may be missing or incomplete.
   [junit4]   2> 822380 INFO  (jetty-launcher-3160-thread-2) [    ] o.a.s.s.SolrDispatchFilter  ___      _       Welcome to Apache Solr? version 7.0.0
   [junit4]   2> 822380 INFO  (jetty-launcher-3160-thread-1) [    ] o.a.s.s.SolrDispatchFilter  ___      _       Welcome to Apache Solr? version 7.0.0
   [junit4]   2> 822380 INFO  (jetty-launcher-3160-thread-2) [    ] o.a.s.s.SolrDispatchFilter / __| ___| |_ _   Starting in cloud mode on port null
   [junit4]   2> 822380 INFO  (jetty-launcher-3160-thread-1) [    ] o.a.s.s.SolrDispatchFilter / __| ___| |_ _   Starting in cloud mode on port null
   [junit4]   2> 822380 INFO  (jetty-launcher-3160-thread-2) [    ] o.a.s.s.SolrDispatchFilter \__ \/ _ \ | '_|  Install dir: null, Default config dir: null
   [junit4]   2> 822380 INFO  (jetty-launcher-3160-thread-1) [    ] o.a.s.s.SolrDispatchFilter \__ \/ _ \ | '_|  Install dir: null, Default config dir: null
   [junit4]   2> 822380 INFO  (jetty-launcher-3160-thread-2) [    ] o.a.s.s.SolrDispatchFilter |___/\___/_|_|    Start time: 2017-08-04T21:21:34.786Z
   [junit4]   2> 822380 INFO  (jetty-launcher-3160-thread-1) [    ] o.a.s.s.SolrDispatchFilter |___/\___/_|_|    Start time: 2017-08-04T21:21:34.786Z
   [junit4]   2> 822382 INFO  (jetty-launcher-3160-thread-1) [    ] o.a.s.s.SolrDispatchFilter solr.xml found in ZooKeeper. Loading...
   [junit4]   2> 822382 INFO  (jetty-launcher-3160-thread-2) [    ] o.a.s.s.SolrDispatchFilter solr.xml found in ZooKeeper. Loading...
   [junit4]   2> 822398 INFO  (jetty-launcher-3160-thread-1) [    ] o.a.s.c.ZkContainer Zookeeper client=127.0.0.1:40213/solr
   [junit4]   2> 822399 INFO  (jetty-launcher-3160-thread-2) [    ] o.a.s.c.ZkContainer Zookeeper client=127.0.0.1:40213/solr
   [junit4]   2> 822467 INFO  (jetty-launcher-3160-thread-2) [n:127.0.0.1:40531_solr    ] o.a.s.c.Overseer Overseer (id=null) closing
   [junit4]   2> 822467 INFO  (jetty-launcher-3160-thread-1) [n:127.0.0.1:42649_solr    ] o.a.s.c.Overseer Overseer (id=null) closing
   [junit4]   2> 822468 INFO  (jetty-launcher-3160-thread-1) [n:127.0.0.1:42649_solr    ] o.a.s.c.OverseerElectionContext I am going to be the leader 127.0.0.1:42649_solr
   [junit4]   2> 822469 INFO  (jetty-launcher-3160-thread-1) [n:127.0.0.1:42649_solr    ] o.a.s.c.Overseer Overseer (id=98427318742220805-127.0.0.1:42649_solr-n_0000000000) starting
   [junit4]   2> 822469 INFO  (jetty-launcher-3160-thread-2) [n:127.0.0.1:40531_solr    ] o.a.s.c.ZkController Register node as live in ZooKeeper:/live_nodes/127.0.0.1:40531_solr
   [junit4]   2> 822471 INFO  (zkCallback-3171-thread-1-processing-n:127.0.0.1:42649_solr) [n:127.0.0.1:42649_solr    ] o.a.s.c.c.ZkStateReader Updated live nodes from ZooKeeper... (0) -> (1)
   [junit4]   2> 822471 INFO  (zkCallback-3172-thread-1-processing-n:127.0.0.1:40531_solr) [n:127.0.0.1:40531_solr    ] o.a.s.c.c.ZkStateReader Updated live nodes from ZooKeeper... (0) -> (1)
   [junit4]   2> 822475 INFO  (jetty-launcher-3160-thread-1) [n:127.0.0.1:42649_solr    ] o.a.s.c.ZkController Register node as live in ZooKeeper:/live_nodes/127.0.0.1:42649_solr
   [junit4]   2> 822475 INFO  (zkCallback-3172-thread-1-processing-n:127.0.0.1:40531_solr) [n:127.0.0.1:40531_solr    ] o.a.s.c.c.ZkStateReader Updated live nodes from ZooKeeper... (1) -> (2)
   [junit4]   2> 822475 INFO  (zkCallback-3171-thread-1-processing-n:127.0.0.1:42649_solr) [n:127.0.0.1:42649_solr    ] o.a.s.c.c.ZkStateReader Updated live nodes from ZooKeeper... (1) -> (2)
   [junit4]   2> 822548 INFO  (jetty-launcher-3160-thread-2) [n:127.0.0.1:40531_solr    ] o.a.s.c.CoreContainer Initializing authentication plugin: org.apache.solr.security.HttpParamDelegationTokenPlugin
   [junit4]   2> 822552 WARN  (jetty-launcher-3160-thread-2) [n:127.0.0.1:40531_solr    ] o.a.s.c.s.i.Krb5HttpClientBuilder org.apache.solr.client.solrj.impl.Krb5HttpClientBuilder is configured without specifying system property 'java.security.auth.login.config'
   [junit4]   2> 822556 INFO  (jetty-launcher-3160-thread-2) [n:127.0.0.1:40531_solr    ] o.a.s.s.KerberosPlugin Params: {solr.kerberos.impersonator.user.noGroups.hosts=*, solr.kerberos.impersonator.user.bogusGroup.groups=__some_bogus_group, token.valid=30, cookie.domain=127.0.0.1, solr.kerberos.impersonator.user.anyHostAnyUser.groups=*, solr.kerberos.impersonator.user.bogusGroup.hosts=*, solr.kerberos.impersonator.user.anyHostAnyUser.hosts=*, token.validity=36000, solr.kerberos.impersonator.user.noHosts.groups=*, type=kerberos, solr.kerberos.impersonator.user.localHostAnyGroup.groups=*, delegation-token.token-kind=solr-dt, solr.kerberos.impersonator.user.wrongHost.hosts=1.1.1.1.1.1, cookie.path=/, zk-dt-secret-manager.znodeWorkingPath=solr/security/zkdtsm, solr.kerberos.impersonator.user.localHostAnyGroup.hosts=localhost.localdomain,localhost,127.0.0.1, signer.secret.provider.zookeeper.path=/token, solr.kerberos.impersonator.user.anyHostUsersGroup.groups=jenkins, zk-dt-secret-manager.enable=true, solr.kerberos.impersonator.user.wrongHost.groups=*, kerberos.name.rules=DEFAULT, signer.secret.provider=zookeeper, solr.kerberos.impersonator.user.anyHostUsersGroup.hosts=*}
   [junit4]   2> 822598 INFO  (jetty-launcher-3160-thread-1) [n:127.0.0.1:42649_solr    ] o.a.s.c.CoreContainer Initializing authentication plugin: org.apache.solr.security.HttpParamDelegationTokenPlugin
   [junit4]   2> 822598 WARN  (jetty-launcher-3160-thread-1) [n:127.0.0.1:42649_solr    ] o.a.s.c.s.i.Krb5HttpClientBuilder org.apache.solr.client.solrj.impl.Krb5HttpClientBuilder is configured without specifying system property 'java.security.auth.login.config'
   [junit4]   2> 822599 INFO  (jetty-launcher-3160-thread-1) [n:127.0.0.1:42649_solr    ] o.a.s.s.KerberosPlugin Params: {solr.kerberos.impersonator.user.noGroups.hosts=*, solr.kerberos.impersonator.user.bogusGroup.groups=__some_bogus_group, token.valid=30, cookie.domain=127.0.0.1, solr.kerberos.impersonator.user.anyHostAnyUser.groups=*, solr.kerberos.impersonator.user.bogusGroup.hosts=*, solr.kerberos.impersonator.user.anyHostAnyUser.hosts=*, token.validity=36000, solr.kerberos.impersonator.user.noHosts.groups=*, type=kerberos, solr.kerberos.impersonator.user.localHostAnyGroup.groups=*, delegation-token.token-kind=solr-dt, solr.kerberos.impersonator.user.wrongHost.hosts=1.1.1.1.1.1, cookie.path=/, zk-dt-secret-manager.znodeWorkingPath=solr/security/zkdtsm, solr.kerberos.impersonator.user.localHostAnyGroup.hosts=localhost.localdomain,localhost,127.0.0.1, signer.secret.provider.zookeeper.path=/token, solr.kerberos.impersonator.user.anyHostUsersGroup.groups=jenkins, zk-dt-secret-manager.enable=true, solr.kerberos.impersonator.user.wrongHost.groups=*, kerberos.name.rules=DEFAULT, signer.secret.provider=zookeeper, solr.kerberos.impersonator.user.anyHostUsersGroup.hosts=*}
   [junit4]   2> 822604 INFO  (jetty-launcher-3160-thread-2) [n:127.0.0.1:40531_solr    ] o.a.c.f.i.CuratorFrameworkImpl Starting
   [junit4]   2> 822604 INFO  (jetty-launcher-3160-thread-1) [n:127.0.0.1:42649_solr    ] o.a.c.f.i.CuratorFrameworkImpl Starting
   [junit4]   2> 822616 INFO  (jetty-launcher-3160-thread-1-EventThread) [n:127.0.0.1:42649_solr    ] o.a.c.f.s.ConnectionStateManager State change: CONNECTED
   [junit4]   2> 822616 INFO  (jetty-launcher-3160-thread-2-EventThread) [n:127.0.0.1:40531_solr    ] o.a.c.f.s.ConnectionStateManager State change: CONNECTED
   [junit4]   2> 822686 WARN  (jetty-launcher-3160-thread-1) [n:127.0.0.1:42649_solr    ] o.a.s.c.s.i.Krb5HttpClientBuilder org.apache.solr.client.solrj.impl.Krb5HttpClientBuilder is configured without specifying system property 'java.security.auth.login.config'
   [junit4]   2> 822686 WARN  (jetty-launcher-3160-thread-2) [n:127.0.0.1:40531_solr    ] o.a.s.c.s.i.Krb5HttpClientBuilder org.apache.solr.client.solrj.impl.Krb5HttpClientBuilder is configured without specifying system property 'java.security.auth.login.config'
   [junit4]   2> 822717 INFO  (jetty-launcher-3160-thread-1) [n:127.0.0.1:42649_solr    ] o.a.s.m.r.SolrJmxReporter JMX monitoring for 'solr_42649.solr.node' (registry 'solr.node') enabled at server: com.sun.jmx.mbeanserver.JmxMBeanServer@477ff7
   [junit4]   2> 822717 INFO  (jetty-launcher-3160-thread-2) [n:127.0.0.1:40531_solr    ] o.a.s.m.r.SolrJmxReporter JMX monitoring for 'solr_40531.solr.node' (registry 'solr.node') enabled at server: com.sun.jmx.mbeanserver.JmxMBeanServer@477ff7
   [junit4]   2> 822722 INFO  (jetty-launcher-3160-thread-2) [n:127.0.0.1:40531_solr    ] o.a.s.m.r.SolrJmxReporter JMX monitoring for 'solr_40531.solr.jvm' (registry 'solr.jvm') enabled at server: com.sun.jmx.mbeanserver.JmxMBeanServer@477ff7
   [junit4]   2> 822722 INFO  (jetty-launcher-3160-thread-2) [n:127.0.0.1:40531_solr    ] o.a.s.m.r.SolrJmxReporter JMX monitoring for 'solr_40531.solr.jetty' (registry 'solr.jetty') enabled at server: com.sun.jmx.mbeanserver.JmxMBeanServer@477ff7
   [junit4]   2> 822723 INFO  (jetty-launcher-3160-thread-1) [n:127.0.0.1:42649_solr    ] o.a.s.m.r.SolrJmxReporter JMX monitoring for 'solr_42649.solr.jvm' (registry 'solr.jvm') enabled at server: com.sun.jmx.mbeanserver.JmxMBeanServer@477ff7
   [junit4]   2> 822723 INFO  (jetty-launcher-3160-thread-1) [n:127.0.0.1:42649_solr    ] o.a.s.m.r.SolrJmxReporter JMX monitoring for 'solr_42649.solr.jetty' (registry 'solr.jetty') enabled at server: com.sun.jmx.mbeanserver.JmxMBeanServer@477ff7
   [junit4]   2> 822724 INFO  (jetty-launcher-3160-thread-2) [n:127.0.0.1:40531_solr    ] o.a.s.c.CorePropertiesLocator Found 0 core definitions underneath /home/jenkins/workspace/Lucene-Solr-7.0-Linux/solr/build/solr-core/test/J0/temp/solr.cloud.TestSolrCloudWithSecureImpersonation_809F94C0A4272EA5-001/tempDir-001/node2/.
   [junit4]   2> 822724 INFO  (jetty-launcher-3160-thread-1) [n:127.0.0.1:42649_solr    ] o.a.s.c.CorePropertiesLocator Found 0 core definitions underneath /home/jenkins/workspace/Lucene-Solr-7.0-Linux/solr/build/solr-core/test/J0/temp/solr.cloud.TestSolrCloudWithSecureImpersonation_809F94C0A4272EA5-001/tempDir-001/node1/.
   [junit4]   2> 822772 INFO  (TEST-TestSolrCloudWithSecureImpersonation.testProxyValidateHost-seed#[809F94C0A4272EA5]) [    ] o.a.s.SolrTestCaseJ4 ###Starting testProxyValidateHost
   [junit4]   2> 822824 INFO  (qtp7256155-15012) [n:127.0.0.1:40531_solr    ] o.a.s.h.a.CollectionsHandler Invoked Collection Action :list with params doAs=bar&action=LIST&wt=javabin&version=2 and sendToOCPQueue=true
   [junit4]   2> 822824 INFO  (qtp7256155-15012) [n:127.0.0.1:40531_solr    ] o.a.s.s.HttpSolrCall [admin] webapp=null path=/admin/collections params={doAs=bar&action=LIST&wt=javabin&version=2} status=0 QTime=0
   [junit4]   2> 822829 WARN  (TEST-TestSolrCloudWithSecureImpersonation.testProxyValidateHost-seed#[809F94C0A4272EA5]) [    ] o.a.h.c.p.ResponseProcessCookies Invalid cookie header: "Set-Cookie: hadoop.auth="u=localHostAnyGroup&p=localHostAnyGroup&t=test&e=1501917695226&s=5hcCBiVNcKz83VJL3u3WOAuFSzg="; Path=/; Domain=127.0.0.1; Expires=sub, 05-avg-2017 07:21:35 GMT; Secure; HttpOnly". Invalid 'expires' attribute: sub, 05-avg-2017 07:21:35 GMT
   [junit4]   2> 822829 INFO  (TEST-TestSolrCloudWithSecureImpersonation.testProxyValidateHost-seed#[809F94C0A4272EA5]) [    ] o.a.s.SolrTestCaseJ4 ###Ending testProxyValidateHost
   [junit4]   2> 822839 INFO  (TEST-TestSolrCloudWithSecureImpersonation.testProxyNoConfigHosts-seed#[809F94C0A4272EA5]) [    ] o.a.s.SolrTestCaseJ4 ###Starting testProxyNoConfigHosts
   [junit4]   2> 822857 WARN  (TEST-TestSolrCloudWithSecureImpersonation.testProxyNoConfigHosts-seed#[809F94C0A4272EA5]) [    ] o.a.h.c.p.ResponseProcessCookies Invalid cookie header: "Set-Cookie: hadoop.auth="u=noHosts&p=noHosts&t=test&e=1501917695246&s=0PVnZzY/ImmPj5ur1s0/uu7o9ds="; Path=/; Domain=127.0.0.1; Expires=sub, 05-avg-2017 07:21:35 GMT; Secure; HttpOnly". Invalid 'expires' attribute: sub, 05-avg-2017 07:21:35 GMT
   [junit4]   2> 822858 INFO  (TEST-TestSolrCloudWithSecureImpersonation.testProxyNoConfigHosts-seed#[809F94C0A4272EA5]) [    ] o.a.s.SolrTestCaseJ4 ###Ending testProxyNoConfigHosts
   [junit4]   2> 822868 INFO  (TEST-TestSolrCloudWithSecureImpersonation.testProxyInvalidRemote-seed#[809F94C0A4272EA5]) [    ] o.a.s.SolrTestCaseJ4 ###Starting testProxyInvalidRemote
   [junit4]   2> 822875 WARN  (TEST-TestSolrCloudWithSecureImpersonation.testProxyInvalidRemote-seed#[809F94C0A4272EA5]) [    ] o.a.h.c.p.ResponseProcessCookies Invalid cookie header: "Set-Cookie: hadoop.auth="u=localHostAnyGroup&p=localHostAnyGroup&t=test&e=1501917695274&s=9OYoDCdDIgoNxgdNILNIhHM+x4k="; Path=/; Domain=127.0.0.1; Expires=sub, 05-avg-2017 07:21:35 GMT; Secure; HttpOnly". Invalid 'expires' attribute: sub, 05-avg-2017 07:21:35 GMT
   [junit4]   2> 822875 INFO  (TEST-TestSolrCloudWithSecureImpersonation.testProxyInvalidRemote-seed#[809F94C0A4272EA5]) [    ] o.a.s.SolrTestCaseJ4 ###Ending testProxyInvalidRemote
   [junit4]   2> 822885 INFO  (TEST-TestSolrCloudWithSecureImpersonation.testProxyWrongHost-seed#[809F94C0A4272EA5]) [    ] o.a.s.SolrTestCaseJ4 ###Starting testProxyWrongHost
   [junit4]   2> 828655 WARN  (TEST-TestSolrCloudWithSecureImpersonation.testProxyWrongHost-seed#[809F94C0A4272EA5]) [    ] o.a.h.c.p.ResponseProcessCookies Invalid cookie header: "Set-Cookie: hadoop.auth="u=wrongHost&p=wrongHost&t=test&e=1501917695292&s=0dJ82ao7aNfgQF5jU/A85zsyJzY="; Path=/; Domain=127.0.0.1; Expires=sub, 05-avg-2017 07:21:35 GMT; Secure; HttpOnly". Invalid 'expires' attribute: sub, 05-avg-2017 07:21:35 GMT
   [junit4]   2> 828656 INFO  (TEST-TestSolrCloudWithSecureImpersonation.testProxyWrongHost-seed#[809F94C0A4272EA5]) [    ] o.a.s.SolrTestCaseJ4 ###Ending testProxyWrongHost
   [junit4]   2> 828682 INFO  (TEST-TestSolrCloudWithSecureImpersonation.testProxyInvalidProxyUser-seed#[809F94C0A4272EA5]) [    ] o.a.s.SolrTestCaseJ4 ###Starting testProxyInvalidProxyUser
   [junit4]   2> 828688 WARN  (TEST-TestSolrCloudWithSecureImpersonation.testProxyInvalidProxyUser-seed#[809F94C0A4272EA5]) [    ] o.a.h.c.p.ResponseProcessCookies Invalid cookie header: "Set-Cookie: hadoop.auth="u=bar&p=bar&t=test&e=1501917701089&s=iXoQ8sEThZlAasOzqvE5+lA8V4c="; Path=/; Domain=127.0.0.1; Expires=sub, 05-avg-2017 07:21:41 GMT; Secure; HttpOnly". Invalid 'expires' attribute: sub, 05-avg-2017 07:21:41 GMT
   [junit4]   2> 828688 INFO  (TEST-TestSolrCloudWithSecureImpersonation.testProxyInvalidProxyUser-seed#[809F94C0A4272EA5]) [    ] o.a.s.SolrTestCaseJ4 ###Ending testProxyInvalidProxyUser
   [junit4]   2> 828712 INFO  (TEST-TestSolrCloudWithSecureImpersonation.testProxyNullProxyUser-seed#[809F94C0A4272EA5]) [    ] o.a.s.SolrTestCaseJ4 ###Starting testProxyNullProxyUser
   [junit4]   2> 828713 INFO  (qtp7256155-14999) [    ] o.a.s.s.SolrDispatchFilter Error authenticating
   [junit4]   2> java.lang.IllegalArgumentException: userName is NULL, empty or contains a '&'
   [junit4]   2> 	at org.apache.hadoop.security.authentication.util.AuthToken.checkForIllegalArgument(AuthToken.java:87)
   [junit4]   2> 	at org.apache.hadoop.security.authentication.util.AuthToken.<init>(AuthToken.java:70)
   [junit4]   2> 	at org.apache.hadoop.security.authentication.server.AuthenticationToken.<init>(AuthenticationToken.java:58)
   [junit4]   2> 	at org.apache.solr.security.HttpParamDelegationTokenPlugin$HttpParamDelegationTokenAuthenticationHandler$HttpParamAuthenticationHandler.authenticate(HttpParamDelegationTokenPlugin.java:213)
   [junit4]   2> 	at org.apache.hadoop.security.token.delegation.web.DelegationTokenAuthenticationHandler.authenticate(DelegationTokenAuthenticationHandler.java:348)
   [junit4]   2> 	at org.apache.solr.security.RequestContinuesRecorderAuthenticationHandler.authenticate(RequestContinuesRecorderAuthenticationHandler.java:69)
   [junit4]   2> 	at org.apache.hadoop.security.authentication.server.AuthenticationFilter.doFilter(AuthenticationFilter.java:519)
   [junit4]   2> 	at org.apache.solr.security.DelegationTokenKerberosFilter.doFilter(DelegationTokenKerberosFilter.java:128)
   [junit4]   2> 	at org.apache.solr.security.HttpParamDelegationTokenPlugin$HttpParamToRequestFilter.doFilter(HttpParamDelegationTokenPlugin.java:245)
   [junit4]   2> 	at org.apache.solr.security.KerberosPlugin.doAuthenticate(KerberosPlugin.java:243)
   [junit4]   2> 	at org.apache.solr.servlet.SolrDispatchFilter.authenticateRequest(SolrDispatchFilter.java:447)
   [junit4]   2> 	at org.apache.solr.servlet.SolrDispatchFilter.doFilter(SolrDispatchFilter.java:343)
   [junit4]   2> 	at org.apache.solr.servlet.SolrDispatchFilter.doFilter(SolrDispatchFilter.java:322)
   [junit4]   2> 	at org.eclipse.jetty.servlet.ServletHandler$CachedChain.doFilter(ServletHandler.java:1699)
   [junit4]   2> 	at org.apache.solr.client.solrj.embedded.JettySolrRunner$DebugFilter.doFilter(JettySolrRunner.java:139)
   [junit4]   2> 	at org.eclipse.jetty.servlet.ServletHandler$CachedChain.doFilter(ServletHandler.java:1699)
   [junit4]   2> 	at org.eclipse.jetty.servlet.ServletHandler.doHandle(ServletHandler.java:582)
   [junit4]   2> 	at org.eclipse.jetty.server.session.SessionHandler.doHandle(SessionHandler.java:224)
   [junit4]   2> 	at org.eclipse.jetty.server.handler.ContextHandler.doHandle(ContextHandler.java:1180)
   [junit4]   2> 	at org.eclipse.jetty.servlet.ServletHandler.doScope(ServletHandler.java:512)
   [junit4]   2> 	at org.eclipse.jetty.server.session.SessionHandler.doScope(SessionHandler.java:185)
   [junit4]   2> 	at org.eclipse.jetty.server.handler.ContextHandler.doScope(ContextHandler.java:1112)
   [junit4]   2> 	at org.eclipse.jetty.server.handler.ScopedHandler.handle(ScopedHandler.java:141)
   [junit4]   2> 	at org.eclipse.jetty.server.handler.gzip.GzipHandler.handle(GzipHandler.java:462)
   [junit4]   2> 	at org.eclipse.jetty.server.handler.HandlerWrapper.handle(HandlerWrapper.java:134)
   [junit4]   2> 	at org.eclipse.jetty.server.Server.handle(Server.java:534)
   [junit4]   2> 	at org.eclipse.jetty.server.HttpChannel.handle(HttpChannel.java:320)
   [junit4]   2> 	at org.eclipse.jetty.server.HttpConnection.onFillable(HttpConnection.java:251)
   [junit4]   2> 	at org.eclipse.jetty.io.AbstractConnection$ReadCallback.succeeded(AbstractConnection.java:273)
   [junit4]   2> 	at org.eclipse.jetty.io.FillInterest.fillable(FillInterest.java:95)
   [junit4]   2> 	at org.eclipse.jetty.io.ssl.SslConnection.onFillable(SslConnection.java:202)
   [junit4]   2> 	at org.eclipse.jetty.io.AbstractConnection$ReadCallback.succeeded(AbstractConnection.java:273)
   [junit4]   2> 	at org.eclipse.jetty.io.FillInterest.fillable(FillInterest.java:95)
   [junit4]   2> 	at org.eclipse.jetty.io.SelectChannelEndPoint$2.run(SelectChannelEndPoint.java:93)
   [junit4]   2> 	at org.eclipse.jetty.util.thread.strategy.ExecuteProduceConsume.executeProduceConsume(ExecuteProduceConsume.java:303)
   [junit4]   2> 	at org.eclipse.jetty.util.thread.strategy.ExecuteProduceConsume.produceConsume(ExecuteProduceConsume.java:148)
   [junit4]   2> 	at org.eclipse.jetty.util.thread.strategy.ExecuteProduceConsume.run(ExecuteProduceConsume.java:136)
   [junit4]   2> 	at org.eclipse.jetty.util.thread.QueuedThreadPool.runJob(QueuedThreadPool.java:671)
   [junit4]   2> 	at org.eclipse.jetty.util.thread.QueuedThreadPool$2.run(QueuedThreadPool.java:589)
   [junit4]   2> 	at java.lang.Thread.run(Thread.java:748)
   [junit4]   2> 828715 WARN  (qtp7256155-14999) [    ] o.e.j.s.ServletHandler /solr/admin/collections
   [junit4]   2> org.apache.solr.common.SolrException: Error during request authentication, 
   [junit4]   2> 	at org.apache.solr.servlet.SolrDispatchFilter.authenticateRequest(SolrDispatchFilter.java:453)
   [junit4]   2> 	at org.apache.solr.servlet.SolrDispatchFilter.doFilter(SolrDispatchFilter.java:343)
   [junit4]   2> 	at org.apache.solr.servlet.SolrDispatchFilter.doFilter(SolrDispatchFilter.java:322)
   [junit4]   2> 	at org.eclipse.jetty.servlet.ServletHandler$CachedChain.doFilter(ServletHandler.java:1699)
   [junit4]   2> 	at org.apache.solr.client.solrj.embedded.JettySolrRunner$DebugFilter.doFilter(JettySolrRunner.java:139)
   [junit4]   2> 	at org.eclipse.jetty.servlet.ServletHandler$CachedChain.doFilter(ServletHandler.java:1699)
   [junit4]   2> 	at org.eclipse.jetty.servlet.ServletHandler.doHandle(ServletHandler.java:582)
   [junit4]   2> 	at org.eclipse.jetty.server.session.SessionHandler.doHandle(SessionHandler.java:224)
   [junit4]   2> 	at org.eclipse.jetty.server.handler.ContextHandler.doHandle(ContextHandler.java:1180)
   [junit4]   2> 	at org.eclipse.jetty.servlet.ServletHandler.doScope(ServletHandler.java:512)
   [junit4]   2> 	at org.eclipse.jetty.server.session.SessionHandler.doScope(SessionHandler.java:185)
   [junit4]   2> 	at org.eclipse.jetty.server.handler.ContextHandler.doScope(ContextHandler.java:1112)
   [junit4]   2> 	at org.eclipse.jetty.server.handler.ScopedHandler.handle(ScopedHandler.java:141)
   [junit4]   2> 	at org.eclipse.jetty.server.handler.gzip.GzipHandler.handle(GzipHandler.java:462)
   [junit4]   2> 	at org.eclipse.jetty.server.handler.HandlerWrapper.handle(HandlerWrapper.java:134)
   [junit4]   2> 	at org.eclipse.jetty.server.Server.handle(Server.java:534)
   [junit4]   2> 	at org.eclipse.jetty.server.HttpChannel.handle(HttpChannel.java:320)
   [junit4]   2> 	at org.eclipse.jetty.server.HttpConnection.onFillable(HttpConnection.java:251)
   [junit4]   2> 	at org.eclipse.jetty.io.AbstractConnection$ReadCallback.succeeded(AbstractConnection.java:273)
   [junit4]   2> 	at org.eclipse.jetty.io.FillInterest.fillable(FillInterest.java:95)
   [junit4]   2> 	at org.eclipse.jetty.io.ssl.SslConnection.onFillable(SslConnection.java:202)
   [junit4]   2> 	at org.eclipse.jetty.io.AbstractConnection$ReadCallback.succeeded(AbstractConnection.java:273)
   [junit4]   2> 	at org.eclipse.jetty.io.FillInterest.fillable(FillInterest.java:95)
   [junit4]   2> 	at org.eclipse.jetty.io.SelectChannelEndPoint$2.run(SelectChannelEndPoint.java:93)
   [junit4]   2> 	at org.eclipse.jetty.util.thread.strategy.ExecuteProduceConsume.executeProduceConsume(ExecuteProduceConsume.java:303)
   [junit4]   2> 	at org.eclipse.jetty.util.thread.strategy.ExecuteProduceConsume.produceConsume(ExecuteProduceConsume.java:148)
   [junit4]   2> 	at org.eclipse.jetty.util.thread.strategy.ExecuteProduceConsume.run(ExecuteProduceConsume.java:136)
   [junit4]   2> 	at org.eclipse.jetty.util.thread.QueuedThreadPool.runJob(QueuedThreadPool.java:671)
   [junit4]   2> 	at org.eclipse.jetty.util.thread.QueuedThreadPool$2.run(QueuedThreadPool.java:589)
   [junit4]   2> 	at java.lang.Thread.run(Thread.java:748)
   [junit4]   2> Caused by: java.lang.IllegalArgumentException: userName is NULL, empty or contains a '&'
   [junit4]   2> 	at org.apache.hadoop.security.authentication.util.AuthToken.checkForIllegalArgument(AuthToken.java:87)
   [junit4]   2> 	at org.apache.hadoop.security.authentication.util.AuthToken.<init>(AuthToken.java:70)
   [junit4]   2> 	at org.apache.hadoop.security.authentication.server.AuthenticationToken.<init>(AuthenticationToken.java:58)
   [junit4]   2> 	at org.apache.solr.security.HttpParamDelegationTokenPlugin$HttpParamDelegationTokenAuthenticationHandler$HttpParamAuthenticationHandler.authenticate(HttpParamDelegationTokenPlugin.java:213)
   [junit4]   2> 	at org.apache.hadoop.security.token.delegation.web.DelegationTokenAuthenticationHandler.authenticate(DelegationTokenAuthenticationHandler.java:348)
   [junit4]   2> 	at org.apache.solr.security.RequestContinuesRecorderAuthenticationHandler.authenticate(RequestContinuesRecorderAuthenticationHandler.java:69)
   [junit4]   2> 	at org.apache.hadoop.security.authentication.server.AuthenticationFilter.doFilter(AuthenticationFilter.java:519)
   [junit4]   2> 	at org.apache.solr.security.DelegationTokenKerberosFilter.doFilter(DelegationTokenKerberosFilter.java:128)
   [junit4]   2> 	at org.apache.solr.security.HttpParamDelegationTokenPlugin$HttpParamToRequestFilter.doFilter(HttpParamDelegationTokenPlugin.java:245)
   [junit4]   2> 	at org.apache.solr.security.KerberosPlugin.doAuthenticate(KerberosPlugin.java:243)
   [junit4]   2> 	at org.apache.solr.servlet.SolrDispatchFilter.authenticateRequest(SolrDispatchFilter.java:447)
   [junit4]   2> 	... 29 more
   [junit4]   2> 828717 INFO  (TEST-TestSolrCloudWithSecureImpersonation.testProxyNullProxyUser-seed#[809F94C0A4272EA5]) [    ] o.a.s.SolrTestCaseJ4 ###Ending testProxyNullProxyUser
   [junit4]   2> 828740 INFO  (TEST-TestSolrCloudWithSecureImpersonation.testProxyInvalidGroup-seed#[809F94C0A4272EA5]) [    ] o.a.s.SolrTestCaseJ4 ###Starting testProxyInvalidGroup
   [junit4]   2> 828758 WARN  (qtp7256155-15010) [    ] o.a.h.s.ShellBasedUnixGroupsMapping got exception trying to get groups for user bar: id: ???bar???: no such user
   [junit4]   2> 
   [junit4]   2> 828758 WARN  (qtp7256155-15010) [    ] o.a.h.s.UserGroupInformation No groups available for user bar
   [junit4]   2> 828763 WARN  (TEST-TestSolrCloudWithSecureImpersonation.testProxyInvalidGroup-seed#[809F94C0A4272EA5]) [    ] o.a.h.c.p.ResponseProcessCookies Invalid cookie header: "Set-Cookie: hadoop.auth="u=bogusGroup&p=bogusGroup&t=test&e=1501917701155&s=pr7IQtmyN1sU1jsEALx7rSl8k3g="; Path=/; Domain=127.0.0.1; Expires=sub, 05-avg-2017 07:21:41 GMT; Secure; HttpOnly". Invalid 'expires' attribute: sub, 05-avg-2017 07:21:41 GMT
   [junit4]   2> 828763 INFO  (TEST-TestSolrCloudWithSecureImpersonation.testProxyInvalidGroup-seed#[809F94C0A4272EA5]) [    ] o.a.s.SolrTestCaseJ4 ###Ending testProxyInvalidGroup
   [junit4]   2> 828779 INFO  (TEST-TestSolrCloudWithSecureImpersonation.testProxyValidateAnyHostAnyUser-seed#[809F94C0A4272EA5]) [    ] o.a.s.SolrTestCaseJ4 ###Starting testProxyValidateAnyHostAnyUser
   [junit4]   2> 828780 INFO  (qtp7256155-15000) [n:127.0.0.1:40531_solr    ] o.a.s.h.a.CollectionsHandler Invoked Collection Action :list with params doAs=bar&action=LIST&wt=javabin&version=2 and sendToOCPQueue=true
   [junit4]   2> 828780 INFO  (qtp7256155-15000) [n:127.0.0.1:40531_solr    ] o.a.s.s.HttpSolrCall [admin] webapp=null path=/admin/collections params={doAs=bar&action=LIST&wt=javabin&version=2} status=0 QTime=0
   [junit4]   2> 828781 WARN  (TEST-TestSolrCloudWithSecureImpersonation.testProxyValidateAnyHostAnyUser-seed#[809F94C0A4272EA5]) [    ] o.a.h.c.p.ResponseProcessCookies Invalid cookie header: "Set-Cookie: hadoop.auth="u=anyHostAnyUser&p=anyHostAnyUser&t=test&e=1501917701186&s=3wqAiY9t2ccN914kHTtKTvzjBy0="; Path=/; Domain=127.0.0.1; Expires=sub, 05-avg-2017 07:21:41 GMT; Secure; HttpOnly". Invalid 'expires' attribute: sub, 05-avg-2017 07:21:41 GMT
   [junit4]   2> 828781 INFO  (TEST-TestSolrCloudWithSecureImpersonation.testProxyValidateAnyHostAnyUser-seed#[809F94C0A4272EA5]) [    ] o.a.s.SolrTestCaseJ4 ###Ending testProxyValidateAnyHostAnyUser
   [junit4]   2> 828793 INFO  (TEST-TestSolrCloudWithSecureImpersonation.testProxyUnknownRemote-seed#[809F94C0A4272EA5]) [    ] o.a.s.SolrTestCaseJ4 ###Starting testProxyUnknownRemote
   [junit4]   2> 836183 WARN  (jetty-launcher-3160-thread-2-SendThread(127.0.0.1:40213)) [n:127.0.0.1:40531_solr    ] o.a.z.ClientCnxn Client session timed out, have not heard from server in 13459ms for sessionid 0x15daf1ff9d30006
   [junit4]   2> 836183 WARN  (jetty-launcher-3160-thread-1-SendThread(127.0.0.1:40213)) [n:127.0.0.1:42649_solr    ] o.a.z.ClientCnxn Client session timed out, have not heard from server in 13497ms for sessionid 0x15daf1ff9d30008
   [junit4]   2> 836183 WARN  (jetty-launcher-3160-thread-2-SendThread(127.0.0.1:40213)) [n:127.0.0.1:40531_solr    ] o.a.z.ClientCnxn Client session timed out, have not heard from server in 13497ms for sessionid 0x15daf1ff9d30007
   [junit4]   2> 836184 WARN  (NIOServerCxn.Factory:0.0.0.0/0.0.0.0:0) [    ] o.a.z.s.NIOServerCnxn caught end of stream exception
   [junit4]   2> EndOfStreamException: Unable to read additional data from client sessionid 0x15daf1ff9d30006, likely client has closed socket
   [junit4]   2> 	at org.apache.zookeeper.server.NIOServerCnxn.doIO(NIOServerCnxn.java:239)
   [junit4]   2> 	at org.apache.zookeeper.server.NIOServerCnxnFactory.run(NIOServerCnxnFactory.java:203)
   [junit4]   2> 	at java.lang.Thread.run(Thread.java:748)
   [junit4]   2> 836184 WARN  (NIOServerCxn.Factory:0.0.0.0/0.0.0.0:0) [    ] o.a.z.s.NIOServerCnxn caught end of stream exception
   [junit4]   2> EndOfStreamException: Unable to read additional data from client sessionid 0x15daf1ff9d30008, likely client has closed socket
   [junit4]   2> 	at org.apache.zookeeper.server.NIOServerCnxn.doIO(NIOServerCnxn.java:239)
   [junit4]   2> 	at org.apache.zookeeper.server.NIOServerCnxnFactory.run(NIOServerCnxnFactory.java:203)
   [junit4]   2> 	at java.lang.Thread.run(Thread.java:748)
   [junit4]   2> 836185 WARN  (NIOServerCxn.Factory:0.0.0.0/0.0.0.0:0) [    ] o.a.z.s.NIOServerCnxn caught end of stream exception
   [junit4]   2> EndOfStreamException: Unable to read additional data from client sessionid 0x15daf1ff9d30007, likely client has closed socket
   [junit4]   2> 	at org.apache.zookeeper.server.NIOServerCnxn.doIO(NIOServerCnxn.java:239)
   [junit4]   2> 	at org.apache.zookeeper.server.NIOServerCnxnFactory.run(NIOServerCnxnFactory.java:203)
   [junit4]   2> 	at java.lang.Thread.run(Thread.java:748)
   [junit4]   2> 836190 WARN  (TEST-TestSolrCloudWithSecureImpersonation.testProxyUnknownRemote-seed#[809F94C0A4272EA5]) [    ] o.a.h.c.p.ResponseProcessCookies Invalid cookie header: "Set-Cookie: hadoop.auth="u=localHostAnyGroup&p=localHostAnyGroup&t=test&e=1501917701200&s=N6/8sTShtZj7Lu0kElgz7M2UjP4="; Path=/; Domain=127.0.0.1; Expires=sub, 05-avg-2017 07:21:41 GMT; Secure; HttpOnly". Invalid 'expires' attribute: sub, 05-avg-2017 07:21:41 GMT
   [junit4]   2> 836190 INFO  (TEST-TestSolrCloudWithSecureImpersonation.testProxyUnknownRemote-seed#[809F94C0A4272EA5]) [    ] o.a.s.SolrTestCaseJ4 ###Ending testProxyUnknownRemote
   [junit4]   2> 836216 INFO  (TEST-TestSolrCloudWithSecureImpersonation.testProxyNoConfigGroups-seed#[809F94C0A4272EA5]) [    ] o.a.s.SolrTestCaseJ4 ###Starting testProxyNoConfigGroups
   [junit4]   2> 836222 WARN  (TEST-TestSolrCloudWithSecureImpersonation.testProxyNoConfigGroups-seed#[809F94C0A4272EA5]) [    ] o.a.h.c.p.ResponseProcessCookies Invalid cookie header: "Set-Cookie: hadoop.auth="u=noGroups&p=noGroups&t=test&e=1501917708624&s=uPFiWZOd0pxsvlCs4qpOFlYxN2Y="; Path=/; Domain=127.0.0.1; Expires=sub, 05-avg-2017 07:21:48 GMT; Secure; HttpOnly". Invalid 'expires' attribute: sub, 05-avg-2017 07:21:48 GMT
   [junit4]   2> 836223 INFO  (TEST-TestSolrCloudWithSecureImpersonation.testProxyNoConfigGroups-seed#[809F94C0A4272EA5]) [    ] o.a.s.SolrTestCaseJ4 ###Ending testProxyNoConfigGroups
   [junit4]   2> 836245 INFO  (TEST-TestSolrCloudWithSecureImpersonation.testProxyValidateGroup-seed#[809F94C0A4272EA5]) [    ] o.a.s.SolrTestCaseJ4 ###Starting testProxyValidateGroup
   [junit4]   2> 836247 INFO  (qtp7256155-15010) [n:127.0.0.1:40531_solr    ] o.a.s.h.a.CollectionsHandler Invoked Collection Action :list with params doAs=jenkins&action=LIST&wt=javabin&version=2 and sendToOCPQueue=true
   [junit4]   2> 836247 INFO  (qtp7256155-15010) [n:127.0.0.1:40531_solr    ] o.a.s.s.HttpSolrCall [admin] webapp=null path=/admin/collections params={doAs=jenkins&action=LIST&wt=javabin&version=2} status=0 QTime=0
   [junit4]   2> 836248 WARN  (TEST-TestSolrCloudWithSecureImpersonation.testProxyValidateGroup-seed#[809F94C0A4272EA5]) [    ] o.a.h.c.p.ResponseProcessCookies Invalid cookie header: "Set-Cookie: hadoop.auth="u=anyHostUsersGroup&p=anyHostUsersGroup&t=test&e=1501917708652&s=uYKt149PPU2OCh5//EyPkocgeVg="; Path=/; Domain=127.0.0.1; Expires=sub, 05-avg-2017 07:21:48 GMT; Secure; HttpOnly". Invalid 'expires' attribute: sub, 05-avg-2017 07:21:48 GMT
   [junit4]   2> 836248 INFO  (TEST-TestSolrCloudWithSecureImpersonation.testProxyValidateGroup-seed#[809F94C0A4272EA5]) [    ] o.a.s.SolrTestCaseJ4 ###Ending testProxyValidateGroup
   [junit4]   2> 836276 INFO  (TEST-TestSolrCloudWithSecureImpersonation.testForwarding-seed#[809F94C0A4272EA5]) [    ] o.a.s.SolrTestCaseJ4 ###Starting testForwarding
   [junit4]   2> 836284 WARN  (zkCallback-3172-thread-1-processing-n:127.0.0.1:40531_solr) [n:127.0.0.1:40531_solr    ] o.a.s.c.c.ConnectionManager Watcher org.apache.solr.common.cloud.ConnectionManager@d759e name: ZooKeeperConnection Watcher:127.0.0.1:40213/solr got event WatchedEvent state:Disconnected type:None path:null path: null type: None
   [junit4]   2> 836284 WARN  (zkCallback-3172-thread-1-processing-n:127.0.0.1:40531_solr) [n:127.0.0.1:40531_solr    ] o.a.s.c.c.ConnectionManager zkClient has disconnected
   [junit4]   2> 836476 INFO  (TEST-TestSolrCloudWithSecureImpersonation.testForwarding-seed#[809F94C0A4272EA5]) [    ] o.a.s.c.c.ZkStateReader Updated live nodes from ZooKeeper... (0) -> (2)
   [junit4]   2> 836477 INFO  (TEST-TestSolrCloudWithSecureImpersonation.testForwarding-seed#[809F94C0A4272EA5]) [    ] o.a.s.c.s.i.ZkClientClusterStateProvider Cluster at 127.0.0.1:40213/solr ready
   [junit4]   2> 836515 INFO  (qtp25482163-15014) [n:127.0.0.1:42649_solr    ] o.a.s.h.a.CollectionsHandler Invoked Collection Action :create with params pullReplicas=0&replicationFactor=1&collection.configName=conf1&maxShardsPerNode=1&name=forwardingCollection&nrtReplicas=1&action=CREATE&numShards=1&tlogReplicas=0&wt=javabin&version=2 and sendToOCPQueue=true
   [junit4]   2> 836517 INFO  (OverseerThreadFactory-3434-thread-1-processing-n:127.0.0.1:42649_solr) [n:127.0.0.1:42649_solr    ] o.a.s.c.CreateCollectionCmd Create collection forwardingCollection
   [junit4]   2> 836622 INFO  (OverseerStateUpdate-98427318742220805-127.0.0.1:42649_solr-n_0000000000) [n:127.0.0.1:42649_solr    ] o.a.s.c.o.SliceMutator createReplica() {
   [junit4]   2>   "operation":"ADDREPLICA",
   [junit4]   2>   "collection":"forwardingCollection",
   [junit4]   2>   "shard":"shard1",
   [junit4]   2>   "core":"forwardingCollection_shard1_replica_n1",
   [junit4]   2>   "state":"down",
   [junit4]   2>   "base_url":"https://127.0.0.1:42649/solr",
   [junit4]   2>   "type":"NRT"} 
   [junit4]   2> 836834 INFO  (qtp25482163-15003) [n:127.0.0.1:42649_solr    ] o.a.s.h.a.CoreAdminOperation core create command qt=/admin/cores&coreNodeName=core_node1&collection.configName=conf1&newCollection=true&name=forwardingCollection_shard1_replica_n1&action=CREATE&numShards=1&collection=forwardingCollection&shard=shard1&wt=javabin&version=2&replicaType=NRT
   [junit4]   2> 836835 INFO  (qtp25482163-15003) [n:127.0.0.1:42649_solr    ] o.a.s.c.TransientSolrCoreCacheDefault Allocating transient cache for 2147483647 transient cores
   [junit4]   2> 836942 INFO  (zkCallback-3171-thread-1-processing-n:127.0.0.1:42649_solr) [n:127.0.0.1:42649_solr    ] o.a.s.c.c.ZkStateReader A cluster state change: [WatchedEvent state:SyncConnected type:NodeDataChanged path:/collections/forwardingCollection/state.json] for collection [forwardingCollection] has occurred - updating... (live nodes size: [2])
   [junit4]   2> 836942 INFO  (zkCallback-3171-thread-2-processing-n:127.0.0.1:42649_solr) [n:127.0.0.1:42649_solr    ] o.a.s.c.c.ZkStateReader A cluster state change: [WatchedEvent state:SyncConnected type:NodeDataChanged path:/collections/forwardingCollection/state.json] for collection [forwardingCollection] has occurred - updating... (live nodes size: [2])
   [junit4]   2> 837337 INFO  (jetty-launcher-3160-thread-2-EventThread) [n:127.0.0.1:40531_solr    ] o.a.c.f.s.ConnectionStateManager State change: SUSPENDED
   [junit4]   2> 837719 INFO  (jetty-launcher-3160-thread-1-EventThread) [n:127.0.0.1:42649_solr    ] o.a.c.f.s.ConnectionStateManager State change: SUSPENDED
   [junit4]   2> 837883 INFO  (qtp25482163-15003) [n:127.0.0.1:42649_solr c:forwardingCollection s:shard1 r:core_node1 x:forwardingCollection_shard1_replica_n1] o.a.s.c.SolrConfig Using Lucene MatchVersion: 7.0.0
   [junit4]   2> 837912 INFO  (qtp25482163-15003) [n:127.0.0.1:42649_solr c:forwardingCollection s:shard1 r:core_node1 x:forwardingCollection_shard1_replica_n1] o.a.s.s.IndexSchema [forwardingCollection_shard1_replica_n1] Schema name=test
   [junit4]   2> 838001 INFO  (qtp25482163-15003) [n:127.0.0.1:42649_solr c:forwardingCollection s:shard1 r:core_node1 x:forwardingCollection_shard1_replica_n1] o.a.s.s.IndexSchema Loaded schema test/1.0 with uniqueid field id
   [junit4]   2> 838020 INFO  (qtp25482163-15003) [n:127.0.0.1:42649_solr c:forwardingCollection s:shard1 r:core_node1 x:forwardingCollection_shard1_replica_n1] o.a.s.c.CoreContainer Creating SolrCore 'forwardingCollection_shard1_replica_n1' using configuration from collection forwardingCollection, trusted=true
   [junit4]   2> 838020 INFO  (qtp25482163-15003) [n:127.0.0.1:42649_solr c:forwardingCollection s:shard1 r:core_node1 x:forwardingCollection_shard1_replica_n1] o.a.s.m.r.SolrJmxReporter JMX monitoring for 'solr_42649.solr.core.forwardingCollection.shard1.replica_n1' (registry 'solr.core.forwardingCollection.shard1.replica_n1') enabled at server: com.sun.jmx.mbeanserver.JmxMBeanServer@477ff7
   [junit4]   2> 838020 INFO  (qtp25482163-15003) [n:127.0.0.1:42649_solr c:forwardingCollection s:shard1 r:core_node1 x:forwardingCollection_shard1_replica_n1] o.a.s.c.SolrCore solr.RecoveryStrategy.Builder
   [junit4]   2> 838020 INFO  (qtp25482163-15003) [n:127.0.0.1:42649_solr c:forwardingCollection s:shard1 r:core_node1 x:forwardingCollection_shard1_replica_n1] o.a.s.c.SolrCore [[forwardingCollection_shard1_replica_n1] ] Opening new SolrCore at [/home/jenkins/workspace/Lucene-Solr-7.0-Linux/solr/build/solr-core/test/J0/temp/solr.cloud.TestSolrCloudWithSecureImpersonation_809F94C0A4272EA5-001/tempDir-001/node1/forwardingCollection_shard1_replica_n1], dataDir=[/home/jenkins/workspace/Lucene-Solr-7.0-Linux/solr/build/solr-core/test/J0/temp/solr.cloud.TestSolrCloudWithSecureImpersonation_809F94C0A4272EA5-001/tempDir-001/node1/./forwardingCollection_shard1_replica_n1/data/]
   [junit4]   2> 838023 INFO  (qtp25482163-15003) [n:127.0.0.1:42649_solr c:forwardingCollection s:shard1 r:core_node1 x:forwardingCollection_shard1_replica_n1] o.a.s.u.RandomMergePolicy RandomMergePolicy wrapping class org.apache.lucene.index.TieredMergePolicy: [TieredMergePolicy: maxMergeAtOnce=41, maxMergeAtOnceExplicit=17, maxMergedSegmentMB=76.59765625, floorSegmentMB=1.44140625, forceMergeDeletesPctAllowed=8.030977643894945, segmentsPerTier=23.0, maxCFSSegmentSizeMB=8.796093022207999E12, noCFSRatio=0.6896519509404795
   [junit4]   2> 838080 INFO  (qtp25482163-15003) [n:127.0.0.1:42649_solr c:forwardingCollection s:shard1 r:core_node1 x:forwardingCollection_shard1_replica_n1] o.a.s.u.UpdateHandler Using UpdateLog implementation: org.apache.solr.update.UpdateLog
   [junit4]   2> 838080 INFO  (qtp25482163-15003) [n:127.0.0.1:42649_solr c:forwardingCollection s:shard1 r:core_node1 x:forwardingCollection_shard1_replica_n1] o.a.s.u.UpdateLog Initializing UpdateLog: dataDir= defaultSyncLevel=FLUSH numRecordsToKeep=100 maxNumLogsToKeep=10 numVersionBuckets=65536
   [junit4]   2> 838081 INFO  (qtp25482163-15003) [n:127.0.0.1:42649_solr c:forwardingCollection s:shard1 r:core_node1 x:forwardingCollection_shard1_replica_n1] o.a.s.u.CommitTracker Hard AutoCommit: disabled
   [junit4]   2> 838081 INFO  (qtp25482163-15003) [n:127.0.0.1:42649_solr c:forwardingCollection s:shard1 r:core_node1 x:forwardingCollection_shard1_replica_n1] o.a.s.u.CommitTracker Soft AutoCommit: disabled
   [junit4]   2> 838083 INFO  (qtp25482163-15003) [n:127.0.0.1:42649_solr c:forwardingCollection s:shard1 r:core_node1 x:forwardingCollection_shard1_replica_n1] o.a.s.u.RandomMergePolicy RandomMergePolicy wrapping class org.apache.lucene.index.TieredMergePolicy: [TieredMergePolicy: maxMergeAtOnce=27, maxMergeAtOnceExplicit=25, maxMergedSegmentMB=93.9541015625, floorSegmentMB=0.994140625, forceMergeDeletesPctAllowed=25.531646301157824, segmentsPerTier=41.0, maxCFSSegmentSizeMB=8.796093022207999E12, noCFSRatio=0.21729067489801324
   [junit4]   2> 838083 INFO  (qtp25482163-15003) [n:127.0.0.1:42649_solr c:forwardingCollection s:shard1 r:core_node1 x:forwardingCollection_shard1_replica_n1] o.a.s.s.SolrIndexSearcher Opening [Searcher@47f098[forwardingCollection_shard1_replica_n1] main]
   [junit4]   2> 838085 INFO  (qtp25482163-15003) [n:127.0.0.1:42649_solr c:forwardingCollection s:shard1 r:core_node1 x:forwardingCollection_shard1_replica_n1] o.a.s.h.c.SpellCheckComponent Initializing spell checkers
   [junit4]   2> 838101 INFO  (qtp25482163-15003) [n:127.0.0.1:42649_solr c:forwardingCollection s:shard1 r:core_node1 x:forwardingCollection_shard1_replica_n1] o.a.s.s.DirectSolrSpellChecker init: {name=direct,classname=DirectSolrSpellChecker,field=lowerfilt,minQueryLength=3}
   [junit4]   2> 838171 INFO  (qtp25482163-15003) [n:127.0.0.1:42649_solr c:forwardingCollection s:shard1 r:core_node1 x:forwardingCollection_shard1_replica_n1] o.a.s.h.ReplicationHandler Commits will be reserved for  10000
   [junit4]   2> 838171 INFO  (searcherExecutor-3439-thread-1-processing-n:127.0.0.1:42649_solr x:forwardingCollection_shard1_replica_n1 s:shard1 c:forwardingCollection r:core_node1) [n:127.0.0.1:42649_solr c:forwardingCollection s:shard1 r:core_node1 x:forwardingCollection_shard1_replica_n1] o.a.s.h.c.SpellCheckComponent Loading spell index for spellchecker: default
   [junit4]   2> 838171 INFO  (searcherExecutor-3439-thread-1-processing-n:127.0.0.1:42649_solr x:forwardingCollection_shard1_replica_n1 s:shard1 c:forwardingCollection r:core_node1) [n:127.0.0.1:42649_solr c:forwardingCollection s:shard1 r:core_node1 x:forwardingCollection_shard1_replica_n1] o.a.s.h.c.SpellCheckComponent Loading spell index for spellchecker: direct
   [junit4]   2> 838172 INFO  (searcherExecutor-3439-thread-1-processing-n:127.0.0.1:42649_solr x:forwardingCollection_shard1_replica_n1 s:shard1 c:forwardingCollection r:core_node1) [n:127.0.0.1:42649_solr c:forwardingCollection s:shard1 r:core_node1 x:forwardingCollection_shard1_replica_n1] o.a.s.h.c.SpellCheckComponent Loading spell index for spellchecker: wordbreak
   [junit4]   2> 838172 INFO  (qtp25482163-15003) [n:127.0.0.1:42649_solr c:forwardingCollection s:shard1 r:core_node1 x:forwardingCollection_shard1_replica_n1] o.a.s.u.UpdateLog Could not find max version in index or recent updates, using new clock 1574837116551036928
   [junit4]   2> 838172 INFO  (searcherExecutor-3439-thread-1-processing-n:127.0.0.1:42649_solr x:forwardingCollection_shard1_replica_n1 s:shard1 c:forwardingCollection r:core_node1) [n:127.0.0.1:42649_solr c:forwardingCollection s:shard1 r:core_node1 x:forwardingCollection_shard1_replica_n1] o.a.s.h.c.SpellCheckComponent Loading spell index for spellchecker: multipleFields
   [junit4]   2> 838172 INFO  (searcherExecutor-3439-thread-1-processing-n:127.0.0.1:42649_solr x:forwardingCollection_shard1_replica_n1 s:shard1 c:forwardingCollection r:core_node1) [n:127.0.0.1:42649_solr c:forwardingCollection s:shard1 r:core_node1 x:forwardingCollection_shard1_replica_n1] o.a.s.h.c.SpellCheckComponent Loading spell index for spellchecker: jarowinkler
   [junit4]   2> 838173 INFO  (searcherExecutor-3439-thread-1-processing-n:127.0.0.1:42649_solr x:forwardingCollection_shard1_replica_n1 s:shard1 c:forwardingCollection r:core_node1) [n:127.0.0.1:42649_solr c:forwardingCollection s:shard1 r:core_node1 x:forwardingCollection_shard1_replica_n1] o.a.s.h.c.SpellCheckComponent Loading spell index for spellchecker: external
   [junit4]   2> 838173 INFO  (searcherExecutor-3439-thread-1-processing-n:127.0.0.1:42649_solr x:forwardingCollection_shard1_replica_n1 s:shard1 c:forwardingCollection r:core_node1) [n:127.0.0.1:42649_solr c:forwardingCollection s:shard1 r:core_node1 x:forwardingCollection_shard1_replica_n1] o.a.s.h.c.SpellCheckComponent Loading spell index for spellchecker: freq
   [junit4]   2> 838173 INFO  (searcherExecutor-3439-thread-1-processing-n:127.0.0.1:42649_solr x:forwardingCollection_shard1_replica_n1 s:shard1 c:forwardingCollection r:core_node1) [n:127.0.0.1:42649_solr c:forwardingCollection s:shard1 r:core_node1 x:forwardingCollection_shard1_replica_n1] o.a.s.h.c.SpellCheckComponent Loading spell index for spellchecker: fqcn
   [junit4]   2> 838173 INFO  (searcherExecutor-3439-thread-1-processing-n:127.0.0.1:42649_solr x:forwardingCollection_shard1_replica_n1 s:shard1 c:forwardingCollection r:core_node1) [n:127.0.0.1:42649_solr c:forwardingCollection s:shard1 r:core_node1 x:forwardingCollection_shard1_replica_n1] o.a.s.h.c.SpellCheckComponent Loading spell index for spellchecker: perDict
   [junit4]   2> 838177 INFO  (searcherExecutor-3439-thread-1-processing-n:127.0.0.1:42649_solr x:forwardingCollection_shard1_replica_n1 s:shard1 c:forwardingCollection r:core_node1) [n:127.0.0.1:42649_solr c:forwardingCollection s:shard1 r:core_node1 x:forwardingCollection_shard1_replica_n1] o.a.s.c.SolrCore [forwardingCollection_shard1_replica_n1] Registered new searcher Searcher@47f098[forwardingCollection_shard1_replica_n1] main{ExitableDirectoryReader(UninvertingDirectoryReader())}
   [junit4]   2> 838181 INFO  (qtp25482163-15003) [n:127.0.0.1:42649_solr c:forwardingCollection s:shard1 r:core_node1 x:forwardingCollection_shard1_replica_n1] o.a.s.c.ShardLeaderElectionContext Enough replicas found to continue.
   [junit4]   2> 838181 INFO  (qtp25482163-15003) [n:127.0.0.1:42649_solr c:forwardingCollection s:shard1 r:core_node1 x:forwardingCollection_shard1_replica_n1] o.a.s.c.ShardLeaderElectionContext I may be the new leader - try and sync
   [junit4]   2> 838181 INFO  (qtp25482163-15003) [n:127.0.0.1:42649_solr c:forwardingCollection s:shard1 r:core_node1 x:forwardingCollection_shard1_replica_n1] o.a.s.c.SyncStrategy Sync replicas to https://127.0.0.1:42649/solr/forwardingCollection_shard1_replica_n1/
   [junit4]   2> 838181 INFO  (qtp25482163-15003) [n:127.0.0.1:42649_solr c:forwardingCollection s:shard1 r:core_node1 x:forwardingCollection_shard1_replica_n1] o.a.s.c.SyncStrategy Sync Success - now sync replicas to me
   [junit4]   2> 838181 INFO  (qtp25482163-15003) [n:127.0.0.1:42649_solr c:forwardingCollection s:shard1 r:core_node1 x:forwardingCollection_shard1_replica_n1] o.a.s.c.SyncStrategy https://127.0.0.1:42649/solr/forwardingCollection_shard1_replica_n1/ has no replicas
   [junit4]   2> 838181 INFO  (qtp25482163-15003) [n:127.0.0.1:42649_solr c:forwardingCollection s:shard1 r:core_node1 x:forwardingCollection_shard1_replica_n1] o.a.s.c.ShardLeaderElectionContext Found all replicas participating in election, clear LIR
   [junit4]   2> 838186 INFO  (qtp25482163-15003) [n:127.0.0.1:42649_solr c:forwardingCollection s:shard1 r:core_node1 x:forwardingCollection_shard1_replica_n1] o.a.s.c.ShardLeaderElectionContext I am the new leader: https://127.0.0.1:42649/solr/forwardingCollection_shard1_replica_n1/ shard1
   [junit4]   2> 838289 INFO  (zkCallback-3171-thread-2-processing-n:127.0.0.1:42649_solr) [n:127.0.0.1:42649_solr    ] o.a.s.c.c.ZkStateReader A cluster state change: [WatchedEvent state:SyncConnected type:NodeDataChanged path:/collections/forwardingCollection/state.json] for collection [forwardingCollection] has occurred - updating... (live nodes size: [2])
   [junit4]   2> 838289 INFO  (zkCallback-3171-thread-1-processing-n:127.0.0.1:42649_solr) [n:127.0.0.1:42649_solr    ] o.a.s.c.c.ZkStateReader A cluster state change: [WatchedEvent state:SyncConnected type:NodeDataChanged path:/collections/forwardingCollection/state.json] for collection [forwardingCollection] has occurred - updating... (live nodes size: [2])
   [junit4]   2> 838337 INFO  (qtp25482163-15003) [n:127.0.0.1:42649_solr c:forwardingCollection s:shard1 r:core_node1 x:forwardingCollection_shard1_replica_n1] o.a.s.c.ZkController I am the leader, no recovery necessary
   [junit4]   2> 838340 INFO  (qtp25482163-15003) [n:127.0.0.1:42649_solr c:forwardingCollection s:shard1 r:core_node1 x:forwardingCollection_shard1_replica_n1] o.a.s.s.HttpSolrCall [admin] webapp=null path=/admin/cores params={qt=/admin/cores&coreNodeName=core_node1&collection.configName=conf1&newCollection=true&name=forwardingCollection_shard1_replica_n1&action=CREATE&numShards=1&collection=forwardingCollection&shard=shard1&wt=javabin&version=2&replicaType=NRT} status=0 QTime=1505
   [junit4]   2> 838341 WARN  (httpShardExecutor-3430-thread-1-processing-n:127.0.0.1:42649_solr [https:////127.0.0.1:42649//solr] https:////127.0.0.1:42649//solr) [n:127.0.0.1:42649_solr    ] o.a.h.c.p.ResponseProcessCookies Invalid cookie header: "Set-Cookie: hadoop.auth="u=$&p=$&t=test&e=1501917709239&s=hiwe86peKHNiSh2suwKpXj/HYoM="; Path=/; Domain=127.0.0.1; Expires=sub, 05-avg-2017 07:21:49 GMT; Secure; HttpOnly". Invalid 'expires' attribute: sub, 05-avg-2017 07:21:49 GMT
   [junit4]   2> 838346 INFO  (qtp25482163-15014) [n:127.0.0.1:42649_solr    ] o.a.s.h.a.CollectionsHandler Wait for new collection to be active for at most 30 seconds. Check all shard replicas
   [junit4]   2> 838444 INFO  (zkCallback-3171-thread-1-processing-n:127.0.0.1:42649_solr) [n:127.0.0.1:42649_solr    ] o.a.s.c.c.ZkStateReader A cluster state change: [WatchedEvent state:SyncConnected type:NodeDataChanged path:/collections/forwardingCollection/state.json] for collection [forwardingCollection] has occurred - updating... (live nodes size: [2])
   [junit4]   2> 838444 INFO  (zkCallback-3171-thread-2-processing-n:127.0.0.1:42649_solr) [n:127.0.0.1:42649_solr    ] o.a.s.c.c.ZkStateReader A cluster state change: [WatchedEvent state:SyncConnected type:NodeDataChanged path:/collections/forwardingCollection/state.json] for collection [forwardingCollection] has occurred - updating... (live nodes size: [2])
   [junit4]   2> 838520 INFO  (OverseerCollectionConfigSetProcessor-98427318742220805-127.0.0.1:42649_solr-n_0000000000) [n:127.0.0.1:42649_solr    ] o.a.s.c.OverseerTaskQueue Response ZK path: /overseer/collection-queue-work/qnr-0000000000 doesn't exist.  Requestor may have disconnected from ZooKeeper
   [junit4]   2> 839346 INFO  (qtp25482163-15014) [n:127.0.0.1:42649_solr    ] o.a.s.s.HttpSolrCall [admin] webapp=null path=/admin/collections params={pullReplicas=0&replicationFactor=1&collection.configName=conf1&maxShardsPerNode=1&name=forwardingCollection&nrtReplicas=1&action=CREATE&numShards=1&tlogReplicas=0&wt=javabin&version=2} status=0 QTime=2831
   [junit4]   2> 839347 WARN  (TEST-TestSolrCloudWithSecureImpersonation.testForwarding-seed#[809F94C0A4272EA5]) [    ] o.a.h.c.p.ResponseProcessCookies Invalid cookie header: "Set-Cookie: hadoop.auth="u=user&p=user&t=test&e=1501917708920&s=CskF7gsNCVY5VNV3FPAFblEyf6s="; Path=/; Domain=127.0.0.1; Expires=sub, 05-avg-2017 07:21:48 GMT; Secure; HttpOnly". Invalid 'expires' attribute: sub, 05-avg-2017 07:21:48 GMT
   [junit4]   2> 839348 INFO  (TEST-TestSolrCloudWithSecureImpersonation.testForwarding-seed#[809F94C0A4272EA5]) [    ] o.a.s.c.AbstractDistribZkTestBase Wait for recoveries to finish - collection: forwardingCollection failOnTimeout:true timeout (sec):100
   [junit4]   2> 839348 INFO  (TEST-TestSolrCloudWithSecureImpersonation.testForwarding-seed#[809F94C0A4272EA5]) [    ] o.a.s.c.AbstractDistribZkTestBase Recoveries finished - collection: forwardingCollection
   [junit4]   2> 839361 INFO  (qtp7256155-14999) [n:127.0.0.1:40531_solr    ] o.a.s.c.TransientSolrCoreCacheDefault Allocating transient cache for 2147483647 transient cores
   [junit4]   2> 839373 INFO  (qtp25482163-15014) [n:127.0.0.1:42649_solr c:forwardingCollection s:shard1 r:core_node1 x:forwardingCollection_shard1_replica_n1] o.a.s.c.S.Request [forwardingCollection_shard1_replica_n1]  webapp=/solr path=/select params={q=*:*&wt=javabin&version=2} hits=0 status=0 QTime=0
   [junit4]   2> 839374 WARN  (qtp7256155-14999) [n:127.0.0.1:40531_solr    ] o.a.h.c.p.ResponseProcessCookies Invalid cookie header: "Set-Cookie: hadoop.auth="u=$&p=$&t=test&e=1501917711777&s=RFCF13g+s4A2ZSYnkTOz0H9q2wA="; Path=/; Domain=127.0.0.1; Expires=sub, 05-avg-2017 07:21:51 GMT; Secure; HttpOnly". Invalid 'expires' attribute: sub, 05-avg-2017 07:21:51 GMT
   [junit4]   2> 839380 WARN  (TEST-TestSolrCloudWithSecureImpersonation.testForwarding-seed#[809F94C0A4272EA5]) [    ] o.a.h.c.p.ResponseProcessCookies Invalid cookie header: "Set-Cookie: hadoop.auth="u=user&p=user&t=test&e=1501917711766&s=abYqsp6P0w3mjOzarKedNtbLtM4="; Path=/; Domain=127.0.0.1; Expires=sub, 05-avg-2017 07:21:51 GMT; Secure; HttpOnly". Invalid 'expires' attribute: sub, 05-avg-2017 07:21:51 GMT
   [junit4]   2> 839381 WARN  (TEST-TestSolrCloudWithSecureImpersonation.testForwarding-seed#[809F94C0A4272EA5]) [    ] o.a.h.c.p.ResponseProcessCookies Invalid cookie header: "Set-Cookie: hadoop.auth="u=$&p=$&t=test&e=1501917711777&s=RFCF13g+s4A2ZSYnkTOz0H9q2wA="; Path=/; Domain=127.0.0.1; Expires=sub, 05-avg-2017 07:21:51 GMT; Secure; HttpOnly". Invalid 'expires' attribute: sub, 05-avg-2017 07:21:51 GMT
   [junit4]   2> 839392 INFO  (qtp25482163-15003) [n:127.0.0.1:42649_solr c:forwardingCollection s:shard1 r:core_node1 x:forwardingCollection_shard1_replica_n1] o.a.s.c.S.Request [forwardingCollection_shard1_replica_n1]  webapp=/solr path=/select params={q=*:*&wt=javabin&version=2} hits=0 status=0 QTime=0
   [junit4]   2> 839393 WARN  (TEST-TestSolrCloudWithSecureImpersonation.testForwarding-seed#[809F94C0A4272EA5]) [    ] o.a.h.c.p.ResponseProcessCookies Invalid cookie header: "Set-Cookie: hadoop.auth="u=user&p=user&t=test&e=1501917711797&s=wPu65Xj1+E3xc4YbLNJ6fNZp45M="; Path=/; Domain=127.0.0.1; Expires=sub, 05-avg-2017 07:21:51 GMT; Secure; HttpOnly". Invalid 'expires' attribute: sub, 05-avg-2017 07:21:51 GMT
   [junit4]   2> 839394 INFO  (TEST-TestSolrCloudWithSecureImpersonation.testForwarding-seed#[809F94C0A4272EA5]) [    ] o.a.s.SolrTestCaseJ4 ###Ending testForwarding
   [junit4]   2> 839398 INFO  (jetty-closer-3161-thread-1) [    ] o.e.j.s.AbstractConnector Stopped ServerConnector@615da7{SSL,[ssl, http/1.1]}{127.0.0.1:0}
   [junit4]   2> 839398 INFO  (jetty-closer-3161-thread-2) [    ] o.e.j.s.AbstractConnector Stopped ServerConnector@1839169{SSL,[ssl, http/1.1]}{127.0.0.1:0}
   [junit4]   2> 839398 INFO  (jetty-closer-3161-thread-1) [    ] o.a.s.c.CoreContainer Shutting down CoreContainer instance=28815234
   [junit4]   2> 839399 INFO  (jetty-closer-3161-thread-2) [    ] o.a.s.c.CoreContainer Shutting down CoreContainer instance=33130881
   [junit4]   2> 839399 INFO  (jetty-closer-3161-thread-1) [    ] o.a.s.m.SolrMetricManager Closing metric reporters for registry=solr.node, tag=null
   [junit4]   2> 839399 INFO  (jetty-closer-3161-thread-2) [    ] o.a.s.m.SolrMetricManager Closing metric reporters for registry=solr.node, tag=null
   [junit4]   2> 839406 INFO  (jetty-closer-3161-thread-2) [    ] o.a.s.m.SolrMetricManager Closing metric reporters for registry=solr.jvm, tag=null
   [junit4]   2> 839407 INFO  (jetty-closer-3161-thread-1) [    ] o.a.s.m.SolrMetricManager Closing metric reporters for registry=solr.jvm, tag=null
   [junit4]   2> 839411 INFO  (jetty-closer-3161-thread-2) [    ] o.a.s.m.SolrMetricManager Closing metric reporters for registry=solr.jetty, tag=null
   [junit4]   2> 839412 INFO  (jetty-closer-3161-thread-1) [    ] o.a.s.m.SolrMetricManager Closing metric reporters for registry=solr.jetty, tag=null
   [junit4]   2> 839414 INFO  (jetty-closer-3161-thread-2) [    ] o.a.s.m.SolrMetricManager Closing metric reporters for registry=solr.cluster, tag=null
   [junit4]   2> 839414 INFO  (jetty-closer-3161-thread-1) [    ] o.a.s.m.SolrMetricManager Closing metric reporters for registry=solr.cluster, tag=null
   [junit4]   2> 839415 INFO  (coreCloseExecutor-3444-thread-1) [n:127.0.0.1:42649_solr c:forwardingCollection s:shard1 r:core_node1 x:forwardingCollection_shard1_replica_n1] o.a.s.c.SolrCore [forwardingCollection_shard1_replica_n1]  CLOSING SolrCore org.apache.solr.core.SolrCore@18ec36f
   [junit4]   2> 839416 WARN  (zkCallback-3172-thread-3-processing-n:127.0.0.1:40531_solr) [n:127.0.0.1:40531_solr    ] o.a.s.c.c.ZkStateReader ZooKeeper watch triggered, but Solr cannot talk to ZK: [KeeperErrorCode = Session expired for /live_nodes]
   [junit4]   2> 839416 INFO  (zkCallback-3171-thread-2-processing-n:127.0.0.1:42649_solr) [n:127.0.0.1:42649_solr    ] o.a.s.c.c.ZkStateReader Updated live nodes from ZooKeeper... (2) -> (1)
   [junit4]   2> 839416 ERROR (Thread[Thread-1833,5,TGRP-TestSolrCloudWithSecureImpersonation]) [n:127.0.0.1:40531_solr    ] o.a.h.s.t.d.AbstractDelegationTokenSecretManager ExpiredTokenRemover received java.lang.InterruptedException: sleep interrupted
   [junit4]   2> 839418 INFO  (coreCloseExecutor-3444-thread-1) [n:127.0.0.1:42649_solr c:forwardingCollection s:shard1 r:core_node1 x:forwardingCollection_shard1_replica_n1] o.a.s.m.SolrMetricManager Closing metric reporters for registry=solr.core.forwardingCollection.shard1.replica_n1, tag=26133359
   [junit4]   2> 839423 INFO  (jetty-closer-3161-thread-1) [    ] o.e.j.s.h.ContextHandler Stopped o.e.j.s.ServletContextHandler@17fa210{/solr,null,UNAVAILABLE}
   [junit4]   2> 839424 INFO  (coreCloseExecutor-3444-thread-1) [n:127.0.0.1:42649_solr c:forwardingCollection s:shard1 r:core_node1 x:forwardingCollection_shard1_replica_n1] o.a.s.m.SolrMetricManager Closing metric reporters for registry=solr.collection.forwardingCollection.shard1.leader, tag=26133359
   [junit4]   2> 839425 INFO  (jetty-closer-3161-thread-2) [    ] o.a.s.c.Overseer Overseer (id=98427318742220805-127.0.0.1:42649_solr-n_0000000000) closing
   [junit4]   2> 839425 INFO  (OverseerStateUpdate-98427318742220805-127.0.0.1:42649_solr-n_0000000000) [n:127.0.0.1:42649_solr    ] o.a.s.c.Overseer Overseer Loop exiting : 127.0.0.1:42649_solr
   [junit4]   2> 839426 WARN  (zkCallback-3171-thread-2-processing-n:127.0.0.1:42649_solr) [n:127.0.0.1:42649_solr    ] o.a.s.c.c.ZkStateReader ZooKeeper watch triggered, but Solr cannot talk to ZK: [KeeperErrorCode = Session expired for /live_nodes]
   [junit4]   2> 839426 ERROR (Thread[Thread-1832,5,TGRP-TestSolrCloudWithSecureImpersonation]) [n:127.0.0.1:42649_solr    ] o.a.h.s.t.d.AbstractDelegationTokenSecretManager ExpiredTokenRemover received java.lang.InterruptedException: sleep interrupted
   [junit4]   2> 839427 INFO  (jetty-closer-3161-thread-2) [    ] o.e.j.s.h.ContextHandler Stopped o.e.j.s.ServletContextHandler@1540dba{/solr,null,UNAVAILABLE}
   [junit4]   2> 839427 ERROR (SUITE-TestSolrCloudWithSecureImpersonation-seed#[809F94C0A4272EA5]-worker) [    ] o.a.z.s.ZooKeeperServer ZKShutdownHandler is not registered, so ZooKeeper server won't take any action on ERROR or SHUTDOWN server state changes
   [junit4]   2> 839427 INFO  (SUITE-TestSolrCloudWithSecureImpersonation-seed#[809F94C0A4272EA5]-worker) [    ] o.a.s.c.ZkTestServer connecting to 127.0.0.1:40213 40213
   [junit4]   2> 846744 INFO  (Thread-1815) [    ] o.a.s.c.ZkTestServer connecting to 127.0.0.1:40213 40213
   [junit4]   2> 846746 WARN  (Thread-1815) [    ] o.a.s.c.ZkTestServer Watch limit violations: 
   [junit4]   2> Maximum concurrent create/delete watches above limit:
   [junit4]   2> 
   [junit4]   2> 	3	/solr/aliases.json
   [junit4]   2> 	2	/solr/security.json
   [junit4]   2> 
   [junit4]   2> Maximum concurrent data watches above limit:
   [junit4]   2> 
   [junit4]   2> 	6	/solr/security/zkdtsm/ZKDTSMRoot/ZKDTSMKeyIdRoot
   [junit4]   2> 	5	/solr/collections/forwardingCollection/state.json
   [junit4]   2> 	4	/solr/security/zkdtsm/ZKDTSMRoot/ZKDTSMSeqNumRoot
   [junit4]   2> 	3	/solr/clusterstate.json
   [junit4]   2> 	3	/solr/clusterprops.json
   [junit4]   2> 	2	/solr/security/zkdtsm/ZKDTSMRoot/ZKDTSMMasterKeyRoot/DK_1
   [junit4]   2> 	2	/solr/security/zkdtsm/ZKDTSMRoot/ZKDTSMMasterKeyRoot/DK_3
   [junit4]   2> 	2	/solr/security/zkdtsm/ZKDTSMRoot/ZKDTSMMasterKeyRoot/DK_2
   [junit4]   2> 	2	/solr/security/zkdtsm/ZKDTSMRoot/ZKDTSMMasterKeyRoot/DK_4
   [junit4]   2> 
   [junit4]   2> Maximum concurrent children watches above limit:
   [junit4]   2> 
   [junit4]   2> 	4	/solr/security/zkdtsm/ZKDTSMRoot/ZKDTSMMasterKeyRoot
   [junit4]   2> 	3	/solr/live_nodes
   [junit4]   2> 	3	/solr/collections
   [junit4]   2> 	3	/solr/security/zkdtsm/ZKDTSMRoot/ZKDTSMTokensRoot
   [junit4]   2> 
   [junit4]   2> 846761 INFO  (SUITE-TestSolrCloudWithSecureImpersonation-seed#[809F94C0A4272EA5]-worker) [    ] o.a.s.SolrTestCaseJ4 ------------------------------------------------------- Done waiting for tracked resources to be released
   [junit4]   2> Aug 04, 2017 9:21:59 PM com.carrotsearch.randomizedtesting.ThreadLeakControl checkThreadLeaks
   [junit4]   2> WARNING: Will linger awaiting termination of 2 leaked thread(s).
   [junit4]   2> Aug 04, 2017 9:22:19 PM com.carrotsearch.randomizedtesting.ThreadLeakControl checkThreadLeaks
   [junit4]   2> SEVERE: 2 threads leaked from SUITE scope at org.apache.solr.cloud.TestSolrCloudWithSecureImpersonation: 
   [junit4]   2>    1) Thread[id=15047, name=jetty-launcher-3160-thread-1-EventThread, state=TIMED_WAITING, group=TGRP-TestSolrCloudWithSecureImpersonation]
   [junit4]   2>         at sun.misc.Unsafe.park(Native Method)
   [junit4]   2>         at java.util.concurrent.locks.LockSupport.parkNanos(LockSupport.java:215)
   [junit4]   2>         at java.util.concurrent.locks.AbstractQueuedSynchronizer.doAcquireSharedNanos(AbstractQueuedSynchronizer.java:1037)
   [junit4]   2>         at java.util.concurrent.locks.AbstractQueuedSynchronizer.tryAcquireSharedNanos(AbstractQueuedSynchronizer.java:1328)
   [junit4]   2>         at java.util.concurrent.CountDownLatch.await(CountDownLatch.java:277)
   [junit4]   2>         at org.apache.curator.CuratorZookeeperClient.internalBlockUntilConnectedOrTimedOut(CuratorZookeeperClient.java:323)
   [junit4]   2>         at org.apache.curator.RetryLoop.callWithRetry(RetryLoop.java:105)
   [junit4]   2>         at org.apache.curator.framework.imps.GetDataBuilderImpl.pathInForeground(GetDataBuilderImpl.java:288)
   [junit4]   2>         at org.apache.curator.framework.imps.GetDataBuilderImpl.forPath(GetDataBuilderImpl.java:279)
   [junit4]   2>         at org.apache.curator.framework.imps.GetDataBuilderImpl.forPath(GetDataBuilderImpl.java:41)
   [junit4]   2>         at org.apache.curator.framework.recipes.shared.SharedValue.readValue(SharedValue.java:244)
   [junit4]   2>         at org.apache.curator.framework.recipes.shared.SharedValue.access$100(SharedValue.java:44)
   [junit4]   2>         at org.apache.curator.framework.recipes.shared.SharedValue$1.process(SharedValue.java:61)
   [junit4]   2>         at org.apache.curator.framework.imps.NamespaceWatcher.process(NamespaceWatcher.java:67)
   [junit4]   2>         at org.apache.zookeeper.ClientCnxn$EventThread.processEvent(ClientCnxn.java:530)
   [junit4]   2>         at org.apache.zookeeper.ClientCnxn$EventThread.run(ClientCnxn.java:505)
   [junit4]   2>    2) Thread[id=15045, name=jetty-launcher-3160-thread-2-EventThread, state=TIMED_WAITING, group=TGRP-TestSolrCloudWithSecureImpersonation]
   [junit4]   2>         at sun.misc.Unsafe.park(Native Method)
   [junit4]   2>         at java.util.concurrent.locks.LockSupport.parkNanos(LockSupport.java:215)
   [junit4]   2>         at java.util.concurrent.locks.AbstractQueuedSynchronizer.doAcquireSharedNanos(AbstractQueuedSynchronizer.java:1037)
   [junit4]   2>         at java.util.concurrent.locks.AbstractQueuedSynchronizer.tryAcquireSharedNanos(AbstractQueuedSynchronizer.java:1328)
   [junit4]   2>         at java.util.concurrent.CountDownLatch.await(CountDownLatch.java:277)
   [junit4]   2>         at org.apache.curator.CuratorZookeeperClient.internalBlockUntilConnectedOrTimedOut(CuratorZookeeperClient.java:323)
   [junit4]   2>         at org.apache.curator.RetryLoop.callWithRetry(RetryLoop.java:105)
   [junit4]   2>         at org.apache.curator.framework.imps.GetDataBuilderImpl.pathInForeground(GetDataBuilderImpl.java:288)
   [junit4]   2>         at org.apache.curator.framework.imps.GetDataBuilderImpl.forPath(GetDataBuilderImpl.java:279)
   [junit4]   2>         at org.apache.curator.framework.imps.GetDataBuilderImpl.forPath(GetDataBuilderImpl.java:41)
   [junit4]   2>         at org.apache.curator.framework.recipes.shared.SharedValue.readValue(SharedValue.java:244)
   [junit4]   2>         at org.apache.curator.framework.recipes.shared.SharedValue.access$100(SharedValue.java:44)
   [junit4]   2>         at org.apache.curator.framework.recipes.shared.SharedValue$1.process(SharedValue.java:61)
   [junit4]   2>         at org.apache.curator.framework.imps.NamespaceWatcher.process(NamespaceWatcher.java:67)
   [junit4]   2>         at org.apache.zookeeper.ClientCnxn$EventThread.processEvent(ClientCnxn.java:530)
   [junit4]   2>         at org.apache.zookeeper.ClientCnxn$EventThread.run(ClientCnxn.java:505)
   [junit4]   2> Aug 04, 2017 9:22:19 PM com.carrotsearch.randomizedtesting.ThreadLeakControl tryToInterruptAll
   [junit4]   2> INFO: Starting to interrupt leaked threads:
   [junit4]   2>    1) Thread[id=15047, name=jetty-launcher-3160-thread-1-EventThread, state=TIMED_WAITING, group=TGRP-TestSolrCloudWithSecureImpersonation]
   [junit4]   2>    2) Thread[id=15045, name=jetty-launcher-3160-thread-2-EventThread, state=TIMED_WAITING, group=TGRP-TestSolrCloudWithSecureImpersonation]
   [junit4]   2> 866917 ERROR (jetty-launcher-3160-thread-2-EventThread) [n:127.0.0.1:40531_solr    ] o.a.c.f.i.CuratorFrameworkImpl Watcher exception
   [junit4]   2> java.lang.InterruptedException
   [junit4]   2> 	at java.util.concurrent.locks.AbstractQueuedSynchronizer.doAcquireSharedNanos(AbstractQueuedSynchronizer.java:1039)
   [junit4]   2> 	at java.util.concurrent.locks.AbstractQueuedSynchronizer.tryAcquireSharedNanos(AbstractQueuedSynchronizer.java:1328)
   [junit4]   2> 	at java.util.concurrent.CountDownLatch.await(CountDownLatch.java:277)
   [junit4]   2> 	at org.apache.curator.CuratorZookeeperClient.internalBlockUntilConnectedOrTimedOut(CuratorZookeeperClient.java:323)
   [junit4]   2> 	at org.apache.curator.RetryLoop.callWithRetry(RetryLoop.java:105)
   [junit4]   2> 	at org.apache.curator.framework.imps.GetDataBuilderImpl.pathInForeground(GetDataBuilderImpl.java:288)
   [junit4]   2> 	at org.apache.curator.framework.imps.GetDataBuilderImpl.forPath(GetDataBuilderImpl.java:279)
   [junit4]   2> 	at org.apache.curator.framework.imps.GetDataBuilderImpl.forPath(GetDataBuilderImpl.java:41)
   [junit4]   2> 	at org.apache.curator.framework.recipes.shared.SharedValue.readValue(SharedValue.java:244)
   [junit4]   2> 	at org.apache.curator.framework.recipes.shared.SharedValue.access$100(SharedValue.java:44)
   [junit4]   2> 	at org.apache.curator.framework.recipes.shared.SharedValue$1.process(SharedValue.java:61)
   [junit4]   2> 	at org.apache.curator.framework.imps.NamespaceWatcher.process(NamespaceWatcher.java:67)
   [junit4]   2> 	at org.apache.zookeeper.ClientCnxn$EventThread.processEvent(ClientCnxn.java:530)
   [junit4]   2> 	at org.apache.zookeeper.ClientCnxn$EventThread.run(ClientCnxn.java:505)
   [junit4]   2> 866917 ERROR (jetty-launcher-3160-thread-1-EventThread) [n:127.0.0.1:42649_solr    ] o.a.c.f.i.CuratorFrameworkImpl Watcher exception
   [junit4]   2> java.lang.InterruptedException
   [junit4]   2> 	at java.util.concurrent.locks.AbstractQueuedSynchronizer.doAcquireSharedNanos(AbstractQueuedSynchronizer.java:1039)
   [junit4]   2> 	at java.util.concurrent.locks.AbstractQueuedSynchronizer.tryAcquireSharedNanos(AbstractQueuedSynchronizer.java:1328)
   [junit4]   2> 	at java.util.concurrent.CountDownLatch.await(CountDownLatch.java:277)
   [junit4]   2> 	at org.apache.curator.CuratorZookeeperClient.internalBlockUntilConnectedOrTimedOut(CuratorZookeeperClient.java:323)
   [junit4]   2> 	at org.apache.curator.RetryLoop.callWithRetry(RetryLoop.java:105)
   [junit4]   2> 	at org.apache.curator.framework.imps.GetDataBuilderImpl.pathInForeground(GetDataBuilderImpl.java:288)
   [junit4]   2> 	at org.apache.curator.framework.imps.GetDataBuilderImpl.forPath(GetDataBuilderImpl.java:279)
   [junit4]   2> 	at org.apache.curator.framework.imps.GetDataBuilderImpl.forPath(GetDataBuilderImpl.java:41)
   [junit4]   2> 	at org.apache.curator.framework.recipes.shared.SharedValue.readValue(SharedValue.java:244)
   [junit4]   2> 	at org.apache.curator.framework.recipes.shared.SharedValue.access$100(SharedValue.java:44)
   [junit4]   2> 	at org.apache.curator.framework.recipes.shared.SharedValue$1.process(SharedValue.java:61)
   [junit4]   2> 	at org.apache.curator.framework.imps.NamespaceWatcher.process(NamespaceWatcher.java:67)
   [junit4]   2> 	at org.apache.zookeeper.ClientCnxn$EventThread.processEvent(ClientCnxn.java:530)
   [junit4]   2> 	at org.apache.zookeeper.ClientCnxn$EventThread.run(ClientCnxn.java:505)
   [junit4]   2> Aug 04, 2017 9:22:19 PM com.carrotsearch.randomizedtesting.ThreadLeakControl tryToInterruptAll
   [junit4]   2> INFO: All leaked threads terminated.
   [junit4]   2> NOTE: test params are: codec=CheapBastard, sim=RandomSimilarity(queryNorm=false): {}, locale=sr-Latn-BA, timezone=CST
   [junit4]   2> NOTE: Linux 4.10.0-27-generic i386/Oracle Corporation 1.8.0_141 (32-bit)/cpus=8,threads=1,free=244515440,total=403439616
   [junit4]   2> NOTE: All tests run in this JVM: [OutputWriterTest, RAMDirectoryFactoryTest, TestJsonFacetRefinement, XmlUpdateRequestHandlerTest, BinaryUpdateRequestHandlerTest, TestCSVResponseWriter, CdcrRequestHandlerTest, HighlighterConfigTest, AnalysisErrorHandlingTest, TestWordDelimiterFilterFactory, SolrGraphiteReporterTest, TestNumericTerms64, TestExceedMaxTermLength, CursorPagingTest, TestMultiValuedNumericRangeQuery, TestMacros, FieldMutatingUpdateProcessorTest, ConjunctionSolrSpellCheckerTest, HdfsChaosMonkeySafeLeaderTest, ChaosMonkeyNothingIsSafeTest, TestTrackingShardHandlerFactory, TestScoreJoinQPNoScore, TestBackupRepositoryFactory, HdfsBasicDistributedZk2Test, TestSolrFieldCacheBean, AddSchemaFieldsUpdateProcessorFactoryTest, CloudExitableDirectoryReaderTest, TestExactSharedStatsCache, TestPhraseSuggestions, UpdateParamsTest, DefaultValueUpdateProcessorTest, ManagedSchemaRoundRobinCloudTest, TestLazyCores, TestSSLRandomization, TestSolr4Spatial, TestTolerantUpdateProcessorRandomCloud, RecoveryAfterSoftCommitTest, TestBinaryField, OpenExchangeRatesOrgProviderTest, BasicDistributedZkTest, DistributedSuggestComponentTest, VMParamsZkACLAndCredentialsProvidersTest, TestReloadDeadlock, TestClusterStateMutator, TestFieldTypeCollectionResource, TestSolrConfigHandler, MoveReplicaHDFSUlogDirTest, TestJoin, DistribDocExpirationUpdateProcessorTest, TestExtendedDismaxParser, DistributedExpandComponentTest, TestDynamicFieldResource, TestSolrConfigHandlerConcurrent, StatsReloadRaceTest, TestConfigSetsAPI, TestUnifiedSolrHighlighter, DateRangeFieldTest, UUIDUpdateProcessorFallbackTest, TestComplexPhraseLeadingWildcard, HttpPartitionTest, TestConfigsApi, HdfsUnloadDistributedZkTest, TemplateUpdateProcessorTest, TestStressLiveNodes, TestManagedSchemaThreadSafety, TestCustomStream, TestReloadAndDeleteDocs, ZkNodePropsTest, DistributedVersionInfoTest, HdfsRecoverLeaseTest, TestReplicaProperties, TestObjectReleaseTracker, TestOrdValues, ChaosMonkeySafeLeaderWithPullReplicasTest, TestDocTermOrds, TestFieldSortValues, DistributedSpellCheckComponentTest, TestSolrCloudWithSecureImpersonation]
   [junit4]   2> NOTE: reproduce with: ant test  -Dtestcase=TestSolrCloudWithSecureImpersonation -Dtests.seed=809F94C0A4272EA5 -Dtests.multiplier=3 -Dtests.slow=true -Dtests.locale=sr-Latn-BA -Dtests.timezone=CST -Dtests.asserts=true -Dtests.file.encoding=US-ASCII
   [junit4] ERROR   0.00s J0 | TestSolrCloudWithSecureImpersonation (suite) <<<
   [junit4]    > Throwable #1: com.carrotsearch.randomizedtesting.ThreadLeakError: 2 threads leaked from SUITE scope at org.apache.solr.cloud.TestSolrCloudWithSecureImpersonation: 
   [junit4]    >    1) Thread[id=15047, name=jetty-launcher-3160-thread-1-EventThread, state=TIMED_WAITING, group=TGRP-TestSolrCloudWithSecureImpersonation]
   [junit4]    >         at sun.misc.Unsafe.park(Native Method)
   [junit4]    >         at java.util.concurrent.locks.LockSupport.parkNanos(LockSupport.java:215)
   [junit4]    >         at java.util.concurrent.locks.AbstractQueuedSynchronizer.doAcquireSharedNanos(AbstractQueuedSynchronizer.java:1037)
   [junit4]    >         at java.util.concurrent.locks.AbstractQueuedSynchronizer.tryAcquireSharedNanos(AbstractQueuedSynchronizer.java:1328)
   [junit4]    >         at java.util.concurrent.CountDownLatch.await(CountDownLatch.java:277)
   [junit4]    >         at org.apache.curator.CuratorZookeeperClient.internalBlockUntilConnectedOrTimedOut(CuratorZookeeperClient.java:323)
   [junit4]    >         at org.apache.curator.RetryLoop.callWithRetry(RetryLoop.java:105)
   [junit4]    >         at org.apache.curator.framework.imps.GetDataBuilderImpl.pathInForeground(GetDataBuilderImpl.java:288)
   [junit4]    >         at org.apache.curator.framework.imps.GetDataBuilderImpl.forPath(GetDataBuilderImpl.java:279)
   [junit4]    >         at org.apache.curator.framework.imps.GetDataBuilderImpl.forPath(GetDataBuilderImpl.java:41)
   [junit4]    >         at org.apache.curator.framework.recipes.shared.SharedValue.readValue(SharedValue.java:244)
   [junit4]    >         at org.apache.curator.framework.recipes.shared.SharedValue.access$100(SharedValue.java:44)
   [junit4]    >         at org.apache.curator.framework.recipes.shared.SharedValue$1.process(SharedValue.java:61)
   [junit4]    >         at org.apache.curator.framework.imps.NamespaceWatcher.process(NamespaceWatcher.java:67)
   [junit4]    >         at org.apache.zookeeper.ClientCnxn$EventThread.processEvent(ClientCnxn.java:530)
   [junit4]    >         at org.apache.zookeeper.ClientCnxn$EventThread.run(ClientCnxn.java:505)
   [junit4]    >    2) Thread[id=15045, name=jetty-launcher-3160-thread-2-EventThread, state=TIMED_WAITING, group=TGRP-TestSolrCloudWithSecureImpersonation]
   [junit4]    >         at sun.misc.Unsafe.park(Native Method)
   [junit4]    >         at java.util.concurrent.locks.LockSupport.parkNanos(LockSupport.java:215)
   [junit4]    >         at java.util.concurrent.locks.AbstractQueuedSynchronizer.doAcquireSharedNanos(AbstractQueuedSynchronizer.java:1037)
   [junit4]    >         at java.util.concurrent.locks.AbstractQueuedSynchronizer.tryAcquireSharedNanos(AbstractQueuedSynchronizer.java:1328)
   [junit4]    >         at java.util.concurrent.CountDownLatch.await(CountDownLatch.java:277)
   [junit4]    >         at org.apache.curator.CuratorZook

[...truncated too long message...]


   [junit4]   2> 1844779 INFO  (jetty-closer-2606-thread-1) [    ] o.a.s.m.SolrMetricManager Closing metric reporters for registry=solr.node, tag=null
   [junit4]   2> 1844779 INFO  (jetty-closer-2606-thread-2) [    ] o.a.s.m.SolrMetricManager Closing metric reporters for registry=solr.node, tag=null
   [junit4]   2> 1844781 INFO  (jetty-closer-2606-thread-1) [    ] o.a.s.m.SolrMetricManager Closing metric reporters for registry=solr.jvm, tag=null
   [junit4]   2> 1844781 INFO  (jetty-closer-2606-thread-2) [    ] o.a.s.m.SolrMetricManager Closing metric reporters for registry=solr.jvm, tag=null
   [junit4]   2> 1844783 INFO  (jetty-closer-2606-thread-1) [    ] o.a.s.m.SolrMetricManager Closing metric reporters for registry=solr.jetty, tag=null
   [junit4]   2> 1844783 INFO  (jetty-closer-2606-thread-2) [    ] o.a.s.m.SolrMetricManager Closing metric reporters for registry=solr.jetty, tag=null
   [junit4]   2> 1844785 INFO  (jetty-closer-2606-thread-1) [    ] o.a.s.m.SolrMetricManager Closing metric reporters for registry=solr.cluster, tag=null
   [junit4]   2> 1844785 INFO  (jetty-closer-2606-thread-2) [    ] o.a.s.m.SolrMetricManager Closing metric reporters for registry=solr.cluster, tag=null
   [junit4]   2> 1844786 INFO  (jetty-closer-2606-thread-1) [    ] o.a.s.c.Overseer Overseer (id=98427380851474437-127.0.0.1:45009_solr-n_0000000001) closing
   [junit4]   2> 1844786 INFO  (zkCallback-2616-thread-3-processing-n:127.0.0.1:45009_solr) [n:127.0.0.1:45009_solr    ] o.a.s.c.c.ZkStateReader Updated live nodes from ZooKeeper... (2) -> (1)
   [junit4]   2> 1844786 INFO  (jetty-closer-2606-thread-2) [    ] o.e.j.s.h.ContextHandler Stopped o.e.j.s.ServletContextHandler@37b438{/solr,null,UNAVAILABLE}
   [junit4]   2> 1844786 INFO  (OverseerStateUpdate-98427380851474437-127.0.0.1:45009_solr-n_0000000001) [n:127.0.0.1:45009_solr    ] o.a.s.c.Overseer Overseer Loop exiting : 127.0.0.1:45009_solr
   [junit4]   2> 1844787 WARN  (zkCallback-2616-thread-3-processing-n:127.0.0.1:45009_solr) [n:127.0.0.1:45009_solr    ] o.a.s.c.c.ZkStateReader ZooKeeper watch triggered, but Solr cannot talk to ZK: [KeeperErrorCode = Session expired for /live_nodes]
   [junit4]   2> 1844787 INFO  (jetty-closer-2606-thread-1) [    ] o.e.j.s.h.ContextHandler Stopped o.e.j.s.ServletContextHandler@1d9ac4b{/solr,null,UNAVAILABLE}
   [junit4]   2> 1844787 ERROR (SUITE-TestPullReplica-seed#[809F94C0A4272EA5]-worker) [    ] o.a.z.s.ZooKeeperServer ZKShutdownHandler is not registered, so ZooKeeper server won't take any action on ERROR or SHUTDOWN server state changes
   [junit4]   2> 1844787 INFO  (SUITE-TestPullReplica-seed#[809F94C0A4272EA5]-worker) [    ] o.a.s.c.ZkTestServer connecting to 127.0.0.1:38457 38457
   [junit4]   2> 1859692 INFO  (Thread-9044) [    ] o.a.s.c.ZkTestServer connecting to 127.0.0.1:38457 38457
   [junit4]   2> 1859693 WARN  (Thread-9044) [    ] o.a.s.c.ZkTestServer Watch limit violations: 
   [junit4]   2> Maximum concurrent create/delete watches above limit:
   [junit4]   2> 
   [junit4]   2> 	19	/solr/configs/conf
   [junit4]   2> 	5	/solr/aliases.json
   [junit4]   2> 	4	/solr/security.json
   [junit4]   2> 
   [junit4]   2> Maximum concurrent data watches above limit:
   [junit4]   2> 
   [junit4]   2> 	24	/solr/collections/pull_replica_test_create_delete/state.json
   [junit4]   2> 	20	/solr/collections/pull_replica_test_kill_pull_replica/state.json
   [junit4]   2> 	20	/solr/collections/pull_replica_test_remove_all_writer_replicas/state.json
   [junit4]   2> 	19	/solr/collections/pull_replica_test_kill_leader/state.json
   [junit4]   2> 	19	/solr/collections/pull_replica_test_add_remove_pull_replica/state.json
   [junit4]   2> 	13	/solr/collections/pull_replica_test_real_time_get/state.json
   [junit4]   2> 	13	/solr/collections/pull_replica_test_add_docs/state.json
   [junit4]   2> 	5	/solr/clusterprops.json
   [junit4]   2> 	5	/solr/clusterstate.json
   [junit4]   2> 	2	/solr/overseer_elect/election/98427380851474437-127.0.0.1:45009_solr-n_0000000001
   [junit4]   2> 
   [junit4]   2> Maximum concurrent children watches above limit:
   [junit4]   2> 
   [junit4]   2> 	5	/solr/collections
   [junit4]   2> 	3	/solr/live_nodes
   [junit4]   2> 	2	/solr/overseer/queue
   [junit4]   2> 	2	/solr/overseer/collection-queue-work
   [junit4]   2> 
   [junit4]   2> NOTE: leaving temporary files on disk at: /home/jenkins/workspace/Lucene-Solr-7.0-Linux/solr/build/solr-core/test/J1/temp/solr.cloud.TestPullReplica_809F94C0A4272EA5-001
   [junit4]   2> NOTE: test params are: codec=Asserting(Lucene70): {_version_=PostingsFormat(name=Memory), foo=PostingsFormat(name=LuceneVarGapDocFreqInterval), id=PostingsFormat(name=LuceneFixedGap), foo_s=PostingsFormat(name=LuceneVarGapDocFreqInterval)}, docValues:{}, maxPointsInLeafNode=237, maxMBSortInHeap=6.167094447214188, sim=RandomSimilarity(queryNorm=false): {}, locale=he-IL, timezone=Asia/Ashkhabad
   [junit4]   2> NOTE: Linux 4.10.0-27-generic i386/Oracle Corporation 1.8.0_141 (32-bit)/cpus=8,threads=1,free=113134448,total=474480640
   [junit4]   2> NOTE: All tests run in this JVM: [HighlighterTest, DocValuesMissingTest, TestFieldCollectionResource, TestQueryWrapperFilter, TestUninvertingReader, TestReqParamsAPI, TestLeaderElectionZkExpiry, TestFuzzyAnalyzedSuggestions, TestSolr4Spatial2, DocValuesMultiTest, TestGraphMLResponseWriter, DistributedTermsComponentTest, TestBM25SimilarityFactory, SpatialFilterTest, TestReRankQParserPlugin, TestRestManager, DirectSolrConnectionTest, DeleteNodeTest, TestSweetSpotSimilarityFactory, MissingSegmentRecoveryTest, HdfsWriteToMultipleCollectionsTest, OutOfBoxZkACLAndCredentialsProvidersTest, AsyncCallRequestStatusResponseTest, TestQueryTypes, ZkCLITest, TermVectorComponentTest, TestStandardQParsers, UpdateRequestProcessorFactoryTest, JavabinLoaderTest, TestRTGBase, DistributedFacetExistsSmallTest, TestHttpShardHandlerFactory, SimpleMLTQParserTest, ClassificationUpdateProcessorIntegrationTest, TestLockTree, TestInitQParser, TestManagedSynonymGraphFilterFactory, PreAnalyzedFieldManagedSchemaCloudTest, BlockCacheTest, DistributedMLTComponentTest, TestDefaultStatsCache, TestCustomDocTransformer, TestHdfsUpdateLog, HdfsThreadLeakTest, TestDynamicLoading, DistribJoinFromCollectionTest, TestSegmentSorting, AnalysisAfterCoreReloadTest, ResourceLoaderTest, SOLR749Test, TestPKIAuthenticationPlugin, TestSolrCloudWithDelegationTokens, CdcrReplicationDistributedZkTest, DistanceFunctionTest, SliceStateTest, SampleTest, SolrShardReporterTest, SolrCloudExampleTest, BlockJoinFacetRandomTest, InfoHandlerTest, TestSlowCompositeReaderWrapper, TestInitParams, HdfsRecoveryZkTest, TestAtomicUpdateErrorCases, SpellCheckCollatorWithCollapseTest, ZkStateReaderTest, TestXmlQParser, PrimUtilsTest, TestLRUCache, TestChildDocTransformer, LeaderInitiatedRecoveryOnCommitTest, TestCharFilters, SolrMetricsIntegrationTest, SparseHLLTest, CdcrVersionReplicationTest, SolrJmxReporterTest, TestTlogReplica, TestStressCloudBlindAtomicUpdates, LukeRequestHandlerTest, TestPartialUpdateDeduplication, CustomCollectionTest, TestExclusionRuleCollectionAccess, NoCacheHeaderTest, TestNamedUpdateProcessors, MoreLikeThisHandlerTest, TestConfigOverlay, TestAddFieldRealTimeGet, FacetPivotSmallTest, FileUtilsTest, TestSQLHandlerNonCloud, TestBulkSchemaConcurrent, MoveReplicaTest, ConvertedLegacyTest, ShufflingReplicaListTransformerTest, CollectionsAPIDistributedZkTest, ChaosMonkeySafeLeaderTest, BigEndianAscendingWordSerializerTest, AlternateDirectoryTest, TestShardHandlerFactory, LoggingHandlerTest, TestFilteredDocIdSet, TestValueSourceCache, TestFieldCacheSortRandom, TestEmbeddedSolrServerSchemaAPI, HdfsDirectoryFactoryTest, TestIntervalFaceting, TestMissingGroups, AnalyticsQueryTest, MergeStrategyTest, OpenCloseCoreStressTest, SuggestComponentTest, SaslZkACLProviderTest, TestUseDocValuesAsStored, TestElisionMultitermQuery, HdfsBasicDistributedZkTest, SharedFSAutoReplicaFailoverUtilsTest, TestApiFramework, ShardRoutingTest, TestFieldTypeResource, OverseerTaskQueueTest, TestMiniSolrCloudClusterSSL, ClusterStateUpdateTest, TestRandomFaceting, TestRandomDVFaceting, TestDistributedGrouping, TestRecovery, TestRealTimeGet, TestReload, SpellCheckComponentTest, SolrCmdDistributorTest, QueryElevationComponentTest, BadIndexSchemaTest, TestFiltering, ShowFileRequestHandlerTest, DistributedQueryElevationComponentTest, SolrIndexSplitterTest, SimplePostToolTest, TestCoreDiscovery, SignatureUpdateProcessorFactoryTest, CoreAdminHandlerTest, SolrRequestParserTest, DocValuesTest, SuggesterTSTTest, SuggesterTest, TestCSVLoader, PolyFieldTest, SchemaVersionSpecificBehaviorTest, QueryEqualityTest, TestRemoteStreaming, SolrInfoBeanTest, CacheHeaderTest, TestWriterPerf, TestReversedWildcardFilterFactory, PrimitiveFieldTypeTest, TermsComponentTest, DocumentBuilderTest, TestIndexingPerformance, FieldAnalysisRequestHandlerTest, FastVectorHighlighterTest, RegexBoostProcessorTest, IndexSchemaTest, JsonLoaderTest, PingRequestHandlerTest, TestQuerySenderListener, TestSolrIndexConfig, TestQuerySenderNoQuery, CopyFieldTest, SolrIndexConfigTest, BadComponentTest, TestStressRecovery, TestSolrCoreProperties, TestXIncludeConfig, TestPerFieldSimilarity, TestIBSimilarityFactory, TestFastLRUCache, TestSuggestSpellingConverter, SpellingQueryConverterTest, TestSolrJ, UUIDFieldTest, TestCrossCoreJoin, TestHighlightDedupGrouping, TestSimpleTrackingShardHandler, ActionThrottleTest, CdcrBootstrapTest, DistributedQueueTest, MigrateRouteKeyTest, MultiThreadedOCPTest, OverseerStatusTest, ReplicationFactorTest, RestartWhileUpdatingTest, RollingRestartTest, SolrCLIZkUtilsTest, TestAuthenticationFramework, TestCloudInspectUtil, TestCloudPivotFacet, TestDeleteCollectionOnDownNodes, TestDownShardTolerantSearch, TestLeaderElectionWithEmptyReplica, TestLeaderInitiatedRecoveryThread, TestMiniSolrCloudCluster, TestPullReplica]
   [junit4] Completed [558/727 (2!)] on J1 in 89.70s, 10 tests, 1 failure, 1 skipped <<< FAILURES!

[...truncated 40030 lines...]

Mime
View raw message