lucene-dev mailing list archives

Site index · List index
Message view « Date » · « Thread »
Top « Date » · « Thread »
From Policeman Jenkins Server <jenk...@thetaphi.de>
Subject [JENKINS] Lucene-Solr-7.x-Linux (32bit/jdk1.8.0_144) - Build # 296 - Still Unstable!
Date Mon, 21 Aug 2017 07:02:57 GMT
Build: https://jenkins.thetaphi.de/job/Lucene-Solr-7.x-Linux/296/
Java: 32bit/jdk1.8.0_144 -server -XX:+UseG1GC

3 tests failed.
FAILED:  junit.framework.TestSuite.org.apache.solr.cloud.ChaosMonkeyNothingIsSafeTest

Error Message:
7 threads leaked from SUITE scope at org.apache.solr.cloud.ChaosMonkeyNothingIsSafeTest:     1) Thread[id=1793, name=zkCallback-244-thread-4, state=TIMED_WAITING, group=TGRP-ChaosMonkeyNothingIsSafeTest]         at sun.misc.Unsafe.park(Native Method)         at java.util.concurrent.locks.LockSupport.parkNanos(LockSupport.java:215)         at java.util.concurrent.SynchronousQueue$TransferStack.awaitFulfill(SynchronousQueue.java:460)         at java.util.concurrent.SynchronousQueue$TransferStack.transfer(SynchronousQueue.java:362)         at java.util.concurrent.SynchronousQueue.poll(SynchronousQueue.java:941)         at java.util.concurrent.ThreadPoolExecutor.getTask(ThreadPoolExecutor.java:1073)         at java.util.concurrent.ThreadPoolExecutor.runWorker(ThreadPoolExecutor.java:1134)         at java.util.concurrent.ThreadPoolExecutor$Worker.run(ThreadPoolExecutor.java:624)         at java.lang.Thread.run(Thread.java:748)    2) Thread[id=1651, name=TEST-ChaosMonkeyNothingIsSafeTest.test-seed#[14D04BAC0FDC6C15]-EventThread, state=WAITING, group=TGRP-ChaosMonkeyNothingIsSafeTest]         at sun.misc.Unsafe.park(Native Method)         at java.util.concurrent.locks.LockSupport.park(LockSupport.java:175)         at java.util.concurrent.locks.AbstractQueuedSynchronizer$ConditionObject.await(AbstractQueuedSynchronizer.java:2039)         at java.util.concurrent.LinkedBlockingQueue.take(LinkedBlockingQueue.java:442)         at org.apache.zookeeper.ClientCnxn$EventThread.run(ClientCnxn.java:501)    3) Thread[id=1649, name=Connection evictor, state=TIMED_WAITING, group=TGRP-ChaosMonkeyNothingIsSafeTest]         at java.lang.Thread.sleep(Native Method)         at org.apache.http.impl.client.IdleConnectionEvictor$1.run(IdleConnectionEvictor.java:66)         at java.lang.Thread.run(Thread.java:748)    4) Thread[id=1652, name=zkCallback-244-thread-1, state=TIMED_WAITING, group=TGRP-ChaosMonkeyNothingIsSafeTest]         at sun.misc.Unsafe.park(Native Method)         at java.util.concurrent.locks.LockSupport.parkNanos(LockSupport.java:215)         at java.util.concurrent.SynchronousQueue$TransferStack.awaitFulfill(SynchronousQueue.java:460)         at java.util.concurrent.SynchronousQueue$TransferStack.transfer(SynchronousQueue.java:362)         at java.util.concurrent.SynchronousQueue.poll(SynchronousQueue.java:941)         at java.util.concurrent.ThreadPoolExecutor.getTask(ThreadPoolExecutor.java:1073)         at java.util.concurrent.ThreadPoolExecutor.runWorker(ThreadPoolExecutor.java:1134)         at java.util.concurrent.ThreadPoolExecutor$Worker.run(ThreadPoolExecutor.java:624)         at java.lang.Thread.run(Thread.java:748)    5) Thread[id=1704, name=zkCallback-244-thread-2, state=TIMED_WAITING, group=TGRP-ChaosMonkeyNothingIsSafeTest]         at sun.misc.Unsafe.park(Native Method)         at java.util.concurrent.locks.LockSupport.parkNanos(LockSupport.java:215)         at java.util.concurrent.SynchronousQueue$TransferStack.awaitFulfill(SynchronousQueue.java:460)         at java.util.concurrent.SynchronousQueue$TransferStack.transfer(SynchronousQueue.java:362)         at java.util.concurrent.SynchronousQueue.poll(SynchronousQueue.java:941)         at java.util.concurrent.ThreadPoolExecutor.getTask(ThreadPoolExecutor.java:1073)         at java.util.concurrent.ThreadPoolExecutor.runWorker(ThreadPoolExecutor.java:1134)         at java.util.concurrent.ThreadPoolExecutor$Worker.run(ThreadPoolExecutor.java:624)         at java.lang.Thread.run(Thread.java:748)    6) Thread[id=1773, name=zkCallback-244-thread-3, state=TIMED_WAITING, group=TGRP-ChaosMonkeyNothingIsSafeTest]         at sun.misc.Unsafe.park(Native Method)         at java.util.concurrent.locks.LockSupport.parkNanos(LockSupport.java:215)         at java.util.concurrent.SynchronousQueue$TransferStack.awaitFulfill(SynchronousQueue.java:460)         at java.util.concurrent.SynchronousQueue$TransferStack.transfer(SynchronousQueue.java:362)         at java.util.concurrent.SynchronousQueue.poll(SynchronousQueue.java:941)         at java.util.concurrent.ThreadPoolExecutor.getTask(ThreadPoolExecutor.java:1073)         at java.util.concurrent.ThreadPoolExecutor.runWorker(ThreadPoolExecutor.java:1134)         at java.util.concurrent.ThreadPoolExecutor$Worker.run(ThreadPoolExecutor.java:624)         at java.lang.Thread.run(Thread.java:748)    7) Thread[id=1650, name=TEST-ChaosMonkeyNothingIsSafeTest.test-seed#[14D04BAC0FDC6C15]-SendThread(127.0.0.1:41783), state=TIMED_WAITING, group=TGRP-ChaosMonkeyNothingIsSafeTest]         at java.lang.Thread.sleep(Native Method)         at org.apache.zookeeper.client.StaticHostProvider.next(StaticHostProvider.java:101)         at org.apache.zookeeper.ClientCnxn$SendThread.startConnect(ClientCnxn.java:997)         at org.apache.zookeeper.ClientCnxn$SendThread.run(ClientCnxn.java:1060)

Stack Trace:
com.carrotsearch.randomizedtesting.ThreadLeakError: 7 threads leaked from SUITE scope at org.apache.solr.cloud.ChaosMonkeyNothingIsSafeTest: 
   1) Thread[id=1793, name=zkCallback-244-thread-4, state=TIMED_WAITING, group=TGRP-ChaosMonkeyNothingIsSafeTest]
        at sun.misc.Unsafe.park(Native Method)
        at java.util.concurrent.locks.LockSupport.parkNanos(LockSupport.java:215)
        at java.util.concurrent.SynchronousQueue$TransferStack.awaitFulfill(SynchronousQueue.java:460)
        at java.util.concurrent.SynchronousQueue$TransferStack.transfer(SynchronousQueue.java:362)
        at java.util.concurrent.SynchronousQueue.poll(SynchronousQueue.java:941)
        at java.util.concurrent.ThreadPoolExecutor.getTask(ThreadPoolExecutor.java:1073)
        at java.util.concurrent.ThreadPoolExecutor.runWorker(ThreadPoolExecutor.java:1134)
        at java.util.concurrent.ThreadPoolExecutor$Worker.run(ThreadPoolExecutor.java:624)
        at java.lang.Thread.run(Thread.java:748)
   2) Thread[id=1651, name=TEST-ChaosMonkeyNothingIsSafeTest.test-seed#[14D04BAC0FDC6C15]-EventThread, state=WAITING, group=TGRP-ChaosMonkeyNothingIsSafeTest]
        at sun.misc.Unsafe.park(Native Method)
        at java.util.concurrent.locks.LockSupport.park(LockSupport.java:175)
        at java.util.concurrent.locks.AbstractQueuedSynchronizer$ConditionObject.await(AbstractQueuedSynchronizer.java:2039)
        at java.util.concurrent.LinkedBlockingQueue.take(LinkedBlockingQueue.java:442)
        at org.apache.zookeeper.ClientCnxn$EventThread.run(ClientCnxn.java:501)
   3) Thread[id=1649, name=Connection evictor, state=TIMED_WAITING, group=TGRP-ChaosMonkeyNothingIsSafeTest]
        at java.lang.Thread.sleep(Native Method)
        at org.apache.http.impl.client.IdleConnectionEvictor$1.run(IdleConnectionEvictor.java:66)
        at java.lang.Thread.run(Thread.java:748)
   4) Thread[id=1652, name=zkCallback-244-thread-1, state=TIMED_WAITING, group=TGRP-ChaosMonkeyNothingIsSafeTest]
        at sun.misc.Unsafe.park(Native Method)
        at java.util.concurrent.locks.LockSupport.parkNanos(LockSupport.java:215)
        at java.util.concurrent.SynchronousQueue$TransferStack.awaitFulfill(SynchronousQueue.java:460)
        at java.util.concurrent.SynchronousQueue$TransferStack.transfer(SynchronousQueue.java:362)
        at java.util.concurrent.SynchronousQueue.poll(SynchronousQueue.java:941)
        at java.util.concurrent.ThreadPoolExecutor.getTask(ThreadPoolExecutor.java:1073)
        at java.util.concurrent.ThreadPoolExecutor.runWorker(ThreadPoolExecutor.java:1134)
        at java.util.concurrent.ThreadPoolExecutor$Worker.run(ThreadPoolExecutor.java:624)
        at java.lang.Thread.run(Thread.java:748)
   5) Thread[id=1704, name=zkCallback-244-thread-2, state=TIMED_WAITING, group=TGRP-ChaosMonkeyNothingIsSafeTest]
        at sun.misc.Unsafe.park(Native Method)
        at java.util.concurrent.locks.LockSupport.parkNanos(LockSupport.java:215)
        at java.util.concurrent.SynchronousQueue$TransferStack.awaitFulfill(SynchronousQueue.java:460)
        at java.util.concurrent.SynchronousQueue$TransferStack.transfer(SynchronousQueue.java:362)
        at java.util.concurrent.SynchronousQueue.poll(SynchronousQueue.java:941)
        at java.util.concurrent.ThreadPoolExecutor.getTask(ThreadPoolExecutor.java:1073)
        at java.util.concurrent.ThreadPoolExecutor.runWorker(ThreadPoolExecutor.java:1134)
        at java.util.concurrent.ThreadPoolExecutor$Worker.run(ThreadPoolExecutor.java:624)
        at java.lang.Thread.run(Thread.java:748)
   6) Thread[id=1773, name=zkCallback-244-thread-3, state=TIMED_WAITING, group=TGRP-ChaosMonkeyNothingIsSafeTest]
        at sun.misc.Unsafe.park(Native Method)
        at java.util.concurrent.locks.LockSupport.parkNanos(LockSupport.java:215)
        at java.util.concurrent.SynchronousQueue$TransferStack.awaitFulfill(SynchronousQueue.java:460)
        at java.util.concurrent.SynchronousQueue$TransferStack.transfer(SynchronousQueue.java:362)
        at java.util.concurrent.SynchronousQueue.poll(SynchronousQueue.java:941)
        at java.util.concurrent.ThreadPoolExecutor.getTask(ThreadPoolExecutor.java:1073)
        at java.util.concurrent.ThreadPoolExecutor.runWorker(ThreadPoolExecutor.java:1134)
        at java.util.concurrent.ThreadPoolExecutor$Worker.run(ThreadPoolExecutor.java:624)
        at java.lang.Thread.run(Thread.java:748)
   7) Thread[id=1650, name=TEST-ChaosMonkeyNothingIsSafeTest.test-seed#[14D04BAC0FDC6C15]-SendThread(127.0.0.1:41783), state=TIMED_WAITING, group=TGRP-ChaosMonkeyNothingIsSafeTest]
        at java.lang.Thread.sleep(Native Method)
        at org.apache.zookeeper.client.StaticHostProvider.next(StaticHostProvider.java:101)
        at org.apache.zookeeper.ClientCnxn$SendThread.startConnect(ClientCnxn.java:997)
        at org.apache.zookeeper.ClientCnxn$SendThread.run(ClientCnxn.java:1060)
	at __randomizedtesting.SeedInfo.seed([14D04BAC0FDC6C15]:0)


FAILED:  junit.framework.TestSuite.org.apache.solr.cloud.ChaosMonkeyNothingIsSafeTest

Error Message:
There are still zombie threads that couldn't be terminated:    1) Thread[id=1793, name=zkCallback-244-thread-4, state=TIMED_WAITING, group=TGRP-ChaosMonkeyNothingIsSafeTest]         at sun.misc.Unsafe.park(Native Method)         at java.util.concurrent.locks.LockSupport.parkNanos(LockSupport.java:215)         at java.util.concurrent.SynchronousQueue$TransferStack.awaitFulfill(SynchronousQueue.java:460)         at java.util.concurrent.SynchronousQueue$TransferStack.transfer(SynchronousQueue.java:362)         at java.util.concurrent.SynchronousQueue.poll(SynchronousQueue.java:941)         at java.util.concurrent.ThreadPoolExecutor.getTask(ThreadPoolExecutor.java:1073)         at java.util.concurrent.ThreadPoolExecutor.runWorker(ThreadPoolExecutor.java:1134)         at java.util.concurrent.ThreadPoolExecutor$Worker.run(ThreadPoolExecutor.java:624)         at java.lang.Thread.run(Thread.java:748)    2) Thread[id=1652, name=zkCallback-244-thread-1, state=TIMED_WAITING, group=TGRP-ChaosMonkeyNothingIsSafeTest]         at sun.misc.Unsafe.park(Native Method)         at java.util.concurrent.locks.LockSupport.parkNanos(LockSupport.java:215)         at java.util.concurrent.SynchronousQueue$TransferStack.awaitFulfill(SynchronousQueue.java:460)         at java.util.concurrent.SynchronousQueue$TransferStack.transfer(SynchronousQueue.java:362)         at java.util.concurrent.SynchronousQueue.poll(SynchronousQueue.java:941)         at java.util.concurrent.ThreadPoolExecutor.getTask(ThreadPoolExecutor.java:1073)         at java.util.concurrent.ThreadPoolExecutor.runWorker(ThreadPoolExecutor.java:1134)         at java.util.concurrent.ThreadPoolExecutor$Worker.run(ThreadPoolExecutor.java:624)         at java.lang.Thread.run(Thread.java:748)    3) Thread[id=1704, name=zkCallback-244-thread-2, state=TIMED_WAITING, group=TGRP-ChaosMonkeyNothingIsSafeTest]         at sun.misc.Unsafe.park(Native Method)         at java.util.concurrent.locks.LockSupport.parkNanos(LockSupport.java:215)         at java.util.concurrent.SynchronousQueue$TransferStack.awaitFulfill(SynchronousQueue.java:460)         at java.util.concurrent.SynchronousQueue$TransferStack.transfer(SynchronousQueue.java:362)         at java.util.concurrent.SynchronousQueue.poll(SynchronousQueue.java:941)         at java.util.concurrent.ThreadPoolExecutor.getTask(ThreadPoolExecutor.java:1073)         at java.util.concurrent.ThreadPoolExecutor.runWorker(ThreadPoolExecutor.java:1134)         at java.util.concurrent.ThreadPoolExecutor$Worker.run(ThreadPoolExecutor.java:624)         at java.lang.Thread.run(Thread.java:748)    4) Thread[id=1773, name=zkCallback-244-thread-3, state=TIMED_WAITING, group=TGRP-ChaosMonkeyNothingIsSafeTest]         at sun.misc.Unsafe.park(Native Method)         at java.util.concurrent.locks.LockSupport.parkNanos(LockSupport.java:215)         at java.util.concurrent.SynchronousQueue$TransferStack.awaitFulfill(SynchronousQueue.java:460)         at java.util.concurrent.SynchronousQueue$TransferStack.transfer(SynchronousQueue.java:362)         at java.util.concurrent.SynchronousQueue.poll(SynchronousQueue.java:941)         at java.util.concurrent.ThreadPoolExecutor.getTask(ThreadPoolExecutor.java:1073)         at java.util.concurrent.ThreadPoolExecutor.runWorker(ThreadPoolExecutor.java:1134)         at java.util.concurrent.ThreadPoolExecutor$Worker.run(ThreadPoolExecutor.java:624)         at java.lang.Thread.run(Thread.java:748)    5) Thread[id=1650, name=TEST-ChaosMonkeyNothingIsSafeTest.test-seed#[14D04BAC0FDC6C15]-SendThread(127.0.0.1:41783), state=TIMED_WAITING, group=TGRP-ChaosMonkeyNothingIsSafeTest]         at java.lang.Thread.sleep(Native Method)         at org.apache.zookeeper.ClientCnxn$SendThread.run(ClientCnxn.java:1051)

Stack Trace:
com.carrotsearch.randomizedtesting.ThreadLeakError: There are still zombie threads that couldn't be terminated:
   1) Thread[id=1793, name=zkCallback-244-thread-4, state=TIMED_WAITING, group=TGRP-ChaosMonkeyNothingIsSafeTest]
        at sun.misc.Unsafe.park(Native Method)
        at java.util.concurrent.locks.LockSupport.parkNanos(LockSupport.java:215)
        at java.util.concurrent.SynchronousQueue$TransferStack.awaitFulfill(SynchronousQueue.java:460)
        at java.util.concurrent.SynchronousQueue$TransferStack.transfer(SynchronousQueue.java:362)
        at java.util.concurrent.SynchronousQueue.poll(SynchronousQueue.java:941)
        at java.util.concurrent.ThreadPoolExecutor.getTask(ThreadPoolExecutor.java:1073)
        at java.util.concurrent.ThreadPoolExecutor.runWorker(ThreadPoolExecutor.java:1134)
        at java.util.concurrent.ThreadPoolExecutor$Worker.run(ThreadPoolExecutor.java:624)
        at java.lang.Thread.run(Thread.java:748)
   2) Thread[id=1652, name=zkCallback-244-thread-1, state=TIMED_WAITING, group=TGRP-ChaosMonkeyNothingIsSafeTest]
        at sun.misc.Unsafe.park(Native Method)
        at java.util.concurrent.locks.LockSupport.parkNanos(LockSupport.java:215)
        at java.util.concurrent.SynchronousQueue$TransferStack.awaitFulfill(SynchronousQueue.java:460)
        at java.util.concurrent.SynchronousQueue$TransferStack.transfer(SynchronousQueue.java:362)
        at java.util.concurrent.SynchronousQueue.poll(SynchronousQueue.java:941)
        at java.util.concurrent.ThreadPoolExecutor.getTask(ThreadPoolExecutor.java:1073)
        at java.util.concurrent.ThreadPoolExecutor.runWorker(ThreadPoolExecutor.java:1134)
        at java.util.concurrent.ThreadPoolExecutor$Worker.run(ThreadPoolExecutor.java:624)
        at java.lang.Thread.run(Thread.java:748)
   3) Thread[id=1704, name=zkCallback-244-thread-2, state=TIMED_WAITING, group=TGRP-ChaosMonkeyNothingIsSafeTest]
        at sun.misc.Unsafe.park(Native Method)
        at java.util.concurrent.locks.LockSupport.parkNanos(LockSupport.java:215)
        at java.util.concurrent.SynchronousQueue$TransferStack.awaitFulfill(SynchronousQueue.java:460)
        at java.util.concurrent.SynchronousQueue$TransferStack.transfer(SynchronousQueue.java:362)
        at java.util.concurrent.SynchronousQueue.poll(SynchronousQueue.java:941)
        at java.util.concurrent.ThreadPoolExecutor.getTask(ThreadPoolExecutor.java:1073)
        at java.util.concurrent.ThreadPoolExecutor.runWorker(ThreadPoolExecutor.java:1134)
        at java.util.concurrent.ThreadPoolExecutor$Worker.run(ThreadPoolExecutor.java:624)
        at java.lang.Thread.run(Thread.java:748)
   4) Thread[id=1773, name=zkCallback-244-thread-3, state=TIMED_WAITING, group=TGRP-ChaosMonkeyNothingIsSafeTest]
        at sun.misc.Unsafe.park(Native Method)
        at java.util.concurrent.locks.LockSupport.parkNanos(LockSupport.java:215)
        at java.util.concurrent.SynchronousQueue$TransferStack.awaitFulfill(SynchronousQueue.java:460)
        at java.util.concurrent.SynchronousQueue$TransferStack.transfer(SynchronousQueue.java:362)
        at java.util.concurrent.SynchronousQueue.poll(SynchronousQueue.java:941)
        at java.util.concurrent.ThreadPoolExecutor.getTask(ThreadPoolExecutor.java:1073)
        at java.util.concurrent.ThreadPoolExecutor.runWorker(ThreadPoolExecutor.java:1134)
        at java.util.concurrent.ThreadPoolExecutor$Worker.run(ThreadPoolExecutor.java:624)
        at java.lang.Thread.run(Thread.java:748)
   5) Thread[id=1650, name=TEST-ChaosMonkeyNothingIsSafeTest.test-seed#[14D04BAC0FDC6C15]-SendThread(127.0.0.1:41783), state=TIMED_WAITING, group=TGRP-ChaosMonkeyNothingIsSafeTest]
        at java.lang.Thread.sleep(Native Method)
        at org.apache.zookeeper.ClientCnxn$SendThread.run(ClientCnxn.java:1051)
	at __randomizedtesting.SeedInfo.seed([14D04BAC0FDC6C15]:0)


FAILED:  org.apache.solr.cloud.ChaosMonkeyNothingIsSafeTest.test

Error Message:
Timeout occured while waiting response from server at: http://127.0.0.1:35085/collection1

Stack Trace:
org.apache.solr.client.solrj.SolrServerException: Timeout occured while waiting response from server at: http://127.0.0.1:35085/collection1
	at __randomizedtesting.SeedInfo.seed([14D04BAC0FDC6C15:9C847476A12001ED]:0)
	at org.apache.solr.client.solrj.impl.HttpSolrClient.executeMethod(HttpSolrClient.java:638)
	at org.apache.solr.client.solrj.impl.HttpSolrClient.request(HttpSolrClient.java:253)
	at org.apache.solr.client.solrj.impl.HttpSolrClient.request(HttpSolrClient.java:242)
	at org.apache.solr.client.solrj.impl.LBHttpSolrClient.doRequest(LBHttpSolrClient.java:483)
	at org.apache.solr.client.solrj.impl.LBHttpSolrClient.request(LBHttpSolrClient.java:413)
	at org.apache.solr.client.solrj.impl.CloudSolrClient.sendRequest(CloudSolrClient.java:1121)
	at org.apache.solr.client.solrj.impl.CloudSolrClient.requestWithRetryOnStaleState(CloudSolrClient.java:862)
	at org.apache.solr.client.solrj.impl.CloudSolrClient.request(CloudSolrClient.java:793)
	at org.apache.solr.client.solrj.SolrRequest.process(SolrRequest.java:178)
	at org.apache.solr.client.solrj.SolrClient.commit(SolrClient.java:484)
	at org.apache.solr.client.solrj.SolrClient.commit(SolrClient.java:463)
	at org.apache.solr.cloud.AbstractFullDistribZkTestBase.commit(AbstractFullDistribZkTestBase.java:1583)
	at org.apache.solr.cloud.ChaosMonkeyNothingIsSafeTest.test(ChaosMonkeyNothingIsSafeTest.java:213)
	at sun.reflect.NativeMethodAccessorImpl.invoke0(Native Method)
	at sun.reflect.NativeMethodAccessorImpl.invoke(NativeMethodAccessorImpl.java:62)
	at sun.reflect.DelegatingMethodAccessorImpl.invoke(DelegatingMethodAccessorImpl.java:43)
	at java.lang.reflect.Method.invoke(Method.java:498)
	at com.carrotsearch.randomizedtesting.RandomizedRunner.invoke(RandomizedRunner.java:1713)
	at com.carrotsearch.randomizedtesting.RandomizedRunner$8.evaluate(RandomizedRunner.java:907)
	at com.carrotsearch.randomizedtesting.RandomizedRunner$9.evaluate(RandomizedRunner.java:943)
	at com.carrotsearch.randomizedtesting.RandomizedRunner$10.evaluate(RandomizedRunner.java:957)
	at org.apache.solr.BaseDistributedSearchTestCase$ShardsRepeatRule$ShardsFixedStatement.callStatement(BaseDistributedSearchTestCase.java:993)
	at org.apache.solr.BaseDistributedSearchTestCase$ShardsRepeatRule$ShardsStatement.evaluate(BaseDistributedSearchTestCase.java:968)
	at com.carrotsearch.randomizedtesting.rules.SystemPropertiesRestoreRule$1.evaluate(SystemPropertiesRestoreRule.java:57)
	at org.apache.lucene.util.TestRuleSetupTeardownChained$1.evaluate(TestRuleSetupTeardownChained.java:49)
	at org.apache.lucene.util.AbstractBeforeAfterRule$1.evaluate(AbstractBeforeAfterRule.java:45)
	at org.apache.lucene.util.TestRuleThreadAndTestName$1.evaluate(TestRuleThreadAndTestName.java:48)
	at org.apache.lucene.util.TestRuleIgnoreAfterMaxFailures$1.evaluate(TestRuleIgnoreAfterMaxFailures.java:64)
	at org.apache.lucene.util.TestRuleMarkFailure$1.evaluate(TestRuleMarkFailure.java:47)
	at com.carrotsearch.randomizedtesting.rules.StatementAdapter.evaluate(StatementAdapter.java:36)
	at com.carrotsearch.randomizedtesting.ThreadLeakControl$StatementRunner.run(ThreadLeakControl.java:368)
	at com.carrotsearch.randomizedtesting.ThreadLeakControl.forkTimeoutingTask(ThreadLeakControl.java:817)
	at com.carrotsearch.randomizedtesting.ThreadLeakControl$3.evaluate(ThreadLeakControl.java:468)
	at com.carrotsearch.randomizedtesting.RandomizedRunner.runSingleTest(RandomizedRunner.java:916)
	at com.carrotsearch.randomizedtesting.RandomizedRunner$5.evaluate(RandomizedRunner.java:802)
	at com.carrotsearch.randomizedtesting.RandomizedRunner$6.evaluate(RandomizedRunner.java:852)
	at com.carrotsearch.randomizedtesting.RandomizedRunner$7.evaluate(RandomizedRunner.java:863)
	at com.carrotsearch.randomizedtesting.rules.StatementAdapter.evaluate(StatementAdapter.java:36)
	at com.carrotsearch.randomizedtesting.rules.SystemPropertiesRestoreRule$1.evaluate(SystemPropertiesRestoreRule.java:57)
	at org.apache.lucene.util.AbstractBeforeAfterRule$1.evaluate(AbstractBeforeAfterRule.java:45)
	at com.carrotsearch.randomizedtesting.rules.StatementAdapter.evaluate(StatementAdapter.java:36)
	at org.apache.lucene.util.TestRuleStoreClassName$1.evaluate(TestRuleStoreClassName.java:41)
	at com.carrotsearch.randomizedtesting.rules.NoShadowingOrOverridesOnMethodsRule$1.evaluate(NoShadowingOrOverridesOnMethodsRule.java:40)
	at com.carrotsearch.randomizedtesting.rules.NoShadowingOrOverridesOnMethodsRule$1.evaluate(NoShadowingOrOverridesOnMethodsRule.java:40)
	at com.carrotsearch.randomizedtesting.rules.StatementAdapter.evaluate(StatementAdapter.java:36)
	at com.carrotsearch.randomizedtesting.rules.StatementAdapter.evaluate(StatementAdapter.java:36)
	at com.carrotsearch.randomizedtesting.rules.StatementAdapter.evaluate(StatementAdapter.java:36)
	at org.apache.lucene.util.TestRuleAssertionsRequired$1.evaluate(TestRuleAssertionsRequired.java:53)
	at org.apache.lucene.util.TestRuleMarkFailure$1.evaluate(TestRuleMarkFailure.java:47)
	at org.apache.lucene.util.TestRuleIgnoreAfterMaxFailures$1.evaluate(TestRuleIgnoreAfterMaxFailures.java:64)
	at org.apache.lucene.util.TestRuleIgnoreTestSuites$1.evaluate(TestRuleIgnoreTestSuites.java:54)
	at com.carrotsearch.randomizedtesting.rules.StatementAdapter.evaluate(StatementAdapter.java:36)
	at com.carrotsearch.randomizedtesting.ThreadLeakControl$StatementRunner.run(ThreadLeakControl.java:368)
	at java.lang.Thread.run(Thread.java:748)
Caused by: java.net.SocketTimeoutException: Read timed out
	at java.net.SocketInputStream.socketRead0(Native Method)
	at java.net.SocketInputStream.socketRead(SocketInputStream.java:116)
	at java.net.SocketInputStream.read(SocketInputStream.java:171)
	at java.net.SocketInputStream.read(SocketInputStream.java:141)
	at org.apache.http.impl.io.SessionInputBufferImpl.streamRead(SessionInputBufferImpl.java:139)
	at org.apache.http.impl.io.SessionInputBufferImpl.fillBuffer(SessionInputBufferImpl.java:155)
	at org.apache.http.impl.io.SessionInputBufferImpl.readLine(SessionInputBufferImpl.java:284)
	at org.apache.http.impl.conn.DefaultHttpResponseParser.parseHead(DefaultHttpResponseParser.java:140)
	at org.apache.http.impl.conn.DefaultHttpResponseParser.parseHead(DefaultHttpResponseParser.java:57)
	at org.apache.http.impl.io.AbstractMessageParser.parse(AbstractMessageParser.java:261)
	at org.apache.http.impl.DefaultBHttpClientConnection.receiveResponseHeader(DefaultBHttpClientConnection.java:165)
	at org.apache.http.impl.conn.CPoolProxy.receiveResponseHeader(CPoolProxy.java:167)
	at org.apache.http.protocol.HttpRequestExecutor.doReceiveResponse(HttpRequestExecutor.java:272)
	at org.apache.http.protocol.HttpRequestExecutor.execute(HttpRequestExecutor.java:124)
	at org.apache.http.impl.execchain.MainClientExec.execute(MainClientExec.java:271)
	at org.apache.http.impl.execchain.ProtocolExec.execute(ProtocolExec.java:184)
	at org.apache.http.impl.execchain.RetryExec.execute(RetryExec.java:88)
	at org.apache.http.impl.execchain.RedirectExec.execute(RedirectExec.java:110)
	at org.apache.http.impl.client.InternalHttpClient.doExecute(InternalHttpClient.java:184)
	at org.apache.http.impl.client.CloseableHttpClient.execute(CloseableHttpClient.java:82)
	at org.apache.http.impl.client.CloseableHttpClient.execute(CloseableHttpClient.java:55)
	at org.apache.solr.client.solrj.impl.HttpSolrClient.executeMethod(HttpSolrClient.java:526)
	... 53 more




Build Log:
[...truncated 11188 lines...]
   [junit4] Suite: org.apache.solr.cloud.ChaosMonkeyNothingIsSafeTest
   [junit4]   2> 395344 INFO  (SUITE-ChaosMonkeyNothingIsSafeTest-seed#[14D04BAC0FDC6C15]-worker) [    ] o.a.s.SolrTestCaseJ4 SecureRandom sanity checks: test.solr.allowed.securerandom=null & java.security.egd=file:/dev/./urandom
   [junit4]   2> Creating dataDir: /home/jenkins/workspace/Lucene-Solr-7.x-Linux/solr/build/solr-core/test/J0/temp/solr.cloud.ChaosMonkeyNothingIsSafeTest_14D04BAC0FDC6C15-001/init-core-data-001
   [junit4]   2> 395344 WARN  (SUITE-ChaosMonkeyNothingIsSafeTest-seed#[14D04BAC0FDC6C15]-worker) [    ] o.a.s.SolrTestCaseJ4 startTrackingSearchers: numOpens=2 numCloses=2
   [junit4]   2> 395345 INFO  (SUITE-ChaosMonkeyNothingIsSafeTest-seed#[14D04BAC0FDC6C15]-worker) [    ] o.a.s.SolrTestCaseJ4 Using TrieFields (NUMERIC_POINTS_SYSPROP=false) w/NUMERIC_DOCVALUES_SYSPROP=false
   [junit4]   2> 395346 INFO  (SUITE-ChaosMonkeyNothingIsSafeTest-seed#[14D04BAC0FDC6C15]-worker) [    ] o.a.s.SolrTestCaseJ4 Randomized ssl (false) and clientAuth (false) via: @org.apache.solr.SolrTestCaseJ4$SuppressSSL(bugUrl=https://issues.apache.org/jira/browse/SOLR-5776)
   [junit4]   2> 395346 INFO  (SUITE-ChaosMonkeyNothingIsSafeTest-seed#[14D04BAC0FDC6C15]-worker) [    ] o.a.s.BaseDistributedSearchTestCase Setting hostContext system property: /
   [junit4]   2> 395349 INFO  (TEST-ChaosMonkeyNothingIsSafeTest.test-seed#[14D04BAC0FDC6C15]) [    ] o.a.s.c.ZkTestServer STARTING ZK TEST SERVER
   [junit4]   2> 395349 INFO  (Thread-311) [    ] o.a.s.c.ZkTestServer client port:0.0.0.0/0.0.0.0:0
   [junit4]   2> 395349 INFO  (Thread-311) [    ] o.a.s.c.ZkTestServer Starting server
   [junit4]   2> 395353 ERROR (Thread-311) [    ] o.a.z.s.ZooKeeperServer ZKShutdownHandler is not registered, so ZooKeeper server won't take any action on ERROR or SHUTDOWN server state changes
   [junit4]   2> 395449 INFO  (TEST-ChaosMonkeyNothingIsSafeTest.test-seed#[14D04BAC0FDC6C15]) [    ] o.a.s.c.ZkTestServer start zk server on port:41783
   [junit4]   2> 395501 INFO  (TEST-ChaosMonkeyNothingIsSafeTest.test-seed#[14D04BAC0FDC6C15]) [    ] o.a.s.c.AbstractZkTestCase put /home/jenkins/workspace/Lucene-Solr-7.x-Linux/solr/core/src/test-files/solr/collection1/conf/solrconfig-tlog.xml to /configs/conf1/solrconfig.xml
   [junit4]   2> 395502 INFO  (TEST-ChaosMonkeyNothingIsSafeTest.test-seed#[14D04BAC0FDC6C15]) [    ] o.a.s.c.AbstractZkTestCase put /home/jenkins/workspace/Lucene-Solr-7.x-Linux/solr/core/src/test-files/solr/collection1/conf/schema15.xml to /configs/conf1/schema.xml
   [junit4]   2> 395503 INFO  (TEST-ChaosMonkeyNothingIsSafeTest.test-seed#[14D04BAC0FDC6C15]) [    ] o.a.s.c.AbstractZkTestCase put /home/jenkins/workspace/Lucene-Solr-7.x-Linux/solr/core/src/test-files/solr/collection1/conf/solrconfig.snippet.randomindexconfig.xml to /configs/conf1/solrconfig.snippet.randomindexconfig.xml
   [junit4]   2> 395503 INFO  (TEST-ChaosMonkeyNothingIsSafeTest.test-seed#[14D04BAC0FDC6C15]) [    ] o.a.s.c.AbstractZkTestCase put /home/jenkins/workspace/Lucene-Solr-7.x-Linux/solr/core/src/test-files/solr/collection1/conf/stopwords.txt to /configs/conf1/stopwords.txt
   [junit4]   2> 395504 INFO  (TEST-ChaosMonkeyNothingIsSafeTest.test-seed#[14D04BAC0FDC6C15]) [    ] o.a.s.c.AbstractZkTestCase put /home/jenkins/workspace/Lucene-Solr-7.x-Linux/solr/core/src/test-files/solr/collection1/conf/protwords.txt to /configs/conf1/protwords.txt
   [junit4]   2> 395504 INFO  (TEST-ChaosMonkeyNothingIsSafeTest.test-seed#[14D04BAC0FDC6C15]) [    ] o.a.s.c.AbstractZkTestCase put /home/jenkins/workspace/Lucene-Solr-7.x-Linux/solr/core/src/test-files/solr/collection1/conf/currency.xml to /configs/conf1/currency.xml
   [junit4]   2> 395505 INFO  (TEST-ChaosMonkeyNothingIsSafeTest.test-seed#[14D04BAC0FDC6C15]) [    ] o.a.s.c.AbstractZkTestCase put /home/jenkins/workspace/Lucene-Solr-7.x-Linux/solr/core/src/test-files/solr/collection1/conf/enumsConfig.xml to /configs/conf1/enumsConfig.xml
   [junit4]   2> 395505 INFO  (TEST-ChaosMonkeyNothingIsSafeTest.test-seed#[14D04BAC0FDC6C15]) [    ] o.a.s.c.AbstractZkTestCase put /home/jenkins/workspace/Lucene-Solr-7.x-Linux/solr/core/src/test-files/solr/collection1/conf/open-exchange-rates.json to /configs/conf1/open-exchange-rates.json
   [junit4]   2> 395512 INFO  (TEST-ChaosMonkeyNothingIsSafeTest.test-seed#[14D04BAC0FDC6C15]) [    ] o.a.s.c.AbstractZkTestCase put /home/jenkins/workspace/Lucene-Solr-7.x-Linux/solr/core/src/test-files/solr/collection1/conf/mapping-ISOLatin1Accent.txt to /configs/conf1/mapping-ISOLatin1Accent.txt
   [junit4]   2> 395513 INFO  (TEST-ChaosMonkeyNothingIsSafeTest.test-seed#[14D04BAC0FDC6C15]) [    ] o.a.s.c.AbstractZkTestCase put /home/jenkins/workspace/Lucene-Solr-7.x-Linux/solr/core/src/test-files/solr/collection1/conf/old_synonyms.txt to /configs/conf1/old_synonyms.txt
   [junit4]   2> 395514 INFO  (TEST-ChaosMonkeyNothingIsSafeTest.test-seed#[14D04BAC0FDC6C15]) [    ] o.a.s.c.AbstractZkTestCase put /home/jenkins/workspace/Lucene-Solr-7.x-Linux/solr/core/src/test-files/solr/collection1/conf/synonyms.txt to /configs/conf1/synonyms.txt
   [junit4]   2> 395514 INFO  (TEST-ChaosMonkeyNothingIsSafeTest.test-seed#[14D04BAC0FDC6C15]) [    ] o.a.s.c.AbstractFullDistribZkTestBase Will use TLOG replicas unless explicitly asked otherwise
   [junit4]   2> 395595 INFO  (TEST-ChaosMonkeyNothingIsSafeTest.test-seed#[14D04BAC0FDC6C15]) [    ] o.e.j.s.Server jetty-9.3.20.v20170531
   [junit4]   2> 395595 INFO  (TEST-ChaosMonkeyNothingIsSafeTest.test-seed#[14D04BAC0FDC6C15]) [    ] o.e.j.s.h.ContextHandler Started o.e.j.s.ServletContextHandler@121f4ad{/,null,AVAILABLE}
   [junit4]   2> 395597 INFO  (TEST-ChaosMonkeyNothingIsSafeTest.test-seed#[14D04BAC0FDC6C15]) [    ] o.e.j.s.AbstractConnector Started ServerConnector@b88596{HTTP/1.1,[http/1.1]}{127.0.0.1:45253}
   [junit4]   2> 395597 INFO  (TEST-ChaosMonkeyNothingIsSafeTest.test-seed#[14D04BAC0FDC6C15]) [    ] o.e.j.s.Server Started @396957ms
   [junit4]   2> 395597 INFO  (TEST-ChaosMonkeyNothingIsSafeTest.test-seed#[14D04BAC0FDC6C15]) [    ] o.a.s.c.s.e.JettySolrRunner Jetty properties: {solr.data.dir=/home/jenkins/workspace/Lucene-Solr-7.x-Linux/solr/build/solr-core/test/J0/temp/solr.cloud.ChaosMonkeyNothingIsSafeTest_14D04BAC0FDC6C15-001/tempDir-001/control/data, hostContext=/, hostPort=45253, coreRootDirectory=/home/jenkins/workspace/Lucene-Solr-7.x-Linux/solr/build/solr-core/test/J0/../../../../../../../../../home/jenkins/workspace/Lucene-Solr-7.x-Linux/solr/build/solr-core/test/J0/temp/solr.cloud.ChaosMonkeyNothingIsSafeTest_14D04BAC0FDC6C15-001/control-001/cores}
   [junit4]   2> 395604 ERROR (TEST-ChaosMonkeyNothingIsSafeTest.test-seed#[14D04BAC0FDC6C15]) [    ] o.a.s.s.StartupLoggingUtils Missing Java Option solr.log.dir. Logging may be missing or incomplete.
   [junit4]   2> 395604 INFO  (TEST-ChaosMonkeyNothingIsSafeTest.test-seed#[14D04BAC0FDC6C15]) [    ] o.a.s.s.SolrDispatchFilter  ___      _       Welcome to Apache Solr™ version 7.1.0
   [junit4]   2> 395604 INFO  (TEST-ChaosMonkeyNothingIsSafeTest.test-seed#[14D04BAC0FDC6C15]) [    ] o.a.s.s.SolrDispatchFilter / __| ___| |_ _   Starting in cloud mode on port null
   [junit4]   2> 395604 INFO  (TEST-ChaosMonkeyNothingIsSafeTest.test-seed#[14D04BAC0FDC6C15]) [    ] o.a.s.s.SolrDispatchFilter \__ \/ _ \ | '_|  Install dir: null, Default config dir: null
   [junit4]   2> 395604 INFO  (TEST-ChaosMonkeyNothingIsSafeTest.test-seed#[14D04BAC0FDC6C15]) [    ] o.a.s.s.SolrDispatchFilter |___/\___/_|_|    Start time: 2017-08-21T06:40:52.292Z
   [junit4]   2> 395610 INFO  (TEST-ChaosMonkeyNothingIsSafeTest.test-seed#[14D04BAC0FDC6C15]) [    ] o.a.s.s.SolrDispatchFilter Loading solr.xml from SolrHome (not found in ZooKeeper)
   [junit4]   2> 395610 INFO  (TEST-ChaosMonkeyNothingIsSafeTest.test-seed#[14D04BAC0FDC6C15]) [    ] o.a.s.c.SolrXmlConfig Loading container configuration from /home/jenkins/workspace/Lucene-Solr-7.x-Linux/solr/build/solr-core/test/J0/temp/solr.cloud.ChaosMonkeyNothingIsSafeTest_14D04BAC0FDC6C15-001/control-001/solr.xml
   [junit4]   2> 395614 INFO  (TEST-ChaosMonkeyNothingIsSafeTest.test-seed#[14D04BAC0FDC6C15]) [    ] o.a.s.c.SolrXmlConfig MBean server found: com.sun.jmx.mbeanserver.JmxMBeanServer@1ab750b, but no JMX reporters were configured - adding default JMX reporter.
   [junit4]   2> 395616 INFO  (TEST-ChaosMonkeyNothingIsSafeTest.test-seed#[14D04BAC0FDC6C15]) [    ] o.a.s.c.ZkContainer Zookeeper client=127.0.0.1:41783/solr
   [junit4]   2> 395683 INFO  (TEST-ChaosMonkeyNothingIsSafeTest.test-seed#[14D04BAC0FDC6C15]) [n:127.0.0.1:45253_    ] o.a.s.c.Overseer Overseer (id=null) closing
   [junit4]   2> 395684 INFO  (TEST-ChaosMonkeyNothingIsSafeTest.test-seed#[14D04BAC0FDC6C15]) [n:127.0.0.1:45253_    ] o.a.s.c.OverseerElectionContext I am going to be the leader 127.0.0.1:45253_
   [junit4]   2> 395684 INFO  (TEST-ChaosMonkeyNothingIsSafeTest.test-seed#[14D04BAC0FDC6C15]) [n:127.0.0.1:45253_    ] o.a.s.c.Overseer Overseer (id=98520114923962372-127.0.0.1:45253_-n_0000000000) starting
   [junit4]   2> 395695 INFO  (TEST-ChaosMonkeyNothingIsSafeTest.test-seed#[14D04BAC0FDC6C15]) [n:127.0.0.1:45253_    ] o.a.s.c.ZkController Register node as live in ZooKeeper:/live_nodes/127.0.0.1:45253_
   [junit4]   2> 395696 INFO  (zkCallback-237-thread-1-processing-n:127.0.0.1:45253_) [n:127.0.0.1:45253_    ] o.a.s.c.c.ZkStateReader Updated live nodes from ZooKeeper... (0) -> (1)
   [junit4]   2> 395820 INFO  (TEST-ChaosMonkeyNothingIsSafeTest.test-seed#[14D04BAC0FDC6C15]) [n:127.0.0.1:45253_    ] o.a.s.m.r.SolrJmxReporter JMX monitoring for 'solr.node' (registry 'solr.node') enabled at server: com.sun.jmx.mbeanserver.JmxMBeanServer@1ab750b
   [junit4]   2> 395830 INFO  (TEST-ChaosMonkeyNothingIsSafeTest.test-seed#[14D04BAC0FDC6C15]) [n:127.0.0.1:45253_    ] o.a.s.m.r.SolrJmxReporter JMX monitoring for 'solr.jvm' (registry 'solr.jvm') enabled at server: com.sun.jmx.mbeanserver.JmxMBeanServer@1ab750b
   [junit4]   2> 395830 INFO  (TEST-ChaosMonkeyNothingIsSafeTest.test-seed#[14D04BAC0FDC6C15]) [n:127.0.0.1:45253_    ] o.a.s.m.r.SolrJmxReporter JMX monitoring for 'solr.jetty' (registry 'solr.jetty') enabled at server: com.sun.jmx.mbeanserver.JmxMBeanServer@1ab750b
   [junit4]   2> 395831 INFO  (TEST-ChaosMonkeyNothingIsSafeTest.test-seed#[14D04BAC0FDC6C15]) [n:127.0.0.1:45253_    ] o.a.s.c.CorePropertiesLocator Found 0 core definitions underneath /home/jenkins/workspace/Lucene-Solr-7.x-Linux/solr/build/solr-core/test/J0/../../../../../../../../../home/jenkins/workspace/Lucene-Solr-7.x-Linux/solr/build/solr-core/test/J0/temp/solr.cloud.ChaosMonkeyNothingIsSafeTest_14D04BAC0FDC6C15-001/control-001/cores
   [junit4]   2> 395851 INFO  (TEST-ChaosMonkeyNothingIsSafeTest.test-seed#[14D04BAC0FDC6C15]) [    ] o.a.s.c.c.ZkStateReader Updated live nodes from ZooKeeper... (0) -> (1)
   [junit4]   2> 395851 INFO  (TEST-ChaosMonkeyNothingIsSafeTest.test-seed#[14D04BAC0FDC6C15]) [    ] o.a.s.c.s.i.ZkClientClusterStateProvider Cluster at 127.0.0.1:41783/solr ready
   [junit4]   2> 395853 INFO  (qtp9348697-1618) [n:127.0.0.1:45253_    ] o.a.s.h.a.CollectionsHandler Invoked Collection Action :create with params replicationFactor=1&collection.configName=conf1&name=control_collection&nrtReplicas=1&action=CREATE&numShards=1&createNodeSet=127.0.0.1:45253_&wt=javabin&version=2 and sendToOCPQueue=true
   [junit4]   2> 395857 INFO  (OverseerThreadFactory-696-thread-1-processing-n:127.0.0.1:45253_) [n:127.0.0.1:45253_    ] o.a.s.c.CreateCollectionCmd Create collection control_collection
   [junit4]   2> 395964 INFO  (qtp9348697-1614) [n:127.0.0.1:45253_    ] o.a.s.h.a.CoreAdminOperation core create command qt=/admin/cores&collection.configName=conf1&newCollection=true&name=control_collection_shard1_replica_n1&action=CREATE&numShards=1&collection=control_collection&shard=shard1&wt=javabin&version=2&replicaType=NRT
   [junit4]   2> 395965 INFO  (qtp9348697-1614) [n:127.0.0.1:45253_    ] o.a.s.c.TransientSolrCoreCacheDefault Allocating transient cache for 4 transient cores
   [junit4]   2> 396071 INFO  (zkCallback-237-thread-1-processing-n:127.0.0.1:45253_) [n:127.0.0.1:45253_    ] o.a.s.c.c.ZkStateReader A cluster state change: [WatchedEvent state:SyncConnected type:NodeDataChanged path:/collections/control_collection/state.json] for collection [control_collection] has occurred - updating... (live nodes size: [1])
   [junit4]   2> 396983 INFO  (qtp9348697-1614) [n:127.0.0.1:45253_ c:control_collection s:shard1  x:control_collection_shard1_replica_n1] o.a.s.c.SolrConfig Using Lucene MatchVersion: 7.1.0
   [junit4]   2> 396990 INFO  (qtp9348697-1614) [n:127.0.0.1:45253_ c:control_collection s:shard1  x:control_collection_shard1_replica_n1] o.a.s.s.IndexSchema [control_collection_shard1_replica_n1] Schema name=test
   [junit4]   2> 397052 INFO  (qtp9348697-1614) [n:127.0.0.1:45253_ c:control_collection s:shard1  x:control_collection_shard1_replica_n1] o.a.s.s.IndexSchema Loaded schema test/1.6 with uniqueid field id
   [junit4]   2> 397059 INFO  (qtp9348697-1614) [n:127.0.0.1:45253_ c:control_collection s:shard1  x:control_collection_shard1_replica_n1] o.a.s.c.CoreContainer Creating SolrCore 'control_collection_shard1_replica_n1' using configuration from collection control_collection, trusted=true
   [junit4]   2> 397060 INFO  (qtp9348697-1614) [n:127.0.0.1:45253_ c:control_collection s:shard1  x:control_collection_shard1_replica_n1] o.a.s.m.r.SolrJmxReporter JMX monitoring for 'solr.core.control_collection.shard1.replica_n1' (registry 'solr.core.control_collection.shard1.replica_n1') enabled at server: com.sun.jmx.mbeanserver.JmxMBeanServer@1ab750b
   [junit4]   2> 397060 INFO  (qtp9348697-1614) [n:127.0.0.1:45253_ c:control_collection s:shard1  x:control_collection_shard1_replica_n1] o.a.s.c.SolrCore solr.RecoveryStrategy.Builder
   [junit4]   2> 397060 INFO  (qtp9348697-1614) [n:127.0.0.1:45253_ c:control_collection s:shard1  x:control_collection_shard1_replica_n1] o.a.s.c.SolrCore [[control_collection_shard1_replica_n1] ] Opening new SolrCore at [/home/jenkins/workspace/Lucene-Solr-7.x-Linux/solr/build/solr-core/test/J0/temp/solr.cloud.ChaosMonkeyNothingIsSafeTest_14D04BAC0FDC6C15-001/control-001/cores/control_collection_shard1_replica_n1], dataDir=[/home/jenkins/workspace/Lucene-Solr-7.x-Linux/solr/build/solr-core/test/J0/../../../../../../../../../home/jenkins/workspace/Lucene-Solr-7.x-Linux/solr/build/solr-core/test/J0/temp/solr.cloud.ChaosMonkeyNothingIsSafeTest_14D04BAC0FDC6C15-001/control-001/cores/control_collection_shard1_replica_n1/data/]
   [junit4]   2> 397064 INFO  (qtp9348697-1614) [n:127.0.0.1:45253_ c:control_collection s:shard1  x:control_collection_shard1_replica_n1] o.a.s.u.RandomMergePolicy RandomMergePolicy wrapping class org.apache.lucene.index.TieredMergePolicy: [TieredMergePolicy: maxMergeAtOnce=26, maxMergeAtOnceExplicit=30, maxMergedSegmentMB=64.3330078125, floorSegmentMB=1.3603515625, forceMergeDeletesPctAllowed=6.901292712528972, segmentsPerTier=17.0, maxCFSSegmentSizeMB=8.796093022207999E12, noCFSRatio=0.5803029934945613
   [junit4]   2> 397075 WARN  (qtp9348697-1614) [n:127.0.0.1:45253_ c:control_collection s:shard1  x:control_collection_shard1_replica_n1] o.a.s.c.RequestHandlers INVALID paramSet a in requestHandler {type = requestHandler,name = /dump,class = DumpRequestHandler,attributes = {initParams=a, name=/dump, class=DumpRequestHandler},args = {defaults={a=A,b=B}}}
   [junit4]   2> 397115 INFO  (qtp9348697-1614) [n:127.0.0.1:45253_ c:control_collection s:shard1  x:control_collection_shard1_replica_n1] o.a.s.u.UpdateHandler Using UpdateLog implementation: org.apache.solr.update.UpdateLog
   [junit4]   2> 397115 INFO  (qtp9348697-1614) [n:127.0.0.1:45253_ c:control_collection s:shard1  x:control_collection_shard1_replica_n1] o.a.s.u.UpdateLog Initializing UpdateLog: dataDir= defaultSyncLevel=FLUSH numRecordsToKeep=100 maxNumLogsToKeep=10 numVersionBuckets=65536
   [junit4]   2> 397115 INFO  (qtp9348697-1614) [n:127.0.0.1:45253_ c:control_collection s:shard1  x:control_collection_shard1_replica_n1] o.a.s.u.CommitTracker Hard AutoCommit: if uncommited for 15000ms; 
   [junit4]   2> 397115 INFO  (qtp9348697-1614) [n:127.0.0.1:45253_ c:control_collection s:shard1  x:control_collection_shard1_replica_n1] o.a.s.u.CommitTracker Soft AutoCommit: disabled
   [junit4]   2> 397117 INFO  (qtp9348697-1614) [n:127.0.0.1:45253_ c:control_collection s:shard1  x:control_collection_shard1_replica_n1] o.a.s.u.RandomMergePolicy RandomMergePolicy wrapping class org.apache.lucene.index.LogDocMergePolicy: [LogDocMergePolicy: minMergeSize=1000, mergeFactor=31, maxMergeSize=9223372036854775807, maxMergeSizeForForcedMerge=9223372036854775807, calibrateSizeByDeletes=false, maxMergeDocs=2147483647, maxCFSSegmentSizeMB=8.796093022207999E12, noCFSRatio=1.0]
   [junit4]   2> 397117 INFO  (qtp9348697-1614) [n:127.0.0.1:45253_ c:control_collection s:shard1  x:control_collection_shard1_replica_n1] o.a.s.s.SolrIndexSearcher Opening [Searcher@1ec7f0b[control_collection_shard1_replica_n1] main]
   [junit4]   2> 397118 INFO  (qtp9348697-1614) [n:127.0.0.1:45253_ c:control_collection s:shard1  x:control_collection_shard1_replica_n1] o.a.s.r.ManagedResourceStorage Configured ZooKeeperStorageIO with znodeBase: /configs/conf1
   [junit4]   2> 397118 INFO  (qtp9348697-1614) [n:127.0.0.1:45253_ c:control_collection s:shard1  x:control_collection_shard1_replica_n1] o.a.s.r.ManagedResourceStorage Loaded null at path _rest_managed.json using ZooKeeperStorageIO:path=/configs/conf1
   [junit4]   2> 397119 INFO  (qtp9348697-1614) [n:127.0.0.1:45253_ c:control_collection s:shard1  x:control_collection_shard1_replica_n1] o.a.s.h.ReplicationHandler Commits will be reserved for  10000
   [junit4]   2> 397120 INFO  (searcherExecutor-699-thread-1-processing-n:127.0.0.1:45253_ x:control_collection_shard1_replica_n1 s:shard1 c:control_collection) [n:127.0.0.1:45253_ c:control_collection s:shard1  x:control_collection_shard1_replica_n1] o.a.s.c.SolrCore [control_collection_shard1_replica_n1] Registered new searcher Searcher@1ec7f0b[control_collection_shard1_replica_n1] main{ExitableDirectoryReader(UninvertingDirectoryReader())}
   [junit4]   2> 397120 INFO  (qtp9348697-1614) [n:127.0.0.1:45253_ c:control_collection s:shard1  x:control_collection_shard1_replica_n1] o.a.s.u.UpdateLog Could not find max version in index or recent updates, using new clock 1576321840639377408
   [junit4]   2> 397123 INFO  (qtp9348697-1614) [n:127.0.0.1:45253_ c:control_collection s:shard1  x:control_collection_shard1_replica_n1] o.a.s.c.ShardLeaderElectionContext Enough replicas found to continue.
   [junit4]   2> 397123 INFO  (qtp9348697-1614) [n:127.0.0.1:45253_ c:control_collection s:shard1  x:control_collection_shard1_replica_n1] o.a.s.c.ShardLeaderElectionContext I may be the new leader - try and sync
   [junit4]   2> 397123 INFO  (qtp9348697-1614) [n:127.0.0.1:45253_ c:control_collection s:shard1  x:control_collection_shard1_replica_n1] o.a.s.c.SyncStrategy Sync replicas to http://127.0.0.1:45253/control_collection_shard1_replica_n1/
   [junit4]   2> 397123 INFO  (qtp9348697-1614) [n:127.0.0.1:45253_ c:control_collection s:shard1  x:control_collection_shard1_replica_n1] o.a.s.c.SyncStrategy Sync Success - now sync replicas to me
   [junit4]   2> 397123 INFO  (qtp9348697-1614) [n:127.0.0.1:45253_ c:control_collection s:shard1  x:control_collection_shard1_replica_n1] o.a.s.c.SyncStrategy http://127.0.0.1:45253/control_collection_shard1_replica_n1/ has no replicas
   [junit4]   2> 397123 INFO  (qtp9348697-1614) [n:127.0.0.1:45253_ c:control_collection s:shard1  x:control_collection_shard1_replica_n1] o.a.s.c.ShardLeaderElectionContext Found all replicas participating in election, clear LIR
   [junit4]   2> 397125 INFO  (qtp9348697-1614) [n:127.0.0.1:45253_ c:control_collection s:shard1  x:control_collection_shard1_replica_n1] o.a.s.c.ShardLeaderElectionContext I am the new leader: http://127.0.0.1:45253/control_collection_shard1_replica_n1/ shard1
   [junit4]   2> 397226 INFO  (zkCallback-237-thread-1-processing-n:127.0.0.1:45253_) [n:127.0.0.1:45253_    ] o.a.s.c.c.ZkStateReader A cluster state change: [WatchedEvent state:SyncConnected type:NodeDataChanged path:/collections/control_collection/state.json] for collection [control_collection] has occurred - updating... (live nodes size: [1])
   [junit4]   2> 397275 INFO  (qtp9348697-1614) [n:127.0.0.1:45253_ c:control_collection s:shard1  x:control_collection_shard1_replica_n1] o.a.s.c.ZkController I am the leader, no recovery necessary
   [junit4]   2> 397276 INFO  (qtp9348697-1614) [n:127.0.0.1:45253_ c:control_collection s:shard1  x:control_collection_shard1_replica_n1] o.a.s.s.HttpSolrCall [admin] webapp=null path=/admin/cores params={qt=/admin/cores&collection.configName=conf1&newCollection=true&name=control_collection_shard1_replica_n1&action=CREATE&numShards=1&collection=control_collection&shard=shard1&wt=javabin&version=2&replicaType=NRT} status=0 QTime=1312
   [junit4]   2> 397278 INFO  (qtp9348697-1618) [n:127.0.0.1:45253_    ] o.a.s.h.a.CollectionsHandler Wait for new collection to be active for at most 30 seconds. Check all shard replicas
   [junit4]   2> 397378 INFO  (zkCallback-237-thread-1-processing-n:127.0.0.1:45253_) [n:127.0.0.1:45253_    ] o.a.s.c.c.ZkStateReader A cluster state change: [WatchedEvent state:SyncConnected type:NodeDataChanged path:/collections/control_collection/state.json] for collection [control_collection] has occurred - updating... (live nodes size: [1])
   [junit4]   2> 397859 INFO  (OverseerCollectionConfigSetProcessor-98520114923962372-127.0.0.1:45253_-n_0000000000) [n:127.0.0.1:45253_    ] o.a.s.c.OverseerTaskQueue Response ZK path: /overseer/collection-queue-work/qnr-0000000000 doesn't exist.  Requestor may have disconnected from ZooKeeper
   [junit4]   2> 398278 INFO  (qtp9348697-1618) [n:127.0.0.1:45253_    ] o.a.s.s.HttpSolrCall [admin] webapp=null path=/admin/collections params={replicationFactor=1&collection.configName=conf1&name=control_collection&nrtReplicas=1&action=CREATE&numShards=1&createNodeSet=127.0.0.1:45253_&wt=javabin&version=2} status=0 QTime=2424
   [junit4]   2> 398284 INFO  (TEST-ChaosMonkeyNothingIsSafeTest.test-seed#[14D04BAC0FDC6C15]) [    ] o.a.s.c.c.ZkStateReader Updated live nodes from ZooKeeper... (0) -> (1)
   [junit4]   2> 398285 INFO  (TEST-ChaosMonkeyNothingIsSafeTest.test-seed#[14D04BAC0FDC6C15]) [    ] o.a.s.c.s.i.ZkClientClusterStateProvider Cluster at 127.0.0.1:41783/solr ready
   [junit4]   2> 398285 INFO  (TEST-ChaosMonkeyNothingIsSafeTest.test-seed#[14D04BAC0FDC6C15]) [    ] o.a.s.c.ChaosMonkey monkey: init - expire sessions:false cause connection loss:false
   [junit4]   2> 398286 INFO  (qtp9348697-1618) [n:127.0.0.1:45253_    ] o.a.s.h.a.CollectionsHandler Invoked Collection Action :create with params replicationFactor=1&collection.configName=conf1&name=collection1&nrtReplicas=1&action=CREATE&numShards=2&createNodeSet=&stateFormat=1&wt=javabin&version=2 and sendToOCPQueue=true
   [junit4]   2> 398287 INFO  (OverseerThreadFactory-696-thread-2-processing-n:127.0.0.1:45253_) [n:127.0.0.1:45253_    ] o.a.s.c.CreateCollectionCmd Create collection collection1
   [junit4]   2> 398288 WARN  (OverseerThreadFactory-696-thread-2-processing-n:127.0.0.1:45253_) [n:127.0.0.1:45253_    ] o.a.s.c.CreateCollectionCmd It is unusual to create a collection (collection1) without cores.
   [junit4]   2> 398491 INFO  (qtp9348697-1618) [n:127.0.0.1:45253_    ] o.a.s.h.a.CollectionsHandler Wait for new collection to be active for at most 30 seconds. Check all shard replicas
   [junit4]   2> 398491 INFO  (qtp9348697-1618) [n:127.0.0.1:45253_    ] o.a.s.s.HttpSolrCall [admin] webapp=null path=/admin/collections params={replicationFactor=1&collection.configName=conf1&name=collection1&nrtReplicas=1&action=CREATE&numShards=2&createNodeSet=&stateFormat=1&wt=javabin&version=2} status=0 QTime=204
   [junit4]   2> 398613 INFO  (TEST-ChaosMonkeyNothingIsSafeTest.test-seed#[14D04BAC0FDC6C15]) [    ] o.a.s.c.AbstractFullDistribZkTestBase create jetty 1 in directory /home/jenkins/workspace/Lucene-Solr-7.x-Linux/solr/build/solr-core/test/J0/temp/solr.cloud.ChaosMonkeyNothingIsSafeTest_14D04BAC0FDC6C15-001/shard-1-001 of type TLOG
   [junit4]   2> 398614 INFO  (TEST-ChaosMonkeyNothingIsSafeTest.test-seed#[14D04BAC0FDC6C15]) [    ] o.e.j.s.Server jetty-9.3.20.v20170531
   [junit4]   2> 398615 INFO  (TEST-ChaosMonkeyNothingIsSafeTest.test-seed#[14D04BAC0FDC6C15]) [    ] o.e.j.s.h.ContextHandler Started o.e.j.s.ServletContextHandler@1091946{/,null,AVAILABLE}
   [junit4]   2> 398615 INFO  (TEST-ChaosMonkeyNothingIsSafeTest.test-seed#[14D04BAC0FDC6C15]) [    ] o.e.j.s.AbstractConnector Started ServerConnector@1d90a01{HTTP/1.1,[http/1.1]}{127.0.0.1:43325}
   [junit4]   2> 398615 INFO  (TEST-ChaosMonkeyNothingIsSafeTest.test-seed#[14D04BAC0FDC6C15]) [    ] o.e.j.s.Server Started @399975ms
   [junit4]   2> 398616 INFO  (TEST-ChaosMonkeyNothingIsSafeTest.test-seed#[14D04BAC0FDC6C15]) [    ] o.a.s.c.s.e.JettySolrRunner Jetty properties: {solr.data.dir=/home/jenkins/workspace/Lucene-Solr-7.x-Linux/solr/build/solr-core/test/J0/temp/solr.cloud.ChaosMonkeyNothingIsSafeTest_14D04BAC0FDC6C15-001/tempDir-001/jetty1, replicaType=TLOG, solrconfig=solrconfig.xml, hostContext=/, hostPort=43325, coreRootDirectory=/home/jenkins/workspace/Lucene-Solr-7.x-Linux/solr/build/solr-core/test/J0/temp/solr.cloud.ChaosMonkeyNothingIsSafeTest_14D04BAC0FDC6C15-001/shard-1-001/cores}
   [junit4]   2> 398616 ERROR (TEST-ChaosMonkeyNothingIsSafeTest.test-seed#[14D04BAC0FDC6C15]) [    ] o.a.s.s.StartupLoggingUtils Missing Java Option solr.log.dir. Logging may be missing or incomplete.
   [junit4]   2> 398616 INFO  (TEST-ChaosMonkeyNothingIsSafeTest.test-seed#[14D04BAC0FDC6C15]) [    ] o.a.s.s.SolrDispatchFilter  ___      _       Welcome to Apache Solr™ version 7.1.0
   [junit4]   2> 398616 INFO  (TEST-ChaosMonkeyNothingIsSafeTest.test-seed#[14D04BAC0FDC6C15]) [    ] o.a.s.s.SolrDispatchFilter / __| ___| |_ _   Starting in cloud mode on port null
   [junit4]   2> 398616 INFO  (TEST-ChaosMonkeyNothingIsSafeTest.test-seed#[14D04BAC0FDC6C15]) [    ] o.a.s.s.SolrDispatchFilter \__ \/ _ \ | '_|  Install dir: null, Default config dir: null
   [junit4]   2> 398616 INFO  (TEST-ChaosMonkeyNothingIsSafeTest.test-seed#[14D04BAC0FDC6C15]) [    ] o.a.s.s.SolrDispatchFilter |___/\___/_|_|    Start time: 2017-08-21T06:40:55.304Z
   [junit4]   2> 398621 INFO  (TEST-ChaosMonkeyNothingIsSafeTest.test-seed#[14D04BAC0FDC6C15]) [    ] o.a.s.s.SolrDispatchFilter Loading solr.xml from SolrHome (not found in ZooKeeper)
   [junit4]   2> 398621 INFO  (TEST-ChaosMonkeyNothingIsSafeTest.test-seed#[14D04BAC0FDC6C15]) [    ] o.a.s.c.SolrXmlConfig Loading container configuration from /home/jenkins/workspace/Lucene-Solr-7.x-Linux/solr/build/solr-core/test/J0/temp/solr.cloud.ChaosMonkeyNothingIsSafeTest_14D04BAC0FDC6C15-001/shard-1-001/solr.xml
   [junit4]   2> 398624 INFO  (TEST-ChaosMonkeyNothingIsSafeTest.test-seed#[14D04BAC0FDC6C15]) [    ] o.a.s.c.SolrXmlConfig MBean server found: com.sun.jmx.mbeanserver.JmxMBeanServer@1ab750b, but no JMX reporters were configured - adding default JMX reporter.
   [junit4]   2> 398626 INFO  (TEST-ChaosMonkeyNothingIsSafeTest.test-seed#[14D04BAC0FDC6C15]) [    ] o.a.s.c.ZkContainer Zookeeper client=127.0.0.1:41783/solr
   [junit4]   2> 398634 INFO  (TEST-ChaosMonkeyNothingIsSafeTest.test-seed#[14D04BAC0FDC6C15]) [n:127.0.0.1:43325_    ] o.a.s.c.c.ZkStateReader Updated live nodes from ZooKeeper... (0) -> (1)
   [junit4]   2> 398634 INFO  (TEST-ChaosMonkeyNothingIsSafeTest.test-seed#[14D04BAC0FDC6C15]) [n:127.0.0.1:43325_    ] o.a.s.c.Overseer Overseer (id=null) closing
   [junit4]   2> 398635 INFO  (TEST-ChaosMonkeyNothingIsSafeTest.test-seed#[14D04BAC0FDC6C15]) [n:127.0.0.1:43325_    ] o.a.s.c.ZkController Register node as live in ZooKeeper:/live_nodes/127.0.0.1:43325_
   [junit4]   2> 398635 INFO  (zkCallback-244-thread-1) [    ] o.a.s.c.c.ZkStateReader Updated live nodes from ZooKeeper... (1) -> (2)
   [junit4]   2> 398635 INFO  (zkCallback-237-thread-1-processing-n:127.0.0.1:45253_) [n:127.0.0.1:45253_    ] o.a.s.c.c.ZkStateReader Updated live nodes from ZooKeeper... (1) -> (2)
   [junit4]   2> 398636 INFO  (zkCallback-249-thread-1-processing-n:127.0.0.1:43325_) [n:127.0.0.1:43325_    ] o.a.s.c.c.ZkStateReader Updated live nodes from ZooKeeper... (1) -> (2)
   [junit4]   2> 398726 INFO  (TEST-ChaosMonkeyNothingIsSafeTest.test-seed#[14D04BAC0FDC6C15]) [n:127.0.0.1:43325_    ] o.a.s.m.r.SolrJmxReporter JMX monitoring for 'solr.node' (registry 'solr.node') enabled at server: com.sun.jmx.mbeanserver.JmxMBeanServer@1ab750b
   [junit4]   2> 398733 INFO  (TEST-ChaosMonkeyNothingIsSafeTest.test-seed#[14D04BAC0FDC6C15]) [n:127.0.0.1:43325_    ] o.a.s.m.r.SolrJmxReporter JMX monitoring for 'solr.jvm' (registry 'solr.jvm') enabled at server: com.sun.jmx.mbeanserver.JmxMBeanServer@1ab750b
   [junit4]   2> 398733 INFO  (TEST-ChaosMonkeyNothingIsSafeTest.test-seed#[14D04BAC0FDC6C15]) [n:127.0.0.1:43325_    ] o.a.s.m.r.SolrJmxReporter JMX monitoring for 'solr.jetty' (registry 'solr.jetty') enabled at server: com.sun.jmx.mbeanserver.JmxMBeanServer@1ab750b
   [junit4]   2> 398734 INFO  (TEST-ChaosMonkeyNothingIsSafeTest.test-seed#[14D04BAC0FDC6C15]) [n:127.0.0.1:43325_    ] o.a.s.c.CorePropertiesLocator Found 0 core definitions underneath /home/jenkins/workspace/Lucene-Solr-7.x-Linux/solr/build/solr-core/test/J0/temp/solr.cloud.ChaosMonkeyNothingIsSafeTest_14D04BAC0FDC6C15-001/shard-1-001/cores
   [junit4]   2> 398757 INFO  (qtp14539996-1659) [n:127.0.0.1:43325_    ] o.a.s.h.a.CollectionsHandler Invoked Collection Action :addreplica with params node=127.0.0.1:43325_&action=ADDREPLICA&collection=collection1&shard=shard2&type=TLOG&wt=javabin&version=2 and sendToOCPQueue=true
   [junit4]   2> 398758 INFO  (OverseerThreadFactory-696-thread-3-processing-n:127.0.0.1:45253_) [n:127.0.0.1:45253_    ] o.a.s.c.AddReplicaCmd Node Identified 127.0.0.1:43325_ for creating new replica
   [junit4]   2> 398758 INFO  (OverseerCollectionConfigSetProcessor-98520114923962372-127.0.0.1:45253_-n_0000000000) [n:127.0.0.1:45253_    ] o.a.s.c.OverseerTaskQueue Response ZK path: /overseer/collection-queue-work/qnr-0000000002 doesn't exist.  Requestor may have disconnected from ZooKeeper
   [junit4]   2> 398759 INFO  (qtp14539996-1661) [n:127.0.0.1:43325_    ] o.a.s.h.a.CoreAdminOperation core create command qt=/admin/cores&collection.configName=conf1&name=collection1_shard2_replica_t41&action=CREATE&collection=collection1&shard=shard2&wt=javabin&version=2&replicaType=TLOG
   [junit4]   2> 398760 INFO  (qtp14539996-1661) [n:127.0.0.1:43325_    ] o.a.s.c.TransientSolrCoreCacheDefault Allocating transient cache for 4 transient cores
   [junit4]   2> 399771 INFO  (qtp14539996-1661) [n:127.0.0.1:43325_ c:collection1 s:shard2  x:collection1_shard2_replica_t41] o.a.s.c.SolrConfig Using Lucene MatchVersion: 7.1.0
   [junit4]   2> 399788 INFO  (qtp14539996-1661) [n:127.0.0.1:43325_ c:collection1 s:shard2  x:collection1_shard2_replica_t41] o.a.s.s.IndexSchema [collection1_shard2_replica_t41] Schema name=test
   [junit4]   2> 399873 INFO  (qtp14539996-1661) [n:127.0.0.1:43325_ c:collection1 s:shard2  x:collection1_shard2_replica_t41] o.a.s.s.IndexSchema Loaded schema test/1.6 with uniqueid field id
   [junit4]   2> 399881 INFO  (qtp14539996-1661) [n:127.0.0.1:43325_ c:collection1 s:shard2  x:collection1_shard2_replica_t41] o.a.s.c.CoreContainer Creating SolrCore 'collection1_shard2_replica_t41' using configuration from collection collection1, trusted=true
   [junit4]   2> 399882 INFO  (qtp14539996-1661) [n:127.0.0.1:43325_ c:collection1 s:shard2  x:collection1_shard2_replica_t41] o.a.s.m.r.SolrJmxReporter JMX monitoring for 'solr.core.collection1.shard2.replica_t41' (registry 'solr.core.collection1.shard2.replica_t41') enabled at server: com.sun.jmx.mbeanserver.JmxMBeanServer@1ab750b
   [junit4]   2> 399882 INFO  (qtp14539996-1661) [n:127.0.0.1:43325_ c:collection1 s:shard2  x:collection1_shard2_replica_t41] o.a.s.c.SolrCore solr.RecoveryStrategy.Builder
   [junit4]   2> 399882 INFO  (qtp14539996-1661) [n:127.0.0.1:43325_ c:collection1 s:shard2  x:collection1_shard2_replica_t41] o.a.s.c.SolrCore [[collection1_shard2_replica_t41] ] Opening new SolrCore at [/home/jenkins/workspace/Lucene-Solr-7.x-Linux/solr/build/solr-core/test/J0/temp/solr.cloud.ChaosMonkeyNothingIsSafeTest_14D04BAC0FDC6C15-001/shard-1-001/cores/collection1_shard2_replica_t41], dataDir=[/home/jenkins/workspace/Lucene-Solr-7.x-Linux/solr/build/solr-core/test/J0/temp/solr.cloud.ChaosMonkeyNothingIsSafeTest_14D04BAC0FDC6C15-001/shard-1-001/cores/collection1_shard2_replica_t41/data/]
   [junit4]   2> 399892 INFO  (qtp14539996-1661) [n:127.0.0.1:43325_ c:collection1 s:shard2  x:collection1_shard2_replica_t41] o.a.s.u.RandomMergePolicy RandomMergePolicy wrapping class org.apache.lucene.index.TieredMergePolicy: [TieredMergePolicy: maxMergeAtOnce=26, maxMergeAtOnceExplicit=30, maxMergedSegmentMB=64.3330078125, floorSegmentMB=1.3603515625, forceMergeDeletesPctAllowed=6.901292712528972, segmentsPerTier=17.0, maxCFSSegmentSizeMB=8.796093022207999E12, noCFSRatio=0.5803029934945613
   [junit4]   2> 399908 WARN  (qtp14539996-1661) [n:127.0.0.1:43325_ c:collection1 s:shard2  x:collection1_shard2_replica_t41] o.a.s.c.RequestHandlers INVALID paramSet a in requestHandler {type = requestHandler,name = /dump,class = DumpRequestHandler,attributes = {initParams=a, name=/dump, class=DumpRequestHandler},args = {defaults={a=A,b=B}}}
   [junit4]   2> 399955 INFO  (qtp14539996-1661) [n:127.0.0.1:43325_ c:collection1 s:shard2  x:collection1_shard2_replica_t41] o.a.s.u.UpdateHandler Using UpdateLog implementation: org.apache.solr.update.UpdateLog
   [junit4]   2> 399955 INFO  (qtp14539996-1661) [n:127.0.0.1:43325_ c:collection1 s:shard2  x:collection1_shard2_replica_t41] o.a.s.u.UpdateLog Initializing UpdateLog: dataDir= defaultSyncLevel=FLUSH numRecordsToKeep=100 maxNumLogsToKeep=10 numVersionBuckets=65536
   [junit4]   2> 399956 INFO  (qtp14539996-1661) [n:127.0.0.1:43325_ c:collection1 s:shard2  x:collection1_shard2_replica_t41] o.a.s.u.CommitTracker Hard AutoCommit: if uncommited for 15000ms; 
   [junit4]   2> 399956 INFO  (qtp14539996-1661) [n:127.0.0.1:43325_ c:collection1 s:shard2  x:collection1_shard2_replica_t41] o.a.s.u.CommitTracker Soft AutoCommit: disabled
   [junit4]   2> 399957 INFO  (qtp14539996-1661) [n:127.0.0.1:43325_ c:collection1 s:shard2  x:collection1_shard2_replica_t41] o.a.s.u.RandomMergePolicy RandomMergePolicy wrapping class org.apache.lucene.index.LogDocMergePolicy: [LogDocMergePolicy: minMergeSize=1000, mergeFactor=31, maxMergeSize=9223372036854775807, maxMergeSizeForForcedMerge=9223372036854775807, calibrateSizeByDeletes=false, maxMergeDocs=2147483647, maxCFSSegmentSizeMB=8.796093022207999E12, noCFSRatio=1.0]
   [junit4]   2> 399958 INFO  (qtp14539996-1661) [n:127.0.0.1:43325_ c:collection1 s:shard2  x:collection1_shard2_replica_t41] o.a.s.s.SolrIndexSearcher Opening [Searcher@fb84af[collection1_shard2_replica_t41] main]
   [junit4]   2> 399958 INFO  (qtp14539996-1661) [n:127.0.0.1:43325_ c:collection1 s:shard2  x:collection1_shard2_replica_t41] o.a.s.r.ManagedResourceStorage Configured ZooKeeperStorageIO with znodeBase: /configs/conf1
   [junit4]   2> 399958 INFO  (qtp14539996-1661) [n:127.0.0.1:43325_ c:collection1 s:shard2  x:collection1_shard2_replica_t41] o.a.s.r.ManagedResourceStorage Loaded null at path _rest_managed.json using ZooKeeperStorageIO:path=/configs/conf1
   [junit4]   2> 399959 INFO  (qtp14539996-1661) [n:127.0.0.1:43325_ c:collection1 s:shard2  x:collection1_shard2_replica_t41] o.a.s.h.ReplicationHandler Commits will be reserved for  10000
   [junit4]   2> 399959 INFO  (qtp14539996-1661) [n:127.0.0.1:43325_ c:collection1 s:shard2  x:collection1_shard2_replica_t41] o.a.s.u.UpdateLog Could not find max version in index or recent updates, using new clock 1576321843616284672
   [junit4]   2> 399963 INFO  (qtp14539996-1661) [n:127.0.0.1:43325_ c:collection1 s:shard2  x:collection1_shard2_replica_t41] o.a.s.c.ShardLeaderElectionContext Enough replicas found to continue.
   [junit4]   2> 399963 INFO  (qtp14539996-1661) [n:127.0.0.1:43325_ c:collection1 s:shard2  x:collection1_shard2_replica_t41] o.a.s.c.ShardLeaderElectionContext I may be the new leader - try and sync
   [junit4]   2> 399963 INFO  (qtp14539996-1661) [n:127.0.0.1:43325_ c:collection1 s:shard2  x:collection1_shard2_replica_t41] o.a.s.c.SyncStrategy Sync replicas to http://127.0.0.1:43325/collection1_shard2_replica_t41/
   [junit4]   2> 399963 INFO  (qtp14539996-1661) [n:127.0.0.1:43325_ c:collection1 s:shard2  x:collection1_shard2_replica_t41] o.a.s.c.SyncStrategy Sync Success - now sync replicas to me
   [junit4]   2> 399963 INFO  (qtp14539996-1661) [n:127.0.0.1:43325_ c:collection1 s:shard2  x:collection1_shard2_replica_t41] o.a.s.c.SyncStrategy http://127.0.0.1:43325/collection1_shard2_replica_t41/ has no replicas
   [junit4]   2> 399963 INFO  (qtp14539996-1661) [n:127.0.0.1:43325_ c:collection1 s:shard2  x:collection1_shard2_replica_t41] o.a.s.c.ShardLeaderElectionContext Found all replicas participating in election, clear LIR
   [junit4]   2> 399963 INFO  (qtp14539996-1661) [n:127.0.0.1:43325_ c:collection1 s:shard2  x:collection1_shard2_replica_t41] o.a.s.c.ZkController collection1_shard2_replica_t41 stopping background replication from leader
   [junit4]   2> 399964 INFO  (searcherExecutor-710-thread-1-processing-n:127.0.0.1:43325_ x:collection1_shard2_replica_t41 s:shard2 c:collection1) [n:127.0.0.1:43325_ c:collection1 s:shard2  x:collection1_shard2_replica_t41] o.a.s.c.SolrCore [collection1_shard2_replica_t41] Registered new searcher Searcher@fb84af[collection1_shard2_replica_t41] main{ExitableDirectoryReader(UninvertingDirectoryReader())}
   [junit4]   2> 399965 INFO  (qtp14539996-1661) [n:127.0.0.1:43325_ c:collection1 s:shard2  x:collection1_shard2_replica_t41] o.a.s.c.ShardLeaderElectionContext I am the new leader: http://127.0.0.1:43325/collection1_shard2_replica_t41/ shard2
   [junit4]   2> 400118 INFO  (qtp14539996-1661) [n:127.0.0.1:43325_ c:collection1 s:shard2  x:collection1_shard2_replica_t41] o.a.s.c.ZkController I am the leader, no recovery necessary
   [junit4]   2> 400119 INFO  (qtp14539996-1661) [n:127.0.0.1:43325_ c:collection1 s:shard2  x:collection1_shard2_replica_t41] o.a.s.s.HttpSolrCall [admin] webapp=null path=/admin/cores params={qt=/admin/cores&collection.configName=conf1&name=collection1_shard2_replica_t41&action=CREATE&collection=collection1&shard=shard2&wt=javabin&version=2&replicaType=TLOG} status=0 QTime=1359
   [junit4]   2> 400120 INFO  (qtp14539996-1659) [n:127.0.0.1:43325_    ] o.a.s.s.HttpSolrCall [admin] webapp=null path=/admin/collections params={node=127.0.0.1:43325_&action=ADDREPLICA&collection=collection1&shard=shard2&type=TLOG&wt=javabin&version=2} status=0 QTime=1363
   [junit4]   2> 400181 INFO  (TEST-ChaosMonkeyNothingIsSafeTest.test-seed#[14D04BAC0FDC6C15]) [    ] o.a.s.c.AbstractFullDistribZkTestBase create jetty 2 in directory /home/jenkins/workspace/Lucene-Solr-7.x-Linux/solr/build/solr-core/test/J0/temp/solr.cloud.ChaosMonkeyNothingIsSafeTest_14D04BAC0FDC6C15-001/shard-2-001 of type TLOG
   [junit4]   2> 400181 INFO  (TEST-ChaosMonkeyNothingIsSafeTest.test-seed#[14D04BAC0FDC6C15]) [    ] o.e.j.s.Server jetty-9.3.20.v20170531
   [junit4]   2> 400182 INFO  (TEST-ChaosMonkeyNothingIsSafeTest.test-seed#[14D04BAC0FDC6C15]) [    ] o.e.j.s.h.ContextHandler Started o.e.j.s.ServletContextHandler@29a6c2{/,null,AVAILABLE}
   [junit4]   2> 400182 INFO  (TEST-ChaosMonkeyNothingIsSafeTest.test-seed#[14D04BAC0FDC6C15]) [    ] o.e.j.s.AbstractConnector Started ServerConnector@1222eeb{HTTP/1.1,[http/1.1]}{127.0.0.1:35085}
   [junit4]   2> 400182 INFO  (TEST-ChaosMonkeyNothingIsSafeTest.test-seed#[14D04BAC0FDC6C15]) [    ] o.e.j.s.Server Started @401542ms
   [junit4]   2> 400182 INFO  (TEST-ChaosMonkeyNothingIsSafeTest.test-seed#[14D04BAC0FDC6C15]) [    ] o.a.s.c.s.e.JettySolrRunner Jetty properties: {solr.data.dir=/home/jenkins/workspace/Lucene-Solr-7.x-Linux/solr/build/solr-core/test/J0/temp/solr.cloud.ChaosMonkeyNothingIsSafeTest_14D04BAC0FDC6C15-001/tempDir-001/jetty2, replicaType=TLOG, solrconfig=solrconfig.xml, hostContext=/, hostPort=35085, coreRootDirectory=/home/jenkins/workspace/Lucene-Solr-7.x-Linux/solr/build/solr-core/test/J0/../../../../../../../../../home/jenkins/workspace/Lucene-Solr-7.x-Linux/solr/build/solr-core/test/J0/temp/solr.cloud.ChaosMonkeyNothingIsSafeTest_14D04BAC0FDC6C15-001/shard-2-001/cores}
   [junit4]   2> 400182 ERROR (TEST-ChaosMonkeyNothingIsSafeTest.test-seed#[14D04BAC0FDC6C15]) [    ] o.a.s.s.StartupLoggingUtils Missing Java Option solr.log.dir. Logging may be missing or incomplete.
   [junit4]   2> 400182 INFO  (TEST-ChaosMonkeyNothingIsSafeTest.test-seed#[14D04BAC0FDC6C15]) [    ] o.a.s.s.SolrDispatchFilter  ___      _       Welcome to Apache Solr™ version 7.1.0
   [junit4]   2> 400182 INFO  (TEST-ChaosMonkeyNothingIsSafeTest.test-seed#[14D04BAC0FDC6C15]) [    ] o.a.s.s.SolrDispatchFilter / __| ___| |_ _   Starting in cloud mode on port null
   [junit4]   2> 400183 INFO  (TEST-ChaosMonkeyNothingIsSafeTest.test-seed#[14D04BAC0FDC6C15]) [    ] o.a.s.s.SolrDispatchFilter \__ \/ _ \ | '_|  Install dir: null, Default config dir: null
   [junit4]   2> 400183 INFO  (TEST-ChaosMonkeyNothingIsSafeTest.test-seed#[14D04BAC0FDC6C15]) [    ] o.a.s.s.SolrDispatchFilter |___/\___/_|_|    Start time: 2017-08-21T06:40:56.871Z
   [junit4]   2> 400190 INFO  (TEST-ChaosMonkeyNothingIsSafeTest.test-seed#[14D04BAC0FDC6C15]) [    ] o.a.s.s.SolrDispatchFilter Loading solr.xml from SolrHome (not found in ZooKeeper)
   [junit4]   2> 400190 INFO  (TEST-ChaosMonkeyNothingIsSafeTest.test-seed#[14D04BAC0FDC6C15]) [    ] o.a.s.c.SolrXmlConfig Loading container configuration from /home/jenkins/workspace/Lucene-Solr-7.x-Linux/solr/build/solr-core/test/J0/temp/solr.cloud.ChaosMonkeyNothingIsSafeTest_14D04BAC0FDC6C15-001/shard-2-001/solr.xml
   [junit4]   2> 400193 INFO  (TEST-ChaosMonkeyNothingIsSafeTest.test-seed#[14D04BAC0FDC6C15]) [    ] o.a.s.c.SolrXmlConfig MBean server found: com.sun.jmx.mbeanserver.JmxMBeanServer@1ab750b, but no JMX reporters were configured - adding default JMX reporter.
   [junit4]   2> 400196 INFO  (TEST-ChaosMonkeyNothingIsSafeTest.test-seed#[14D04BAC0FDC6C15]) [    ] o.a.s.c.ZkContainer Zookeeper client=127.0.0.1:41783/solr
   [junit4]   2> 400219 INFO  (TEST-ChaosMonkeyNothingIsSafeTest.test-seed#[14D04BAC0FDC6C15]) [n:127.0.0.1:35085_    ] o.a.s.c.c.ZkStateReader Updated live nodes from ZooKeeper... (0) -> (2)
   [junit4]   2> 400220 INFO  (TEST-ChaosMonkeyNothingIsSafeTest.test-seed#[14D04BAC0FDC6C15]) [n:127.0.0.1:35085_    ] o.a.s.c.Overseer Overseer (id=null) closing
   [junit4]   2> 400221 INFO  (TEST-ChaosMonkeyNothingIsSafeTest.test-seed#[14D04BAC0FDC6C15]) [n:127.0.0.1:35085_    ] o.a.s.c.ZkController Register node as live in ZooKeeper:/live_nodes/127.0.0.1:35085_
   [junit4]   2> 400222 INFO  (zkCallback-249-thread-1-processing-n:127.0.0.1:43325_) [n:127.0.0.1:43325_    ] o.a.s.c.c.ZkStateReader Updated live nodes from ZooKeeper... (2) -> (3)
   [junit4]   2> 400222 INFO  (zkCallback-244-thread-1) [    ] o.a.s.c.c.ZkStateReader Updated live nodes from ZooKeeper... (2) -> (3)
   [junit4]   2> 400222 INFO  (zkCallback-237-thread-2-processing-n:127.0.0.1:45253_) [n:127.0.0.1:45253_    ] o.a.s.c.c.ZkStateReader Updated live nodes from ZooKeeper... (2) -> (3)
   [junit4]   2> 400228 INFO  (zkCallback-255-thread-1-processing-n:127.0.0.1:35085_) [n:127.0.0.1:35085_    ] o.a.s.c.c.ZkStateReader Updated live nodes from ZooKeeper... (2) -> (3)
   [junit4]   2> 400360 INFO  (TEST-ChaosMonkeyNothingIsSafeTest.test-seed#[14D04BAC0FDC6C15]) [n:127.0.0.1:35085_    ] o.a.s.m.r.SolrJmxReporter JMX monitoring for 'solr.node' (registry 'solr.node') enabled at server: com.sun.jmx.mbeanserver.JmxMBeanServer@1ab750b
   [junit4]   2> 400371 INFO  (TEST-ChaosMonkeyNothingIsSafeTest.test-seed#[14D04BAC0FDC6C15]) [n:127.0.0.1:35085_    ] o.a.s.m.r.SolrJmxReporter JMX monitoring for 'solr.jvm' (registry 'solr.jvm') enabled at server: com.sun.jmx.mbeanserver.JmxMBeanServer@1ab750b
   [junit4]   2> 400371 INFO  (TEST-ChaosMonkeyNothingIsSafeTest.test-seed#[14D04BAC0FDC6C15]) [n:127.0.0.1:35085_    ] o.a.s.m.r.SolrJmxReporter JMX monitoring for 'solr.jetty' (registry 'solr.jetty') enabled at server: com.sun.jmx.mbeanserver.JmxMBeanServer@1ab750b
   [junit4]   2> 400372 INFO  (TEST-ChaosMonkeyNothingIsSafeTest.test-seed#[14D04BAC0FDC6C15]) [n:127.0.0.1:35085_    ] o.a.s.c.CorePropertiesLocator Found 0 core definitions underneath /home/jenkins/workspace/Lucene-Solr-7.x-Linux/solr/build/solr-core/test/J0/../../../../../../../../../home/jenkins/workspace/Lucene-Solr-7.x-Linux/solr/build/solr-core/test/J0/temp/solr.cloud.ChaosMonkeyNothingIsSafeTest_14D04BAC0FDC6C15-001/shard-2-001/cores
   [junit4]   2> 400404 INFO  (qtp14539996-1660) [n:127.0.0.1:43325_    ] o.a.s.h.a.CollectionsHandler Invoked Collection Action :addreplica with params node=127.0.0.1:35085_&action=ADDREPLICA&collection=collection1&shard=shard1&type=TLOG&wt=javabin&version=2 and sendToOCPQueue=true
   [junit4]   2> 400405 INFO  (OverseerCollectionConfigSetProcessor-98520114923962372-127.0.0.1:45253_-n_0000000000) [n:127.0.0.1:45253_    ] o.a.s.c.OverseerTaskQueue Response ZK path: /overseer/collection-queue-work/qnr-0000000004 doesn't exist.  Requestor may have disconnected from ZooKeeper
   [junit4]   2> 400406 INFO  (OverseerThreadFactory-696-thread-4-processing-n:127.0.0.1:45253_) [n:127.0.0.1:45253_    ] o.a.s.c.AddReplicaCmd Node Identified 127.0.0.1:35085_ for creating new replica
   [junit4]   2> 400409 INFO  (qtp31447678-1689) [n:127.0.0.1:35085_    ] o.a.s.h.a.CoreAdminOperation core create command qt=/admin/cores&collection.configName=conf1&name=collection1_shard1_replica_t43&action=CREATE&collection=collection1&shard=shard1&wt=javabin&version=2&replicaType=TLOG
   [junit4]   2> 400409 INFO  (qtp31447678-1689) [n:127.0.0.1:35085_    ] o.a.s.c.TransientSolrCoreCacheDefault Allocating transient cache for 4 transient cores
   [junit4]   2> 401417 INFO  (qtp31447678-1689) [n:127.0.0.1:35085_ c:collection1 s:shard1  x:collection1_shard1_replica_t43] o.a.s.c.SolrConfig Using Lucene MatchVersion: 7.1.0
   [junit4]   2> 401424 INFO  (qtp31447678-1689) [n:127.0.0.1:35085_ c:collection1 s:shard1  x:collection1_shard1_replica_t43] o.a.s.s.IndexSchema [collection1_shard1_replica_t43] Schema name=test
   [junit4]   2> 401472 INFO  (qtp31447678-1689) [n:127.0.0.1:35085_ c:collection1 s:shard1  x:collection1_shard1_replica_t43] o.a.s.s.IndexSchema Loaded schema test/1.6 with uniqueid field id
   [junit4]   2> 401480 INFO  (qtp31447678-1689) [n:127.0.0.1:35085_ c:collection1 s:shard1  x:collection1_shard1_replica_t43] o.a.s.c.CoreContainer Creating SolrCore 'collection1_shard1_replica_t43' using configuration from collection collection1, trusted=true
   [junit4]   2> 401480 INFO  (qtp31447678-1689) [n:127.0.0.1:35085_ c:collection1 s:shard1  x:collection1_shard1_replica_t43] o.a.s.m.r.SolrJmxReporter JMX monitoring for 'solr.core.collection1.shard1.replica_t43' (registry 'solr.core.collection1.shard1.replica_t43') enabled at server: com.sun.jmx.mbeanserver.JmxMBeanServer@1ab750b
   [junit4]   2> 401480 INFO  (qtp31447678-1689) [n:127.0.0.1:35085_ c:collection1 s:shard1  x:collection1_shard1_replica_t43] o.a.s.c.SolrCore solr.RecoveryStrategy.Builder
   [junit4]   2> 401480 INFO  (qtp31447678-1689) [n:127.0.0.1:35085_ c:collection1 s:shard1  x:collection1_shard1_replica_t43] o.a.s.c.SolrCore [[collection1_shard1_replica_t43] ] Opening new SolrCore at [/home/jenkins/workspace/Lucene-Solr-7.x-Linux/solr/build/solr-core/test/J0/temp/solr.cloud.ChaosMonkeyNothingIsSafeTest_14D04BAC0FDC6C15-001/shard-2-001/cores/collection1_shard1_replica_t43], dataDir=[/home/jenkins/workspace/Lucene-Solr-7.x-Linux/solr/build/solr-core/test/J0/../../../../../../../../../home/jenkins/workspace/Lucene-Solr-7.x-Linux/solr/build/solr-core/test/J0/temp/solr.cloud.ChaosMonkeyNothingIsSafeTest_14D04BAC0FDC6C15-001/shard-2-001/cores/collection1_shard1_replica_t43/data/]
   [junit4]   2> 401483 INFO  (qtp31447678-1689) [n:127.0.0.1:35085_ c:collection1 s:shard1  x:collection1_shard1_replica_t43] o.a.s.u.RandomMergePolicy RandomMergePolicy wrapping class org.apache.lucene.index.TieredMergePolicy: [TieredMergePolicy: maxMergeAtOnce=26, maxMergeAtOnceExplicit=30, maxMergedSegmentMB=64.3330078125, floorSegmentMB=1.3603515625, forceMergeDeletesPctAllowed=6.901292712528972, segmentsPerTier=17.0, maxCFSSegmentSizeMB=8.796093022207999E12, noCFSRatio=0.5803029934945613
   [junit4]   2> 401503 WARN  (qtp31447678-1689) [n:127.0.0.1:35085_ c:collection1 s:shard1  x:collection1_shard1_replica_t43] o.a.s.c.RequestHandlers INVALID paramSet a in requestHandler {type = requestHandler,name = /dump,class = DumpRequestHandler,attributes = {initParams=a, name=/dump, class=DumpRequestHandler},args = {defaults={a=A,b=B}}}
   [junit4]   2> 401542 INFO  (qtp31447678-1689) [n:127.0.0.1:35085_ c:collection1 s:shard1  x:collection1_shard1_replica_t43] o.a.s.u.UpdateHandler Using UpdateLog implementation: org.apache.solr.update.UpdateLog
   [junit4]   2> 401542 INFO  (qtp31447678-1689) [n:127.0.0.1:35085_ c:collection1 s:shard1  x:collection1_shard1_replica_t43] o.a.s.u.UpdateLog Initializing UpdateLog: dataDir= defaultSyncLevel=FLUSH numRecordsToKeep=100 maxNumLogsToKeep=10 numVersionBuckets=65536
   [junit4]   2> 401544 INFO  (qtp31447678-1689) [n:127.0.0.1:35085_ c:collection1 s:shard1  x:collection1_shard1_replica_t43] o.a.s.u.CommitTracker Hard AutoCommit: if uncommited for 15000ms; 
   [junit4]   2> 401544 INFO  (qtp31447678-1689) [n:127.0.0.1:35085_ c:collection1 s:shard1  x:collection1_shard1_replica_t43] o.a.s.u.CommitTracker Soft AutoCommit: disabled
   [junit4]   2> 401545 INFO  (qtp31447678-1689) [n:127.0.0.1:35085_ c:collection1 s:shard1  x:collection1_shard1_replica_t43] o.a.s.u.RandomMergePolicy RandomMergePolicy wrapping class org.apache.lucene.index.LogDocMergePolicy: [LogDocMergePolicy: minMergeSize=1000, mergeFactor=31, maxMergeSize=9223372036854775807, maxMergeSizeForForcedMerge=9223372036854775807, calibrateSizeByDeletes=false, maxMergeDocs=2147483647, maxCFSSegmentSizeMB=8.796093022207999E12, noCFSRatio=1.0]
   [junit4]   2> 401545 INFO  (qtp31447678-1689) [n:127.0.0.1:35085_ c:collection1 s:shard1  x:collection1_shard1_replica_t43] o.a.s.s.SolrIndexSearcher Opening [Searcher@43e97[collection1_shard1_replica_t43] main]
   [junit4]   2> 401552 INFO  (qtp31447678-1689) [n:127.0.0.1:35085_ c:collection1 s:shard1  x:collection1_shard1_replica_t43] o.a.s.r.ManagedResourceStorage Configured ZooKeeperStorageIO with znodeBase: /configs/conf1
   [junit4]   2> 401553 INFO  (qtp31447678-1689) [n:127.0.0.1:35085_ c:collection1 s:shard1  x:collection1_shard1_replica_t43] o.a.s.r.ManagedResourceStorage Loaded null at path _rest_managed.json using ZooKeeperStorageIO:path=/configs/conf1
   [junit4]   2> 401554 INFO  (qtp31447678-1689) [n:127.0.0.1:35085_ c:collection1 s:shard1  x:collection1_shard1_replica_t43] o.a.s.h.ReplicationHandler Commits will be reserved for  10000
   [junit4]   2> 401555 INFO  (searcherExecutor-721-thread-1-processing-n:127.0.0.1:35085_ x:collection1_shard1_replica_t43 s:shard1 c:collection1) [n:127.0.0.1:35085_ c:collection1 s:shard1  x:collection1_shard1_replica_t43] o.a.s.c.SolrCore [collection1_shard1_replica_t43] Registered new searcher Searcher@43e97[collection1_shard1_replica_t43] main{ExitableDirectoryReader(UninvertingDirectoryReader())}
   [junit4]   2> 401555 INFO  (qtp31447678-1689) [n:127.0.0.1:35085_ c:collection1 s:shard1  x:collection1_shard1_replica_t43] o.a.s.u.UpdateLog Could not find max version in index or recent updates, using new clock 1576321845289811968
   [junit4]   2> 401559 INFO  (qtp31447678-1689) [n:127.0.0.1:35085_ c:collection1 s:shard1  x:collection1_shard1_replica_t43] o.a.s.c.ShardLeaderElectionContext Enough replicas found to continue.
   [junit4]   2> 401559 INFO  (qtp31447678-1689) [n:127.0.0.1:35085_ c:collection1 s:shard1  x:collection1_shard1_replica_t43] o.a.s.c.ShardLeaderElectionContext I may be the new leader - try and sync
   [junit4]   2> 401559 INFO  (qtp31447678-1689) [n:127.0.0.1:35085_ c:collection1 s:shard1  x:collection1_shard1_replica_t43] o.a.s.c.SyncStrategy Sync replicas to http://127.0.0.1:35085/collection1_shard1_replica_t43/
   [junit4]   2> 401559 INFO  (qtp31447678-1689) [n:127.0.0.1:35085_ c:collection1 s:shard1  x:collection1_shard1_replica_t43] o.a.s.c.SyncStrategy Sync Success - now sync replicas to me
   [junit4]   2> 401559 INFO  (qtp31447678-1689) [n:127.0.0.1:35085_ c:collection1 s:shard1  x:collection1_shard1_replica_t43] o.a.s.c.SyncStrategy http://127.0.0.1:35085/collection1_shard1_replica_t43/ has no replicas
   [junit4]   2> 401559 INFO  (qtp31447678-1689) [n:127.0.0.1:35085_ c:collection1 s:shard1  x:collection1_shard1_replica_t43] o.a.s.c.ShardLeaderElectionContext Found all replicas participating in election, clear LIR
   [junit4]   2> 401559 INFO  (qtp31447678-1689) [n:127.0.0.1:35085_ c:collection1 s:shard1  x:collection1_shard1_replica_t43] o.a.s.c.ZkController collection1_shard1_replica_t43 stopping background replication from leader
   [junit4]   2> 401561 INFO  (qtp31447678-1689) [n:127.0.0.1:35085_ c:collection1 s:shard1  x:collection1_shard1_replica_t43] o.a.s.c.ShardLeaderElectionContext I am the new leader: http://127.0.0.1:35085/collection1_shard1_replica_t43/ shard1
   [junit4]   2> 401711 INFO  (qtp31447678-1689) [n:127.0.0.1:35085_ c:collection1 s:shard1  x:collection1_shard1_replica_t43] o.a.s.c.ZkController I am the leader, no recovery necessary
   [junit4]   2> 401712 INFO  (qtp31447678-1689) [n:127.0.0.1:35085_ c:collection1 s:shard1  x:collection1_shard1_replica_t43] o.a.s.s.HttpSolrCall [admin] webapp=null path=/admin/cores params={qt=/admin/cores&collection.configName=conf1&name=collection1_shard1_replica_t43&action=CREATE&collection=collection1&shard=shard1&wt=javabin&version=2&replicaType=TLOG} status=0 QTime=1303
   [junit4]   2> 401714 INFO  (qtp14539996-1660) [n:127.0.0.1:43325_    ] o.a.s.s.HttpSolrCall [admin] webapp=null path=/admin/collections params={node=127.0.0.1:35085_&action=ADDREPLICA&collection=collection1&shard=shard1&type=TLOG&wt=javabin&version=2} status=0 QTime=1309
   [junit4]   2> 401791 INFO  (TEST-ChaosMonkeyNothingIsSafeTest.test-seed#[14D04BAC0FDC6C15]) [    ] o.a.s.c.AbstractFullDistribZkTestBase create jetty 3 in directory /home/jenkins/workspace/Lucene-Solr-7.x-Linux/solr/build/solr-core/test/J0/temp/solr.cloud.ChaosMonkeyNothingIsSafeTest_14D04BAC0FDC6C15-001/shard-3-001 of type TLOG
   [junit4]   2> 401791 INFO  (TEST-ChaosMonkeyNothingIsSafeTest.test-seed#[14D04BAC0FDC6C15]) [    ] o.e.j.s.Server jetty-9.3.20.v20170531
   [junit4]   2> 401792 INFO  (TEST-ChaosMonkeyNothingIsSafeTest.test-seed#[14D04BAC0FDC6C15]) [    ] o.e.j.s.h.ContextHandler Started o.e.j.s.ServletContextHandler@9798c6{/,null,AVAILABLE}
   [junit4]   2> 401792 INFO  (TEST-ChaosMonkeyNothingIsSafeTest.test-seed#[14D04BAC0FDC6C15]) [    ] o.e.j.s.AbstractConnector Started ServerConnector@562377{HTTP/1.1,[http/1.1]}{127.0.0.1:36263}
   [junit4]   2> 401792 INFO  (TEST-ChaosMonkeyNothingIsSafeTest.test-seed#[14D04BAC0FDC6C15]) [    ] o.e.j.s.Server Started @403152ms
   [junit4]   2> 401792 INFO  (TEST-ChaosMonkeyNothingIsSafeTest.test-seed#[14D04BAC0FDC6C15]) [    ] o.a.s.c.s.e.JettySolrRunner Jetty properties: {solr.data.dir=/home/jenkins/workspace/Lucene-Solr-7.x-Linux/solr/build/solr-core/test/J0/temp/solr.cloud.ChaosMonkeyNothingIsSafeTest_14D04BAC0FDC6C15-001/tempDir-001/jetty3, replicaType=TLOG, solrconfig=solrconfig.xml, hostContext=/, hostPort=36263, coreRootDirectory=/home/jenkins/workspace/Lucene-Solr-7.x-Linux/solr/build/solr-core/test/J0/../../../../../../../../../home/jenkins/workspace/Lucene-Solr-7.x-Linux/solr/build/solr-core/test/J0/temp/solr.cloud.ChaosMonkeyNothingIsSafeTest_14D04BAC0FDC6C15-001/shard-3-001/cores}
   [junit4]   2> 401792 ERROR (TEST-ChaosMonkeyNothingIsSafeTest.test-seed#[14D04BAC0FDC6C15]) [    ] o.a.s.s.StartupLoggingUtils Missing Java Option solr.log.dir. Logging may be missing or incomplete.
   [junit4]   2> 401793 INFO  (TEST-ChaosMonkeyNothingIsSafeTest.test-seed#[14D04BAC0FDC6C15]) [    ] o.a.s.s.SolrDispatchFilter  ___      _       Welcome to Apache Solr™ version 7.1.0
   [junit4]   2> 401793 INFO  (TEST-ChaosMonkeyNothingIsSafeTest.test-seed#[14D04BAC0FDC6C15]) [    ] o.a.s.s.SolrDispatchFilter / __| ___| |_ _   Starting in cloud mode on port null
   [junit4]   2> 401793 INFO  (TEST-ChaosMonkeyNothingIsSafeTest.test-seed#[14D04BAC0FDC6C15]) [    ] o.a.s.s.SolrDispatchFilter \__ \/ _ \ | '_|  Install dir: null, Default config dir: null
   [junit4]   2> 401793 INFO  (TEST-ChaosMonkeyNothingIsSafeTest.test-seed#[14D04BAC0FDC6C15]) [    ] o.a.s.s.SolrDispatchFilter |___/\___/_|_|    Start time: 2017-08-21T06:40:58.481Z
   [junit4]   2> 401796 INFO  (TEST-ChaosMonkeyNothingIsSafeTest.test-seed#[14D04BAC0FDC6C15]) [    ] o.a.s.s.SolrDispatchFilter Loading solr.xml from SolrHome (not found in ZooKeeper)
   [junit4]   2> 401796 INFO  (TEST-ChaosMonkeyNothingIsSafeTest.test-seed#[14D04BAC0FDC6C15]) [    ] o.a.s.c.SolrXmlConfig Loading container configuration from /home/jenkins/workspace/Lucene-Solr-7.x-Linux/solr/build/solr-core/test/J0/temp/solr.cloud.ChaosMonkeyNothingIsSafeTest_14D04BAC0FDC6C15-001/shard-3-001/solr.xml
   [junit4]   2> 401799 INFO  (TEST-ChaosMonkeyNothingIsSafeTest.test-seed#[14D04BAC0FDC6C15]) [    ] o.a.s.c.SolrXmlConfig MBean server found: com.sun.jmx.mbeanserver.JmxMBeanServer@1ab750b, but no JMX reporters were configured - adding default JMX reporter.
   [junit4]   2> 401805 INFO  (TEST-ChaosMonkeyNothingIsSafeTest.test-seed#[14D04BAC0FDC6C15]) [    ] o.a.s.c.ZkContainer Zookeeper client=127.0.0.1:41783/solr
   [junit4]   2> 401820 INFO  (TEST-ChaosMonkeyNothingIsSafeTest.test-seed#[14D04BAC0FDC6C15]) [n:127.0.0.1:36263_    ] o.a.s.c.c.ZkStateReader Updated live nodes from ZooKeeper... (0) -> (3)
   [junit4]   2> 401821 INFO  (TEST-ChaosMonkeyNothingIsSafeTest.test-seed#[14D04BAC0FDC6C15]) [n:127.0.0.1:36263_    ] o.a.s.c.Overseer Overseer (id=null) closing
   [junit4]   2> 401822 INFO  (TEST-ChaosMonkeyNothingIsSafeTest.test-seed#[14D04BAC0FDC6C15]) [n:127.0.0.1:36263_    ] o.a.s.c.ZkController Register node as live in ZooKeeper:/live_nodes/127.0.0.1:36263_
   [junit4]   2> 401822 INFO  (zkCallback-249-thread-2-processing-n:127.0.0.1:43325_) [n:127.0.0.1:43325_    ] o.a.s.c.c.ZkStateReader Updated live nodes from ZooKeeper... (3) -> (4)
   [junit4]   2> 401822 INFO  (zkCallback-244-thread-2) [    ] o.a.s.c.c.ZkStateReader Updated live nodes from ZooKeeper... (3) -> (4)
   [junit4]   2> 401822 INFO  (zkCallback-255-thread-2-processing-n:127.0.0.1:35085_) [n:127.0.0.1:35085_    ] o.a.s.c.c.ZkStateReader Updated live nodes from ZooKeeper... (3) -> (4)
   [junit4]   2> 401823 INFO  (zkCallback-237-thread-1-processing-n:127.0.0.1:45253_) [n:127.0.0.1:45253_    ] o.a.s.c.c.ZkStateReader Updated live nodes from ZooKeeper... (3) -> (4)
   [junit4]   2> 401828 INFO  (zkCallback-261-thread-1-processing-n:127.0.0.1:36263_) [n:127.0.0.1:36263_    ] o.a.s.c.c.ZkStateReader Updated live nodes from ZooKeeper... (3) -> (4)
   [junit4]   2> 401868 INFO  (TEST-ChaosMonkeyNothingIsSafeTest.test-seed#[14D04BAC0FDC6C15]) [n:127.0.0.1:36263_    ] o.a.s.m.r.SolrJmxReporter JMX monitoring for 'solr.node' (registry 'solr.node') enabled at server: com.sun.jmx.mbeanserver.JmxMBeanServer@1ab750b
   [junit4]   2> 401919 INFO  (TEST-ChaosMonkeyNothingIsSafeTest.test-seed#[14D04BAC0FDC6C15]) [n:127.0.0.1:36263_    ] o.a.s.m.r.SolrJmxReporter JMX monitoring for 'solr.jvm' (registry 'solr.jvm') enabled at server: com.sun.jmx.mbeanserver.JmxMBeanServer@1ab750b
   [junit4]   2> 401919 INFO  (TEST-ChaosMonkeyNothingIsSafeTest.test-seed#[14D04BAC0FDC6C15]) [n:127.0.0.1:36263_    ] o.a.s.m.r.SolrJmxReporter JMX monitoring for 'solr.jetty' (registry 'solr.jetty') enabled at server: com.sun.jmx.mbeanserver.JmxMBeanServer@1ab750b
   [junit4]   2> 401921 INFO  (TEST-ChaosMonkeyNothingIsSafeTest.test-seed#[14D04BAC0FDC6C15]) [n:127.0.0.1:36263_    ] o.a.s.c.CorePropertiesLocator Found 0 core definitions underneath /home/jenkins/workspace/Lucene-Solr-7.x-Linux/solr/build/solr-core/test/J0/../../../../../../../../../home/jenkins/workspace/Lucene-Solr-7.x-Linux/solr/build/solr-core/test/J0/temp/solr.cloud.ChaosMonkeyNothingIsSafeTest_14D04BAC0FDC6C15-001/shard-3-001/cores
   [junit4]   2> 401950 INFO  (qtp14539996-1655) [n:127.0.0.1:43325_    ] o.a.s.h.a.CollectionsHandler Invoked Collection Action :addreplica with params node=127.0.0.1:36263_&action=ADDREPLICA&collection=collection1&shard=shard2&type=TLOG&wt=javabin&version=2 and sendToOCPQueue=true
   [junit4]   2> 401952 INFO  (OverseerThreadFactory-696-thread-5-processing-n:127.0.0.1:45253_) [n:127.0.0.1:45253_    ] o.a.s.c.AddReplicaCmd Node Identified 127.0.0.1:36263_ for creating new replica
   [junit4]   2> 401952 INFO  (OverseerCollectionConfigSetProcessor-98520114923962372-127.0.0.1:45253_-n_0000000000) [n:127.0.0.1:45253_    ] o.a.s.c.OverseerTaskQueue Response ZK path: /overseer/collection-queue-work/qnr-0000000006 doesn't exist.  Requestor may have disconnected from ZooKeeper
   [junit4]   2> 401954 INFO  (qtp18856748-1721) [n:127.0.0.1:36263_    ] o.a.s.h.a.CoreAdminOperation core create command qt=/admin/cores&collection.configName=conf1&name=collection1_shard2_replica_t45&action=CREATE&collection=collection1&shard=shard2&wt=javabin&version=2&replicaType=TLOG
   [junit4]   2> 401955 INFO  (qtp18856748-1721) [n:127.0.0.1:36263_    ] o.a.s.c.TransientSolrCoreCacheDefault Allocating transient cache for 4 transient cores
   [junit4]   2> 402970 INFO  (qtp18856748-1721) [n:127.0.0.1:36263_ c:collection1 s:shard2  x:collection1_shard2_replica_t45] o.a.s.c.SolrConfig Using Lucene MatchVersion: 7.1.0
   [junit4]   2> 402984 INFO  (qtp18856748-1721) [n:127.0.0.1:36263_ c:collection1 s:shard2  x:collection1_shard2_replica_t45] o.a.s.s.IndexSchema [collection1_shard2_replica_t45] Schema name=test
   [junit4]   2> 403029 INFO  (qtp18856748-1721) [n:127.0.0.1:36263_ c:collection1 s:shard2  x:collection1_shard2_replica_t45] o.a.s.s.IndexSchema Loaded schema test/1.6 with uniqueid field id
   [junit4]   2> 403035 INFO  (qtp18856748-1721) [n:127.0.0.1:36263_ c:collection1 s:shard2  x:collection1_shard2_replica_t45] o.a.s.c.CoreContainer Creating SolrCore 'collection1_shard2_replica_t45' using configuration from collection collection1, trusted=true
   [junit4]   2> 403036 INFO  (qtp18856748-1721) [n:127.0.0.1:36263_ c:collection1 s:shard2  x:collection1_shard2_replica_t45] o.a.s.m.r.SolrJmxReporter JMX monitoring for 'solr.core.collection1.shard2.replica_t45' (registry 'solr.core.collection1.shard2.replica_t45') enabled at server: com.sun.jmx.mbeanserver.JmxMBeanServer@1ab750b
   [junit4]   2> 403036 INFO  (qtp18856748-1721) [n:127.0.0.1:36263_ c:collection1 s:shard2  x:collection1_shard2_replica_t45] o.a.s.c.SolrCore solr.RecoveryStrategy.Builder
   [junit4]   2> 403036 INFO  (qtp18856748-1721) [n:127.0.0.1:36263_ c:collection1 s:shard2  x:collection1_shard2_replica_t45] o.a.s.c.SolrCore [[collection1_shard2_replica_t45] ] Opening new SolrCore at [/home/jenkins/workspace/Lucene-Solr-7.x-Linux/solr/build/solr-core/test/J0/temp/solr.cloud.ChaosMonkeyNothingIsSafeTest_14D04BAC0FDC6C15-001/shard-3-001/cores/collection1_shard2_replica_t45], dataDir=[/home/jenkins/workspace/Lucene-Solr-7.x-Linux/solr/build/solr-core/test/J0/../../../../../../../../../home/jenkins/workspace/Lucene-Solr-7.x-Linux/solr/build/solr-core/test/J0/temp/solr.cloud.ChaosMonkeyNothingIsSafeTest_14D04BAC0FDC6C15-001/shard-3-001/cores/collection1_shard2_replica_t45/data/]
   [junit4]   2> 403038 INFO  (qtp18856748-1721) [n:127.0.0.1:36263_ c:collection1 s:shard2  x:collection1_shard2_replica_t45] o.a.s.u.RandomMergePolicy RandomMergePolicy wrapping class org.apache.lucene.index.TieredMergePolicy: [TieredMergePolicy: maxMergeAtOnce=26, maxMergeAtOnceExplicit=30, maxMergedSegmentMB=64.3330078125, floorSegmentMB=1.3603515625, forceMergeDeletesPctAllowed=6.901292712528972, segmentsPerTier=17.0, maxCFSSegmentSizeMB=8.796093022207999E12, noCFSRatio=0.5803029934945613
   [jun

[...truncated too long message...]

ronousQueue.java:362)
   [junit4]    >         at java.util.concurrent.SynchronousQueue.poll(SynchronousQueue.java:941)
   [junit4]    >         at java.util.concurrent.ThreadPoolExecutor.getTask(ThreadPoolExecutor.java:1073)
   [junit4]    >         at java.util.concurrent.ThreadPoolExecutor.runWorker(ThreadPoolExecutor.java:1134)
   [junit4]    >         at java.util.concurrent.ThreadPoolExecutor$Worker.run(ThreadPoolExecutor.java:624)
   [junit4]    >         at java.lang.Thread.run(Thread.java:748)
   [junit4]    >    2) Thread[id=1651, name=TEST-ChaosMonkeyNothingIsSafeTest.test-seed#[14D04BAC0FDC6C15]-EventThread, state=WAITING, group=TGRP-ChaosMonkeyNothingIsSafeTest]
   [junit4]    >         at sun.misc.Unsafe.park(Native Method)
   [junit4]    >         at java.util.concurrent.locks.LockSupport.park(LockSupport.java:175)
   [junit4]    >         at java.util.concurrent.locks.AbstractQueuedSynchronizer$ConditionObject.await(AbstractQueuedSynchronizer.java:2039)
   [junit4]    >         at java.util.concurrent.LinkedBlockingQueue.take(LinkedBlockingQueue.java:442)
   [junit4]    >         at org.apache.zookeeper.ClientCnxn$EventThread.run(ClientCnxn.java:501)
   [junit4]    >    3) Thread[id=1649, name=Connection evictor, state=TIMED_WAITING, group=TGRP-ChaosMonkeyNothingIsSafeTest]
   [junit4]    >         at java.lang.Thread.sleep(Native Method)
   [junit4]    >         at org.apache.http.impl.client.IdleConnectionEvictor$1.run(IdleConnectionEvictor.java:66)
   [junit4]    >         at java.lang.Thread.run(Thread.java:748)
   [junit4]    >    4) Thread[id=1652, name=zkCallback-244-thread-1, state=TIMED_WAITING, group=TGRP-ChaosMonkeyNothingIsSafeTest]
   [junit4]    >         at sun.misc.Unsafe.park(Native Method)
   [junit4]    >         at java.util.concurrent.locks.LockSupport.parkNanos(LockSupport.java:215)
   [junit4]    >         at java.util.concurrent.SynchronousQueue$TransferStack.awaitFulfill(SynchronousQueue.java:460)
   [junit4]    >         at java.util.concurrent.SynchronousQueue$TransferStack.transfer(SynchronousQueue.java:362)
   [junit4]    >         at java.util.concurrent.SynchronousQueue.poll(SynchronousQueue.java:941)
   [junit4]    >         at java.util.concurrent.ThreadPoolExecutor.getTask(ThreadPoolExecutor.java:1073)
   [junit4]    >         at java.util.concurrent.ThreadPoolExecutor.runWorker(ThreadPoolExecutor.java:1134)
   [junit4]    >         at java.util.concurrent.ThreadPoolExecutor$Worker.run(ThreadPoolExecutor.java:624)
   [junit4]    >         at java.lang.Thread.run(Thread.java:748)
   [junit4]    >    5) Thread[id=1704, name=zkCallback-244-thread-2, state=TIMED_WAITING, group=TGRP-ChaosMonkeyNothingIsSafeTest]
   [junit4]    >         at sun.misc.Unsafe.park(Native Method)
   [junit4]    >         at java.util.concurrent.locks.LockSupport.parkNanos(LockSupport.java:215)
   [junit4]    >         at java.util.concurrent.SynchronousQueue$TransferStack.awaitFulfill(SynchronousQueue.java:460)
   [junit4]    >         at java.util.concurrent.SynchronousQueue$TransferStack.transfer(SynchronousQueue.java:362)
   [junit4]    >         at java.util.concurrent.SynchronousQueue.poll(SynchronousQueue.java:941)
   [junit4]    >         at java.util.concurrent.ThreadPoolExecutor.getTask(ThreadPoolExecutor.java:1073)
   [junit4]    >         at java.util.concurrent.ThreadPoolExecutor.runWorker(ThreadPoolExecutor.java:1134)
   [junit4]    >         at java.util.concurrent.ThreadPoolExecutor$Worker.run(ThreadPoolExecutor.java:624)
   [junit4]    >         at java.lang.Thread.run(Thread.java:748)
   [junit4]    >    6) Thread[id=1773, name=zkCallback-244-thread-3, state=TIMED_WAITING, group=TGRP-ChaosMonkeyNothingIsSafeTest]
   [junit4]    >         at sun.misc.Unsafe.park(Native Method)
   [junit4]    >         at java.util.concurrent.locks.LockSupport.parkNanos(LockSupport.java:215)
   [junit4]    >         at java.util.concurrent.SynchronousQueue$TransferStack.awaitFulfill(SynchronousQueue.java:460)
   [junit4]    >         at java.util.concurrent.SynchronousQueue$TransferStack.transfer(SynchronousQueue.java:362)
   [junit4]    >         at java.util.concurrent.SynchronousQueue.poll(SynchronousQueue.java:941)
   [junit4]    >         at java.util.concurrent.ThreadPoolExecutor.getTask(ThreadPoolExecutor.java:1073)
   [junit4]    >         at java.util.concurrent.ThreadPoolExecutor.runWorker(ThreadPoolExecutor.java:1134)
   [junit4]    >         at java.util.concurrent.ThreadPoolExecutor$Worker.run(ThreadPoolExecutor.java:624)
   [junit4]    >         at java.lang.Thread.run(Thread.java:748)
   [junit4]    >    7) Thread[id=1650, name=TEST-ChaosMonkeyNothingIsSafeTest.test-seed#[14D04BAC0FDC6C15]-SendThread(127.0.0.1:41783), state=TIMED_WAITING, group=TGRP-ChaosMonkeyNothingIsSafeTest]
   [junit4]    >         at java.lang.Thread.sleep(Native Method)
   [junit4]    >         at org.apache.zookeeper.client.StaticHostProvider.next(StaticHostProvider.java:101)
   [junit4]    >         at org.apache.zookeeper.ClientCnxn$SendThread.startConnect(ClientCnxn.java:997)
   [junit4]    >         at org.apache.zookeeper.ClientCnxn$SendThread.run(ClientCnxn.java:1060)
   [junit4]    > 	at __randomizedtesting.SeedInfo.seed([14D04BAC0FDC6C15]:0)Throwable #2: com.carrotsearch.randomizedtesting.ThreadLeakError: There are still zombie threads that couldn't be terminated:
   [junit4]    >    1) Thread[id=1793, name=zkCallback-244-thread-4, state=TIMED_WAITING, group=TGRP-ChaosMonkeyNothingIsSafeTest]
   [junit4]    >         at sun.misc.Unsafe.park(Native Method)
   [junit4]    >         at java.util.concurrent.locks.LockSupport.parkNanos(LockSupport.java:215)
   [junit4]    >         at java.util.concurrent.SynchronousQueue$TransferStack.awaitFulfill(SynchronousQueue.java:460)
   [junit4]    >         at java.util.concurrent.SynchronousQueue$TransferStack.transfer(SynchronousQueue.java:362)
   [junit4]    >         at java.util.concurrent.SynchronousQueue.poll(SynchronousQueue.java:941)
   [junit4]    >         at java.util.concurrent.ThreadPoolExecutor.getTask(ThreadPoolExecutor.java:1073)
   [junit4]    >         at java.util.concurrent.ThreadPoolExecutor.runWorker(ThreadPoolExecutor.java:1134)
   [junit4]    >         at java.util.concurrent.ThreadPoolExecutor$Worker.run(ThreadPoolExecutor.java:624)
   [junit4]    >         at java.lang.Thread.run(Thread.java:748)
   [junit4]    >    2) Thread[id=1652, name=zkCallback-244-thread-1, state=TIMED_WAITING, group=TGRP-ChaosMonkeyNothingIsSafeTest]
   [junit4]    >         at sun.misc.Unsafe.park(Native Method)
   [junit4]    >         at java.util.concurrent.locks.LockSupport.parkNanos(LockSupport.java:215)
   [junit4]    >         at java.util.concurrent.SynchronousQueue$TransferStack.awaitFulfill(SynchronousQueue.java:460)
   [junit4]    >         at java.util.concurrent.SynchronousQueue$TransferStack.transfer(SynchronousQueue.java:362)
   [junit4]    >         at java.util.concurrent.SynchronousQueue.poll(SynchronousQueue.java:941)
   [junit4]    >         at java.util.concurrent.ThreadPoolExecutor.getTask(ThreadPoolExecutor.java:1073)
   [junit4]    >         at java.util.concurrent.ThreadPoolExecutor.runWorker(ThreadPoolExecutor.java:1134)
   [junit4]    >         at java.util.concurrent.ThreadPoolExecutor$Worker.run(ThreadPoolExecutor.java:624)
   [junit4]    >         at java.lang.Thread.run(Thread.java:748)
   [junit4]    >    3) Thread[id=1704, name=zkCallback-244-thread-2, state=TIMED_WAITING, group=TGRP-ChaosMonkeyNothingIsSafeTest]
   [junit4]    >         at sun.misc.Unsafe.park(Native Method)
   [junit4]    >         at java.util.concurrent.locks.LockSupport.parkNanos(LockSupport.java:215)
   [junit4]    >         at java.util.concurrent.SynchronousQueue$TransferStack.awaitFulfill(SynchronousQueue.java:460)
   [junit4]    >         at java.util.concurrent.SynchronousQueue$TransferStack.transfer(SynchronousQueue.java:362)
   [junit4]    >         at java.util.concurrent.SynchronousQueue.poll(SynchronousQueue.java:941)
   [junit4]    >         at java.util.concurrent.ThreadPoolExecutor.getTask(ThreadPoolExecutor.java:1073)
   [junit4]    >         at java.util.concurrent.ThreadPoolExecutor.runWorker(ThreadPoolExecutor.java:1134)
   [junit4]    >         at java.util.concurrent.ThreadPoolExecutor$Worker.run(ThreadPoolExecutor.java:624)
   [junit4]    >         at java.lang.Thread.run(Thread.java:748)
   [junit4]    >    4) Thread[id=1773, name=zkCallback-244-thread-3, state=TIMED_WAITING, group=TGRP-ChaosMonkeyNothingIsSafeTest]
   [junit4]    >         at sun.misc.Unsafe.park(Native Method)
   [junit4]    >         at java.util.concurrent.locks.LockSupport.parkNanos(LockSupport.java:215)
   [junit4]    >         at java.util.concurrent.SynchronousQueue$TransferStack.awaitFulfill(SynchronousQueue.java:460)
   [junit4]    >         at java.util.concurrent.SynchronousQueue$TransferStack.transfer(SynchronousQueue.java:362)
   [junit4]    >         at java.util.concurrent.SynchronousQueue.poll(SynchronousQueue.java:941)
   [junit4]    >         at java.util.concurrent.ThreadPoolExecutor.getTask(ThreadPoolExecutor.java:1073)
   [junit4]    >         at java.util.concurrent.ThreadPoolExecutor.runWorker(ThreadPoolExecutor.java:1134)
   [junit4]    >         at java.util.concurrent.ThreadPoolExecutor$Worker.run(ThreadPoolExecutor.java:624)
   [junit4]    >         at java.lang.Thread.run(Thread.java:748)
   [junit4]    >    5) Thread[id=1650, name=TEST-ChaosMonkeyNothingIsSafeTest.test-seed#[14D04BAC0FDC6C15]-SendThread(127.0.0.1:41783), state=TIMED_WAITING, group=TGRP-ChaosMonkeyNothingIsSafeTest]
   [junit4]    >         at java.lang.Thread.sleep(Native Method)
   [junit4]    >         at org.apache.zookeeper.ClientCnxn$SendThread.run(ClientCnxn.java:1051)
   [junit4]    > 	at __randomizedtesting.SeedInfo.seed([14D04BAC0FDC6C15]:0)
   [junit4] Completed [124/729 (1!)] on J0 in 75.91s, 1 test, 3 errors <<< FAILURES!

[...truncated 41337 lines...]

Mime
View raw message