lucene-dev mailing list archives

Site index · List index
Message view « Date » · « Thread »
Top « Date » · « Thread »
From Policeman Jenkins Server <jenk...@thetaphi.de>
Subject [JENKINS] Lucene-Solr-7.0-Linux (64bit/jdk1.8.0_144) - Build # 245 - Still Unstable!
Date Tue, 22 Aug 2017 20:03:43 GMT
Build: https://jenkins.thetaphi.de/job/Lucene-Solr-7.0-Linux/245/
Java: 64bit/jdk1.8.0_144 -XX:-UseCompressedOops -XX:+UseConcMarkSweepGC

1 tests failed.
FAILED:  junit.framework.TestSuite.org.apache.solr.cloud.TestSolrCloudWithSecureImpersonation

Error Message:
2 threads leaked from SUITE scope at org.apache.solr.cloud.TestSolrCloudWithSecureImpersonation:     1) Thread[id=17554, name=jetty-launcher-3003-thread-1-EventThread, state=TIMED_WAITING, group=TGRP-TestSolrCloudWithSecureImpersonation]         at sun.misc.Unsafe.park(Native Method)         at java.util.concurrent.locks.LockSupport.parkNanos(LockSupport.java:215)         at java.util.concurrent.locks.AbstractQueuedSynchronizer.doAcquireSharedNanos(AbstractQueuedSynchronizer.java:1037)         at java.util.concurrent.locks.AbstractQueuedSynchronizer.tryAcquireSharedNanos(AbstractQueuedSynchronizer.java:1328)         at java.util.concurrent.CountDownLatch.await(CountDownLatch.java:277)         at org.apache.curator.CuratorZookeeperClient.internalBlockUntilConnectedOrTimedOut(CuratorZookeeperClient.java:323)         at org.apache.curator.RetryLoop.callWithRetry(RetryLoop.java:105)         at org.apache.curator.framework.imps.GetDataBuilderImpl.pathInForeground(GetDataBuilderImpl.java:288)         at org.apache.curator.framework.imps.GetDataBuilderImpl.forPath(GetDataBuilderImpl.java:279)         at org.apache.curator.framework.imps.GetDataBuilderImpl.forPath(GetDataBuilderImpl.java:41)         at org.apache.curator.framework.recipes.shared.SharedValue.readValue(SharedValue.java:244)         at org.apache.curator.framework.recipes.shared.SharedValue.access$100(SharedValue.java:44)         at org.apache.curator.framework.recipes.shared.SharedValue$1.process(SharedValue.java:61)         at org.apache.curator.framework.imps.NamespaceWatcher.process(NamespaceWatcher.java:67)         at org.apache.zookeeper.ClientCnxn$EventThread.processEvent(ClientCnxn.java:530)         at org.apache.zookeeper.ClientCnxn$EventThread.run(ClientCnxn.java:505)    2) Thread[id=17564, name=jetty-launcher-3003-thread-2-EventThread, state=TIMED_WAITING, group=TGRP-TestSolrCloudWithSecureImpersonation]         at sun.misc.Unsafe.park(Native Method)         at java.util.concurrent.locks.LockSupport.parkNanos(LockSupport.java:215)         at java.util.concurrent.locks.AbstractQueuedSynchronizer.doAcquireSharedNanos(AbstractQueuedSynchronizer.java:1037)         at java.util.concurrent.locks.AbstractQueuedSynchronizer.tryAcquireSharedNanos(AbstractQueuedSynchronizer.java:1328)         at java.util.concurrent.CountDownLatch.await(CountDownLatch.java:277)         at org.apache.curator.CuratorZookeeperClient.internalBlockUntilConnectedOrTimedOut(CuratorZookeeperClient.java:323)         at org.apache.curator.RetryLoop.callWithRetry(RetryLoop.java:105)         at org.apache.curator.framework.imps.GetDataBuilderImpl.pathInForeground(GetDataBuilderImpl.java:288)         at org.apache.curator.framework.imps.GetDataBuilderImpl.forPath(GetDataBuilderImpl.java:279)         at org.apache.curator.framework.imps.GetDataBuilderImpl.forPath(GetDataBuilderImpl.java:41)         at org.apache.curator.framework.recipes.shared.SharedValue.readValue(SharedValue.java:244)         at org.apache.curator.framework.recipes.shared.SharedValue.access$100(SharedValue.java:44)         at org.apache.curator.framework.recipes.shared.SharedValue$1.process(SharedValue.java:61)         at org.apache.curator.framework.imps.NamespaceWatcher.process(NamespaceWatcher.java:67)         at org.apache.zookeeper.ClientCnxn$EventThread.processEvent(ClientCnxn.java:530)         at org.apache.zookeeper.ClientCnxn$EventThread.run(ClientCnxn.java:505)

Stack Trace:
com.carrotsearch.randomizedtesting.ThreadLeakError: 2 threads leaked from SUITE scope at org.apache.solr.cloud.TestSolrCloudWithSecureImpersonation: 
   1) Thread[id=17554, name=jetty-launcher-3003-thread-1-EventThread, state=TIMED_WAITING, group=TGRP-TestSolrCloudWithSecureImpersonation]
        at sun.misc.Unsafe.park(Native Method)
        at java.util.concurrent.locks.LockSupport.parkNanos(LockSupport.java:215)
        at java.util.concurrent.locks.AbstractQueuedSynchronizer.doAcquireSharedNanos(AbstractQueuedSynchronizer.java:1037)
        at java.util.concurrent.locks.AbstractQueuedSynchronizer.tryAcquireSharedNanos(AbstractQueuedSynchronizer.java:1328)
        at java.util.concurrent.CountDownLatch.await(CountDownLatch.java:277)
        at org.apache.curator.CuratorZookeeperClient.internalBlockUntilConnectedOrTimedOut(CuratorZookeeperClient.java:323)
        at org.apache.curator.RetryLoop.callWithRetry(RetryLoop.java:105)
        at org.apache.curator.framework.imps.GetDataBuilderImpl.pathInForeground(GetDataBuilderImpl.java:288)
        at org.apache.curator.framework.imps.GetDataBuilderImpl.forPath(GetDataBuilderImpl.java:279)
        at org.apache.curator.framework.imps.GetDataBuilderImpl.forPath(GetDataBuilderImpl.java:41)
        at org.apache.curator.framework.recipes.shared.SharedValue.readValue(SharedValue.java:244)
        at org.apache.curator.framework.recipes.shared.SharedValue.access$100(SharedValue.java:44)
        at org.apache.curator.framework.recipes.shared.SharedValue$1.process(SharedValue.java:61)
        at org.apache.curator.framework.imps.NamespaceWatcher.process(NamespaceWatcher.java:67)
        at org.apache.zookeeper.ClientCnxn$EventThread.processEvent(ClientCnxn.java:530)
        at org.apache.zookeeper.ClientCnxn$EventThread.run(ClientCnxn.java:505)
   2) Thread[id=17564, name=jetty-launcher-3003-thread-2-EventThread, state=TIMED_WAITING, group=TGRP-TestSolrCloudWithSecureImpersonation]
        at sun.misc.Unsafe.park(Native Method)
        at java.util.concurrent.locks.LockSupport.parkNanos(LockSupport.java:215)
        at java.util.concurrent.locks.AbstractQueuedSynchronizer.doAcquireSharedNanos(AbstractQueuedSynchronizer.java:1037)
        at java.util.concurrent.locks.AbstractQueuedSynchronizer.tryAcquireSharedNanos(AbstractQueuedSynchronizer.java:1328)
        at java.util.concurrent.CountDownLatch.await(CountDownLatch.java:277)
        at org.apache.curator.CuratorZookeeperClient.internalBlockUntilConnectedOrTimedOut(CuratorZookeeperClient.java:323)
        at org.apache.curator.RetryLoop.callWithRetry(RetryLoop.java:105)
        at org.apache.curator.framework.imps.GetDataBuilderImpl.pathInForeground(GetDataBuilderImpl.java:288)
        at org.apache.curator.framework.imps.GetDataBuilderImpl.forPath(GetDataBuilderImpl.java:279)
        at org.apache.curator.framework.imps.GetDataBuilderImpl.forPath(GetDataBuilderImpl.java:41)
        at org.apache.curator.framework.recipes.shared.SharedValue.readValue(SharedValue.java:244)
        at org.apache.curator.framework.recipes.shared.SharedValue.access$100(SharedValue.java:44)
        at org.apache.curator.framework.recipes.shared.SharedValue$1.process(SharedValue.java:61)
        at org.apache.curator.framework.imps.NamespaceWatcher.process(NamespaceWatcher.java:67)
        at org.apache.zookeeper.ClientCnxn$EventThread.processEvent(ClientCnxn.java:530)
        at org.apache.zookeeper.ClientCnxn$EventThread.run(ClientCnxn.java:505)
	at __randomizedtesting.SeedInfo.seed([CAF29F2AEC86C07C]:0)




Build Log:
[...truncated 12643 lines...]
   [junit4] Suite: org.apache.solr.cloud.TestSolrCloudWithSecureImpersonation
   [junit4]   2> Creating dataDir: /home/jenkins/workspace/Lucene-Solr-7.0-Linux/solr/build/solr-core/test/J2/temp/solr.cloud.TestSolrCloudWithSecureImpersonation_CAF29F2AEC86C07C-001/init-core-data-001
   [junit4]   2> 1795558 INFO  (SUITE-TestSolrCloudWithSecureImpersonation-seed#[CAF29F2AEC86C07C]-worker) [    ] o.a.s.SolrTestCaseJ4 Using PointFields (NUMERIC_POINTS_SYSPROP=true) w/NUMERIC_DOCVALUES_SYSPROP=true
   [junit4]   2> 1795559 INFO  (SUITE-TestSolrCloudWithSecureImpersonation-seed#[CAF29F2AEC86C07C]-worker) [    ] o.a.s.SolrTestCaseJ4 Randomized ssl (true) and clientAuth (true) via: @org.apache.solr.util.RandomizeSSL(reason=, ssl=NaN, value=NaN, clientAuth=NaN)
   [junit4]   2> 1795579 INFO  (SUITE-TestSolrCloudWithSecureImpersonation-seed#[CAF29F2AEC86C07C]-worker) [    ] o.a.s.c.MiniSolrCloudCluster Starting cluster of 2 servers in /home/jenkins/workspace/Lucene-Solr-7.0-Linux/solr/build/solr-core/test/J2/temp/solr.cloud.TestSolrCloudWithSecureImpersonation_CAF29F2AEC86C07C-001/tempDir-001
   [junit4]   2> 1795579 INFO  (SUITE-TestSolrCloudWithSecureImpersonation-seed#[CAF29F2AEC86C07C]-worker) [    ] o.a.s.c.ZkTestServer STARTING ZK TEST SERVER
   [junit4]   2> 1795579 INFO  (Thread-4204) [    ] o.a.s.c.ZkTestServer client port:0.0.0.0/0.0.0.0:0
   [junit4]   2> 1795579 INFO  (Thread-4204) [    ] o.a.s.c.ZkTestServer Starting server
   [junit4]   2> 1795582 ERROR (Thread-4204) [    ] o.a.z.s.ZooKeeperServer ZKShutdownHandler is not registered, so ZooKeeper server won't take any action on ERROR or SHUTDOWN server state changes
   [junit4]   2> 1795679 INFO  (SUITE-TestSolrCloudWithSecureImpersonation-seed#[CAF29F2AEC86C07C]-worker) [    ] o.a.s.c.ZkTestServer start zk server on port:42613
   [junit4]   2> 1795683 INFO  (jetty-launcher-3003-thread-1) [    ] o.e.j.s.Server jetty-9.3.14.v20161028
   [junit4]   2> 1795683 INFO  (jetty-launcher-3003-thread-2) [    ] o.e.j.s.Server jetty-9.3.14.v20161028
   [junit4]   2> 1795686 INFO  (jetty-launcher-3003-thread-1) [    ] o.e.j.s.h.ContextHandler Started o.e.j.s.ServletContextHandler@220a702{/solr,null,AVAILABLE}
   [junit4]   2> 1795686 INFO  (jetty-launcher-3003-thread-2) [    ] o.e.j.s.h.ContextHandler Started o.e.j.s.ServletContextHandler@43c3f20f{/solr,null,AVAILABLE}
   [junit4]   2> 1795687 INFO  (jetty-launcher-3003-thread-1) [    ] o.e.j.s.AbstractConnector Started ServerConnector@35b493e9{SSL,[ssl, http/1.1]}{127.0.0.1:41217}
   [junit4]   2> 1795687 INFO  (jetty-launcher-3003-thread-2) [    ] o.e.j.s.AbstractConnector Started ServerConnector@556032e3{SSL,[ssl, http/1.1]}{127.0.0.1:34287}
   [junit4]   2> 1795687 INFO  (jetty-launcher-3003-thread-1) [    ] o.e.j.s.Server Started @1797869ms
   [junit4]   2> 1795687 INFO  (jetty-launcher-3003-thread-2) [    ] o.e.j.s.Server Started @1797869ms
   [junit4]   2> 1795687 INFO  (jetty-launcher-3003-thread-1) [    ] o.a.s.c.s.e.JettySolrRunner Jetty properties: {hostContext=/solr, hostPort=41217}
   [junit4]   2> 1795687 INFO  (jetty-launcher-3003-thread-2) [    ] o.a.s.c.s.e.JettySolrRunner Jetty properties: {hostContext=/solr, hostPort=34287}
   [junit4]   2> 1795687 ERROR (jetty-launcher-3003-thread-2) [    ] o.a.s.s.StartupLoggingUtils Missing Java Option solr.log.dir. Logging may be missing or incomplete.
   [junit4]   2> 1795687 ERROR (jetty-launcher-3003-thread-1) [    ] o.a.s.s.StartupLoggingUtils Missing Java Option solr.log.dir. Logging may be missing or incomplete.
   [junit4]   2> 1795688 INFO  (jetty-launcher-3003-thread-2) [    ] o.a.s.s.SolrDispatchFilter  ___      _       Welcome to Apache Solr? version 7.0.0
   [junit4]   2> 1795688 INFO  (jetty-launcher-3003-thread-1) [    ] o.a.s.s.SolrDispatchFilter  ___      _       Welcome to Apache Solr? version 7.0.0
   [junit4]   2> 1795688 INFO  (jetty-launcher-3003-thread-2) [    ] o.a.s.s.SolrDispatchFilter / __| ___| |_ _   Starting in cloud mode on port null
   [junit4]   2> 1795688 INFO  (jetty-launcher-3003-thread-1) [    ] o.a.s.s.SolrDispatchFilter / __| ___| |_ _   Starting in cloud mode on port null
   [junit4]   2> 1795688 INFO  (jetty-launcher-3003-thread-2) [    ] o.a.s.s.SolrDispatchFilter \__ \/ _ \ | '_|  Install dir: null, Default config dir: null
   [junit4]   2> 1795688 INFO  (jetty-launcher-3003-thread-1) [    ] o.a.s.s.SolrDispatchFilter \__ \/ _ \ | '_|  Install dir: null, Default config dir: null
   [junit4]   2> 1795688 INFO  (jetty-launcher-3003-thread-2) [    ] o.a.s.s.SolrDispatchFilter |___/\___/_|_|    Start time: 2017-08-22T19:43:57.838Z
   [junit4]   2> 1795688 INFO  (jetty-launcher-3003-thread-1) [    ] o.a.s.s.SolrDispatchFilter |___/\___/_|_|    Start time: 2017-08-22T19:43:57.838Z
   [junit4]   2> 1795689 INFO  (jetty-launcher-3003-thread-1) [    ] o.a.s.s.SolrDispatchFilter solr.xml found in ZooKeeper. Loading...
   [junit4]   2> 1795689 INFO  (jetty-launcher-3003-thread-2) [    ] o.a.s.s.SolrDispatchFilter solr.xml found in ZooKeeper. Loading...
   [junit4]   2> 1795702 INFO  (jetty-launcher-3003-thread-2) [    ] o.a.s.c.ZkContainer Zookeeper client=127.0.0.1:42613/solr
   [junit4]   2> 1795705 INFO  (jetty-launcher-3003-thread-1) [    ] o.a.s.c.ZkContainer Zookeeper client=127.0.0.1:42613/solr
   [junit4]   2> 1795750 INFO  (jetty-launcher-3003-thread-2) [n:127.0.0.1:34287_solr    ] o.a.s.c.Overseer Overseer (id=null) closing
   [junit4]   2> 1795750 INFO  (jetty-launcher-3003-thread-1) [n:127.0.0.1:41217_solr    ] o.a.s.c.Overseer Overseer (id=null) closing
   [junit4]   2> 1795751 INFO  (jetty-launcher-3003-thread-2) [n:127.0.0.1:34287_solr    ] o.a.s.c.OverseerElectionContext I am going to be the leader 127.0.0.1:34287_solr
   [junit4]   2> 1795751 INFO  (jetty-launcher-3003-thread-1) [n:127.0.0.1:41217_solr    ] o.a.s.c.ZkController Register node as live in ZooKeeper:/live_nodes/127.0.0.1:41217_solr
   [junit4]   2> 1795751 INFO  (jetty-launcher-3003-thread-2) [n:127.0.0.1:34287_solr    ] o.a.s.c.Overseer Overseer (id=98528856488673286-127.0.0.1:34287_solr-n_0000000000) starting
   [junit4]   2> 1795751 INFO  (zkCallback-3014-thread-1-processing-n:127.0.0.1:41217_solr) [n:127.0.0.1:41217_solr    ] o.a.s.c.c.ZkStateReader Updated live nodes from ZooKeeper... (0) -> (1)
   [junit4]   2> 1795751 INFO  (zkCallback-3015-thread-1-processing-n:127.0.0.1:34287_solr) [n:127.0.0.1:34287_solr    ] o.a.s.c.c.ZkStateReader Updated live nodes from ZooKeeper... (0) -> (1)
   [junit4]   2> 1795755 INFO  (jetty-launcher-3003-thread-2) [n:127.0.0.1:34287_solr    ] o.a.s.c.ZkController Register node as live in ZooKeeper:/live_nodes/127.0.0.1:34287_solr
   [junit4]   2> 1795757 INFO  (zkCallback-3014-thread-1-processing-n:127.0.0.1:41217_solr) [n:127.0.0.1:41217_solr    ] o.a.s.c.c.ZkStateReader Updated live nodes from ZooKeeper... (1) -> (2)
   [junit4]   2> 1795757 INFO  (zkCallback-3015-thread-1-processing-n:127.0.0.1:34287_solr) [n:127.0.0.1:34287_solr    ] o.a.s.c.c.ZkStateReader Updated live nodes from ZooKeeper... (1) -> (2)
   [junit4]   2> 1795780 INFO  (jetty-launcher-3003-thread-1) [n:127.0.0.1:41217_solr    ] o.a.s.c.CoreContainer Initializing authentication plugin: org.apache.solr.security.HttpParamDelegationTokenPlugin
   [junit4]   2> 1795780 WARN  (jetty-launcher-3003-thread-1) [n:127.0.0.1:41217_solr    ] o.a.s.c.s.i.Krb5HttpClientBuilder org.apache.solr.client.solrj.impl.Krb5HttpClientBuilder is configured without specifying system property 'java.security.auth.login.config'
   [junit4]   2> 1795780 INFO  (jetty-launcher-3003-thread-1) [n:127.0.0.1:41217_solr    ] o.a.s.s.KerberosPlugin Params: {solr.kerberos.impersonator.user.noGroups.hosts=*, solr.kerberos.impersonator.user.bogusGroup.groups=__some_bogus_group, token.valid=30, cookie.domain=127.0.0.1, solr.kerberos.impersonator.user.anyHostAnyUser.groups=*, solr.kerberos.impersonator.user.bogusGroup.hosts=*, solr.kerberos.impersonator.user.anyHostAnyUser.hosts=*, token.validity=36000, solr.kerberos.impersonator.user.noHosts.groups=*, type=kerberos, solr.kerberos.impersonator.user.localHostAnyGroup.groups=*, delegation-token.token-kind=solr-dt, solr.kerberos.impersonator.user.wrongHost.hosts=1.1.1.1.1.1, cookie.path=/, zk-dt-secret-manager.znodeWorkingPath=solr/security/zkdtsm, solr.kerberos.impersonator.user.localHostAnyGroup.hosts=localhost.localdomain,localhost,127.0.0.1, signer.secret.provider.zookeeper.path=/token, solr.kerberos.impersonator.user.anyHostUsersGroup.groups=jenkins, zk-dt-secret-manager.enable=true, solr.kerberos.impersonator.user.wrongHost.groups=*, kerberos.name.rules=DEFAULT, signer.secret.provider=zookeeper, solr.kerberos.impersonator.user.anyHostUsersGroup.hosts=*}
   [junit4]   2> 1795782 INFO  (jetty-launcher-3003-thread-1) [n:127.0.0.1:41217_solr    ] o.a.c.f.i.CuratorFrameworkImpl Starting
   [junit4]   2> 1795790 INFO  (jetty-launcher-3003-thread-1-EventThread) [n:127.0.0.1:41217_solr    ] o.a.c.f.s.ConnectionStateManager State change: CONNECTED
   [junit4]   2> 1795812 INFO  (jetty-launcher-3003-thread-2) [n:127.0.0.1:34287_solr    ] o.a.s.c.CoreContainer Initializing authentication plugin: org.apache.solr.security.HttpParamDelegationTokenPlugin
   [junit4]   2> 1795812 WARN  (jetty-launcher-3003-thread-2) [n:127.0.0.1:34287_solr    ] o.a.s.c.s.i.Krb5HttpClientBuilder org.apache.solr.client.solrj.impl.Krb5HttpClientBuilder is configured without specifying system property 'java.security.auth.login.config'
   [junit4]   2> 1795813 INFO  (jetty-launcher-3003-thread-2) [n:127.0.0.1:34287_solr    ] o.a.s.s.KerberosPlugin Params: {solr.kerberos.impersonator.user.noGroups.hosts=*, solr.kerberos.impersonator.user.bogusGroup.groups=__some_bogus_group, token.valid=30, cookie.domain=127.0.0.1, solr.kerberos.impersonator.user.anyHostAnyUser.groups=*, solr.kerberos.impersonator.user.bogusGroup.hosts=*, solr.kerberos.impersonator.user.anyHostAnyUser.hosts=*, token.validity=36000, solr.kerberos.impersonator.user.noHosts.groups=*, type=kerberos, solr.kerberos.impersonator.user.localHostAnyGroup.groups=*, delegation-token.token-kind=solr-dt, solr.kerberos.impersonator.user.wrongHost.hosts=1.1.1.1.1.1, cookie.path=/, zk-dt-secret-manager.znodeWorkingPath=solr/security/zkdtsm, solr.kerberos.impersonator.user.localHostAnyGroup.hosts=localhost.localdomain,localhost,127.0.0.1, signer.secret.provider.zookeeper.path=/token, solr.kerberos.impersonator.user.anyHostUsersGroup.groups=jenkins, zk-dt-secret-manager.enable=true, solr.kerberos.impersonator.user.wrongHost.groups=*, kerberos.name.rules=DEFAULT, signer.secret.provider=zookeeper, solr.kerberos.impersonator.user.anyHostUsersGroup.hosts=*}
   [junit4]   2> 1795815 WARN  (jetty-launcher-3003-thread-1) [n:127.0.0.1:41217_solr    ] o.a.s.c.s.i.Krb5HttpClientBuilder org.apache.solr.client.solrj.impl.Krb5HttpClientBuilder is configured without specifying system property 'java.security.auth.login.config'
   [junit4]   2> 1795819 INFO  (jetty-launcher-3003-thread-2) [n:127.0.0.1:34287_solr    ] o.a.c.f.i.CuratorFrameworkImpl Starting
   [junit4]   2> 1795820 INFO  (jetty-launcher-3003-thread-2-EventThread) [n:127.0.0.1:34287_solr    ] o.a.c.f.s.ConnectionStateManager State change: CONNECTED
   [junit4]   2> 1795845 INFO  (jetty-launcher-3003-thread-1) [n:127.0.0.1:41217_solr    ] o.a.s.m.r.SolrJmxReporter JMX monitoring for 'solr_41217.solr.node' (registry 'solr.node') enabled at server: com.sun.jmx.mbeanserver.JmxMBeanServer@209d3c50
   [junit4]   2> 1795850 INFO  (jetty-launcher-3003-thread-1) [n:127.0.0.1:41217_solr    ] o.a.s.m.r.SolrJmxReporter JMX monitoring for 'solr_41217.solr.jvm' (registry 'solr.jvm') enabled at server: com.sun.jmx.mbeanserver.JmxMBeanServer@209d3c50
   [junit4]   2> 1795851 INFO  (jetty-launcher-3003-thread-1) [n:127.0.0.1:41217_solr    ] o.a.s.m.r.SolrJmxReporter JMX monitoring for 'solr_41217.solr.jetty' (registry 'solr.jetty') enabled at server: com.sun.jmx.mbeanserver.JmxMBeanServer@209d3c50
   [junit4]   2> 1795851 INFO  (jetty-launcher-3003-thread-1) [n:127.0.0.1:41217_solr    ] o.a.s.c.CorePropertiesLocator Found 0 core definitions underneath /home/jenkins/workspace/Lucene-Solr-7.0-Linux/solr/build/solr-core/test/J2/temp/solr.cloud.TestSolrCloudWithSecureImpersonation_CAF29F2AEC86C07C-001/tempDir-001/node1/.
   [junit4]   2> 1796826 WARN  (jetty-launcher-3003-thread-2) [n:127.0.0.1:34287_solr    ] o.a.s.c.s.i.Krb5HttpClientBuilder org.apache.solr.client.solrj.impl.Krb5HttpClientBuilder is configured without specifying system property 'java.security.auth.login.config'
   [junit4]   2> 1796844 INFO  (jetty-launcher-3003-thread-2) [n:127.0.0.1:34287_solr    ] o.a.s.m.r.SolrJmxReporter JMX monitoring for 'solr_34287.solr.node' (registry 'solr.node') enabled at server: com.sun.jmx.mbeanserver.JmxMBeanServer@209d3c50
   [junit4]   2> 1796849 INFO  (jetty-launcher-3003-thread-2) [n:127.0.0.1:34287_solr    ] o.a.s.m.r.SolrJmxReporter JMX monitoring for 'solr_34287.solr.jvm' (registry 'solr.jvm') enabled at server: com.sun.jmx.mbeanserver.JmxMBeanServer@209d3c50
   [junit4]   2> 1796849 INFO  (jetty-launcher-3003-thread-2) [n:127.0.0.1:34287_solr    ] o.a.s.m.r.SolrJmxReporter JMX monitoring for 'solr_34287.solr.jetty' (registry 'solr.jetty') enabled at server: com.sun.jmx.mbeanserver.JmxMBeanServer@209d3c50
   [junit4]   2> 1796849 INFO  (jetty-launcher-3003-thread-2) [n:127.0.0.1:34287_solr    ] o.a.s.c.CorePropertiesLocator Found 0 core definitions underneath /home/jenkins/workspace/Lucene-Solr-7.0-Linux/solr/build/solr-core/test/J2/temp/solr.cloud.TestSolrCloudWithSecureImpersonation_CAF29F2AEC86C07C-001/tempDir-001/node2/.
   [junit4]   2> 1796887 INFO  (TEST-TestSolrCloudWithSecureImpersonation.testProxyNullProxyUser-seed#[CAF29F2AEC86C07C]) [    ] o.a.s.SolrTestCaseJ4 ###Starting testProxyNullProxyUser
   [junit4]   2> 1796906 INFO  (qtp1781912471-17508) [    ] o.a.s.s.SolrDispatchFilter Error authenticating
   [junit4]   2> java.lang.IllegalArgumentException: userName is NULL, empty or contains a '&'
   [junit4]   2> 	at org.apache.hadoop.security.authentication.util.AuthToken.checkForIllegalArgument(AuthToken.java:87)
   [junit4]   2> 	at org.apache.hadoop.security.authentication.util.AuthToken.<init>(AuthToken.java:70)
   [junit4]   2> 	at org.apache.hadoop.security.authentication.server.AuthenticationToken.<init>(AuthenticationToken.java:58)
   [junit4]   2> 	at org.apache.solr.security.HttpParamDelegationTokenPlugin$HttpParamDelegationTokenAuthenticationHandler$HttpParamAuthenticationHandler.authenticate(HttpParamDelegationTokenPlugin.java:213)
   [junit4]   2> 	at org.apache.hadoop.security.token.delegation.web.DelegationTokenAuthenticationHandler.authenticate(DelegationTokenAuthenticationHandler.java:348)
   [junit4]   2> 	at org.apache.solr.security.RequestContinuesRecorderAuthenticationHandler.authenticate(RequestContinuesRecorderAuthenticationHandler.java:69)
   [junit4]   2> 	at org.apache.hadoop.security.authentication.server.AuthenticationFilter.doFilter(AuthenticationFilter.java:518)
   [junit4]   2> 	at org.apache.solr.security.DelegationTokenKerberosFilter.doFilter(DelegationTokenKerberosFilter.java:134)
   [junit4]   2> 	at org.apache.solr.security.HttpParamDelegationTokenPlugin$HttpParamToRequestFilter.doFilter(HttpParamDelegationTokenPlugin.java:245)
   [junit4]   2> 	at org.apache.solr.security.KerberosPlugin.doAuthenticate(KerberosPlugin.java:243)
   [junit4]   2> 	at org.apache.solr.servlet.SolrDispatchFilter.authenticateRequest(SolrDispatchFilter.java:447)
   [junit4]   2> 	at org.apache.solr.servlet.SolrDispatchFilter.doFilter(SolrDispatchFilter.java:343)
   [junit4]   2> 	at org.apache.solr.servlet.SolrDispatchFilter.doFilter(SolrDispatchFilter.java:322)
   [junit4]   2> 	at org.eclipse.jetty.servlet.ServletHandler$CachedChain.doFilter(ServletHandler.java:1699)
   [junit4]   2> 	at org.apache.solr.client.solrj.embedded.JettySolrRunner$DebugFilter.doFilter(JettySolrRunner.java:139)
   [junit4]   2> 	at org.eclipse.jetty.servlet.ServletHandler$CachedChain.doFilter(ServletHandler.java:1699)
   [junit4]   2> 	at org.eclipse.jetty.servlet.ServletHandler.doHandle(ServletHandler.java:582)
   [junit4]   2> 	at org.eclipse.jetty.server.session.SessionHandler.doHandle(SessionHandler.java:224)
   [junit4]   2> 	at org.eclipse.jetty.server.handler.ContextHandler.doHandle(ContextHandler.java:1180)
   [junit4]   2> 	at org.eclipse.jetty.servlet.ServletHandler.doScope(ServletHandler.java:512)
   [junit4]   2> 	at org.eclipse.jetty.server.session.SessionHandler.doScope(SessionHandler.java:185)
   [junit4]   2> 	at org.eclipse.jetty.server.handler.ContextHandler.doScope(ContextHandler.java:1112)
   [junit4]   2> 	at org.eclipse.jetty.server.handler.ScopedHandler.handle(ScopedHandler.java:141)
   [junit4]   2> 	at org.eclipse.jetty.server.handler.gzip.GzipHandler.handle(GzipHandler.java:462)
   [junit4]   2> 	at org.eclipse.jetty.server.handler.HandlerWrapper.handle(HandlerWrapper.java:134)
   [junit4]   2> 	at org.eclipse.jetty.server.Server.handle(Server.java:534)
   [junit4]   2> 	at org.eclipse.jetty.server.HttpChannel.handle(HttpChannel.java:320)
   [junit4]   2> 	at org.eclipse.jetty.server.HttpConnection.onFillable(HttpConnection.java:251)
   [junit4]   2> 	at org.eclipse.jetty.io.AbstractConnection$ReadCallback.succeeded(AbstractConnection.java:273)
   [junit4]   2> 	at org.eclipse.jetty.io.FillInterest.fillable(FillInterest.java:95)
   [junit4]   2> 	at org.eclipse.jetty.io.ssl.SslConnection.onFillable(SslConnection.java:202)
   [junit4]   2> 	at org.eclipse.jetty.io.AbstractConnection$ReadCallback.succeeded(AbstractConnection.java:273)
   [junit4]   2> 	at org.eclipse.jetty.io.FillInterest.fillable(FillInterest.java:95)
   [junit4]   2> 	at org.eclipse.jetty.io.SelectChannelEndPoint$2.run(SelectChannelEndPoint.java:93)
   [junit4]   2> 	at org.eclipse.jetty.util.thread.strategy.ExecuteProduceConsume.executeProduceConsume(ExecuteProduceConsume.java:303)
   [junit4]   2> 	at org.eclipse.jetty.util.thread.strategy.ExecuteProduceConsume.produceConsume(ExecuteProduceConsume.java:148)
   [junit4]   2> 	at org.eclipse.jetty.util.thread.strategy.ExecuteProduceConsume.run(ExecuteProduceConsume.java:136)
   [junit4]   2> 	at org.eclipse.jetty.util.thread.QueuedThreadPool.runJob(QueuedThreadPool.java:671)
   [junit4]   2> 	at org.eclipse.jetty.util.thread.QueuedThreadPool$2.run(QueuedThreadPool.java:589)
   [junit4]   2> 	at java.lang.Thread.run(Thread.java:748)
   [junit4]   2> 1796907 WARN  (qtp1781912471-17508) [    ] o.e.j.s.ServletHandler /solr/admin/collections
   [junit4]   2> org.apache.solr.common.SolrException: Error during request authentication, 
   [junit4]   2> 	at org.apache.solr.servlet.SolrDispatchFilter.authenticateRequest(SolrDispatchFilter.java:453)
   [junit4]   2> 	at org.apache.solr.servlet.SolrDispatchFilter.doFilter(SolrDispatchFilter.java:343)
   [junit4]   2> 	at org.apache.solr.servlet.SolrDispatchFilter.doFilter(SolrDispatchFilter.java:322)
   [junit4]   2> 	at org.eclipse.jetty.servlet.ServletHandler$CachedChain.doFilter(ServletHandler.java:1699)
   [junit4]   2> 	at org.apache.solr.client.solrj.embedded.JettySolrRunner$DebugFilter.doFilter(JettySolrRunner.java:139)
   [junit4]   2> 	at org.eclipse.jetty.servlet.ServletHandler$CachedChain.doFilter(ServletHandler.java:1699)
   [junit4]   2> 	at org.eclipse.jetty.servlet.ServletHandler.doHandle(ServletHandler.java:582)
   [junit4]   2> 	at org.eclipse.jetty.server.session.SessionHandler.doHandle(SessionHandler.java:224)
   [junit4]   2> 	at org.eclipse.jetty.server.handler.ContextHandler.doHandle(ContextHandler.java:1180)
   [junit4]   2> 	at org.eclipse.jetty.servlet.ServletHandler.doScope(ServletHandler.java:512)
   [junit4]   2> 	at org.eclipse.jetty.server.session.SessionHandler.doScope(SessionHandler.java:185)
   [junit4]   2> 	at org.eclipse.jetty.server.handler.ContextHandler.doScope(ContextHandler.java:1112)
   [junit4]   2> 	at org.eclipse.jetty.server.handler.ScopedHandler.handle(ScopedHandler.java:141)
   [junit4]   2> 	at org.eclipse.jetty.server.handler.gzip.GzipHandler.handle(GzipHandler.java:462)
   [junit4]   2> 	at org.eclipse.jetty.server.handler.HandlerWrapper.handle(HandlerWrapper.java:134)
   [junit4]   2> 	at org.eclipse.jetty.server.Server.handle(Server.java:534)
   [junit4]   2> 	at org.eclipse.jetty.server.HttpChannel.handle(HttpChannel.java:320)
   [junit4]   2> 	at org.eclipse.jetty.server.HttpConnection.onFillable(HttpConnection.java:251)
   [junit4]   2> 	at org.eclipse.jetty.io.AbstractConnection$ReadCallback.succeeded(AbstractConnection.java:273)
   [junit4]   2> 	at org.eclipse.jetty.io.FillInterest.fillable(FillInterest.java:95)
   [junit4]   2> 	at org.eclipse.jetty.io.ssl.SslConnection.onFillable(SslConnection.java:202)
   [junit4]   2> 	at org.eclipse.jetty.io.AbstractConnection$ReadCallback.succeeded(AbstractConnection.java:273)
   [junit4]   2> 	at org.eclipse.jetty.io.FillInterest.fillable(FillInterest.java:95)
   [junit4]   2> 	at org.eclipse.jetty.io.SelectChannelEndPoint$2.run(SelectChannelEndPoint.java:93)
   [junit4]   2> 	at org.eclipse.jetty.util.thread.strategy.ExecuteProduceConsume.executeProduceConsume(ExecuteProduceConsume.java:303)
   [junit4]   2> 	at org.eclipse.jetty.util.thread.strategy.ExecuteProduceConsume.produceConsume(ExecuteProduceConsume.java:148)
   [junit4]   2> 	at org.eclipse.jetty.util.thread.strategy.ExecuteProduceConsume.run(ExecuteProduceConsume.java:136)
   [junit4]   2> 	at org.eclipse.jetty.util.thread.QueuedThreadPool.runJob(QueuedThreadPool.java:671)
   [junit4]   2> 	at org.eclipse.jetty.util.thread.QueuedThreadPool$2.run(QueuedThreadPool.java:589)
   [junit4]   2> 	at java.lang.Thread.run(Thread.java:748)
   [junit4]   2> Caused by: java.lang.IllegalArgumentException: userName is NULL, empty or contains a '&'
   [junit4]   2> 	at org.apache.hadoop.security.authentication.util.AuthToken.checkForIllegalArgument(AuthToken.java:87)
   [junit4]   2> 	at org.apache.hadoop.security.authentication.util.AuthToken.<init>(AuthToken.java:70)
   [junit4]   2> 	at org.apache.hadoop.security.authentication.server.AuthenticationToken.<init>(AuthenticationToken.java:58)
   [junit4]   2> 	at org.apache.solr.security.HttpParamDelegationTokenPlugin$HttpParamDelegationTokenAuthenticationHandler$HttpParamAuthenticationHandler.authenticate(HttpParamDelegationTokenPlugin.java:213)
   [junit4]   2> 	at org.apache.hadoop.security.token.delegation.web.DelegationTokenAuthenticationHandler.authenticate(DelegationTokenAuthenticationHandler.java:348)
   [junit4]   2> 	at org.apache.solr.security.RequestContinuesRecorderAuthenticationHandler.authenticate(RequestContinuesRecorderAuthenticationHandler.java:69)
   [junit4]   2> 	at org.apache.hadoop.security.authentication.server.AuthenticationFilter.doFilter(AuthenticationFilter.java:518)
   [junit4]   2> 	at org.apache.solr.security.DelegationTokenKerberosFilter.doFilter(DelegationTokenKerberosFilter.java:134)
   [junit4]   2> 	at org.apache.solr.security.HttpParamDelegationTokenPlugin$HttpParamToRequestFilter.doFilter(HttpParamDelegationTokenPlugin.java:245)
   [junit4]   2> 	at org.apache.solr.security.KerberosPlugin.doAuthenticate(KerberosPlugin.java:243)
   [junit4]   2> 	at org.apache.solr.servlet.SolrDispatchFilter.authenticateRequest(SolrDispatchFilter.java:447)
   [junit4]   2> 	... 29 more
   [junit4]   2> 1796909 INFO  (TEST-TestSolrCloudWithSecureImpersonation.testProxyNullProxyUser-seed#[CAF29F2AEC86C07C]) [    ] o.a.s.SolrTestCaseJ4 ###Ending testProxyNullProxyUser
   [junit4]   2> 1796919 INFO  (TEST-TestSolrCloudWithSecureImpersonation.testProxyValidateGroup-seed#[CAF29F2AEC86C07C]) [    ] o.a.s.SolrTestCaseJ4 ###Starting testProxyValidateGroup
   [junit4]   2> 1796935 INFO  (qtp1781912471-17508) [n:127.0.0.1:41217_solr    ] o.a.s.h.a.CollectionsHandler Invoked Collection Action :list with params doAs=jenkins&action=LIST&wt=javabin&version=2 and sendToOCPQueue=true
   [junit4]   2> 1796935 INFO  (qtp1781912471-17508) [n:127.0.0.1:41217_solr    ] o.a.s.s.HttpSolrCall [admin] webapp=null path=/admin/collections params={doAs=jenkins&action=LIST&wt=javabin&version=2} status=0 QTime=0
   [junit4]   2> 1796935 WARN  (TEST-TestSolrCloudWithSecureImpersonation.testProxyValidateGroup-seed#[CAF29F2AEC86C07C]) [    ] o.a.h.c.p.ResponseProcessCookies Invalid cookie header: "Set-Cookie: hadoop.auth="u=anyHostUsersGroup&p=anyHostUsersGroup&t=test&e=1503467039071&s=2i3ManMaO/24wr+SMZ7Cs5po9v4="; Path=/; Domain=127.0.0.1; Expires=sri, 23-kol-2017 05:43:59 GMT; Secure; HttpOnly". Invalid 'expires' attribute: sri, 23-kol-2017 05:43:59 GMT
   [junit4]   2> 1796935 INFO  (TEST-TestSolrCloudWithSecureImpersonation.testProxyValidateGroup-seed#[CAF29F2AEC86C07C]) [    ] o.a.s.SolrTestCaseJ4 ###Ending testProxyValidateGroup
   [junit4]   2> 1796948 INFO  (TEST-TestSolrCloudWithSecureImpersonation.testProxyInvalidGroup-seed#[CAF29F2AEC86C07C]) [    ] o.a.s.SolrTestCaseJ4 ###Starting testProxyInvalidGroup
   [junit4]   2> 1796954 WARN  (qtp1781912471-17520) [    ] o.a.h.s.ShellBasedUnixGroupsMapping got exception trying to get groups for user bar: id: ‘bar’: no such user
   [junit4]   2> id: ‘bar’: no such user
   [junit4]   2> 
   [junit4]   2> 1796956 WARN  (TEST-TestSolrCloudWithSecureImpersonation.testProxyInvalidGroup-seed#[CAF29F2AEC86C07C]) [    ] o.a.h.c.p.ResponseProcessCookies Invalid cookie header: "Set-Cookie: hadoop.auth="u=bogusGroup&p=bogusGroup&t=test&e=1503467039099&s=usjZuBayjcCG3HSsWEoYzg+PLjo="; Path=/; Domain=127.0.0.1; Expires=sri, 23-kol-2017 05:43:59 GMT; Secure; HttpOnly". Invalid 'expires' attribute: sri, 23-kol-2017 05:43:59 GMT
   [junit4]   2> 1796956 INFO  (TEST-TestSolrCloudWithSecureImpersonation.testProxyInvalidGroup-seed#[CAF29F2AEC86C07C]) [    ] o.a.s.SolrTestCaseJ4 ###Ending testProxyInvalidGroup
   [junit4]   2> 1796970 INFO  (TEST-TestSolrCloudWithSecureImpersonation.testProxyValidateAnyHostAnyUser-seed#[CAF29F2AEC86C07C]) [    ] o.a.s.SolrTestCaseJ4 ###Starting testProxyValidateAnyHostAnyUser
   [junit4]   2> 1796971 INFO  (qtp1781912471-17510) [n:127.0.0.1:41217_solr    ] o.a.s.h.a.CollectionsHandler Invoked Collection Action :list with params doAs=bar&action=LIST&wt=javabin&version=2 and sendToOCPQueue=true
   [junit4]   2> 1796971 INFO  (qtp1781912471-17510) [n:127.0.0.1:41217_solr    ] o.a.s.s.HttpSolrCall [admin] webapp=null path=/admin/collections params={doAs=bar&action=LIST&wt=javabin&version=2} status=0 QTime=0
   [junit4]   2> 1796971 WARN  (TEST-TestSolrCloudWithSecureImpersonation.testProxyValidateAnyHostAnyUser-seed#[CAF29F2AEC86C07C]) [    ] o.a.h.c.p.ResponseProcessCookies Invalid cookie header: "Set-Cookie: hadoop.auth="u=anyHostAnyUser&p=anyHostAnyUser&t=test&e=1503467039120&s=fEQfAA9/wcd8vgPNC3O9RJ3wvEM="; Path=/; Domain=127.0.0.1; Expires=sri, 23-kol-2017 05:43:59 GMT; Secure; HttpOnly". Invalid 'expires' attribute: sri, 23-kol-2017 05:43:59 GMT
   [junit4]   2> 1796971 INFO  (TEST-TestSolrCloudWithSecureImpersonation.testProxyValidateAnyHostAnyUser-seed#[CAF29F2AEC86C07C]) [    ] o.a.s.SolrTestCaseJ4 ###Ending testProxyValidateAnyHostAnyUser
   [junit4]   2> 1796984 INFO  (TEST-TestSolrCloudWithSecureImpersonation.testForwarding-seed#[CAF29F2AEC86C07C]) [    ] o.a.s.SolrTestCaseJ4 ###Starting testForwarding
   [junit4]   2> 1797102 INFO  (TEST-TestSolrCloudWithSecureImpersonation.testForwarding-seed#[CAF29F2AEC86C07C]) [    ] o.a.s.c.c.ZkStateReader Updated live nodes from ZooKeeper... (0) -> (2)
   [junit4]   2> 1797102 INFO  (TEST-TestSolrCloudWithSecureImpersonation.testForwarding-seed#[CAF29F2AEC86C07C]) [    ] o.a.s.c.s.i.ZkClientClusterStateProvider Cluster at 127.0.0.1:42613/solr ready
   [junit4]   2> 1797121 INFO  (qtp1760075648-17509) [n:127.0.0.1:34287_solr    ] o.a.s.h.a.CollectionsHandler Invoked Collection Action :create with params pullReplicas=0&replicationFactor=1&collection.configName=conf1&maxShardsPerNode=1&name=forwardingCollection&nrtReplicas=1&action=CREATE&numShards=1&tlogReplicas=0&wt=javabin&version=2 and sendToOCPQueue=true
   [junit4]   2> 1797122 INFO  (OverseerThreadFactory-6817-thread-1-processing-n:127.0.0.1:34287_solr) [n:127.0.0.1:34287_solr    ] o.a.s.c.CreateCollectionCmd Create collection forwardingCollection
   [junit4]   2> 1797225 INFO  (OverseerStateUpdate-98528856488673286-127.0.0.1:34287_solr-n_0000000000) [n:127.0.0.1:34287_solr    ] o.a.s.c.o.SliceMutator createReplica() {
   [junit4]   2>   "operation":"ADDREPLICA",
   [junit4]   2>   "collection":"forwardingCollection",
   [junit4]   2>   "shard":"shard1",
   [junit4]   2>   "core":"forwardingCollection_shard1_replica_n1",
   [junit4]   2>   "state":"down",
   [junit4]   2>   "base_url":"https://127.0.0.1:34287/solr",
   [junit4]   2>   "type":"NRT"} 
   [junit4]   2> 1797432 INFO  (qtp1760075648-17511) [n:127.0.0.1:34287_solr    ] o.a.s.h.a.CoreAdminOperation core create command qt=/admin/cores&coreNodeName=core_node1&collection.configName=conf1&newCollection=true&name=forwardingCollection_shard1_replica_n1&action=CREATE&numShards=1&collection=forwardingCollection&shard=shard1&wt=javabin&version=2&replicaType=NRT
   [junit4]   2> 1797432 INFO  (qtp1760075648-17511) [n:127.0.0.1:34287_solr    ] o.a.s.c.TransientSolrCoreCacheDefault Allocating transient cache for 2147483647 transient cores
   [junit4]   2> 1797538 INFO  (zkCallback-3015-thread-1-processing-n:127.0.0.1:34287_solr) [n:127.0.0.1:34287_solr    ] o.a.s.c.c.ZkStateReader A cluster state change: [WatchedEvent state:SyncConnected type:NodeDataChanged path:/collections/forwardingCollection/state.json] for collection [forwardingCollection] has occurred - updating... (live nodes size: [2])
   [junit4]   2> 1797538 INFO  (zkCallback-3015-thread-2-processing-n:127.0.0.1:34287_solr) [n:127.0.0.1:34287_solr    ] o.a.s.c.c.ZkStateReader A cluster state change: [WatchedEvent state:SyncConnected type:NodeDataChanged path:/collections/forwardingCollection/state.json] for collection [forwardingCollection] has occurred - updating... (live nodes size: [2])
   [junit4]   2> 1798455 INFO  (qtp1760075648-17511) [n:127.0.0.1:34287_solr c:forwardingCollection s:shard1 r:core_node1 x:forwardingCollection_shard1_replica_n1] o.a.s.c.SolrConfig Using Lucene MatchVersion: 7.0.0
   [junit4]   2> 1798478 INFO  (qtp1760075648-17511) [n:127.0.0.1:34287_solr c:forwardingCollection s:shard1 r:core_node1 x:forwardingCollection_shard1_replica_n1] o.a.s.s.IndexSchema [forwardingCollection_shard1_replica_n1] Schema name=test
   [junit4]   2> 1798539 INFO  (qtp1760075648-17511) [n:127.0.0.1:34287_solr c:forwardingCollection s:shard1 r:core_node1 x:forwardingCollection_shard1_replica_n1] o.a.s.s.IndexSchema Loaded schema test/1.0 with uniqueid field id
   [junit4]   2> 1798545 INFO  (qtp1760075648-17511) [n:127.0.0.1:34287_solr c:forwardingCollection s:shard1 r:core_node1 x:forwardingCollection_shard1_replica_n1] o.a.s.c.CoreContainer Creating SolrCore 'forwardingCollection_shard1_replica_n1' using configuration from collection forwardingCollection, trusted=true
   [junit4]   2> 1798546 INFO  (qtp1760075648-17511) [n:127.0.0.1:34287_solr c:forwardingCollection s:shard1 r:core_node1 x:forwardingCollection_shard1_replica_n1] o.a.s.m.r.SolrJmxReporter JMX monitoring for 'solr_34287.solr.core.forwardingCollection.shard1.replica_n1' (registry 'solr.core.forwardingCollection.shard1.replica_n1') enabled at server: com.sun.jmx.mbeanserver.JmxMBeanServer@209d3c50
   [junit4]   2> 1798546 INFO  (qtp1760075648-17511) [n:127.0.0.1:34287_solr c:forwardingCollection s:shard1 r:core_node1 x:forwardingCollection_shard1_replica_n1] o.a.s.c.SolrCore solr.RecoveryStrategy.Builder
   [junit4]   2> 1798546 INFO  (qtp1760075648-17511) [n:127.0.0.1:34287_solr c:forwardingCollection s:shard1 r:core_node1 x:forwardingCollection_shard1_replica_n1] o.a.s.c.SolrCore [[forwardingCollection_shard1_replica_n1] ] Opening new SolrCore at [/home/jenkins/workspace/Lucene-Solr-7.0-Linux/solr/build/solr-core/test/J2/temp/solr.cloud.TestSolrCloudWithSecureImpersonation_CAF29F2AEC86C07C-001/tempDir-001/node2/forwardingCollection_shard1_replica_n1], dataDir=[/home/jenkins/workspace/Lucene-Solr-7.0-Linux/solr/build/solr-core/test/J2/temp/solr.cloud.TestSolrCloudWithSecureImpersonation_CAF29F2AEC86C07C-001/tempDir-001/node2/./forwardingCollection_shard1_replica_n1/data/]
   [junit4]   2> 1798547 INFO  (qtp1760075648-17511) [n:127.0.0.1:34287_solr c:forwardingCollection s:shard1 r:core_node1 x:forwardingCollection_shard1_replica_n1] o.a.s.u.RandomMergePolicy RandomMergePolicy wrapping class org.apache.lucene.index.MockRandomMergePolicy: org.apache.lucene.index.MockRandomMergePolicy@57d7ce75
   [junit4]   2> 1798578 INFO  (qtp1760075648-17511) [n:127.0.0.1:34287_solr c:forwardingCollection s:shard1 r:core_node1 x:forwardingCollection_shard1_replica_n1] o.a.s.u.UpdateHandler Using UpdateLog implementation: org.apache.solr.update.UpdateLog
   [junit4]   2> 1798578 INFO  (qtp1760075648-17511) [n:127.0.0.1:34287_solr c:forwardingCollection s:shard1 r:core_node1 x:forwardingCollection_shard1_replica_n1] o.a.s.u.UpdateLog Initializing UpdateLog: dataDir= defaultSyncLevel=FLUSH numRecordsToKeep=100 maxNumLogsToKeep=10 numVersionBuckets=65536
   [junit4]   2> 1798579 INFO  (qtp1760075648-17511) [n:127.0.0.1:34287_solr c:forwardingCollection s:shard1 r:core_node1 x:forwardingCollection_shard1_replica_n1] o.a.s.u.CommitTracker Hard AutoCommit: disabled
   [junit4]   2> 1798579 INFO  (qtp1760075648-17511) [n:127.0.0.1:34287_solr c:forwardingCollection s:shard1 r:core_node1 x:forwardingCollection_shard1_replica_n1] o.a.s.u.CommitTracker Soft AutoCommit: disabled
   [junit4]   2> 1798580 INFO  (qtp1760075648-17511) [n:127.0.0.1:34287_solr c:forwardingCollection s:shard1 r:core_node1 x:forwardingCollection_shard1_replica_n1] o.a.s.u.RandomMergePolicy RandomMergePolicy wrapping class org.apache.lucene.index.AlcoholicMergePolicy: [AlcoholicMergePolicy: minMergeSize=0, mergeFactor=10, maxMergeSize=877441180, maxMergeSizeForForcedMerge=9223372036854775807, calibrateSizeByDeletes=true, maxMergeDocs=2147483647, maxCFSSegmentSizeMB=8.796093022207999E12, noCFSRatio=0.1]
   [junit4]   2> 1798580 INFO  (qtp1760075648-17511) [n:127.0.0.1:34287_solr c:forwardingCollection s:shard1 r:core_node1 x:forwardingCollection_shard1_replica_n1] o.a.s.s.SolrIndexSearcher Opening [Searcher@487b0373[forwardingCollection_shard1_replica_n1] main]
   [junit4]   2> 1798581 INFO  (qtp1760075648-17511) [n:127.0.0.1:34287_solr c:forwardingCollection s:shard1 r:core_node1 x:forwardingCollection_shard1_replica_n1] o.a.s.h.c.SpellCheckComponent Initializing spell checkers
   [junit4]   2> 1800238 INFO  (qtp1760075648-17511) [n:127.0.0.1:34287_solr c:forwardingCollection s:shard1 r:core_node1 x:forwardingCollection_shard1_replica_n1] o.a.s.s.DirectSolrSpellChecker init: {name=direct,classname=DirectSolrSpellChecker,field=lowerfilt,minQueryLength=3}
   [junit4]   2> 1800327 INFO  (qtp1760075648-17511) [n:127.0.0.1:34287_solr c:forwardingCollection s:shard1 r:core_node1 x:forwardingCollection_shard1_replica_n1] o.a.s.h.ReplicationHandler Commits will be reserved for  10000
   [junit4]   2> 1800327 INFO  (searcherExecutor-6822-thread-1-processing-n:127.0.0.1:34287_solr x:forwardingCollection_shard1_replica_n1 s:shard1 c:forwardingCollection r:core_node1) [n:127.0.0.1:34287_solr c:forwardingCollection s:shard1 r:core_node1 x:forwardingCollection_shard1_replica_n1] o.a.s.h.c.SpellCheckComponent Loading spell index for spellchecker: default
   [junit4]   2> 1800327 INFO  (qtp1760075648-17511) [n:127.0.0.1:34287_solr c:forwardingCollection s:shard1 r:core_node1 x:forwardingCollection_shard1_replica_n1] o.a.s.u.UpdateLog Could not find max version in index or recent updates, using new clock 1576461708796362752
   [junit4]   2> 1800329 INFO  (searcherExecutor-6822-thread-1-processing-n:127.0.0.1:34287_solr x:forwardingCollection_shard1_replica_n1 s:shard1 c:forwardingCollection r:core_node1) [n:127.0.0.1:34287_solr c:forwardingCollection s:shard1 r:core_node1 x:forwardingCollection_shard1_replica_n1] o.a.s.h.c.SpellCheckComponent Loading spell index for spellchecker: direct
   [junit4]   2> 1800329 INFO  (searcherExecutor-6822-thread-1-processing-n:127.0.0.1:34287_solr x:forwardingCollection_shard1_replica_n1 s:shard1 c:forwardingCollection r:core_node1) [n:127.0.0.1:34287_solr c:forwardingCollection s:shard1 r:core_node1 x:forwardingCollection_shard1_replica_n1] o.a.s.h.c.SpellCheckComponent Loading spell index for spellchecker: wordbreak
   [junit4]   2> 1800329 INFO  (searcherExecutor-6822-thread-1-processing-n:127.0.0.1:34287_solr x:forwardingCollection_shard1_replica_n1 s:shard1 c:forwardingCollection r:core_node1) [n:127.0.0.1:34287_solr c:forwardingCollection s:shard1 r:core_node1 x:forwardingCollection_shard1_replica_n1] o.a.s.h.c.SpellCheckComponent Loading spell index for spellchecker: multipleFields
   [junit4]   2> 1800329 INFO  (searcherExecutor-6822-thread-1-processing-n:127.0.0.1:34287_solr x:forwardingCollection_shard1_replica_n1 s:shard1 c:forwardingCollection r:core_node1) [n:127.0.0.1:34287_solr c:forwardingCollection s:shard1 r:core_node1 x:forwardingCollection_shard1_replica_n1] o.a.s.h.c.SpellCheckComponent Loading spell index for spellchecker: jarowinkler
   [junit4]   2> 1800329 INFO  (searcherExecutor-6822-thread-1-processing-n:127.0.0.1:34287_solr x:forwardingCollection_shard1_replica_n1 s:shard1 c:forwardingCollection r:core_node1) [n:127.0.0.1:34287_solr c:forwardingCollection s:shard1 r:core_node1 x:forwardingCollection_shard1_replica_n1] o.a.s.h.c.SpellCheckComponent Loading spell index for spellchecker: external
   [junit4]   2> 1800330 INFO  (searcherExecutor-6822-thread-1-processing-n:127.0.0.1:34287_solr x:forwardingCollection_shard1_replica_n1 s:shard1 c:forwardingCollection r:core_node1) [n:127.0.0.1:34287_solr c:forwardingCollection s:shard1 r:core_node1 x:forwardingCollection_shard1_replica_n1] o.a.s.h.c.SpellCheckComponent Loading spell index for spellchecker: freq
   [junit4]   2> 1800330 INFO  (searcherExecutor-6822-thread-1-processing-n:127.0.0.1:34287_solr x:forwardingCollection_shard1_replica_n1 s:shard1 c:forwardingCollection r:core_node1) [n:127.0.0.1:34287_solr c:forwardingCollection s:shard1 r:core_node1 x:forwardingCollection_shard1_replica_n1] o.a.s.h.c.SpellCheckComponent Loading spell index for spellchecker: fqcn
   [junit4]   2> 1800330 INFO  (searcherExecutor-6822-thread-1-processing-n:127.0.0.1:34287_solr x:forwardingCollection_shard1_replica_n1 s:shard1 c:forwardingCollection r:core_node1) [n:127.0.0.1:34287_solr c:forwardingCollection s:shard1 r:core_node1 x:forwardingCollection_shard1_replica_n1] o.a.s.h.c.SpellCheckComponent Loading spell index for spellchecker: perDict
   [junit4]   2> 1800332 INFO  (searcherExecutor-6822-thread-1-processing-n:127.0.0.1:34287_solr x:forwardingCollection_shard1_replica_n1 s:shard1 c:forwardingCollection r:core_node1) [n:127.0.0.1:34287_solr c:forwardingCollection s:shard1 r:core_node1 x:forwardingCollection_shard1_replica_n1] o.a.s.c.SolrCore [forwardingCollection_shard1_replica_n1] Registered new searcher Searcher@487b0373[forwardingCollection_shard1_replica_n1] main{ExitableDirectoryReader(UninvertingDirectoryReader())}
   [junit4]   2> 1800334 INFO  (qtp1760075648-17511) [n:127.0.0.1:34287_solr c:forwardingCollection s:shard1 r:core_node1 x:forwardingCollection_shard1_replica_n1] o.a.s.c.ShardLeaderElectionContext Enough replicas found to continue.
   [junit4]   2> 1800335 INFO  (qtp1760075648-17511) [n:127.0.0.1:34287_solr c:forwardingCollection s:shard1 r:core_node1 x:forwardingCollection_shard1_replica_n1] o.a.s.c.ShardLeaderElectionContext I may be the new leader - try and sync
   [junit4]   2> 1800335 INFO  (qtp1760075648-17511) [n:127.0.0.1:34287_solr c:forwardingCollection s:shard1 r:core_node1 x:forwardingCollection_shard1_replica_n1] o.a.s.c.SyncStrategy Sync replicas to https://127.0.0.1:34287/solr/forwardingCollection_shard1_replica_n1/
   [junit4]   2> 1800335 INFO  (qtp1760075648-17511) [n:127.0.0.1:34287_solr c:forwardingCollection s:shard1 r:core_node1 x:forwardingCollection_shard1_replica_n1] o.a.s.c.SyncStrategy Sync Success - now sync replicas to me
   [junit4]   2> 1800335 INFO  (qtp1760075648-17511) [n:127.0.0.1:34287_solr c:forwardingCollection s:shard1 r:core_node1 x:forwardingCollection_shard1_replica_n1] o.a.s.c.SyncStrategy https://127.0.0.1:34287/solr/forwardingCollection_shard1_replica_n1/ has no replicas
   [junit4]   2> 1800335 INFO  (qtp1760075648-17511) [n:127.0.0.1:34287_solr c:forwardingCollection s:shard1 r:core_node1 x:forwardingCollection_shard1_replica_n1] o.a.s.c.ShardLeaderElectionContext Found all replicas participating in election, clear LIR
   [junit4]   2> 1800336 INFO  (zkCallback-3015-thread-1-processing-n:127.0.0.1:34287_solr) [n:127.0.0.1:34287_solr    ] o.a.s.c.c.ZkStateReader A cluster state change: [WatchedEvent state:SyncConnected type:NodeDataChanged path:/collections/forwardingCollection/state.json] for collection [forwardingCollection] has occurred - updating... (live nodes size: [2])
   [junit4]   2> 1800336 INFO  (zkCallback-3015-thread-2-processing-n:127.0.0.1:34287_solr) [n:127.0.0.1:34287_solr    ] o.a.s.c.c.ZkStateReader A cluster state change: [WatchedEvent state:SyncConnected type:NodeDataChanged path:/collections/forwardingCollection/state.json] for collection [forwardingCollection] has occurred - updating... (live nodes size: [2])
   [junit4]   2> 1800338 INFO  (qtp1760075648-17511) [n:127.0.0.1:34287_solr c:forwardingCollection s:shard1 r:core_node1 x:forwardingCollection_shard1_replica_n1] o.a.s.c.ShardLeaderElectionContext I am the new leader: https://127.0.0.1:34287/solr/forwardingCollection_shard1_replica_n1/ shard1
   [junit4]   2> 1800440 INFO  (zkCallback-3015-thread-2-processing-n:127.0.0.1:34287_solr) [n:127.0.0.1:34287_solr    ] o.a.s.c.c.ZkStateReader A cluster state change: [WatchedEvent state:SyncConnected type:NodeDataChanged path:/collections/forwardingCollection/state.json] for collection [forwardingCollection] has occurred - updating... (live nodes size: [2])
   [junit4]   2> 1800440 INFO  (zkCallback-3015-thread-1-processing-n:127.0.0.1:34287_solr) [n:127.0.0.1:34287_solr    ] o.a.s.c.c.ZkStateReader A cluster state change: [WatchedEvent state:SyncConnected type:NodeDataChanged path:/collections/forwardingCollection/state.json] for collection [forwardingCollection] has occurred - updating... (live nodes size: [2])
   [junit4]   2> 1800488 INFO  (qtp1760075648-17511) [n:127.0.0.1:34287_solr c:forwardingCollection s:shard1 r:core_node1 x:forwardingCollection_shard1_replica_n1] o.a.s.c.ZkController I am the leader, no recovery necessary
   [junit4]   2> 1800490 INFO  (qtp1760075648-17511) [n:127.0.0.1:34287_solr c:forwardingCollection s:shard1 r:core_node1 x:forwardingCollection_shard1_replica_n1] o.a.s.s.HttpSolrCall [admin] webapp=null path=/admin/cores params={qt=/admin/cores&coreNodeName=core_node1&collection.configName=conf1&newCollection=true&name=forwardingCollection_shard1_replica_n1&action=CREATE&numShards=1&collection=forwardingCollection&shard=shard1&wt=javabin&version=2&replicaType=NRT} status=0 QTime=3058
   [junit4]   2> 1800491 WARN  (httpShardExecutor-6815-thread-1-processing-n:127.0.0.1:34287_solr [https:////127.0.0.1:34287//solr] https:////127.0.0.1:34287//solr) [n:127.0.0.1:34287_solr    ] o.a.h.c.p.ResponseProcessCookies Invalid cookie header: "Set-Cookie: hadoop.auth="u=$&p=$&t=test&e=1503467039581&s=TW0fMdUg27oaUa8ObF4cEQQPUnY="; Path=/; Domain=127.0.0.1; Expires=sri, 23-kol-2017 05:43:59 GMT; Secure; HttpOnly". Invalid 'expires' attribute: sri, 23-kol-2017 05:43:59 GMT
   [junit4]   2> 1800494 INFO  (qtp1760075648-17509) [n:127.0.0.1:34287_solr    ] o.a.s.h.a.CollectionsHandler Wait for new collection to be active for at most 30 seconds. Check all shard replicas
   [junit4]   2> 1800594 INFO  (zkCallback-3015-thread-2-processing-n:127.0.0.1:34287_solr) [n:127.0.0.1:34287_solr    ] o.a.s.c.c.ZkStateReader A cluster state change: [WatchedEvent state:SyncConnected type:NodeDataChanged path:/collections/forwardingCollection/state.json] for collection [forwardingCollection] has occurred - updating... (live nodes size: [2])
   [junit4]   2> 1800594 INFO  (zkCallback-3015-thread-1-processing-n:127.0.0.1:34287_solr) [n:127.0.0.1:34287_solr    ] o.a.s.c.c.ZkStateReader A cluster state change: [WatchedEvent state:SyncConnected type:NodeDataChanged path:/collections/forwardingCollection/state.json] for collection [forwardingCollection] has occurred - updating... (live nodes size: [2])
   [junit4]   2> 1801125 INFO  (OverseerCollectionConfigSetProcessor-98528856488673286-127.0.0.1:34287_solr-n_0000000000) [n:127.0.0.1:34287_solr    ] o.a.s.c.OverseerTaskQueue Response ZK path: /overseer/collection-queue-work/qnr-0000000000 doesn't exist.  Requestor may have disconnected from ZooKeeper
   [junit4]   2> 1801494 INFO  (qtp1760075648-17509) [n:127.0.0.1:34287_solr    ] o.a.s.s.HttpSolrCall [admin] webapp=null path=/admin/collections params={pullReplicas=0&replicationFactor=1&collection.configName=conf1&maxShardsPerNode=1&name=forwardingCollection&nrtReplicas=1&action=CREATE&numShards=1&tlogReplicas=0&wt=javabin&version=2} status=0 QTime=4372
   [junit4]   2> 1801494 WARN  (TEST-TestSolrCloudWithSecureImpersonation.testForwarding-seed#[CAF29F2AEC86C07C]) [    ] o.a.h.c.p.ResponseProcessCookies Invalid cookie header: "Set-Cookie: hadoop.auth="u=user&p=user&t=test&e=1503467039271&s=9GYvRcPINfIDUE/oTNV7iaE78PQ="; Path=/; Domain=127.0.0.1; Expires=sri, 23-kol-2017 05:43:59 GMT; Secure; HttpOnly". Invalid 'expires' attribute: sri, 23-kol-2017 05:43:59 GMT
   [junit4]   2> 1801495 INFO  (TEST-TestSolrCloudWithSecureImpersonation.testForwarding-seed#[CAF29F2AEC86C07C]) [    ] o.a.s.c.AbstractDistribZkTestBase Wait for recoveries to finish - collection: forwardingCollection failOnTimeout:true timeout (sec):100
   [junit4]   2> 1801495 INFO  (TEST-TestSolrCloudWithSecureImpersonation.testForwarding-seed#[CAF29F2AEC86C07C]) [    ] o.a.s.c.AbstractDistribZkTestBase Recoveries finished - collection: forwardingCollection
   [junit4]   2> 1801499 INFO  (qtp1781912471-17520) [n:127.0.0.1:41217_solr    ] o.a.s.c.TransientSolrCoreCacheDefault Allocating transient cache for 2147483647 transient cores
   [junit4]   2> 1801505 INFO  (qtp1760075648-17509) [n:127.0.0.1:34287_solr c:forwardingCollection s:shard1 r:core_node1 x:forwardingCollection_shard1_replica_n1] o.a.s.c.S.Request [forwardingCollection_shard1_replica_n1]  webapp=/solr path=/select params={q=*:*&wt=javabin&version=2} hits=0 status=0 QTime=0
   [junit4]   2> 1801506 WARN  (qtp1781912471-17520) [n:127.0.0.1:41217_solr    ] o.a.h.c.p.ResponseProcessCookies Invalid cookie header: "Set-Cookie: hadoop.auth="u=$&p=$&t=test&e=1503467043655&s=8CeSnkdZ/W3KrL6Wdl9ud0ND8XQ="; Path=/; Domain=127.0.0.1; Expires=sri, 23-kol-2017 05:44:03 GMT; Secure; HttpOnly". Invalid 'expires' attribute: sri, 23-kol-2017 05:44:03 GMT
   [junit4]   2> 1801510 WARN  (TEST-TestSolrCloudWithSecureImpersonation.testForwarding-seed#[CAF29F2AEC86C07C]) [    ] o.a.h.c.p.ResponseProcessCookies Invalid cookie header: "Set-Cookie: hadoop.auth="u=user&p=user&t=test&e=1503467043648&s=LCdl0EvDnkknHFisq6uxwQ9yQN8="; Path=/; Domain=127.0.0.1; Expires=sri, 23-kol-2017 05:44:03 GMT; Secure; HttpOnly". Invalid 'expires' attribute: sri, 23-kol-2017 05:44:03 GMT
   [junit4]   2> 1801511 WARN  (TEST-TestSolrCloudWithSecureImpersonation.testForwarding-seed#[CAF29F2AEC86C07C]) [    ] o.a.h.c.p.ResponseProcessCookies Invalid cookie header: "Set-Cookie: hadoop.auth="u=$&p=$&t=test&e=1503467043655&s=8CeSnkdZ/W3KrL6Wdl9ud0ND8XQ="; Path=/; Domain=127.0.0.1; Expires=sri, 23-kol-2017 05:44:03 GMT; Secure; HttpOnly". Invalid 'expires' attribute: sri, 23-kol-2017 05:44:03 GMT
   [junit4]   2> 1801514 INFO  (qtp1760075648-17509) [n:127.0.0.1:34287_solr c:forwardingCollection s:shard1 r:core_node1 x:forwardingCollection_shard1_replica_n1] o.a.s.c.S.Request [forwardingCollection_shard1_replica_n1]  webapp=/solr path=/select params={q=*:*&wt=javabin&version=2} hits=0 status=0 QTime=0
   [junit4]   2> 1801514 WARN  (TEST-TestSolrCloudWithSecureImpersonation.testForwarding-seed#[CAF29F2AEC86C07C]) [    ] o.a.h.c.p.ResponseProcessCookies Invalid cookie header: "Set-Cookie: hadoop.auth="u=user&p=user&t=test&e=1503467043663&s=eMue/WLxT27r1POT2nugTGkSwI8="; Path=/; Domain=127.0.0.1; Expires=sri, 23-kol-2017 05:44:03 GMT; Secure; HttpOnly". Invalid 'expires' attribute: sri, 23-kol-2017 05:44:03 GMT
   [junit4]   2> 1801514 INFO  (TEST-TestSolrCloudWithSecureImpersonation.testForwarding-seed#[CAF29F2AEC86C07C]) [    ] o.a.s.SolrTestCaseJ4 ###Ending testForwarding
   [junit4]   2> 1801536 INFO  (TEST-TestSolrCloudWithSecureImpersonation.testProxyUnknownRemote-seed#[CAF29F2AEC86C07C]) [    ] o.a.s.SolrTestCaseJ4 ###Starting testProxyUnknownRemote
   [junit4]   2> 1819607 WARN  (jetty-launcher-3003-thread-2-SendThread(127.0.0.1:42613)) [n:127.0.0.1:34287_solr    ] o.a.z.ClientCnxn Client session timed out, have not heard from server in 22774ms for sessionid 0x15e0b7913220008
   [junit4]   2> 1819607 WARN  (jetty-launcher-3003-thread-1-SendThread(127.0.0.1:42613)) [n:127.0.0.1:41217_solr    ] o.a.z.ClientCnxn Client session timed out, have not heard from server in 18106ms for sessionid 0x15e0b7913220005
   [junit4]   2> 1819607 WARN  (jetty-launcher-3003-thread-2-SendThread(127.0.0.1:42613)) [n:127.0.0.1:34287_solr    ] o.a.z.ClientCnxn Client session timed out, have not heard from server in 18482ms for sessionid 0x15e0b7913220006
   [junit4]   2> 1819608 WARN  (NIOServerCxn.Factory:0.0.0.0/0.0.0.0:0) [    ] o.a.z.s.NIOServerCnxn caught end of stream exception
   [junit4]   2> EndOfStreamException: Unable to read additional data from client sessionid 0x15e0b7913220005, likely client has closed socket
   [junit4]   2> 	at org.apache.zookeeper.server.NIOServerCnxn.doIO(NIOServerCnxn.java:239)
   [junit4]   2> 	at org.apache.zookeeper.server.NIOServerCnxnFactory.run(NIOServerCnxnFactory.java:203)
   [junit4]   2> 	at java.lang.Thread.run(Thread.java:748)
   [junit4]   2> 1819607 WARN  (TEST-TestSolrCloudWithSecureImpersonation.testForwarding-seed#[CAF29F2AEC86C07C]-SendThread(127.0.0.1:42613)) [    ] o.a.z.ClientCnxn Client session timed out, have not heard from server in 18112ms for sessionid 0x15e0b791322000b
   [junit4]   2> 1819608 WARN  (NIOServerCxn.Factory:0.0.0.0/0.0.0.0:0) [    ] o.a.z.s.NIOServerCnxn caught end of stream exception
   [junit4]   2> EndOfStreamException: Unable to read additional data from client sessionid 0x15e0b7913220006, likely client has closed socket
   [junit4]   2> 	at org.apache.zookeeper.server.NIOServerCnxn.doIO(NIOServerCnxn.java:239)
   [junit4]   2> 	at org.apache.zookeeper.server.NIOServerCnxnFactory.run(NIOServerCnxnFactory.java:203)
   [junit4]   2> 	at java.lang.Thread.run(Thread.java:748)
   [junit4]   2> 1819609 WARN  (TEST-TestSolrCloudWithSecureImpersonation.testProxyUnknownRemote-seed#[CAF29F2AEC86C07C]) [    ] o.a.h.c.p.ResponseProcessCookies Invalid cookie header: "Set-Cookie: hadoop.auth="u=localHostAnyGroup&p=localHostAnyGroup&t=test&e=1503467043687&s=vjEb+dO8xJVqeFf26r6IHbQ9bbM="; Path=/; Domain=127.0.0.1; Expires=sri, 23-kol-2017 05:44:03 GMT; Secure; HttpOnly". Invalid 'expires' attribute: sri, 23-kol-2017 05:44:03 GMT
   [junit4]   2> 1819609 INFO  (TEST-TestSolrCloudWithSecureImpersonation.testProxyUnknownRemote-seed#[CAF29F2AEC86C07C]) [    ] o.a.s.SolrTestCaseJ4 ###Ending testProxyUnknownRemote
   [junit4]   2> 1819620 INFO  (TEST-TestSolrCloudWithSecureImpersonation.testProxyInvalidProxyUser-seed#[CAF29F2AEC86C07C]) [    ] o.a.s.SolrTestCaseJ4 ###Starting testProxyInvalidProxyUser
   [junit4]   2> 1819622 WARN  (TEST-TestSolrCloudWithSecureImpersonation.testProxyInvalidProxyUser-seed#[CAF29F2AEC86C07C]) [    ] o.a.h.c.p.ResponseProcessCookies Invalid cookie header: "Set-Cookie: hadoop.auth="u=bar&p=bar&t=test&e=1503467061770&s=8CCfDaNkeDu91RXKCiUkaGiHfZY="; Path=/; Domain=127.0.0.1; Expires=sri, 23-kol-2017 05:44:21 GMT; Secure; HttpOnly". Invalid 'expires' attribute: sri, 23-kol-2017 05:44:21 GMT
   [junit4]   2> 1819622 INFO  (TEST-TestSolrCloudWithSecureImpersonation.testProxyInvalidProxyUser-seed#[CAF29F2AEC86C07C]) [    ] o.a.s.SolrTestCaseJ4 ###Ending testProxyInvalidProxyUser
   [junit4]   2> 1819635 INFO  (TEST-TestSolrCloudWithSecureImpersonation.testProxyValidateHost-seed#[CAF29F2AEC86C07C]) [    ] o.a.s.SolrTestCaseJ4 ###Starting testProxyValidateHost
   [junit4]   2> 1819636 INFO  (qtp1781912471-17510) [n:127.0.0.1:41217_solr    ] o.a.s.h.a.CollectionsHandler Invoked Collection Action :list with params doAs=bar&action=LIST&wt=javabin&version=2 and sendToOCPQueue=true
   [junit4]   2> 1819707 INFO  (jetty-launcher-3003-thread-1-EventThread) [n:127.0.0.1:41217_solr    ] o.a.c.f.s.ConnectionStateManager State change: SUSPENDED
   [junit4]   2> 1819708 WARN  (zkCallback-3014-thread-1-processing-n:127.0.0.1:41217_solr) [n:127.0.0.1:41217_solr    ] o.a.s.c.c.ConnectionManager Watcher org.apache.solr.common.cloud.ConnectionManager@2506b950 name: ZooKeeperConnection Watcher:127.0.0.1:42613/solr got event WatchedEvent state:Disconnected type:None path:null path: null type: None
   [junit4]   2> 1819708 WARN  (zkCallback-3015-thread-5-processing-n:127.0.0.1:34287_solr) [n:127.0.0.1:34287_solr    ] o.a.s.c.c.ConnectionManager Watcher org.apache.solr.common.cloud.ConnectionManager@2d4ecb4 name: ZooKeeperConnection Watcher:127.0.0.1:42613/solr got event WatchedEvent state:Disconnected type:None path:null path: null type: None
   [junit4]   2> 1819708 WARN  (zkCallback-3015-thread-5-processing-n:127.0.0.1:34287_solr) [n:127.0.0.1:34287_solr    ] o.a.s.c.c.ConnectionManager zkClient has disconnected
   [junit4]   2> 1819708 WARN  (zkCallback-3014-thread-1-processing-n:127.0.0.1:41217_solr) [n:127.0.0.1:41217_solr    ] o.a.s.c.c.ConnectionManager zkClient has disconnected
   [junit4]   2> 1819713 WARN  (zkCallback-3022-thread-1) [    ] o.a.s.c.c.ConnectionManager Watcher org.apache.solr.common.cloud.ConnectionManager@7ea9b51e name: ZooKeeperConnection Watcher:127.0.0.1:42613/solr got event WatchedEvent state:Disconnected type:None path:null path: null type: None
   [junit4]   2> 1819713 WARN  (zkCallback-3022-thread-1) [    ] o.a.s.c.c.ConnectionManager zkClient has disconnected
   [junit4]   2> 1820934 WARN  (jetty-launcher-3003-thread-2-SendThread(127.0.0.1:42613)) [n:127.0.0.1:34287_solr    ] o.a.z.ClientCnxn Unable to reconnect to ZooKeeper service, session 0x15e0b7913220008 has expired
   [junit4]   2> 1820972 WARN  (TEST-TestSolrCloudWithSecureImpersonation.testForwarding-seed#[CAF29F2AEC86C07C]-SendThread(127.0.0.1:42613)) [    ] o.a.z.ClientCnxn Unable to reconnect to ZooKeeper service, session 0x15e0b791322000b has expired
   [junit4]   2> 1820972 WARN  (zkCallback-3022-thread-3) [    ] o.a.s.c.c.ConnectionManager Watcher org.apache.solr.common.cloud.ConnectionManager@7ea9b51e name: ZooKeeperConnection Watcher:127.0.0.1:42613/solr got event WatchedEvent state:Expired type:None path:null path: null type: None
   [junit4]   2> 1820972 WARN  (zkCallback-3022-thread-3) [    ] o.a.s.c.c.ConnectionManager Our previous ZooKeeper session was expired. Attempting to reconnect to recover relationship with ZooKeeper...
   [junit4]   2> 1820972 WARN  (zkCallback-3022-thread-3) [    ] o.a.s.c.c.DefaultConnectionStrategy Connection expired - starting a new one...
   [junit4]   2> 1820973 INFO  (zkCallback-3022-thread-3) [    ] o.a.s.c.c.ConnectionManager Connection with ZooKeeper reestablished.
   [junit4]   2> 1820974 INFO  (zkCallback-3022-thread-3) [    ] o.a.s.c.c.DefaultConnectionStrategy Reconnected to ZooKeeper
   [junit4]   2> 1820974 INFO  (zkCallback-3022-thread-3) [    ] o.a.s.c.c.ConnectionManager Connected:true
   [junit4]   2> 1821185 WARN  (jetty-launcher-3003-thread-1-SendThread(127.0.0.1:42613)) [n:127.0.0.1:41217_solr    ] o.a.z.ClientCnxn Unable to reconnect to ZooKeeper service, session 0x15e0b7913220007 has expired
   [junit4]   2> 1821208 INFO  (qtp1781912471-17510) [n:127.0.0.1:41217_solr    ] o.a.s.s.HttpSolrCall [admin] webapp=null path=/admin/collections params={doAs=bar&action=LIST&wt=javabin&version=2} status=0 QTime=1572
   [junit4]   2> 1821209 WARN  (TEST-TestSolrCloudWithSecureImpersonation.testProxyValidateHost-seed#[CAF29F2AEC86C07C]) [    ] o.a.h.c.p.ResponseProcessCookies Invalid cookie header: "Set-Cookie: hadoop.auth="u=localHostAnyGroup&p=localHostAnyGroup&t=test&e=1503467061786&s=rV2oq2I4A/pQzZsQAYuk7r0Mbao="; Path=/; Domain=127.0.0.1; Expires=sri, 23-kol-2017 05:44:21 GMT; Secure; HttpOnly". Invalid 'expires' attribute: sri, 23-kol-2017 05:44:21 GMT
   [junit4]   2> 1821209 INFO  (TEST-TestSolrCloudWithSecureImpersonation.testProxyValidateHost-seed#[CAF29F2AEC86C07C]) [    ] o.a.s.SolrTestCaseJ4 ###Ending testProxyValidateHost
   [junit4]   2> 1821242 INFO  (TEST-TestSolrCloudWithSecureImpersonation.testProxyNoConfigHosts-seed#[CAF29F2AEC86C07C]) [    ] o.a.s.SolrTestCaseJ4 ###Starting testProxyNoConfigHosts
   [junit4]   2> 1821244 WARN  (TEST-TestSolrCloudWithSecureImpersonation.testProxyNoConfigHosts-seed#[CAF29F2AEC86C07C]) [    ] o.a.h.c.p.ResponseProcessCookies Invalid cookie header: "Set-Cookie: hadoop.auth="u=noHosts&p=noHosts&t=test&e=1503467063393&s=HOUm4dbvJt310dnQJuLilVURhgI="; Path=/; Domain=127.0.0.1; Expires=sri, 23-kol-2017 05:44:23 GMT; Secure; HttpOnly". Invalid 'expires' attribute: sri, 23-kol-2017 05:44:23 GMT
   [junit4]   2> 1821245 INFO  (TEST-TestSolrCloudWithSecureImpersonation.testProxyNoConfigHosts-seed#[CAF29F2AEC86C07C]) [    ] o.a.s.SolrTestCaseJ4 ###Ending testProxyNoConfigHosts
   [junit4]   2> 1821267 INFO  (TEST-TestSolrCloudWithSecureImpersonation.testProxyInvalidRemote-seed#[CAF29F2AEC86C07C]) [    ] o.a.s.SolrTestCaseJ4 ###Starting testProxyInvalidRemote
   [junit4]   2> 1821275 WARN  (TEST-TestSolrCloudWithSecureImpersonation.testProxyInvalidRemote-seed#[CAF29F2AEC86C07C]) [    ] o.a.h.c.p.ResponseProcessCookies Invalid cookie header: "Set-Cookie: hadoop.auth="u=localHostAnyGroup&p=localHostAnyGroup&t=test&e=1503467063418&s=9ZsKHBPjmM70IOwZIYhMAhOJ/kg="; Path=/; Domain=127.0.0.1; Expires=sri, 23-kol-2017 05:44:23 GMT; Secure; HttpOnly". Invalid 'expires' attribute: sri, 23-kol-2017 05:44:23 GMT
   [junit4]   2> 1821275 INFO  (TEST-TestSolrCloudWithSecureImpersonation.testProxyInvalidRemote-seed#[CAF29F2AEC86C07C]) [    ] o.a.s.SolrTestCaseJ4 ###Ending testProxyInvalidRemote
   [junit4]   2> 1821320 INFO  (TEST-TestSolrCloudWithSecureImpersonation.testProxyWrongHost-seed#[CAF29F2AEC86C07C]) [    ] o.a.s.SolrTestCaseJ4 ###Starting testProxyWrongHost
   [junit4]   2> 1821343 WARN  (TEST-TestSolrCloudWithSecureImpersonation.testProxyWrongHost-seed#[CAF29F2AEC86C07C]) [    ] o.a.h.c.p.ResponseProcessCookies Invalid cookie header: "Set-Cookie: hadoop.auth="u=wrongHost&p=wrongHost&t=test&e=1503467063470&s=fuizko3xFhPP7DY7keGmtAAxdJE="; Path=/; Domain=127.0.0.1; Expires=sri, 23-kol-2017 05:44:23 GMT; Secure; HttpOnly". Invalid 'expires' attribute: sri, 23-kol-2017 05:44:23 GMT
   [junit4]   2> 1821343 INFO  (TEST-TestSolrCloudWithSecureImpersonation.testProxyWrongHost-seed#[CAF29F2AEC86C07C]) [    ] o.a.s.SolrTestCaseJ4 ###Ending testProxyWrongHost
   [junit4]   2> 1821378 INFO  (TEST-TestSolrCloudWithSecureImpersonation.testProxyNoConfigGroups-seed#[CAF29F2AEC86C07C]) [    ] o.a.s.SolrTestCaseJ4 ###Starting testProxyNoConfigGroups
   [junit4]   2> 1821380 WARN  (TEST-TestSolrCloudWithSecureImpersonation.testProxyNoConfigGroups-seed#[CAF29F2AEC86C07C]) [    ] o.a.h.c.p.ResponseProcessCookies Invalid cookie header: "Set-Cookie: hadoop.auth="u=noGroups&p=noGroups&t=test&e=1503467063528&s=epremuMs3eGKkuUciRJsJFdRRgU="; Path=/; Domain=127.0.0.1; Expires=sri, 23-kol-2017 05:44:23 GMT; Secure; HttpOnly". Invalid 'expires' attribute: sri, 23-kol-2017 05:44:23 GMT
   [junit4]   2> 1821380 INFO  (TEST-TestSolrCloudWithSecureImpersonation.testProxyNoConfigGroups-seed#[CAF29F2AEC86C07C]) [    ] o.a.s.SolrTestCaseJ4 ###Ending testProxyNoConfigGroups
   [junit4]   2> 1821393 INFO  (jetty-closer-3004-thread-1) [    ] o.e.j.s.AbstractConnector Stopped ServerConnector@35b493e9{SSL,[ssl, http/1.1]}{127.0.0.1:0}
   [junit4]   2> 1821393 INFO  (jetty-closer-3004-thread-1) [    ] o.a.s.c.CoreContainer Shutting down CoreContainer instance=908127381
   [junit4]   2> 1821393 INFO  (jetty-closer-3004-thread-2) [    ] o.e.j.s.AbstractConnector Stopped ServerConnector@556032e3{SSL,[ssl, http/1.1]}{127.0.0.1:0}
   [junit4]   2> 1821394 INFO  (jetty-closer-3004-thread-2) [    ] o.a.s.c.CoreContainer Shutting down CoreContainer instance=614722946
   [junit4]   2> 1821394 INFO  (jetty-closer-3004-thread-1) [    ] o.a.s.m.SolrMetricManager Closing metric reporters for registry=solr.node, tag=null
   [junit4]   2> 1821394 INFO  (jetty-closer-3004-thread-2) [    ] o.a.s.m.SolrMetricManager Closing metric reporters for registry=solr.node, tag=null
   [junit4]   2> 1821394 INFO  (jetty-closer-3004-thread-1) [    ] o.a.s.m.r.SolrJmxReporter Closing reporter [org.apache.solr.metrics.reporters.SolrJmxReporter@1dd4e696: rootName = solr_41217, domain = solr.node, service url = null, agent id = null] for registry solr.node / com.codahale.metrics.MetricRegistry@5e41711a
   [junit4]   2> 1821394 INFO  (jetty-closer-3004-thread-2) [    ] o.a.s.m.r.SolrJmxReporter Closing reporter [org.apache.solr.metrics.reporters.SolrJmxReporter@51ee09cd: rootName = solr_34287, domain = solr.node, service url = null, agent id = null] for registry solr.node / com.codahale.metrics.MetricRegistry@5b254969
   [junit4]   2> 1821399 INFO  (jetty-closer-3004-thread-1) [    ] o.a.s.m.SolrMetricManager Closing metric reporters for registry=solr.jvm, tag=null
   [junit4]   2> 1821399 INFO  (jetty-closer-3004-thread-2) [    ] o.a.s.m.SolrMetricManager Closing metric reporters for registry=solr.jvm, tag=null
   [junit4]   2> 1821399 INFO  (jetty-closer-3004-thread-1) [    ] o.a.s.m.r.SolrJmxReporter Closing reporter [org.apache.solr.metrics.reporters.SolrJmxReporter@5c12700f: rootName = solr_41217, domain = solr.jvm, service url = null, agent id = null] for registry solr.jvm / com.codahale.metrics.MetricRegistry@7c76d51e
   [junit4]   2> 1821399 INFO  (jetty-closer-3004-thread-2) [    ] o.a.s.m.r.SolrJmxReporter Closing reporter [org.apache.solr.metrics.reporters.SolrJmxReporter@30c79dd1: rootName = solr_34287, domain = solr.jvm, service url = null, agent id = null] for registry solr.jvm / com.codahale.metrics.MetricRegistry@7c76d51e
   [junit4]   2> 1821403 INFO  (jetty-closer-3004-thread-1) [    ] o.a.s.m.SolrMetricManager Closing metric reporters for registry=solr.jetty, tag=null
   [junit4]   2> 1821403 INFO  (jetty-closer-3004-thread-1) [    ] o.a.s.m.r.SolrJmxReporter Closing reporter [org.apache.solr.metrics.reporters.SolrJmxReporter@3b53ae9f: rootName = solr_41217, domain = solr.jetty, service url = null, agent id = null] for registry solr.jetty / com.codahale.metrics.MetricRegistry@409ea352
   [junit4]   2> 1821403 INFO  (jetty-closer-3004-thread-2) [    ] o.a.s.m.SolrMetricManager Closing metric reporters for registry=solr.jetty, tag=null
   [junit4]   2> 1821403 INFO  (jetty-closer-3004-thread-2) [    ] o.a.s.m.r.SolrJmxReporter Closing reporter [org.apache.solr.metrics.reporters.SolrJmxReporter@3e3c0c85: rootName = solr_34287, domain = solr.jetty, service url = null, agent id = null] for registry solr.jetty / com.codahale.metrics.MetricRegistry@409ea352
   [junit4]   2> 1821404 INFO  (jetty-closer-3004-thread-1) [    ] o.a.s.m.SolrMetricManager Closing metric reporters for registry=solr.cluster, tag=null
   [junit4]   2> 1821404 INFO  (jetty-closer-3004-thread-2) [    ] o.a.s.m.SolrMetricManager Closing metric reporters for registry=solr.cluster, tag=null
   [junit4]   2> 1821405 INFO  (zkCallback-3015-thread-5-processing-n:127.0.0.1:34287_solr) [n:127.0.0.1:34287_solr    ] o.a.s.c.c.ZkStateReader A cluster state change: [WatchedEvent state:SyncConnected type:NodeDataChanged path:/collections/forwardingCollection/state.json] for collection [forwardingCollection] has occurred - updating... (live nodes size: [2])
   [junit4]   2> 1821405 INFO  (zkCallback-3015-thread-1-processing-n:127.0.0.1:34287_solr) [n:127.0.0.1:34287_solr    ] o.a.s.c.c.ZkStateReader A cluster state change: [WatchedEvent state:SyncConnected type:NodeDataChanged path:/collections/forwardingCollection/state.json] for collection [forwardingCollection] has occurred - updating... (live nodes size: [2])
   [junit4]   2> 1821411 INFO  (coreCloseExecutor-6827-thread-1) [n:127.0.0.1:34287_solr c:forwardingCollection s:shard1 r:core_node1 x:forwardingCollection_shard1_replica_n1] o.a.s.c.SolrCore [forwardingCollection_shard1_replica_n1]  CLOSING SolrCore org.apache.solr.core.SolrCore@2b19d5ac
   [junit4]   2> 1821411 INFO  (coreCloseExecutor-6827-thread-1) [n:127.0.0.1:34287_solr c:forwardingCollection s:shard1 r:core_node1 x:forwardingCollection_shard1_replica_n1] o.a.s.m.SolrMetricManager Closing metric reporters for registry=solr.core.forwardingCollection.shard1.replica_n1, tag=723113388
   [junit4]   2> 1821411 INFO  (coreCloseExecutor-6827-thread-1) [n:127.0.0.1:34287_solr c:forwardingCollection s:shard1 r:core_node1 x:forwardingCollection_shard1_replica_n1] o.a.s.m.r.SolrJmxReporter Closing reporter [org.apache.solr.metrics.reporters.SolrJmxReporter@5752f378: rootName = solr_34287, domain = solr.core.forwardingCollection.shard1.replica_n1, service url = null, agent id = null] for registry solr.core.forwardingCollection.shard1.replica_n1 / com.codahale.metrics.MetricRegistry@2cceafce
   [junit4]   2> 1821412 INFO  (zkCallback-3015-thread-1-processing-n:127.0.0.1:34287_solr) [n:127.0.0.1:34287_solr    ] o.a.s.c.c.ZkStateReader Updated live nodes from ZooKeeper... (2) -> (1)
   [junit4]   2> 1821423 INFO  (coreCloseExecutor-6827-thread-1) [n:127.0.0.1:34287_solr c:forwardingCollection s:shard1 r:core_node1 x:forwardingCollection_shard1_replica_n1] o.a.s.m.SolrMetricManager Closing metric reporters for registry=solr.collection.forwardingCollection.shard1.leader, tag=723113388
   [junit4]   2> 1821424 INFO  (jetty-closer-3004-thread-2) [    ] o.a.s.c.Overseer Overseer (id=98528856488673286-127.0.0.1:34287_solr-n_0000000000) closing
   [junit4]   2> 1821424 INFO  (OverseerStateUpdate-98528856488673286-127.0.0.1:34287_solr-n_0000000000) [n:127.0.0.1:34287_solr    ] o.a.s.c.Overseer Overseer Loop exiting : 127.0.0.1:34287_solr
   [junit4]   2> 1822912 WARN  (zkCallback-3014-thread-2-processing-n:127.0.0.1:41217_solr) [n:127.0.0.1:41217_solr    ] o.a.s.c.c.ZkStateReader ZooKeeper watch triggered, but Solr cannot talk to ZK: [KeeperErrorCode = Session expired for /live_nodes]
   [junit4]   2> 1822912 ERROR (Thread[Thread-4221,5,TGRP-TestSolrCloudWithSecureImpersonation]) [n:127.0.0.1:41217_solr    ] o.a.h.s.t.d.AbstractDelegationTokenSecretManager ExpiredTokenRemover received java.lang.InterruptedException: sleep interrupted
   [junit4]   2> 1822913 INFO  (jetty-closer-3004-thread-1) [    ] o.e.j.s.h.ContextHandler Stopped o.e.j.s.ServletContextHandler@220a702{/solr,null,UNAVAILABLE}
   [junit4]   2> 1822925 WARN  (zkCallback-3015-thread-1-processing-n:127.0.0.1:34287_solr) [n:127.0.0.1:34287_solr    ] o.a.s.c.c.ZkStateReader ZooKeeper watch triggered, but Solr cannot talk to ZK: [KeeperErrorCode = Session expired for /live_nodes]
   [junit4]   2> 1822925 ERROR (Thread[Thread-4224,5,TGRP-TestSolrCloudWithSecureImpersonation]) [n:127.0.0.1:34287_solr    ] o.a.h.s.t.d.AbstractDelegationTokenSecretManager ExpiredTokenRemover received java.lang.InterruptedException: sleep interrupted
   [junit4]   2> 1822926 INFO  (jetty-closer-3004-thread-2) [    ] o.e.j.s.h.ContextHandler Stopped o.e.j.s.ServletContextHandler@43c3f20f{/solr,null,UNAVAILABLE}
   [junit4]   2> 1822926 ERROR (SUITE-TestSolrCloudWithSecureImpersonation-seed#[CAF29F2AEC86C07C]-worker) [    ] o.a.z.s.ZooKeeperServer ZKShutdownHandler is not registered, so ZooKeeper server won't take any action on ERROR or SHUTDOWN server state changes
   [junit4]   2> 1822926 INFO  (SUITE-TestSolrCloudWithSecureImpersonation-seed#[CAF29F2AEC86C07C]-worker) [    ] o.a.s.c.ZkTestServer connecting to 127.0.0.1:42613 42613
   [junit4]   2> 1823074 INFO  (Thread-4204) [    ] o.a.s.c.ZkTestServer connecting to 127.0.0.1:42613 42613
   [junit4]   2> 1823074 WARN  (Thread-4204) [    ] o.a.s.c.ZkTestServer Watch limit violations: 
   [junit4]   2> Maximum concurrent create/delete watches above limit:
   [junit4]   2> 
   [junit4]   2> 	4	/solr/aliases.json
   [junit4]   2> 	2	/solr/security.json
   [junit4]   2> 
   [junit4]   2> Maximum concurrent data watches above limit:
   [junit4]   2> 
   [junit4]   2> 	7	/solr/collections/forwardingCollection/state.json
   [junit4]   2> 	4	/solr/clusterstate.json
   [junit4]   2> 	4	/solr/clusterprops.json
   [junit4]   2> 	2	/solr/security/zkdtsm/ZKDTSMRoot/ZKDTSMKeyIdRoot
   [junit4]   2> 	2	/solr/security/zkdtsm/ZKDTSMRoot/ZKDTSMMasterKeyRoot/DK_1
   [junit4]   2> 	2	/solr/security/zkdtsm/ZKDTSMRoot/ZKDTSMMasterKeyRoot/DK_3
   [junit4]   2> 	2	/solr/security/zkdtsm/ZKDTSMRoot/ZKDTSMMasterKeyRoot/DK_2
   [junit4]   2> 	2	/solr/security/zkdtsm/ZKDTSMRoot/ZKDTSMMasterKeyRoot/DK_4
   [junit4]   2> 	2	/solr/security/zkdtsm/ZKDTSMRoot/ZKDTSMSeqNumRoot
   [junit4]   2> 
   [junit4]   2> Maximum concurrent children watches above limit:
   [junit4]   2> 
   [junit4]   2> 	4	/solr/live_nodes
   [junit4]   2> 	4	/solr/collections
   [junit4]   2> 	2	/solr/security/zkdtsm/ZKDTSMRoot/ZKDTSMMasterKeyRoot
   [junit4]   2> 	2	/solr/security/zkdtsm/ZKDTSMRoot/ZKDTSMTokensRoot
   [junit4]   2> 
   [junit4]   2> 1823086 INFO  (SUITE-TestSolrCloudWithSecureImpersonation-seed#[CAF29F2AEC86C07C]-worker) [    ] o.a.s.SolrTestCaseJ4 ------------------------------------------------------- Done waiting for tracked resources to be released
   [junit4]   2> Aug 22, 2017 7:44:25 PM com.carrotsearch.randomizedtesting.ThreadLeakControl checkThreadLeaks
   [junit4]   2> WARNING: Will linger awaiting termination of 3 leaked thread(s).
   [junit4]   2> Aug 22, 2017 7:44:45 PM com.carrotsearch.randomizedtesting.ThreadLeakControl checkThreadLeaks
   [junit4]   2> SEVERE: 2 threads leaked from SUITE scope at org.apache.solr.cloud.TestSolrCloudWithSecureImpersonation: 
   [junit4]   2>    1) Thread[id=17554, name=jetty-launcher-3003-thread-1-EventThread, state=TIMED_WAITING, group=TGRP-TestSolrCloudWithSecureImpersonation]
   [junit4]   2>         at sun.misc.Unsafe.park(Native Method)
   [junit4]   2>         at java.util.concurrent.locks.LockSupport.parkNanos(LockSupport.java:215)
   [junit4]   2>         at java.util.concurrent.locks.AbstractQueuedSynchronizer.doAcquireSharedNanos(AbstractQueuedSynchronizer.java:1037)
   [junit4]   2>         at java.util.concurrent.locks.AbstractQueuedSynchronizer.tryAcquireSharedNanos(AbstractQueuedSynchronizer.java:1328)
   [junit4]   2>         at java.util.concurrent.CountDownLatch.await(CountDownLatch.java:277)
   [junit4]   2>         at org.apache.curator.CuratorZookeeperClient.internalBlockUntilConnectedOrTimedOut(CuratorZookeeperClient.java:323)
   [junit4]   2>         at org.apache.curator.RetryLoop.callWithRetry(RetryLoop.java:105)
   [junit4]   2>         at org.apache.curator.framework.imps.GetDataBuilderImpl.pathInForeground(GetDataBuilderImpl.java:288)
   [junit4]   2>         at org.apache.curator.framework.imps.GetDataBuilderImpl.forPath(GetDataBuilderImpl.java:279)
   [junit4]   2>         at org.apache.curator.framework.imps.GetDataBuilderImpl.forPath(GetDataBuilderImpl.java:41)
   [junit4]   2>         at org.apache.curator.framework.recipes.shared.SharedValue.readValue(SharedValue.java:244)
   [junit4]   2>         at org.apache.curator.framework.recipes.shared.SharedValue.access$100(SharedValue.java:44)
   [junit4]   2>         at org.apache.curator.framework.recipes.shared.SharedValue$1.process(SharedValue.java:61)
   [junit4]   2>         at org.apache.curator.framework.imps.NamespaceWatcher.process(NamespaceWatcher.java:67)
   [junit4]   2>         at org.apache.zookeeper.ClientCnxn$EventThread.processEvent(ClientCnxn.java:530)
   [junit4]   2>         at org.apache.zookeeper.ClientCnxn$EventThread.run(ClientCnxn.java:505)
   [junit4]   2>    2) Thread[id=17564, name=jetty-launcher-3003-thread-2-EventThread, state=TIMED_WAITING, group=TGRP-TestSolrCloudWithSecureImpersonation]
   [junit4]   2>         at sun.misc.Unsafe.park(Native Method)
   [junit4]   2>         at java.util.concurrent.locks.LockSupport.parkNanos(LockSupport.java:215)
   [junit4]   2>         at java.util.concurrent.locks.AbstractQueuedSynchronizer.doAcquireSharedNanos(AbstractQueuedSynchronizer.java:1037)
   [junit4]   2>         at java.util.concurrent.locks.AbstractQueuedSynchronizer.tryAcquireSharedNanos(AbstractQueuedSynchronizer.java:1328)
   [junit4]   2>         at java.util.concurrent.CountDownLatch.await(CountDownLatch.java:277)
   [junit4]   2>         at org.apache.curator.CuratorZookeeperClient.internalBlockUntilConnectedOrTimedOut(CuratorZookeeperClient.java:323)
   [junit4]   2>         at org.apache.curator.RetryLoop.callWithRetry(RetryLoop.java:105)
   [junit4]   2>         at org.apache.curator.framework.imps.GetDataBuilderImpl.pathInForeground(GetDataBuilderImpl.java:288)
   [junit4]   2>         at org.apache.curator.framework.imps.GetDataBuilderImpl.forPath(GetDataBuilderImpl.java:279)
   [junit4]   2>         at org.apache.curator.framework.imps.GetDataBuilderImpl.forPath(GetDataBuilderImpl.java:41)
   [junit4]   2>         at org.apache.curator.framework.recipes.shared.SharedValue.readValue(SharedValue.java:244)
   [junit4]   2>         at org.apache.curator.framework.recipes.shared.SharedValue.access$100(SharedValue.java:44)
   [junit4]   2>         at org.apache.curator.framework.recipes.shared.SharedValue$1.process(SharedValue.java:61)
   [junit4]   2>         at org.apache.curator.framework.imps.NamespaceWatcher.process(NamespaceWatcher.java:67)
   [junit4]   2>         at org.apache.zookeeper.ClientCnxn$EventThread.processEvent(ClientCnxn.java:530)
   [junit4]   2>         at org.apache.zookeeper.ClientCnxn$EventThread.run(ClientCnxn.java:505)
   [junit4]   2> Aug 22, 2017 7:44:45 PM com.carrotsearch.randomizedtesting.ThreadLeakControl tryToInterruptAll
   [junit4]   2> INFO: Starting to interrupt leaked threads:
   [junit4]   2>    1) Thread[id=17554, name=jetty-launcher-3003-thread-1-EventThread, state=TIMED_WAITING, group=TGRP-TestSolrCloudWithSecureImpersonation]
   [junit4]   2>    2) Thread[id=17564, name=jetty-launcher-3003-thread-2-EventThread, state=TIMED_WAITING, group=TGRP-TestSolrCloudWithSecureImpersonation]
   [junit4]   2> 1843292 ERROR (jetty-launcher-3003-thread-2-EventThread) [n:127.0.0.1:34287_solr    ] o.a.c.f.i.CuratorFrameworkImpl Watcher exception
   [junit4]   2> java.lang.InterruptedException
   [junit4]   2> 	at java.util.concurrent.locks.AbstractQueuedSynchronizer.doAcquireSharedNanos(AbstractQueuedSynchronizer.java:1039)
   [junit4]   2> 	at java.util.concurrent.locks.AbstractQueuedSynchronizer.tryAcquireSharedNanos(AbstractQueuedSynchronizer.java:1328)
   [junit4]   2> 	at java.util.concurrent.CountDownLatch.await(CountDownLatch.java:277)
   [junit4]   2> 	at org.apache.curator.CuratorZookeeperClient.internalBlockUntilConnectedOrTimedOut(CuratorZookeeperClient.java:323)
   [junit4]   2> 	at org.apache.curator.RetryLoop.callWithRetry(RetryLoop.java:105)
   [junit4]   2> 	at org.apache.curator.framework.imps.GetDataBuilderImpl.pathInForeground(GetDataBuilderImpl.java:288)
   [junit4]   2> 	at org.apache.curator.framework.imps.GetDataBuilderImpl.forPath(GetDataBuilderImpl.java:279)
   [junit4]   2> 	at org.apache.curator.framework.imps.GetDataBuilderImpl.forPath(GetDataBuilderImpl.java:41)
   [junit4]   2> 	at org.apache.curator.framework.recipes.shared.SharedValue.readValue(SharedValue.java:244)
   [junit4]   2> 	at org.apache.curator.framework.recipes.shared.SharedValue.access$100(SharedValue.java:44)
   [junit4]   2> 	at org.apache.curator.framework.recipes.shared.SharedValue$1.process(SharedValue.java:61)
   [junit4]   2> 	at org.apache.curator.framework.imps.NamespaceWatcher.process(NamespaceWatcher.java:67)
   [junit4]   2> 	at org.apache.zookeeper.ClientCnxn$EventThread.processEvent(ClientCnxn.java:530)
   [junit4]   2> 	at org.apache.zookeeper.ClientCnxn$EventThread.run(ClientCnxn.java:505)
   [junit4]   2> 1843292 ERROR (jetty-launcher-3003-thread-1-EventThread) [n:127.0.0.1:41217_solr    ] o.a.c.f.i.CuratorFrameworkImpl Watcher exception
   [junit4]   2> java.lang.InterruptedException
   [junit4]   2> 	at java.util.concurrent.locks.AbstractQueuedSynchronizer.doAcquireSharedNanos(AbstractQueuedSynchronizer.java:1039)
   [junit4]   2> 	at java.util.concurrent.locks.AbstractQueuedSynchronizer.tryAcquireSharedNanos(AbstractQueuedSynchronizer.java:1328)
   [junit4]   2> 	at java.util.concurrent.CountDownLatch.await(CountDownLatch.java:277)
   [junit4]   2> 	at org.apache.curator.CuratorZookeeperClient.internalBlockUntilConnectedOrTimedOut(CuratorZookeeperClient.java:323)
   [junit4]   2> 	at org.apache.curator.RetryLoop.callWithRetry(RetryLoop.java:105)
   [junit4]   2> 	at org.apache.curator.framework.imps.GetDataBuilderImpl.pathInForeground(GetDataBuilderImpl.java:288)
   [junit4]   2> 	at org.apache.curator.framework.imps.GetDataBuilderImpl.forPath(GetDataBuilderImpl.java:279)
   [junit4]   2> 	at org.apache.curator.framework.imps.GetDataBuilderImpl.forPath(GetDataBuilderImpl.java:41)
   [junit4]   2> 	at org.apache.curator.framework.recipes.shared.SharedValue.readValue(SharedValue.java:244)
   [junit4]   2> 	at org.apache.curator.framework.recipes.shared.SharedValue.access$100(SharedValue.java:44)
   [junit4]   2> 	at org.apache.curator.framework.recipes.shared.SharedValue$1.process(SharedValue.java:61)
   [junit4]   2> 	at org.apache.curator.framework.imps.NamespaceWatcher.process(NamespaceWatcher.java:67)
   [junit4]   2> 	at org.apache.zookeeper.ClientCnxn$EventThread.processEvent(ClientCnxn.java:530)
   [junit4]   2> 	at org.apache.zookeeper.ClientCnxn$EventThread.run(ClientCnxn.java:505)
   [junit4]   2> 1843293 WARN  (jetty-launcher-3003-thread-2-EventThread) [n:127.0.0.1:34287_solr    ] o.a.c.ConnectionState Session expired event received
   [junit4]   2> 1843293 WARN  (jetty-launcher-3003-thread-1-EventThread) [n:127.0.0.1:41217_solr    ] o.a.c.ConnectionState Session expired event received
   [junit4]   2> 1843294 WARN  (jetty-launcher-3003-thread-1-SendThread(127.0.0.1:42613)) [n:127.0.0.1:41217_solr    ] o.a.z.ClientCnxn Session 0x0 for server null, unexpected error, closing socket connection and attempting reconnect
   [junit4]   2> java.net.ConnectException: Connection refused
   [junit4]   2> 	at sun.nio.ch.SocketChannelImpl.checkConnect(Native Method)
   [junit4]   2> 	at sun.nio.ch.SocketChannelImpl.finishConnect(SocketChannelImpl.java:717)
   [junit4]   2> 	at org.apache.zookeeper.ClientCnxnSocketNIO.doTransport(ClientCnxnSocketNIO.java:361)
   [junit4]   2> 	at org.apache.zookeeper.ClientCnxn$SendThread.run(ClientCnxn.java:1141)
   [junit4]   2> 1843294 WARN  (jetty-launcher-3003-thread-2-SendThread(127.0.0.1:42613)) [n:127.0.0.1:34287_solr    ] o.a.z.ClientCnxn Session 0x0 for server null, unexpected error, closing socket connection and attempting reconnect
   [junit4]   2> java.net.ConnectException: Connection refused
   [junit4]   2> 	at sun.nio.ch.SocketChannelImpl.checkConnect(Native Method)
   [junit4]   2> 	at sun.nio.ch.SocketChannelImpl.finishConnect(SocketChannelImpl.java:717)
   [junit4]   2> 	at org.apache.zookeeper.ClientCnxnSocketNIO.doTransport(ClientCnxnSocketNIO.java:361)
   [junit4]   2> 	at org.apache.zookeeper.ClientCnxn$SendThread.run(ClientCnxn.java:1141)
   [junit4]   2> Aug 22, 2017 7:44:45 PM com.carrotsearch.randomizedtesting.ThreadLeakControl tryToInterruptAll
   [junit4]   2> INFO: All leaked threads terminated.
   [junit4]   2> NOTE: test params are: codec=Asserting(Lucene70): {}, docValues:{}, maxPointsInLeafNode=283, maxMBSortInHeap=5.092743343970502, sim=RandomSimilarity(queryNorm=false): {}, locale=hr, timezone=Asia/Magadan
   [junit4]   2> NOTE: Linux 4.10.0-27-generic amd64/Oracle Corporation 1.8.0_144 (64-bit)/cpus=8,threads=5,free=260163168,total=518979584
   [junit4]   2> NOTE: All tests run in this JVM: [TestLegacyTerms, TestReload, TestFoldingMultitermQuery, MinimalSchemaTest, TestSort, AutoCommitTest, DateMathParserTest, ReplaceNodeTest, TestShortCircuitedRequests, TestSuggestSpellingConverter, DirectUpdateHandlerTest, PreAnalyzedFieldManagedSchemaCloudTest, MetricsHandlerTest, DirectoryFactoryTest, JSONWriterTest, HighlighterMaxOffsetTest, TestSolrDeletionPolicy2, DistributedFacetPivotSmallTest, TestAnalyzedSuggestions, BigEndianAscendingWordDeserializerTest, TestCollectionAPI, TestBlendedInfixSuggestions, TestMiniSolrCloudCluster, TestPseudoReturnFields, OverseerTest, TestQueryWrapperFilter, TestStressInPlaceUpdates, SpellPossibilityIteratorTest, TestUniqueKeyFieldResource, TestExactStatsCache, TestSimpleTextCodec, TestSearcherReuse, TestBulkSchemaConcurrent, CleanupOldIndexTest, TestComplexPhraseQParserPlugin, HdfsNNFailoverTest, UUIDUpdateProcessorFallbackTest, BlockJoinFacetRandomTest, SimplePostToolTest, DistribCursorPagingTest, TestTrie, TestFilteredDocIdSet, TestDistributedStatsComponentCardinality, TestHdfsCloudBackupRestore, TestGroupingSearch, TestNumericRangeQuery64, TestUseDocValuesAsStored, MoveReplicaHDFSTest, DateFieldTest, TestLeaderInitiatedRecoveryThread, JvmMetricsTest, TestPullReplicaErrorHandling, TestTolerantUpdateProcessorCloud, TemplateUpdateProcessorTest, DeleteInactiveReplicaTest, AddSchemaFieldsUpdateProcessorFactoryTest, ConjunctionSolrSpellCheckerTest, TestExceedMaxTermLength, SpatialHeatmapFacetsTest, SearchHandlerTest, TestMissingGroups, TestLFUCache, RulesTest, DocumentBuilderTest, ExplicitHLLTest, DirectUpdateHandlerOptimizeTest, SolrMetricManagerTest, ForceLeaderTest, BaseCdcrDistributedZkTest, AnalysisErrorHandlingTest, SignatureUpdateProcessorFactoryTest, TestFieldCacheSort, MultiTermTest, TestDelegationWithHadoopAuth, TriLevelCompositeIdRoutingTest, TestTolerantSearch, DeleteReplicaTest, TestCloudSchemaless, ZkStateWriterTest, TestPolicyCloud, RegexBoostProcessorTest, HdfsRestartWhileUpdatingTest, SuggesterFSTTest, TestSolrConfigHandlerCloud, TestLMJelinekMercerSimilarityFactory, TermVectorComponentDistributedTest, TestGraphMLResponseWriter, CachingDirectoryFactoryTest, BasicAuthStandaloneTest, TestInitQParser, RecoveryZkTest, ReturnFieldsTest, LeaderElectionTest, TestImplicitCoreProperties, TermsComponentTest, CdcrReplicationHandlerTest, DocValuesMissingTest, MultiThreadedOCPTest, TestRestManager, InfixSuggestersTest, TestSortByMinMaxFunction, TestStressReorder, PathHierarchyTokenizerFactoryTest, TestDefaultStatsCache, DistributedFacetPivotLargeTest, DistributedQueueTest, TestReversedWildcardFilterFactory, ChaosMonkeyNothingIsSafeWithPullReplicasTest, SolrJmxReporterTest, HLLUtilTest, SolrCoreCheckLockOnStartupTest, QueryEqualityTest, TestDistributedMissingSort, TestQuerySenderListener, TestNumericTerms64, DistributedQueryComponentOptimizationTest, FullSolrCloudDistribCmdsTest, ChangedSchemaMergeTest, TestReRankQParserPlugin, OverseerRolesTest, CollectionsAPIAsyncDistributedZkTest, DeleteLastCustomShardedReplicaTest, DeleteShardTest, DeleteStatusTest, LeaderElectionContextKeyTest, LeaderFailoverAfterPartitionTest, OverseerCollectionConfigSetProcessorTest, OverseerStatusTest, ReplicationFactorTest, RollingRestartTest, SolrXmlInZkTest, TestCloudDeleteByQuery, TestCloudInspectUtil, TestCloudPivotFacet, TestConfigSetsAPI, TestPullReplica, TestSizeLimitedDistributedMap, TestSolrCloudWithDelegationTokens, TestSolrCloudWithSecureImpersonation]
   [junit4]   2> NOTE: reproduce with: ant test  -Dtestcase=TestSolrCloudWithSecureImpersonation -Dtests.seed=CAF29F2AEC86C07C -Dtests.multiplier=3 -Dtests.slow=true -Dtests.locale=hr -Dtests.timezone=Asia/Magadan -Dtests.asserts=true -Dtests.file.encoding=ISO-8859-1
   [junit4] ERROR   0.00s J2 | TestSolrCloudWithSecureImpersonation (suite) <<<
   [junit4]    > Throwable #1: com.carrotsearch.randomizedtesting.ThreadLeakError: 2 threads leaked from SUITE scope at org.apache.solr.cloud.TestSolrCloudWithSecureImpersonation: 
   [junit4]    >    1) Thread[id=17554, name=jetty-launcher-3003-thread-1-EventThread, state=TIMED_WAITING, group=TGRP-TestSolrCloudWithSecureImpersonation]
   [junit4]    >         at sun.misc.Unsafe.park(Native Method)
   [junit4]    >         at java.util.concurrent.locks.LockSupport.parkNanos(LockSupport.java:215)
   [junit4]    >         at java.util.concurrent.locks.AbstractQueuedSynchronizer.doAcquireSharedNanos(AbstractQueuedSynchronizer.java:1037)
   [junit4]    >         at java.util.concurrent.locks.AbstractQueuedSynchronizer.tryAcquireSharedNanos(AbstractQueuedSynchronizer.java:1328)
   [junit4]    >         at java.util.concurrent.CountDownLatch.await(CountDownLatch.java:277)
   [junit4]    >         at org.apache.curator.CuratorZookeeperClient.internalBlockUntilConnectedOrTimedOut(CuratorZookeeperClient.java:323)
   [junit4]    >         at org.apache.curator.RetryLoop.callWithRetry(RetryLoop.java:105)
   [junit4]    >         at org.apache.curator.framework.imps.GetDataBuilderImpl.pathInForeground(GetDataBuilderImpl.java:288)
   [junit4]    >         at org.apache.curator.framework.imps.GetDataBuilderImpl.forPath(GetDataBuilderImpl.java:279)
   [junit4]    >         at org.apache.curator.framework.imps.GetDataBuilderImpl.forPath(GetDataBuilderImpl.java:41)
   [junit4]    >         at org.apache.curator.framework.recipes.shared.SharedValue.readValue(SharedValue.java:244)
   [junit4]    >         at org.apache.curator.framework.recipes.shared.SharedValue.access$100(SharedValue.java:44)
   [junit4]    >         at org.apache.curator.framework.recipes.shared.SharedValue$1.process(SharedValue.java:61)
   [junit4]    >         at org.apache.curator.framework.imps.NamespaceWatcher.process(NamespaceWatcher.java:67)
   [junit4]    >         at org.apache.zookeeper.ClientCnxn$EventThread.processEvent(ClientCnxn.java:530)
   [junit4]    >         at org.apache.zookeeper.ClientCnxn$EventThread.run(ClientCnxn.java:505)
   [junit4]    >    2) Thread[id=17564, name=jetty-launcher-3003-thread-2-EventThread, state=TIMED_WAITING, group=TGRP-TestSolrCloudWithSecureImpersonation]
   [junit4]    >         at sun.misc.Unsafe.park(Native Method)
   [junit4]    >         at java.util.concurrent.locks.LockSupport.parkNanos(LockSupport.java:215)
   [junit4]    >         at java.util.concurrent.locks.AbstractQueuedSynchronizer.doAcquireSharedNanos(AbstractQueuedSynchronizer.java:1037)
   [junit4]    >         at java.util.concurrent.locks.AbstractQueuedSynchronizer.tryAcquireSharedNanos(AbstractQueuedSynchronizer.java:1328)
   [junit4]    >         at java.util.concurrent.CountDownLatch.await(CountDownLatch.java:277)
   [junit4]    >         at org.apache.curator.CuratorZookeeperClient.internalBlockUntilConnectedOrTimedOut(CuratorZookeeperClient.java:323)
   [junit4]    >         at org.apache.curator.RetryLoop.callWithRetry(RetryLoop.java:105)
   [junit4]    >         at org.apache.curator.framework.imps.GetDataBuilderImpl.pathInForeground(GetDataBuilderImpl.java:288)
   [junit4]    >         at org.apache.curator.framework.imps.GetDataBuilderImpl.forPath(GetDataBuilderImpl.java:279)
   [junit4]    >         at org.apache.curator.framework.imps.GetDataBuilderImpl.forPath(GetDataBuilderImpl.java:41)
   [junit4]    >         at org.apache.curator.framework.recipes.shared.SharedValue.readValue(SharedValue.java:244)
   [junit4]    >         at org.apache.curator.framework.recipes.shared.SharedValue.access$100(SharedValue.java:44)
   [junit4]    >         at org.apache.curator.framework.recipes.shared.SharedValue$1.process(SharedValue.java:61)
   [junit4]    >         at org.apache.curator.framework.imps.NamespaceWatcher.process(NamespaceWatcher.java:67)
   [junit4]    >         at org.apache.zookeeper.ClientCnxn$EventThread.processEvent(ClientCnxn.java:530)
   [junit4]    >         at org.apache.zookeeper.ClientCnxn$EventThread.run(ClientCnxn.java:505)
   [junit4]    > 	at __randomizedtesting.SeedInfo.seed([CAF29F2AEC86C07C]:0)
   [junit4] Completed [544/729 (1!)] on J2 in 47.79s, 12 tests, 1 error <<< FAILURES!

[...truncated 43965 lines...]

Mime
View raw message