lucene-dev mailing list archives

Site index · List index
Message view « Date » · « Thread »
Top « Date » · « Thread »
From Policeman Jenkins Server <jenk...@thetaphi.de>
Subject [JENKINS-EA] Lucene-Solr-master-Linux (64bit/jdk-9-ea+181) - Build # 20360 - Still unstable!
Date Wed, 23 Aug 2017 00:39:27 GMT
Build: https://jenkins.thetaphi.de/job/Lucene-Solr-master-Linux/20360/
Java: 64bit/jdk-9-ea+181 -XX:+UseCompressedOops -XX:+UseSerialGC --illegal-access=deny

1 tests failed.
FAILED:  org.apache.solr.metrics.reporters.SolrSlf4jReporterTest.testReporter

Error Message:


Stack Trace:
java.lang.AssertionError
	at __randomizedtesting.SeedInfo.seed([6589E5DEFB366AFA:3A6DC8E9903AF9BF]:0)
	at org.junit.Assert.fail(Assert.java:92)
	at org.junit.Assert.assertTrue(Assert.java:43)
	at org.junit.Assert.assertTrue(Assert.java:54)
	at org.apache.solr.metrics.reporters.SolrSlf4jReporterTest.testReporter(SolrSlf4jReporterTest.java:84)
	at java.base/jdk.internal.reflect.NativeMethodAccessorImpl.invoke0(Native Method)
	at java.base/jdk.internal.reflect.NativeMethodAccessorImpl.invoke(NativeMethodAccessorImpl.java:62)
	at java.base/jdk.internal.reflect.DelegatingMethodAccessorImpl.invoke(DelegatingMethodAccessorImpl.java:43)
	at java.base/java.lang.reflect.Method.invoke(Method.java:564)
	at com.carrotsearch.randomizedtesting.RandomizedRunner.invoke(RandomizedRunner.java:1713)
	at com.carrotsearch.randomizedtesting.RandomizedRunner$8.evaluate(RandomizedRunner.java:907)
	at com.carrotsearch.randomizedtesting.RandomizedRunner$9.evaluate(RandomizedRunner.java:943)
	at com.carrotsearch.randomizedtesting.RandomizedRunner$10.evaluate(RandomizedRunner.java:957)
	at com.carrotsearch.randomizedtesting.rules.SystemPropertiesRestoreRule$1.evaluate(SystemPropertiesRestoreRule.java:57)
	at org.apache.lucene.util.TestRuleSetupTeardownChained$1.evaluate(TestRuleSetupTeardownChained.java:49)
	at org.apache.lucene.util.AbstractBeforeAfterRule$1.evaluate(AbstractBeforeAfterRule.java:45)
	at org.apache.lucene.util.TestRuleThreadAndTestName$1.evaluate(TestRuleThreadAndTestName.java:48)
	at org.apache.lucene.util.TestRuleIgnoreAfterMaxFailures$1.evaluate(TestRuleIgnoreAfterMaxFailures.java:64)
	at org.apache.lucene.util.TestRuleMarkFailure$1.evaluate(TestRuleMarkFailure.java:47)
	at com.carrotsearch.randomizedtesting.rules.StatementAdapter.evaluate(StatementAdapter.java:36)
	at com.carrotsearch.randomizedtesting.ThreadLeakControl$StatementRunner.run(ThreadLeakControl.java:368)
	at com.carrotsearch.randomizedtesting.ThreadLeakControl.forkTimeoutingTask(ThreadLeakControl.java:817)
	at com.carrotsearch.randomizedtesting.ThreadLeakControl$3.evaluate(ThreadLeakControl.java:468)
	at com.carrotsearch.randomizedtesting.RandomizedRunner.runSingleTest(RandomizedRunner.java:916)
	at com.carrotsearch.randomizedtesting.RandomizedRunner$5.evaluate(RandomizedRunner.java:802)
	at com.carrotsearch.randomizedtesting.RandomizedRunner$6.evaluate(RandomizedRunner.java:852)
	at com.carrotsearch.randomizedtesting.RandomizedRunner$7.evaluate(RandomizedRunner.java:863)
	at com.carrotsearch.randomizedtesting.rules.StatementAdapter.evaluate(StatementAdapter.java:36)
	at com.carrotsearch.randomizedtesting.rules.SystemPropertiesRestoreRule$1.evaluate(SystemPropertiesRestoreRule.java:57)
	at org.apache.lucene.util.AbstractBeforeAfterRule$1.evaluate(AbstractBeforeAfterRule.java:45)
	at com.carrotsearch.randomizedtesting.rules.StatementAdapter.evaluate(StatementAdapter.java:36)
	at org.apache.lucene.util.TestRuleStoreClassName$1.evaluate(TestRuleStoreClassName.java:41)
	at com.carrotsearch.randomizedtesting.rules.NoShadowingOrOverridesOnMethodsRule$1.evaluate(NoShadowingOrOverridesOnMethodsRule.java:40)
	at com.carrotsearch.randomizedtesting.rules.NoShadowingOrOverridesOnMethodsRule$1.evaluate(NoShadowingOrOverridesOnMethodsRule.java:40)
	at com.carrotsearch.randomizedtesting.rules.StatementAdapter.evaluate(StatementAdapter.java:36)
	at com.carrotsearch.randomizedtesting.rules.StatementAdapter.evaluate(StatementAdapter.java:36)
	at org.apache.lucene.util.TestRuleAssertionsRequired$1.evaluate(TestRuleAssertionsRequired.java:53)
	at org.apache.lucene.util.TestRuleMarkFailure$1.evaluate(TestRuleMarkFailure.java:47)
	at org.apache.lucene.util.TestRuleIgnoreAfterMaxFailures$1.evaluate(TestRuleIgnoreAfterMaxFailures.java:64)
	at org.apache.lucene.util.TestRuleIgnoreTestSuites$1.evaluate(TestRuleIgnoreTestSuites.java:54)
	at com.carrotsearch.randomizedtesting.rules.StatementAdapter.evaluate(StatementAdapter.java:36)
	at com.carrotsearch.randomizedtesting.ThreadLeakControl$StatementRunner.run(ThreadLeakControl.java:368)
	at java.base/java.lang.Thread.run(Thread.java:844)




Build Log:
[...truncated 12769 lines...]
   [junit4] Suite: org.apache.solr.metrics.reporters.SolrSlf4jReporterTest
   [junit4]   2> Creating dataDir: /home/jenkins/workspace/Lucene-Solr-master-Linux/solr/build/solr-core/test/J2/temp/solr.metrics.reporters.SolrSlf4jReporterTest_6589E5DEFB366AFA-001/init-core-data-001
   [junit4]   2> 2138503 WARN  (SUITE-SolrSlf4jReporterTest-seed#[6589E5DEFB366AFA]-worker)
[    ] o.a.s.SolrTestCaseJ4 startTrackingSearchers: numOpens=1 numCloses=1
   [junit4]   2> NOTE: reproduce with: ant test  -Dtestcase=SolrSlf4jReporterTest -Dtests.method=testReporter
-Dtests.seed=6589E5DEFB366AFA -Dtests.multiplier=3 -Dtests.slow=true -Dtests.locale=dje-NE
-Dtests.timezone=Pacific/Kosrae -Dtests.asserts=true -Dtests.file.encoding=UTF-8
   [junit4] FAILURE 6.39s J2 | SolrSlf4jReporterTest.testReporter <<<
   [junit4]    > Throwable #1: java.lang.AssertionError
   [junit4]    > 	at __randomizedtesting.SeedInfo.seed([6589E5DEFB366AFA:3A6DC8E9903AF9BF]:0)
   [junit4]    > 	at org.apache.solr.metrics.reporters.SolrSlf4jReporterTest.testReporter(SolrSlf4jReporterTest.java:84)
   [junit4]    > 	at java.base/jdk.internal.reflect.NativeMethodAccessorImpl.invoke0(Native
Method)
   [junit4]    > 	at java.base/jdk.internal.reflect.NativeMethodAccessorImpl.invoke(NativeMethodAccessorImpl.java:62)
   [junit4]    > 	at java.base/jdk.internal.reflect.DelegatingMethodAccessorImpl.invoke(DelegatingMethodAccessorImpl.java:43)
   [junit4]    > 	at java.base/java.lang.reflect.Method.invoke(Method.java:564)
   [junit4]    > 	at java.base/java.lang.Thread.run(Thread.java:844)
   [junit4]   2> NOTE: leaving temporary files on disk at: /home/jenkins/workspace/Lucene-Solr-master-Linux/solr/build/solr-core/test/J2/temp/solr.metrics.reporters.SolrSlf4jReporterTest_6589E5DEFB366AFA-001
   [junit4]   2> NOTE: test params are: codec=Asserting(Lucene70): {}, docValues:{}, maxPointsInLeafNode=1147,
maxMBSortInHeap=6.739658647007603, sim=RandomSimilarity(queryNorm=true): {}, locale=dje-NE,
timezone=Pacific/Kosrae
   [junit4]   2> NOTE: Linux 4.10.0-27-generic amd64/Oracle Corporation 9 (64-bit)/cpus=8,threads=1,free=237390536,total=518979584
   [junit4]   2> NOTE: All tests run in this JVM: [UninvertDocValuesMergePolicyTest, TestLegacyNumericRangeQueryBuilder,
CdcrVersionReplicationTest, TestIndexSearcher, TestPerFieldSimilarityWithDefaultOverride,
TestPivotHelperCode, TestCollectionAPI, TestSimpleQParserPlugin, TestSSLRandomization, MinimalSchemaTest,
InfixSuggestersTest, TestCodecSupport, TestLeaderElectionZkExpiry, UtilsToolTest, SolrInfoBeanTest,
TestCollationFieldDocValues, TestFieldTypeResource, CursorMarkTest, TestTolerantUpdateProcessorRandomCloud,
TestPayloadCheckQParserPlugin, TestSolrCloudWithSecureImpersonation, BadIndexSchemaTest, TestJettySolrRunner,
CustomCollectionTest, TestLFUCache, ReturnFieldsTest, SpellCheckCollatorWithCollapseTest,
TestSchemaSimilarityResource, TestUniqueKeyFieldResource, TestSort, SolrCLIZkUtilsTest, TestBulkSchemaConcurrent,
TestSolrQueryResponse, DistributedFacetPivotLargeTest, TestLegacyTerms, CopyFieldTest, FullSolrCloudDistribCmdsTest,
TestSuggestSpellingConverter, SolrMetricManagerTest, TestGroupingSearch, TestConfigSetImmutable,
DistributedQueryComponentOptimizationTest, TestUtils, TestLegacyField, TestLMJelinekMercerSimilarityFactory,
TestRecovery, TestSubQueryTransformerCrossCore, TestCloudJSONFacetJoinDomain, TestPrepRecovery,
TestRestoreCore, SolrTestCaseJ4Test, ConfigSetsAPITest, MigrateRouteKeyTest, BigEndianAscendingWordSerializerTest,
XsltUpdateRequestHandlerTest, CdcrUpdateLogTest, AutoCommitTest, TestSimpleTextCodec, TestDistributedMissingSort,
TestConfigSetsAPIExclusivity, QueryEqualityTest, StressHdfsTest, LeaderFailureAfterFreshStartTest,
NodeMutatorTest, SpellPossibilityIteratorTest, DeleteStatusTest, TestRTimerTree, TestSchemaManager,
ReplicationFactorTest, TestClassicSimilarityFactory, TermsComponentTest, TestRecoveryHdfs,
ResponseLogComponentTest, SortByFunctionTest, SolrGangliaReporterTest, DocumentBuilderTest,
DocValuesMissingTest, TestCustomSort, CachingDirectoryFactoryTest, SolrCoreCheckLockOnStartupTest,
TestStressUserVersions, HttpPartitionTest, TestTrie, TestImpersonationWithHadoopAuth, BlockJoinFacetSimpleTest,
SuggesterTest, CircularListTest, PathHierarchyTokenizerFactoryTest, BlockCacheTest, TestStressReorder,
FastVectorHighlighterTest, TestNamedUpdateProcessors, BJQParserTest, TestRuleBasedAuthorizationPlugin,
TestReplicaProperties, TestCollectionAPIs, TestFastWriter, SimplePostToolTest, TestDistributedStatsComponentCardinality,
DirectUpdateHandlerTest, TestFieldCacheSortRandom, ClassificationUpdateProcessorIntegrationTest,
PolyFieldTest, TestGeoJSONResponseWriter, TestLockTree, TestFieldCollectionResource, TestCopyFieldCollectionResource,
TestManagedResourceStorage, UpdateLogTest, TestMacros, CoreAdminRequestStatusTest, TestHdfsUpdateLog,
TestStressLiveNodes, TestUseDocValuesAsStored2, AtomicUpdateProcessorFactoryTest, TestDistribIDF,
ClusterStateTest, SignatureUpdateProcessorFactoryTest, ChaosMonkeySafeLeaderTest, BasicDistributedZk2Test,
UnloadDistributedZkTest, CollectionsAPIDistributedZkTest, OpenCloseCoreStressTest, OverseerTest,
LeaderElectionIntegrationTest, BasicZkTest, RecoveryZkTest, LeaderElectionTest, TestZkChroot,
TestRandomDVFaceting, TestReload, TestRangeQuery, DisMaxRequestHandlerTest, TestWriterPerf,
TestReversedWildcardFilterFactory, TestOmitPositions, RequestHandlersTest, MoreLikeThisHandlerTest,
FieldAnalysisRequestHandlerTest, RegexBoostProcessorTest, TestJmxIntegration, MBeansHandlerTest,
TestStressRecovery, TestSimpleTrackingShardHandler, AsyncCallRequestStatusResponseTest, CdcrReplicationDistributedZkTest,
CdcrRequestHandlerTest, CleanupOldIndexTest, CloudExitableDirectoryReaderTest, CollectionReloadTest,
CollectionStateFormat2Test, CollectionsAPISolrJTest, DistribJoinFromCollectionTest, DocValuesNotIndexedTest,
LeaderInitiatedRecoveryOnCommitTest, OverseerCollectionConfigSetProcessorTest, OverseerModifyCollectionTest,
OverseerStatusTest, RollingRestartTest, TestCollectionsAPIViaSolrCloudCluster, TestConfigSetsAPIZkFailure,
TestDeleteCollectionOnDownNodes, TestDownShardTolerantSearch, TestHdfsCloudBackupRestore,
TestLocalFSCloudBackupRestore, TestOnReconnectListenerSupport, TestSegmentSorting, TestStressInPlaceUpdates,
VMParamsZkACLAndCredentialsProvidersTest, HdfsBasicDistributedZk2Test, HdfsBasicDistributedZkTest,
HdfsChaosMonkeyNothingIsSafeTest, HdfsChaosMonkeySafeLeaderTest, HdfsCollectionsAPIDistributedZkTest,
HdfsNNFailoverTest, HdfsRecoveryZkTest, QueryResultKeyTest, TestCorePropertiesReload, TestImplicitCoreProperties,
TestInfoStreamLogging, TestNRTOpen, TestSolrCoreSnapshots, TestHdfsBackupRestoreCore, TestSystemCollAutoCreate,
MetricsHandlerTest, SegmentsInfoRequestHandlerTest, TestApiFramework, TestConfigsApi, TestCoreAdminApis,
DistributedDebugComponentTest, DistributedFacetExistsSmallTest, DistributedFacetPivotWhiteBoxTest,
FacetPivotSmallTest, TestHttpShardHandlerFactory, TestTrackingShardHandlerFactory, TestLegacyFieldReuse,
TestNumericRangeQuery32, TestNumericRangeQuery64, JvmMetricsTest, SolrSlf4jReporterTest]
   [junit4] Completed [625/731 (1!)] on J2 in 6.42s, 1 test, 1 failure <<< FAILURES!

[...truncated 36871 lines...]

Mime
View raw message