lucene-dev mailing list archives

Site index · List index
Message view « Date » · « Thread »
Top « Date » · « Thread »
From Policeman Jenkins Server <jenk...@thetaphi.de>
Subject [JENKINS-EA] Lucene-Solr-master-Linux (32bit/jdk-9-ea+181) - Build # 20327 - Still unstable!
Date Wed, 16 Aug 2017 11:47:11 GMT
Build: https://jenkins.thetaphi.de/job/Lucene-Solr-master-Linux/20327/
Java: 32bit/jdk-9-ea+181 -client -XX:+UseParallelGC --illegal-access=deny

1 tests failed.
FAILED:  org.apache.solr.cloud.HttpPartitionTest.test

Error Message:
Doc with id=1 not found in http://127.0.0.1:38323/collMinRf_1x3 due to: Path not found: /id; rsp={doc=null}

Stack Trace:
java.lang.AssertionError: Doc with id=1 not found in http://127.0.0.1:38323/collMinRf_1x3 due to: Path not found: /id; rsp={doc=null}
	at __randomizedtesting.SeedInfo.seed([262B93D78B5E421F:AE7FAC0D25A22FE7]:0)
	at org.junit.Assert.fail(Assert.java:93)
	at org.junit.Assert.assertTrue(Assert.java:43)
	at org.apache.solr.cloud.HttpPartitionTest.assertDocExists(HttpPartitionTest.java:603)
	at org.apache.solr.cloud.HttpPartitionTest.assertDocsExistInAllReplicas(HttpPartitionTest.java:558)
	at org.apache.solr.cloud.HttpPartitionTest.testMinRf(HttpPartitionTest.java:249)
	at org.apache.solr.cloud.HttpPartitionTest.test(HttpPartitionTest.java:127)
	at java.base/jdk.internal.reflect.NativeMethodAccessorImpl.invoke0(Native Method)
	at java.base/jdk.internal.reflect.NativeMethodAccessorImpl.invoke(NativeMethodAccessorImpl.java:62)
	at java.base/jdk.internal.reflect.DelegatingMethodAccessorImpl.invoke(DelegatingMethodAccessorImpl.java:43)
	at java.base/java.lang.reflect.Method.invoke(Method.java:564)
	at com.carrotsearch.randomizedtesting.RandomizedRunner.invoke(RandomizedRunner.java:1713)
	at com.carrotsearch.randomizedtesting.RandomizedRunner$8.evaluate(RandomizedRunner.java:907)
	at com.carrotsearch.randomizedtesting.RandomizedRunner$9.evaluate(RandomizedRunner.java:943)
	at com.carrotsearch.randomizedtesting.RandomizedRunner$10.evaluate(RandomizedRunner.java:957)
	at org.apache.solr.BaseDistributedSearchTestCase$ShardsRepeatRule$ShardsFixedStatement.callStatement(BaseDistributedSearchTestCase.java:993)
	at org.apache.solr.BaseDistributedSearchTestCase$ShardsRepeatRule$ShardsStatement.evaluate(BaseDistributedSearchTestCase.java:968)
	at com.carrotsearch.randomizedtesting.rules.SystemPropertiesRestoreRule$1.evaluate(SystemPropertiesRestoreRule.java:57)
	at org.apache.lucene.util.TestRuleSetupTeardownChained$1.evaluate(TestRuleSetupTeardownChained.java:49)
	at org.apache.lucene.util.AbstractBeforeAfterRule$1.evaluate(AbstractBeforeAfterRule.java:45)
	at org.apache.lucene.util.TestRuleThreadAndTestName$1.evaluate(TestRuleThreadAndTestName.java:48)
	at org.apache.lucene.util.TestRuleIgnoreAfterMaxFailures$1.evaluate(TestRuleIgnoreAfterMaxFailures.java:64)
	at org.apache.lucene.util.TestRuleMarkFailure$1.evaluate(TestRuleMarkFailure.java:47)
	at com.carrotsearch.randomizedtesting.rules.StatementAdapter.evaluate(StatementAdapter.java:36)
	at com.carrotsearch.randomizedtesting.ThreadLeakControl$StatementRunner.run(ThreadLeakControl.java:368)
	at com.carrotsearch.randomizedtesting.ThreadLeakControl.forkTimeoutingTask(ThreadLeakControl.java:817)
	at com.carrotsearch.randomizedtesting.ThreadLeakControl$3.evaluate(ThreadLeakControl.java:468)
	at com.carrotsearch.randomizedtesting.RandomizedRunner.runSingleTest(RandomizedRunner.java:916)
	at com.carrotsearch.randomizedtesting.RandomizedRunner$5.evaluate(RandomizedRunner.java:802)
	at com.carrotsearch.randomizedtesting.RandomizedRunner$6.evaluate(RandomizedRunner.java:852)
	at com.carrotsearch.randomizedtesting.RandomizedRunner$7.evaluate(RandomizedRunner.java:863)
	at com.carrotsearch.randomizedtesting.rules.StatementAdapter.evaluate(StatementAdapter.java:36)
	at com.carrotsearch.randomizedtesting.rules.SystemPropertiesRestoreRule$1.evaluate(SystemPropertiesRestoreRule.java:57)
	at org.apache.lucene.util.AbstractBeforeAfterRule$1.evaluate(AbstractBeforeAfterRule.java:45)
	at com.carrotsearch.randomizedtesting.rules.StatementAdapter.evaluate(StatementAdapter.java:36)
	at org.apache.lucene.util.TestRuleStoreClassName$1.evaluate(TestRuleStoreClassName.java:41)
	at com.carrotsearch.randomizedtesting.rules.NoShadowingOrOverridesOnMethodsRule$1.evaluate(NoShadowingOrOverridesOnMethodsRule.java:40)
	at com.carrotsearch.randomizedtesting.rules.NoShadowingOrOverridesOnMethodsRule$1.evaluate(NoShadowingOrOverridesOnMethodsRule.java:40)
	at com.carrotsearch.randomizedtesting.rules.StatementAdapter.evaluate(StatementAdapter.java:36)
	at com.carrotsearch.randomizedtesting.rules.StatementAdapter.evaluate(StatementAdapter.java:36)
	at org.apache.lucene.util.TestRuleAssertionsRequired$1.evaluate(TestRuleAssertionsRequired.java:53)
	at org.apache.lucene.util.TestRuleMarkFailure$1.evaluate(TestRuleMarkFailure.java:47)
	at org.apache.lucene.util.TestRuleIgnoreAfterMaxFailures$1.evaluate(TestRuleIgnoreAfterMaxFailures.java:64)
	at org.apache.lucene.util.TestRuleIgnoreTestSuites$1.evaluate(TestRuleIgnoreTestSuites.java:54)
	at com.carrotsearch.randomizedtesting.rules.StatementAdapter.evaluate(StatementAdapter.java:36)
	at com.carrotsearch.randomizedtesting.ThreadLeakControl$StatementRunner.run(ThreadLeakControl.java:368)
	at java.base/java.lang.Thread.run(Thread.java:844)




Build Log:
[...truncated 12383 lines...]
   [junit4] Suite: org.apache.solr.cloud.HttpPartitionTest
   [junit4]   2> Creating dataDir: /home/jenkins/workspace/Lucene-Solr-master-Linux/solr/build/solr-core/test/J2/temp/solr.cloud.HttpPartitionTest_262B93D78B5E421F-001/init-core-data-001
   [junit4]   2> 1617714 INFO  (SUITE-HttpPartitionTest-seed#[262B93D78B5E421F]-worker) [    ] o.a.s.SolrTestCaseJ4 Using PointFields (NUMERIC_POINTS_SYSPROP=true) w/NUMERIC_DOCVALUES_SYSPROP=false
   [junit4]   2> 1617714 INFO  (SUITE-HttpPartitionTest-seed#[262B93D78B5E421F]-worker) [    ] o.a.s.SolrTestCaseJ4 Randomized ssl (false) and clientAuth (false) via: @org.apache.solr.SolrTestCaseJ4$SuppressSSL(bugUrl="https://issues.apache.org/jira/browse/SOLR-5776")
   [junit4]   2> 1617714 INFO  (SUITE-HttpPartitionTest-seed#[262B93D78B5E421F]-worker) [    ] o.a.s.SolrTestCaseJ4 SecureRandom sanity checks: test.solr.allowed.securerandom=null & java.security.egd=file:/dev/./urandom
   [junit4]   2> 1617714 INFO  (SUITE-HttpPartitionTest-seed#[262B93D78B5E421F]-worker) [    ] o.a.s.BaseDistributedSearchTestCase Setting hostContext system property: /
   [junit4]   2> 1617716 INFO  (TEST-HttpPartitionTest.test-seed#[262B93D78B5E421F]) [    ] o.a.s.c.ZkTestServer STARTING ZK TEST SERVER
   [junit4]   2> 1617716 INFO  (Thread-2933) [    ] o.a.s.c.ZkTestServer client port:0.0.0.0/0.0.0.0:0
   [junit4]   2> 1617716 INFO  (Thread-2933) [    ] o.a.s.c.ZkTestServer Starting server
   [junit4]   2> 1617718 ERROR (Thread-2933) [    ] o.a.z.s.ZooKeeperServer ZKShutdownHandler is not registered, so ZooKeeper server won't take any action on ERROR or SHUTDOWN server state changes
   [junit4]   2> 1617816 INFO  (TEST-HttpPartitionTest.test-seed#[262B93D78B5E421F]) [    ] o.a.s.c.ZkTestServer start zk server on port:46215
   [junit4]   2> 1617823 INFO  (TEST-HttpPartitionTest.test-seed#[262B93D78B5E421F]) [    ] o.a.s.c.AbstractZkTestCase put /home/jenkins/workspace/Lucene-Solr-master-Linux/solr/core/src/test-files/solr/collection1/conf/solrconfig-tlog.xml to /configs/conf1/solrconfig.xml
   [junit4]   2> 1617824 INFO  (TEST-HttpPartitionTest.test-seed#[262B93D78B5E421F]) [    ] o.a.s.c.AbstractZkTestCase put /home/jenkins/workspace/Lucene-Solr-master-Linux/solr/core/src/test-files/solr/collection1/conf/schema.xml to /configs/conf1/schema.xml
   [junit4]   2> 1617825 INFO  (TEST-HttpPartitionTest.test-seed#[262B93D78B5E421F]) [    ] o.a.s.c.AbstractZkTestCase put /home/jenkins/workspace/Lucene-Solr-master-Linux/solr/core/src/test-files/solr/collection1/conf/solrconfig.snippet.randomindexconfig.xml to /configs/conf1/solrconfig.snippet.randomindexconfig.xml
   [junit4]   2> 1617825 INFO  (TEST-HttpPartitionTest.test-seed#[262B93D78B5E421F]) [    ] o.a.s.c.AbstractZkTestCase put /home/jenkins/workspace/Lucene-Solr-master-Linux/solr/core/src/test-files/solr/collection1/conf/stopwords.txt to /configs/conf1/stopwords.txt
   [junit4]   2> 1617826 INFO  (TEST-HttpPartitionTest.test-seed#[262B93D78B5E421F]) [    ] o.a.s.c.AbstractZkTestCase put /home/jenkins/workspace/Lucene-Solr-master-Linux/solr/core/src/test-files/solr/collection1/conf/protwords.txt to /configs/conf1/protwords.txt
   [junit4]   2> 1617827 INFO  (TEST-HttpPartitionTest.test-seed#[262B93D78B5E421F]) [    ] o.a.s.c.AbstractZkTestCase put /home/jenkins/workspace/Lucene-Solr-master-Linux/solr/core/src/test-files/solr/collection1/conf/currency.xml to /configs/conf1/currency.xml
   [junit4]   2> 1617827 INFO  (TEST-HttpPartitionTest.test-seed#[262B93D78B5E421F]) [    ] o.a.s.c.AbstractZkTestCase put /home/jenkins/workspace/Lucene-Solr-master-Linux/solr/core/src/test-files/solr/collection1/conf/enumsConfig.xml to /configs/conf1/enumsConfig.xml
   [junit4]   2> 1617828 INFO  (TEST-HttpPartitionTest.test-seed#[262B93D78B5E421F]) [    ] o.a.s.c.AbstractZkTestCase put /home/jenkins/workspace/Lucene-Solr-master-Linux/solr/core/src/test-files/solr/collection1/conf/open-exchange-rates.json to /configs/conf1/open-exchange-rates.json
   [junit4]   2> 1617828 INFO  (TEST-HttpPartitionTest.test-seed#[262B93D78B5E421F]) [    ] o.a.s.c.AbstractZkTestCase put /home/jenkins/workspace/Lucene-Solr-master-Linux/solr/core/src/test-files/solr/collection1/conf/mapping-ISOLatin1Accent.txt to /configs/conf1/mapping-ISOLatin1Accent.txt
   [junit4]   2> 1617829 INFO  (TEST-HttpPartitionTest.test-seed#[262B93D78B5E421F]) [    ] o.a.s.c.AbstractZkTestCase put /home/jenkins/workspace/Lucene-Solr-master-Linux/solr/core/src/test-files/solr/collection1/conf/old_synonyms.txt to /configs/conf1/old_synonyms.txt
   [junit4]   2> 1617829 INFO  (TEST-HttpPartitionTest.test-seed#[262B93D78B5E421F]) [    ] o.a.s.c.AbstractZkTestCase put /home/jenkins/workspace/Lucene-Solr-master-Linux/solr/core/src/test-files/solr/collection1/conf/synonyms.txt to /configs/conf1/synonyms.txt
   [junit4]   2> 1617830 INFO  (TEST-HttpPartitionTest.test-seed#[262B93D78B5E421F]) [    ] o.a.s.c.AbstractFullDistribZkTestBase Will use TLOG replicas unless explicitly asked otherwise
   [junit4]   2> 1617921 INFO  (TEST-HttpPartitionTest.test-seed#[262B93D78B5E421F]) [    ] o.e.j.s.Server jetty-9.3.14.v20161028
   [junit4]   2> 1617922 INFO  (TEST-HttpPartitionTest.test-seed#[262B93D78B5E421F]) [    ] o.e.j.s.h.ContextHandler Started o.e.j.s.ServletContextHandler@8df4e1{/,null,AVAILABLE}
   [junit4]   2> 1617924 INFO  (TEST-HttpPartitionTest.test-seed#[262B93D78B5E421F]) [    ] o.e.j.s.AbstractConnector Started ServerConnector@1353a74{HTTP/1.1,[http/1.1]}{127.0.0.1:36765}
   [junit4]   2> 1617924 INFO  (TEST-HttpPartitionTest.test-seed#[262B93D78B5E421F]) [    ] o.e.j.s.Server Started @1618896ms
   [junit4]   2> 1617924 INFO  (TEST-HttpPartitionTest.test-seed#[262B93D78B5E421F]) [    ] o.a.s.c.s.e.JettySolrRunner Jetty properties: {hostContext=/, solr.data.dir=/home/jenkins/workspace/Lucene-Solr-master-Linux/solr/build/solr-core/test/J2/temp/solr.cloud.HttpPartitionTest_262B93D78B5E421F-001/tempDir-001/control/data, hostPort=40273, coreRootDirectory=/home/jenkins/workspace/Lucene-Solr-master-Linux/solr/build/solr-core/test/J2/temp/solr.cloud.HttpPartitionTest_262B93D78B5E421F-001/control-001/cores, replicaType=NRT}
   [junit4]   2> 1617924 ERROR (TEST-HttpPartitionTest.test-seed#[262B93D78B5E421F]) [    ] o.a.s.s.StartupLoggingUtils Missing Java Option solr.log.dir. Logging may be missing or incomplete.
   [junit4]   2> 1617925 INFO  (TEST-HttpPartitionTest.test-seed#[262B93D78B5E421F]) [    ] o.a.s.s.SolrDispatchFilter  ___      _       Welcome to Apache Solr? version 8.0.0
   [junit4]   2> 1617925 INFO  (TEST-HttpPartitionTest.test-seed#[262B93D78B5E421F]) [    ] o.a.s.s.SolrDispatchFilter / __| ___| |_ _   Starting in cloud mode on port null
   [junit4]   2> 1617925 INFO  (TEST-HttpPartitionTest.test-seed#[262B93D78B5E421F]) [    ] o.a.s.s.SolrDispatchFilter \__ \/ _ \ | '_|  Install dir: null, Default config dir: null
   [junit4]   2> 1617925 INFO  (TEST-HttpPartitionTest.test-seed#[262B93D78B5E421F]) [    ] o.a.s.s.SolrDispatchFilter |___/\___/_|_|    Start time: 2017-08-16T11:16:42.963152Z
   [junit4]   2> 1617926 INFO  (TEST-HttpPartitionTest.test-seed#[262B93D78B5E421F]) [    ] o.a.s.s.SolrDispatchFilter Loading solr.xml from SolrHome (not found in ZooKeeper)
   [junit4]   2> 1617926 INFO  (TEST-HttpPartitionTest.test-seed#[262B93D78B5E421F]) [    ] o.a.s.c.SolrXmlConfig Loading container configuration from /home/jenkins/workspace/Lucene-Solr-master-Linux/solr/build/solr-core/test/J2/temp/solr.cloud.HttpPartitionTest_262B93D78B5E421F-001/control-001/solr.xml
   [junit4]   2> 1617928 INFO  (TEST-HttpPartitionTest.test-seed#[262B93D78B5E421F]) [    ] o.a.s.c.SolrXmlConfig MBean server found: com.sun.jmx.mbeanserver.JmxMBeanServer@133acf6, but no JMX reporters were configured - adding default JMX reporter.
   [junit4]   2> 1617930 INFO  (TEST-HttpPartitionTest.test-seed#[262B93D78B5E421F]) [    ] o.a.s.c.ZkContainer Zookeeper client=127.0.0.1:46215/solr
   [junit4]   2> 1617956 INFO  (TEST-HttpPartitionTest.test-seed#[262B93D78B5E421F]) [    ] o.a.s.c.Overseer Overseer (id=null) closing
   [junit4]   2> 1617957 INFO  (TEST-HttpPartitionTest.test-seed#[262B93D78B5E421F]) [    ] o.a.s.c.OverseerElectionContext I am going to be the leader 127.0.0.1:40273_
   [junit4]   2> 1617957 INFO  (TEST-HttpPartitionTest.test-seed#[262B93D78B5E421F]) [    ] o.a.s.c.Overseer Overseer (id=98492888039751684-127.0.0.1:40273_-n_0000000000) starting
   [junit4]   2> 1617959 INFO  (TEST-HttpPartitionTest.test-seed#[262B93D78B5E421F]) [    ] o.a.s.c.ZkController Register node as live in ZooKeeper:/live_nodes/127.0.0.1:40273_
   [junit4]   2> 1617959 INFO  (zkCallback-4196-thread-1) [    ] o.a.s.c.c.ZkStateReader Updated live nodes from ZooKeeper... (0) -> (1)
   [junit4]   2> 1618037 INFO  (TEST-HttpPartitionTest.test-seed#[262B93D78B5E421F]) [    ] o.a.s.m.r.SolrJmxReporter JMX monitoring for 'solr.node' (registry 'solr.node') enabled at server: com.sun.jmx.mbeanserver.JmxMBeanServer@133acf6
   [junit4]   2> 1618045 INFO  (TEST-HttpPartitionTest.test-seed#[262B93D78B5E421F]) [    ] o.a.s.m.r.SolrJmxReporter JMX monitoring for 'solr.jvm' (registry 'solr.jvm') enabled at server: com.sun.jmx.mbeanserver.JmxMBeanServer@133acf6
   [junit4]   2> 1618045 INFO  (TEST-HttpPartitionTest.test-seed#[262B93D78B5E421F]) [    ] o.a.s.m.r.SolrJmxReporter JMX monitoring for 'solr.jetty' (registry 'solr.jetty') enabled at server: com.sun.jmx.mbeanserver.JmxMBeanServer@133acf6
   [junit4]   2> 1618046 INFO  (TEST-HttpPartitionTest.test-seed#[262B93D78B5E421F]) [    ] o.a.s.c.CorePropertiesLocator Found 0 core definitions underneath /home/jenkins/workspace/Lucene-Solr-master-Linux/solr/build/solr-core/test/J2/temp/solr.cloud.HttpPartitionTest_262B93D78B5E421F-001/control-001/cores
   [junit4]   2> 1618057 INFO  (TEST-HttpPartitionTest.test-seed#[262B93D78B5E421F]) [    ] o.a.s.c.c.ZkStateReader Updated live nodes from ZooKeeper... (0) -> (1)
   [junit4]   2> 1618057 INFO  (TEST-HttpPartitionTest.test-seed#[262B93D78B5E421F]) [    ] o.a.s.c.s.i.ZkClientClusterStateProvider Cluster at 127.0.0.1:46215/solr ready
   [junit4]   2> 1618057 INFO  (SocketProxy-Acceptor-40273) [    ] o.a.s.c.SocketProxy accepted Socket[addr=/127.0.0.1,port=58912,localport=40273], receiveBufferSize:531000
   [junit4]   2> 1618058 INFO  (SocketProxy-Acceptor-40273) [    ] o.a.s.c.SocketProxy proxy connection Socket[addr=/127.0.0.1,port=36765,localport=37934], receiveBufferSize=530904
   [junit4]   2> 1618058 INFO  (qtp31761672-20557) [    ] o.a.s.h.a.CollectionsHandler Invoked Collection Action :create with params replicationFactor=1&collection.configName=conf1&name=control_collection&nrtReplicas=1&action=CREATE&numShards=1&createNodeSet=127.0.0.1:40273_&wt=javabin&version=2 and sendToOCPQueue=true
   [junit4]   2> 1618060 INFO  (OverseerThreadFactory-6623-thread-1) [    ] o.a.s.c.CreateCollectionCmd Create collection control_collection
   [junit4]   2> 1618164 INFO  (SocketProxy-Acceptor-40273) [    ] o.a.s.c.SocketProxy accepted Socket[addr=/127.0.0.1,port=58918,localport=40273], receiveBufferSize:531000
   [junit4]   2> 1618164 INFO  (SocketProxy-Acceptor-40273) [    ] o.a.s.c.SocketProxy proxy connection Socket[addr=/127.0.0.1,port=36765,localport=37940], receiveBufferSize=530904
   [junit4]   2> 1618164 INFO  (qtp31761672-20559) [    ] o.a.s.h.a.CoreAdminOperation core create command qt=/admin/cores&collection.configName=conf1&newCollection=true&name=control_collection_shard1_replica_n1&action=CREATE&numShards=1&collection=control_collection&shard=shard1&wt=javabin&version=2&replicaType=NRT
   [junit4]   2> 1618165 INFO  (qtp31761672-20559) [    ] o.a.s.c.TransientSolrCoreCacheDefault Allocating transient cache for 4 transient cores
   [junit4]   2> 1618270 INFO  (zkCallback-4196-thread-1) [    ] o.a.s.c.c.ZkStateReader A cluster state change: [WatchedEvent state:SyncConnected type:NodeDataChanged path:/collections/control_collection/state.json] for collection [control_collection] has occurred - updating... (live nodes size: [1])
   [junit4]   2> 1619177 INFO  (qtp31761672-20559) [    ] o.a.s.c.SolrConfig Using Lucene MatchVersion: 8.0.0
   [junit4]   2> 1619199 INFO  (qtp31761672-20559) [    ] o.a.s.s.IndexSchema [control_collection_shard1_replica_n1] Schema name=test
   [junit4]   2> 1619281 INFO  (qtp31761672-20559) [    ] o.a.s.s.IndexSchema Loaded schema test/1.0 with uniqueid field id
   [junit4]   2> 1619288 INFO  (qtp31761672-20559) [    ] o.a.s.c.CoreContainer Creating SolrCore 'control_collection_shard1_replica_n1' using configuration from collection control_collection, trusted=true
   [junit4]   2> 1619289 INFO  (qtp31761672-20559) [    ] o.a.s.m.r.SolrJmxReporter JMX monitoring for 'solr.core.control_collection.shard1.replica_n1' (registry 'solr.core.control_collection.shard1.replica_n1') enabled at server: com.sun.jmx.mbeanserver.JmxMBeanServer@133acf6
   [junit4]   2> 1619289 INFO  (qtp31761672-20559) [    ] o.a.s.c.SolrCore solr.RecoveryStrategy.Builder
   [junit4]   2> 1619289 INFO  (qtp31761672-20559) [    ] o.a.s.c.SolrCore [[control_collection_shard1_replica_n1] ] Opening new SolrCore at [/home/jenkins/workspace/Lucene-Solr-master-Linux/solr/build/solr-core/test/J2/temp/solr.cloud.HttpPartitionTest_262B93D78B5E421F-001/control-001/cores/control_collection_shard1_replica_n1], dataDir=[/home/jenkins/workspace/Lucene-Solr-master-Linux/solr/build/solr-core/test/J2/temp/solr.cloud.HttpPartitionTest_262B93D78B5E421F-001/control-001/cores/control_collection_shard1_replica_n1/data/]
   [junit4]   2> 1619291 INFO  (qtp31761672-20559) [    ] o.a.s.u.RandomMergePolicy RandomMergePolicy wrapping class org.apache.lucene.index.TieredMergePolicy: [TieredMergePolicy: maxMergeAtOnce=34, maxMergeAtOnceExplicit=30, maxMergedSegmentMB=83.3388671875, floorSegmentMB=1.2861328125, forceMergeDeletesPctAllowed=22.642799959419058, segmentsPerTier=17.0, maxCFSSegmentSizeMB=8.796093022207999E12, noCFSRatio=0.6168663172757627
   [junit4]   2> 1619293 WARN  (qtp31761672-20559) [    ] o.a.s.c.RequestHandlers INVALID paramSet a in requestHandler {type = requestHandler,name = /dump,class = DumpRequestHandler,attributes = {initParams=a, name=/dump, class=DumpRequestHandler},args = {defaults={a=A,b=B}}}
   [junit4]   2> 1619328 INFO  (qtp31761672-20559) [    ] o.a.s.u.UpdateHandler Using UpdateLog implementation: org.apache.solr.update.UpdateLog
   [junit4]   2> 1619328 INFO  (qtp31761672-20559) [    ] o.a.s.u.UpdateLog Initializing UpdateLog: dataDir= defaultSyncLevel=FLUSH numRecordsToKeep=100 maxNumLogsToKeep=10 numVersionBuckets=65536
   [junit4]   2> 1619329 INFO  (qtp31761672-20559) [    ] o.a.s.u.CommitTracker Hard AutoCommit: disabled
   [junit4]   2> 1619329 INFO  (qtp31761672-20559) [    ] o.a.s.u.CommitTracker Soft AutoCommit: disabled
   [junit4]   2> 1619330 INFO  (qtp31761672-20559) [    ] o.a.s.u.RandomMergePolicy RandomMergePolicy wrapping class org.apache.lucene.index.LogDocMergePolicy: [LogDocMergePolicy: minMergeSize=1000, mergeFactor=48, maxMergeSize=9223372036854775807, maxMergeSizeForForcedMerge=9223372036854775807, calibrateSizeByDeletes=true, maxMergeDocs=2147483647, maxCFSSegmentSizeMB=8.796093022207999E12, noCFSRatio=0.32365302918939876]
   [junit4]   2> 1619330 INFO  (qtp31761672-20559) [    ] o.a.s.s.SolrIndexSearcher Opening [Searcher@1a9a6e7[control_collection_shard1_replica_n1] main]
   [junit4]   2> 1619331 INFO  (qtp31761672-20559) [    ] o.a.s.r.ManagedResourceStorage Configured ZooKeeperStorageIO with znodeBase: /configs/conf1
   [junit4]   2> 1619331 INFO  (qtp31761672-20559) [    ] o.a.s.r.ManagedResourceStorage Loaded null at path _rest_managed.json using ZooKeeperStorageIO:path=/configs/conf1
   [junit4]   2> 1619332 INFO  (qtp31761672-20559) [    ] o.a.s.h.ReplicationHandler Commits will be reserved for  10000
   [junit4]   2> 1619333 INFO  (searcherExecutor-6626-thread-1) [    ] o.a.s.c.SolrCore [control_collection_shard1_replica_n1] Registered new searcher Searcher@1a9a6e7[control_collection_shard1_replica_n1] main{ExitableDirectoryReader(UninvertingDirectoryReader())}
   [junit4]   2> 1619333 INFO  (qtp31761672-20559) [    ] o.a.s.u.UpdateLog Could not find max version in index or recent updates, using new clock 1575886210330525696
   [junit4]   2> 1619337 INFO  (qtp31761672-20559) [    ] o.a.s.c.ShardLeaderElectionContext Enough replicas found to continue.
   [junit4]   2> 1619337 INFO  (qtp31761672-20559) [    ] o.a.s.c.ShardLeaderElectionContext I may be the new leader - try and sync
   [junit4]   2> 1619337 INFO  (qtp31761672-20559) [    ] o.a.s.c.SyncStrategy Sync replicas to http://127.0.0.1:40273/control_collection_shard1_replica_n1/
   [junit4]   2> 1619337 INFO  (qtp31761672-20559) [    ] o.a.s.c.SyncStrategy Sync Success - now sync replicas to me
   [junit4]   2> 1619337 INFO  (qtp31761672-20559) [    ] o.a.s.c.SyncStrategy http://127.0.0.1:40273/control_collection_shard1_replica_n1/ has no replicas
   [junit4]   2> 1619337 INFO  (qtp31761672-20559) [    ] o.a.s.c.ShardLeaderElectionContext Found all replicas participating in election, clear LIR
   [junit4]   2> 1619338 INFO  (qtp31761672-20559) [    ] o.a.s.c.ShardLeaderElectionContext I am the new leader: http://127.0.0.1:40273/control_collection_shard1_replica_n1/ shard1
   [junit4]   2> 1619439 INFO  (zkCallback-4196-thread-1) [    ] o.a.s.c.c.ZkStateReader A cluster state change: [WatchedEvent state:SyncConnected type:NodeDataChanged path:/collections/control_collection/state.json] for collection [control_collection] has occurred - updating... (live nodes size: [1])
   [junit4]   2> 1619489 INFO  (qtp31761672-20559) [    ] o.a.s.c.ZkController I am the leader, no recovery necessary
   [junit4]   2> 1619490 INFO  (qtp31761672-20559) [    ] o.a.s.s.HttpSolrCall [admin] webapp=null path=/admin/cores params={qt=/admin/cores&collection.configName=conf1&newCollection=true&name=control_collection_shard1_replica_n1&action=CREATE&numShards=1&collection=control_collection&shard=shard1&wt=javabin&version=2&replicaType=NRT} status=0 QTime=1325
   [junit4]   2> 1619492 INFO  (qtp31761672-20557) [    ] o.a.s.h.a.CollectionsHandler Wait for new collection to be active for at most 30 seconds. Check all shard replicas
   [junit4]   2> 1619593 INFO  (zkCallback-4196-thread-2) [    ] o.a.s.c.c.ZkStateReader A cluster state change: [WatchedEvent state:SyncConnected type:NodeDataChanged path:/collections/control_collection/state.json] for collection [control_collection] has occurred - updating... (live nodes size: [1])
   [junit4]   2> 1620062 INFO  (OverseerCollectionConfigSetProcessor-98492888039751684-127.0.0.1:40273_-n_0000000000) [    ] o.a.s.c.OverseerTaskQueue Response ZK path: /overseer/collection-queue-work/qnr-0000000000 doesn't exist.  Requestor may have disconnected from ZooKeeper
   [junit4]   2> 1620493 INFO  (qtp31761672-20557) [    ] o.a.s.s.HttpSolrCall [admin] webapp=null path=/admin/collections params={replicationFactor=1&collection.configName=conf1&name=control_collection&nrtReplicas=1&action=CREATE&numShards=1&createNodeSet=127.0.0.1:40273_&wt=javabin&version=2} status=0 QTime=2434
   [junit4]   2> 1620497 INFO  (TEST-HttpPartitionTest.test-seed#[262B93D78B5E421F]) [    ] o.a.s.c.c.ZkStateReader Updated live nodes from ZooKeeper... (0) -> (1)
   [junit4]   2> 1620498 INFO  (TEST-HttpPartitionTest.test-seed#[262B93D78B5E421F]) [    ] o.a.s.c.s.i.ZkClientClusterStateProvider Cluster at 127.0.0.1:46215/solr ready
   [junit4]   2> 1620498 INFO  (TEST-HttpPartitionTest.test-seed#[262B93D78B5E421F]) [    ] o.a.s.c.ChaosMonkey monkey: init - expire sessions:false cause connection loss:false
   [junit4]   2> 1620498 INFO  (SocketProxy-Acceptor-40273) [    ] o.a.s.c.SocketProxy accepted Socket[addr=/127.0.0.1,port=58946,localport=40273], receiveBufferSize:531000
   [junit4]   2> 1620499 INFO  (SocketProxy-Acceptor-40273) [    ] o.a.s.c.SocketProxy proxy connection Socket[addr=/127.0.0.1,port=36765,localport=37968], receiveBufferSize=530904
   [junit4]   2> 1620499 INFO  (qtp31761672-20557) [    ] o.a.s.h.a.CollectionsHandler Invoked Collection Action :create with params replicationFactor=1&collection.configName=conf1&name=collection1&nrtReplicas=1&action=CREATE&numShards=2&createNodeSet=&stateFormat=1&wt=javabin&version=2 and sendToOCPQueue=true
   [junit4]   2> 1620500 INFO  (OverseerThreadFactory-6623-thread-2) [    ] o.a.s.c.CreateCollectionCmd Create collection collection1
   [junit4]   2> 1620501 WARN  (OverseerThreadFactory-6623-thread-2) [    ] o.a.s.c.CreateCollectionCmd It is unusual to create a collection (collection1) without cores.
   [junit4]   2> 1620703 INFO  (qtp31761672-20557) [    ] o.a.s.h.a.CollectionsHandler Wait for new collection to be active for at most 30 seconds. Check all shard replicas
   [junit4]   2> 1620703 INFO  (qtp31761672-20557) [    ] o.a.s.s.HttpSolrCall [admin] webapp=null path=/admin/collections params={replicationFactor=1&collection.configName=conf1&name=collection1&nrtReplicas=1&action=CREATE&numShards=2&createNodeSet=&stateFormat=1&wt=javabin&version=2} status=0 QTime=204
   [junit4]   2> 1620799 INFO  (TEST-HttpPartitionTest.test-seed#[262B93D78B5E421F]) [    ] o.a.s.c.AbstractFullDistribZkTestBase create jetty 1 in directory /home/jenkins/workspace/Lucene-Solr-master-Linux/solr/build/solr-core/test/J2/temp/solr.cloud.HttpPartitionTest_262B93D78B5E421F-001/shard-1-001 of type TLOG
   [junit4]   2> 1620799 INFO  (TEST-HttpPartitionTest.test-seed#[262B93D78B5E421F]) [    ] o.e.j.s.Server jetty-9.3.14.v20161028
   [junit4]   2> 1620800 INFO  (TEST-HttpPartitionTest.test-seed#[262B93D78B5E421F]) [    ] o.e.j.s.h.ContextHandler Started o.e.j.s.ServletContextHandler@17bdb39{/,null,AVAILABLE}
   [junit4]   2> 1620800 INFO  (TEST-HttpPartitionTest.test-seed#[262B93D78B5E421F]) [    ] o.e.j.s.AbstractConnector Started ServerConnector@21cc54{HTTP/1.1,[http/1.1]}{127.0.0.1:42879}
   [junit4]   2> 1620801 INFO  (TEST-HttpPartitionTest.test-seed#[262B93D78B5E421F]) [    ] o.e.j.s.Server Started @1621772ms
   [junit4]   2> 1620801 INFO  (TEST-HttpPartitionTest.test-seed#[262B93D78B5E421F]) [    ] o.a.s.c.s.e.JettySolrRunner Jetty properties: {hostContext=/, solrconfig=solrconfig.xml, solr.data.dir=/home/jenkins/workspace/Lucene-Solr-master-Linux/solr/build/solr-core/test/J2/temp/solr.cloud.HttpPartitionTest_262B93D78B5E421F-001/tempDir-001/jetty1, hostPort=44871, coreRootDirectory=/home/jenkins/workspace/Lucene-Solr-master-Linux/solr/build/solr-core/test/J2/temp/solr.cloud.HttpPartitionTest_262B93D78B5E421F-001/shard-1-001/cores, replicaType=TLOG}
   [junit4]   2> 1620801 ERROR (TEST-HttpPartitionTest.test-seed#[262B93D78B5E421F]) [    ] o.a.s.s.StartupLoggingUtils Missing Java Option solr.log.dir. Logging may be missing or incomplete.
   [junit4]   2> 1620801 INFO  (TEST-HttpPartitionTest.test-seed#[262B93D78B5E421F]) [    ] o.a.s.s.SolrDispatchFilter  ___      _       Welcome to Apache Solr? version 8.0.0
   [junit4]   2> 1620801 INFO  (TEST-HttpPartitionTest.test-seed#[262B93D78B5E421F]) [    ] o.a.s.s.SolrDispatchFilter / __| ___| |_ _   Starting in cloud mode on port null
   [junit4]   2> 1620801 INFO  (TEST-HttpPartitionTest.test-seed#[262B93D78B5E421F]) [    ] o.a.s.s.SolrDispatchFilter \__ \/ _ \ | '_|  Install dir: null, Default config dir: null
   [junit4]   2> 1620801 INFO  (TEST-HttpPartitionTest.test-seed#[262B93D78B5E421F]) [    ] o.a.s.s.SolrDispatchFilter |___/\___/_|_|    Start time: 2017-08-16T11:16:45.839633Z
   [junit4]   2> 1620803 WARN  (NIOServerCxn.Factory:0.0.0.0/0.0.0.0:0) [    ] o.a.z.s.NIOServerCnxn caught end of stream exception
   [junit4]   2> EndOfStreamException: Unable to read additional data from client sessionid 0x15deac284830007, likely client has closed socket
   [junit4]   2> 	at org.apache.zookeeper.server.NIOServerCnxn.doIO(NIOServerCnxn.java:239)
   [junit4]   2> 	at org.apache.zookeeper.server.NIOServerCnxnFactory.run(NIOServerCnxnFactory.java:203)
   [junit4]   2> 	at java.base/java.lang.Thread.run(Thread.java:844)
   [junit4]   2> 1620803 INFO  (TEST-HttpPartitionTest.test-seed#[262B93D78B5E421F]) [    ] o.a.s.s.SolrDispatchFilter Loading solr.xml from SolrHome (not found in ZooKeeper)
   [junit4]   2> 1620803 INFO  (TEST-HttpPartitionTest.test-seed#[262B93D78B5E421F]) [    ] o.a.s.c.SolrXmlConfig Loading container configuration from /home/jenkins/workspace/Lucene-Solr-master-Linux/solr/build/solr-core/test/J2/temp/solr.cloud.HttpPartitionTest_262B93D78B5E421F-001/shard-1-001/solr.xml
   [junit4]   2> 1620805 INFO  (TEST-HttpPartitionTest.test-seed#[262B93D78B5E421F]) [    ] o.a.s.c.SolrXmlConfig MBean server found: com.sun.jmx.mbeanserver.JmxMBeanServer@133acf6, but no JMX reporters were configured - adding default JMX reporter.
   [junit4]   2> 1620808 INFO  (TEST-HttpPartitionTest.test-seed#[262B93D78B5E421F]) [    ] o.a.s.c.ZkContainer Zookeeper client=127.0.0.1:46215/solr
   [junit4]   2> 1620812 INFO  (TEST-HttpPartitionTest.test-seed#[262B93D78B5E421F]) [    ] o.a.s.c.c.ZkStateReader Updated live nodes from ZooKeeper... (0) -> (1)
   [junit4]   2> 1620813 INFO  (TEST-HttpPartitionTest.test-seed#[262B93D78B5E421F]) [    ] o.a.s.c.Overseer Overseer (id=null) closing
   [junit4]   2> 1620814 INFO  (TEST-HttpPartitionTest.test-seed#[262B93D78B5E421F]) [    ] o.a.s.c.ZkController Register node as live in ZooKeeper:/live_nodes/127.0.0.1:44871_
   [junit4]   2> 1620814 INFO  (zkCallback-4208-thread-1) [    ] o.a.s.c.c.ZkStateReader Updated live nodes from ZooKeeper... (1) -> (2)
   [junit4]   2> 1620814 INFO  (zkCallback-4196-thread-2) [    ] o.a.s.c.c.ZkStateReader Updated live nodes from ZooKeeper... (1) -> (2)
   [junit4]   2> 1620814 INFO  (zkCallback-4203-thread-1) [    ] o.a.s.c.c.ZkStateReader Updated live nodes from ZooKeeper... (1) -> (2)
   [junit4]   2> 1620874 INFO  (TEST-HttpPartitionTest.test-seed#[262B93D78B5E421F]) [    ] o.a.s.m.r.SolrJmxReporter JMX monitoring for 'solr.node' (registry 'solr.node') enabled at server: com.sun.jmx.mbeanserver.JmxMBeanServer@133acf6
   [junit4]   2> 1620883 INFO  (TEST-HttpPartitionTest.test-seed#[262B93D78B5E421F]) [    ] o.a.s.m.r.SolrJmxReporter JMX monitoring for 'solr.jvm' (registry 'solr.jvm') enabled at server: com.sun.jmx.mbeanserver.JmxMBeanServer@133acf6
   [junit4]   2> 1620883 INFO  (TEST-HttpPartitionTest.test-seed#[262B93D78B5E421F]) [    ] o.a.s.m.r.SolrJmxReporter JMX monitoring for 'solr.jetty' (registry 'solr.jetty') enabled at server: com.sun.jmx.mbeanserver.JmxMBeanServer@133acf6
   [junit4]   2> 1620884 INFO  (TEST-HttpPartitionTest.test-seed#[262B93D78B5E421F]) [    ] o.a.s.c.CorePropertiesLocator Found 0 core definitions underneath /home/jenkins/workspace/Lucene-Solr-master-Linux/solr/build/solr-core/test/J2/temp/solr.cloud.HttpPartitionTest_262B93D78B5E421F-001/shard-1-001/cores
   [junit4]   2> 1620901 INFO  (qtp31761672-20558) [    ] o.a.s.h.a.CollectionsHandler Invoked Collection Action :addreplica with params node=127.0.0.1:44871_&action=ADDREPLICA&collection=collection1&shard=shard2&type=TLOG&wt=javabin&version=2 and sendToOCPQueue=true
   [junit4]   2> 1620902 INFO  (OverseerThreadFactory-6623-thread-3) [    ] o.a.s.c.AddReplicaCmd Node Identified 127.0.0.1:44871_ for creating new replica
   [junit4]   2> 1620902 INFO  (OverseerCollectionConfigSetProcessor-98492888039751684-127.0.0.1:40273_-n_0000000000) [    ] o.a.s.c.OverseerTaskQueue Response ZK path: /overseer/collection-queue-work/qnr-0000000002 doesn't exist.  Requestor may have disconnected from ZooKeeper
   [junit4]   2> 1620903 INFO  (SocketProxy-Acceptor-44871) [    ] o.a.s.c.SocketProxy accepted Socket[addr=/127.0.0.1,port=37138,localport=44871], receiveBufferSize:531000
   [junit4]   2> 1620903 INFO  (SocketProxy-Acceptor-44871) [    ] o.a.s.c.SocketProxy proxy connection Socket[addr=/127.0.0.1,port=42879,localport=51650], receiveBufferSize=530904
   [junit4]   2> 1620903 INFO  (qtp21766048-20606) [    ] o.a.s.h.a.CoreAdminOperation core create command qt=/admin/cores&collection.configName=conf1&name=collection1_shard2_replica_t41&action=CREATE&collection=collection1&shard=shard2&wt=javabin&version=2&replicaType=TLOG
   [junit4]   2> 1620903 INFO  (qtp21766048-20606) [    ] o.a.s.c.TransientSolrCoreCacheDefault Allocating transient cache for 4 transient cores
   [junit4]   2> 1621911 INFO  (qtp21766048-20606) [    ] o.a.s.c.SolrConfig Using Lucene MatchVersion: 8.0.0
   [junit4]   2> 1621921 INFO  (qtp21766048-20606) [    ] o.a.s.s.IndexSchema [collection1_shard2_replica_t41] Schema name=test
   [junit4]   2> 1622001 INFO  (qtp21766048-20606) [    ] o.a.s.s.IndexSchema Loaded schema test/1.0 with uniqueid field id
   [junit4]   2> 1622009 INFO  (qtp21766048-20606) [    ] o.a.s.c.CoreContainer Creating SolrCore 'collection1_shard2_replica_t41' using configuration from collection collection1, trusted=true
   [junit4]   2> 1622009 INFO  (qtp21766048-20606) [    ] o.a.s.m.r.SolrJmxReporter JMX monitoring for 'solr.core.collection1.shard2.replica_t41' (registry 'solr.core.collection1.shard2.replica_t41') enabled at server: com.sun.jmx.mbeanserver.JmxMBeanServer@133acf6
   [junit4]   2> 1622009 INFO  (qtp21766048-20606) [    ] o.a.s.c.SolrCore solr.RecoveryStrategy.Builder
   [junit4]   2> 1622009 INFO  (qtp21766048-20606) [    ] o.a.s.c.SolrCore [[collection1_shard2_replica_t41] ] Opening new SolrCore at [/home/jenkins/workspace/Lucene-Solr-master-Linux/solr/build/solr-core/test/J2/temp/solr.cloud.HttpPartitionTest_262B93D78B5E421F-001/shard-1-001/cores/collection1_shard2_replica_t41], dataDir=[/home/jenkins/workspace/Lucene-Solr-master-Linux/solr/build/solr-core/test/J2/temp/solr.cloud.HttpPartitionTest_262B93D78B5E421F-001/shard-1-001/cores/collection1_shard2_replica_t41/data/]
   [junit4]   2> 1622012 INFO  (qtp21766048-20606) [    ] o.a.s.u.RandomMergePolicy RandomMergePolicy wrapping class org.apache.lucene.index.TieredMergePolicy: [TieredMergePolicy: maxMergeAtOnce=34, maxMergeAtOnceExplicit=30, maxMergedSegmentMB=83.3388671875, floorSegmentMB=1.2861328125, forceMergeDeletesPctAllowed=22.642799959419058, segmentsPerTier=17.0, maxCFSSegmentSizeMB=8.796093022207999E12, noCFSRatio=0.6168663172757627
   [junit4]   2> 1622013 WARN  (qtp21766048-20606) [    ] o.a.s.c.RequestHandlers INVALID paramSet a in requestHandler {type = requestHandler,name = /dump,class = DumpRequestHandler,attributes = {initParams=a, name=/dump, class=DumpRequestHandler},args = {defaults={a=A,b=B}}}
   [junit4]   2> 1622048 INFO  (qtp21766048-20606) [    ] o.a.s.u.UpdateHandler Using UpdateLog implementation: org.apache.solr.update.UpdateLog
   [junit4]   2> 1622048 INFO  (qtp21766048-20606) [    ] o.a.s.u.UpdateLog Initializing UpdateLog: dataDir= defaultSyncLevel=FLUSH numRecordsToKeep=100 maxNumLogsToKeep=10 numVersionBuckets=65536
   [junit4]   2> 1622049 INFO  (qtp21766048-20606) [    ] o.a.s.u.CommitTracker Hard AutoCommit: disabled
   [junit4]   2> 1622049 INFO  (qtp21766048-20606) [    ] o.a.s.u.CommitTracker Soft AutoCommit: disabled
   [junit4]   2> 1622050 INFO  (qtp21766048-20606) [    ] o.a.s.u.RandomMergePolicy RandomMergePolicy wrapping class org.apache.lucene.index.LogDocMergePolicy: [LogDocMergePolicy: minMergeSize=1000, mergeFactor=48, maxMergeSize=9223372036854775807, maxMergeSizeForForcedMerge=9223372036854775807, calibrateSizeByDeletes=true, maxMergeDocs=2147483647, maxCFSSegmentSizeMB=8.796093022207999E12, noCFSRatio=0.32365302918939876]
   [junit4]   2> 1622050 INFO  (qtp21766048-20606) [    ] o.a.s.s.SolrIndexSearcher Opening [Searcher@b9ed2a[collection1_shard2_replica_t41] main]
   [junit4]   2> 1622051 INFO  (qtp21766048-20606) [    ] o.a.s.r.ManagedResourceStorage Configured ZooKeeperStorageIO with znodeBase: /configs/conf1
   [junit4]   2> 1622051 INFO  (qtp21766048-20606) [    ] o.a.s.r.ManagedResourceStorage Loaded null at path _rest_managed.json using ZooKeeperStorageIO:path=/configs/conf1
   [junit4]   2> 1622052 INFO  (qtp21766048-20606) [    ] o.a.s.h.ReplicationHandler Commits will be reserved for  10000
   [junit4]   2> 1622053 INFO  (searcherExecutor-6637-thread-1) [    ] o.a.s.c.SolrCore [collection1_shard2_replica_t41] Registered new searcher Searcher@b9ed2a[collection1_shard2_replica_t41] main{ExitableDirectoryReader(UninvertingDirectoryReader())}
   [junit4]   2> 1622053 INFO  (qtp21766048-20606) [    ] o.a.s.u.UpdateLog Could not find max version in index or recent updates, using new clock 1575886213182652416
   [junit4]   2> 1622065 INFO  (qtp21766048-20606) [    ] o.a.s.c.ShardLeaderElectionContext Enough replicas found to continue.
   [junit4]   2> 1622065 INFO  (qtp21766048-20606) [    ] o.a.s.c.ShardLeaderElectionContext I may be the new leader - try and sync
   [junit4]   2> 1622065 INFO  (qtp21766048-20606) [    ] o.a.s.c.SyncStrategy Sync replicas to http://127.0.0.1:44871/collection1_shard2_replica_t41/
   [junit4]   2> 1622065 INFO  (qtp21766048-20606) [    ] o.a.s.c.SyncStrategy Sync Success - now sync replicas to me
   [junit4]   2> 1622065 INFO  (qtp21766048-20606) [    ] o.a.s.c.SyncStrategy http://127.0.0.1:44871/collection1_shard2_replica_t41/ has no replicas
   [junit4]   2> 1622066 INFO  (qtp21766048-20606) [    ] o.a.s.c.ShardLeaderElectionContext Found all replicas participating in election, clear LIR
   [junit4]   2> 1622066 INFO  (qtp21766048-20606) [    ] o.a.s.c.ZkController collection1_shard2_replica_t41 stopping background replication from leader
   [junit4]   2> 1622067 INFO  (qtp21766048-20606) [    ] o.a.s.c.ShardLeaderElectionContext I am the new leader: http://127.0.0.1:44871/collection1_shard2_replica_t41/ shard2
   [junit4]   2> 1622218 INFO  (qtp21766048-20606) [    ] o.a.s.c.ZkController I am the leader, no recovery necessary
   [junit4]   2> 1622219 INFO  (qtp21766048-20606) [    ] o.a.s.s.HttpSolrCall [admin] webapp=null path=/admin/cores params={qt=/admin/cores&collection.configName=conf1&name=collection1_shard2_replica_t41&action=CREATE&collection=collection1&shard=shard2&wt=javabin&version=2&replicaType=TLOG} status=0 QTime=1315
   [junit4]   2> 1622220 INFO  (qtp31761672-20558) [    ] o.a.s.s.HttpSolrCall [admin] webapp=null path=/admin/collections params={node=127.0.0.1:44871_&action=ADDREPLICA&collection=collection1&shard=shard2&type=TLOG&wt=javabin&version=2} status=0 QTime=1318
   [junit4]   2> 1622303 INFO  (TEST-HttpPartitionTest.test-seed#[262B93D78B5E421F]) [    ] o.a.s.c.AbstractFullDistribZkTestBase create jetty 2 in directory /home/jenkins/workspace/Lucene-Solr-master-Linux/solr/build/solr-core/test/J2/temp/solr.cloud.HttpPartitionTest_262B93D78B5E421F-001/shard-2-001 of type TLOG
   [junit4]   2> 1622303 INFO  (TEST-HttpPartitionTest.test-seed#[262B93D78B5E421F]) [    ] o.e.j.s.Server jetty-9.3.14.v20161028
   [junit4]   2> 1622303 INFO  (TEST-HttpPartitionTest.test-seed#[262B93D78B5E421F]) [    ] o.e.j.s.h.ContextHandler Started o.e.j.s.ServletContextHandler@1a6c41c{/,null,AVAILABLE}
   [junit4]   2> 1622304 INFO  (TEST-HttpPartitionTest.test-seed#[262B93D78B5E421F]) [    ] o.e.j.s.AbstractConnector Started ServerConnector@17c86e4{HTTP/1.1,[http/1.1]}{127.0.0.1:43409}
   [junit4]   2> 1622304 INFO  (TEST-HttpPartitionTest.test-seed#[262B93D78B5E421F]) [    ] o.e.j.s.Server Started @1623275ms
   [junit4]   2> 1622304 INFO  (TEST-HttpPartitionTest.test-seed#[262B93D78B5E421F]) [    ] o.a.s.c.s.e.JettySolrRunner Jetty properties: {hostContext=/, solrconfig=solrconfig.xml, solr.data.dir=/home/jenkins/workspace/Lucene-Solr-master-Linux/solr/build/solr-core/test/J2/temp/solr.cloud.HttpPartitionTest_262B93D78B5E421F-001/tempDir-001/jetty2, hostPort=46243, coreRootDirectory=/home/jenkins/workspace/Lucene-Solr-master-Linux/solr/build/solr-core/test/J2/temp/solr.cloud.HttpPartitionTest_262B93D78B5E421F-001/shard-2-001/cores, replicaType=TLOG}
   [junit4]   2> 1622304 ERROR (TEST-HttpPartitionTest.test-seed#[262B93D78B5E421F]) [    ] o.a.s.s.StartupLoggingUtils Missing Java Option solr.log.dir. Logging may be missing or incomplete.
   [junit4]   2> 1622304 INFO  (TEST-HttpPartitionTest.test-seed#[262B93D78B5E421F]) [    ] o.a.s.s.SolrDispatchFilter  ___      _       Welcome to Apache Solr? version 8.0.0
   [junit4]   2> 1622304 INFO  (TEST-HttpPartitionTest.test-seed#[262B93D78B5E421F]) [    ] o.a.s.s.SolrDispatchFilter / __| ___| |_ _   Starting in cloud mode on port null
   [junit4]   2> 1622304 INFO  (TEST-HttpPartitionTest.test-seed#[262B93D78B5E421F]) [    ] o.a.s.s.SolrDispatchFilter \__ \/ _ \ | '_|  Install dir: null, Default config dir: null
   [junit4]   2> 1622304 INFO  (TEST-HttpPartitionTest.test-seed#[262B93D78B5E421F]) [    ] o.a.s.s.SolrDispatchFilter |___/\___/_|_|    Start time: 2017-08-16T11:16:47.342785Z
   [junit4]   2> 1622306 INFO  (TEST-HttpPartitionTest.test-seed#[262B93D78B5E421F]) [    ] o.a.s.s.SolrDispatchFilter Loading solr.xml from SolrHome (not found in ZooKeeper)
   [junit4]   2> 1622306 INFO  (TEST-HttpPartitionTest.test-seed#[262B93D78B5E421F]) [    ] o.a.s.c.SolrXmlConfig Loading container configuration from /home/jenkins/workspace/Lucene-Solr-master-Linux/solr/build/solr-core/test/J2/temp/solr.cloud.HttpPartitionTest_262B93D78B5E421F-001/shard-2-001/solr.xml
   [junit4]   2> 1622307 INFO  (TEST-HttpPartitionTest.test-seed#[262B93D78B5E421F]) [    ] o.a.s.c.SolrXmlConfig MBean server found: com.sun.jmx.mbeanserver.JmxMBeanServer@133acf6, but no JMX reporters were configured - adding default JMX reporter.
   [junit4]   2> 1622311 INFO  (TEST-HttpPartitionTest.test-seed#[262B93D78B5E421F]) [    ] o.a.s.c.ZkContainer Zookeeper client=127.0.0.1:46215/solr
   [junit4]   2> 1622312 WARN  (NIOServerCxn.Factory:0.0.0.0/0.0.0.0:0) [    ] o.a.z.s.NIOServerCnxn caught end of stream exception
   [junit4]   2> EndOfStreamException: Unable to read additional data from client sessionid 0x15deac28483000b, likely client has closed socket
   [junit4]   2> 	at org.apache.zookeeper.server.NIOServerCnxn.doIO(NIOServerCnxn.java:239)
   [junit4]   2> 	at org.apache.zookeeper.server.NIOServerCnxnFactory.run(NIOServerCnxnFactory.java:203)
   [junit4]   2> 	at java.base/java.lang.Thread.run(Thread.java:844)
   [junit4]   2> 1622314 INFO  (TEST-HttpPartitionTest.test-seed#[262B93D78B5E421F]) [    ] o.a.s.c.c.ZkStateReader Updated live nodes from ZooKeeper... (0) -> (2)
   [junit4]   2> 1622315 INFO  (TEST-HttpPartitionTest.test-seed#[262B93D78B5E421F]) [    ] o.a.s.c.Overseer Overseer (id=null) closing
   [junit4]   2> 1622315 INFO  (TEST-HttpPartitionTest.test-seed#[262B93D78B5E421F]) [    ] o.a.s.c.ZkController Register node as live in ZooKeeper:/live_nodes/127.0.0.1:46243_
   [junit4]   2> 1622316 INFO  (zkCallback-4196-thread-2) [    ] o.a.s.c.c.ZkStateReader Updated live nodes from ZooKeeper... (2) -> (3)
   [junit4]   2> 1622316 INFO  (zkCallback-4208-thread-1) [    ] o.a.s.c.c.ZkStateReader Updated live nodes from ZooKeeper... (2) -> (3)
   [junit4]   2> 1622316 INFO  (zkCallback-4203-thread-1) [    ] o.a.s.c.c.ZkStateReader Updated live nodes from ZooKeeper... (2) -> (3)
   [junit4]   2> 1622316 INFO  (zkCallback-4214-thread-1) [    ] o.a.s.c.c.ZkStateReader Updated live nodes from ZooKeeper... (2) -> (3)
   [junit4]   2> 1622429 INFO  (TEST-HttpPartitionTest.test-seed#[262B93D78B5E421F]) [    ] o.a.s.m.r.SolrJmxReporter JMX monitoring for 'solr.node' (registry 'solr.node') enabled at server: com.sun.jmx.mbeanserver.JmxMBeanServer@133acf6
   [junit4]   2> 1622438 INFO  (TEST-HttpPartitionTest.test-seed#[262B93D78B5E421F]) [    ] o.a.s.m.r.SolrJmxReporter JMX monitoring for 'solr.jvm' (registry 'solr.jvm') enabled at server: com.sun.jmx.mbeanserver.JmxMBeanServer@133acf6
   [junit4]   2> 1622438 INFO  (TEST-HttpPartitionTest.test-seed#[262B93D78B5E421F]) [    ] o.a.s.m.r.SolrJmxReporter JMX monitoring for 'solr.jetty' (registry 'solr.jetty') enabled at server: com.sun.jmx.mbeanserver.JmxMBeanServer@133acf6
   [junit4]   2> 1622439 INFO  (TEST-HttpPartitionTest.test-seed#[262B93D78B5E421F]) [    ] o.a.s.c.CorePropertiesLocator Found 0 core definitions underneath /home/jenkins/workspace/Lucene-Solr-master-Linux/solr/build/solr-core/test/J2/temp/solr.cloud.HttpPartitionTest_262B93D78B5E421F-001/shard-2-001/cores
   [junit4]   2> 1622462 INFO  (qtp31761672-20559) [    ] o.a.s.h.a.CollectionsHandler Invoked Collection Action :addreplica with params node=127.0.0.1:46243_&action=ADDREPLICA&collection=collection1&shard=shard1&type=TLOG&wt=javabin&version=2 and sendToOCPQueue=true
   [junit4]   2> 1622463 INFO  (OverseerThreadFactory-6623-thread-4) [    ] o.a.s.c.AddReplicaCmd Node Identified 127.0.0.1:46243_ for creating new replica
   [junit4]   2> 1622463 INFO  (OverseerCollectionConfigSetProcessor-98492888039751684-127.0.0.1:40273_-n_0000000000) [    ] o.a.s.c.OverseerTaskQueue Response ZK path: /overseer/collection-queue-work/qnr-0000000004 doesn't exist.  Requestor may have disconnected from ZooKeeper
   [junit4]   2> 1622464 INFO  (SocketProxy-Acceptor-46243) [    ] o.a.s.c.SocketProxy accepted Socket[addr=/127.0.0.1,port=39358,localport=46243], receiveBufferSize:531000
   [junit4]   2> 1622464 INFO  (SocketProxy-Acceptor-46243) [    ] o.a.s.c.SocketProxy proxy connection Socket[addr=/127.0.0.1,port=43409,localport=34556], receiveBufferSize=530904
   [junit4]   2> 1622464 INFO  (qtp29941995-20638) [    ] o.a.s.h.a.CoreAdminOperation core create command qt=/admin/cores&collection.configName=conf1&name=collection1_shard1_replica_t43&action=CREATE&collection=collection1&shard=shard1&wt=javabin&version=2&replicaType=TLOG
   [junit4]   2> 1622464 INFO  (qtp29941995-20638) [    ] o.a.s.c.TransientSolrCoreCacheDefault Allocating transient cache for 4 transient cores
   [junit4]   2> 1623473 INFO  (qtp29941995-20638) [    ] o.a.s.c.SolrConfig Using Lucene MatchVersion: 8.0.0
   [junit4]   2> 1623491 INFO  (qtp29941995-20638) [    ] o.a.s.s.IndexSchema [collection1_shard1_replica_t43] Schema name=test
   [junit4]   2> 1623573 INFO  (qtp29941995-20638) [    ] o.a.s.s.IndexSchema Loaded schema test/1.0 with uniqueid field id
   [junit4]   2> 1623581 INFO  (qtp29941995-20638) [    ] o.a.s.c.CoreContainer Creating SolrCore 'collection1_shard1_replica_t43' using configuration from collection collection1, trusted=true
   [junit4]   2> 1623582 INFO  (qtp29941995-20638) [    ] o.a.s.m.r.SolrJmxReporter JMX monitoring for 'solr.core.collection1.shard1.replica_t43' (registry 'solr.core.collection1.shard1.replica_t43') enabled at server: com.sun.jmx.mbeanserver.JmxMBeanServer@133acf6
   [junit4]   2> 1623582 INFO  (qtp29941995-20638) [    ] o.a.s.c.SolrCore solr.RecoveryStrategy.Builder
   [junit4]   2> 1623582 INFO  (qtp29941995-20638) [    ] o.a.s.c.SolrCore [[collection1_shard1_replica_t43] ] Opening new SolrCore at [/home/jenkins/workspace/Lucene-Solr-master-Linux/solr/build/solr-core/test/J2/temp/solr.cloud.HttpPartitionTest_262B93D78B5E421F-001/shard-2-001/cores/collection1_shard1_replica_t43], dataDir=[/home/jenkins/workspace/Lucene-Solr-master-Linux/solr/build/solr-core/test/J2/temp/solr.cloud.HttpPartitionTest_262B93D78B5E421F-001/shard-2-001/cores/collection1_shard1_replica_t43/data/]
   [junit4]   2> 1623584 INFO  (qtp29941995-20638) [    ] o.a.s.u.RandomMergePolicy RandomMergePolicy wrapping class org.apache.lucene.index.TieredMergePolicy: [TieredMergePolicy: maxMergeAtOnce=34, maxMergeAtOnceExplicit=30, maxMergedSegmentMB=83.3388671875, floorSegmentMB=1.2861328125, forceMergeDeletesPctAllowed=22.642799959419058, segmentsPerTier=17.0, maxCFSSegmentSizeMB=8.796093022207999E12, noCFSRatio=0.6168663172757627
   [junit4]   2> 1623586 WARN  (qtp29941995-20638) [    ] o.a.s.c.RequestHandlers INVALID paramSet a in requestHandler {type = requestHandler,name = /dump,class = DumpRequestHandler,attributes = {initParams=a, name=/dump, class=DumpRequestHandler},args = {defaults={a=A,b=B}}}
   [junit4]   2> 1623625 INFO  (qtp29941995-20638) [    ] o.a.s.u.UpdateHandler Using UpdateLog implementation: org.apache.solr.update.UpdateLog
   [junit4]   2> 1623625 INFO  (qtp29941995-20638) [    ] o.a.s.u.UpdateLog Initializing UpdateLog: dataDir= defaultSyncLevel=FLUSH numRecordsToKeep=100 maxNumLogsToKeep=10 numVersionBuckets=65536
   [junit4]   2> 1623626 INFO  (qtp29941995-20638) [    ] o.a.s.u.CommitTracker Hard AutoCommit: disabled
   [junit4]   2> 1623626 INFO  (qtp29941995-20638) [    ] o.a.s.u.CommitTracker Soft AutoCommit: disabled
   [junit4]   2> 1623627 INFO  (qtp29941995-20638) [    ] o.a.s.u.RandomMergePolicy RandomMergePolicy wrapping class org.apache.lucene.index.LogDocMergePolicy: [LogDocMergePolicy: minMergeSize=1000, mergeFactor=48, maxMergeSize=9223372036854775807, maxMergeSizeForForcedMerge=9223372036854775807, calibrateSizeByDeletes=true, maxMergeDocs=2147483647, maxCFSSegmentSizeMB=8.796093022207999E12, noCFSRatio=0.32365302918939876]
   [junit4]   2> 1623627 INFO  (qtp29941995-20638) [    ] o.a.s.s.SolrIndexSearcher Opening [Searcher@195007d[collection1_shard1_replica_t43] main]
   [junit4]   2> 1623628 INFO  (qtp29941995-20638) [    ] o.a.s.r.ManagedResourceStorage Configured ZooKeeperStorageIO with znodeBase: /configs/conf1
   [junit4]   2> 1623629 INFO  (qtp29941995-20638) [    ] o.a.s.r.ManagedResourceStorage Loaded null at path _rest_managed.json using ZooKeeperStorageIO:path=/configs/conf1
   [junit4]   2> 1623629 INFO  (qtp29941995-20638) [    ] o.a.s.h.ReplicationHandler Commits will be reserved for  10000
   [junit4]   2> 1623629 INFO  (qtp29941995-20638) [    ] o.a.s.u.UpdateLog Could not find max version in index or recent updates, using new clock 1575886214835208192
   [junit4]   2> 1623630 INFO  (searcherExecutor-6648-thread-1) [    ] o.a.s.c.SolrCore [collection1_shard1_replica_t43] Registered new searcher Searcher@195007d[collection1_shard1_replica_t43] main{ExitableDirectoryReader(UninvertingDirectoryReader())}
   [junit4]   2> 1623633 INFO  (qtp29941995-20638) [    ] o.a.s.c.ShardLeaderElectionContext Enough replicas found to continue.
   [junit4]   2> 1623633 INFO  (qtp29941995-20638) [    ] o.a.s.c.ShardLeaderElectionContext I may be the new leader - try and sync
   [junit4]   2> 1623633 INFO  (qtp29941995-20638) [    ] o.a.s.c.SyncStrategy Sync replicas to http://127.0.0.1:46243/collection1_shard1_replica_t43/
   [junit4]   2> 1623633 INFO  (qtp29941995-20638) [    ] o.a.s.c.SyncStrategy Sync Success - now sync replicas to me
   [junit4]   2> 1623633 INFO  (qtp29941995-20638) [    ] o.a.s.c.SyncStrategy http://127.0.0.1:46243/collection1_shard1_replica_t43/ has no replicas
   [junit4]   2> 1623633 INFO  (qtp29941995-20638) [    ] o.a.s.c.ShardLeaderElectionContext Found all replicas participating in election, clear LIR
   [junit4]   2> 1623633 INFO  (qtp29941995-20638) [    ] o.a.s.c.ZkController collection1_shard1_replica_t43 stopping background replication from leader
   [junit4]   2> 1623634 INFO  (qtp29941995-20638) [    ] o.a.s.c.ShardLeaderElectionContext I am the new leader: http://127.0.0.1:46243/collection1_shard1_replica_t43/ shard1
   [junit4]   2> 1623785 INFO  (qtp29941995-20638) [    ] o.a.s.c.ZkController I am the leader, no recovery necessary
   [junit4]   2> 1623787 INFO  (qtp29941995-20638) [    ] o.a.s.s.HttpSolrCall [admin] webapp=null path=/admin/cores params={qt=/admin/cores&collection.configName=conf1&name=collection1_shard1_replica_t43&action=CREATE&collection=collection1&shard=shard1&wt=javabin&version=2&replicaType=TLOG} status=0 QTime=1322
   [junit4]   2> 1623788 INFO  (qtp31761672-20559) [    ] o.a.s.s.HttpSolrCall [admin] webapp=null path=/admin/collections params={node=127.0.0.1:46243_&action=ADDREPLICA&collection=collection1&shard=shard1&type=TLOG&wt=javabin&version=2} status=0 QTime=1326
   [junit4]   2> 1623876 INFO  (TEST-HttpPartitionTest.test-seed#[262B93D78B5E421F]) [    ] o.a.s.c.AbstractFullDistribZkTestBase create jetty 3 in directory /home/jenkins/workspace/Lucene-Solr-master-Linux/solr/build/solr-core/test/J2/temp/solr.cloud.HttpPartitionTest_262B93D78B5E421F-001/shard-3-001 of type TLOG
   [junit4]   2> 1623877 INFO  (TEST-HttpPartitionTest.test-seed#[262B93D78B5E421F]) [    ] o.e.j.s.Server jetty-9.3.14.v20161028
   [junit4]   2> 1623877 INFO  (TEST-HttpPartitionTest.test-seed#[262B93D78B5E421F]) [    ] o.e.j.s.h.ContextHandler Started o.e.j.s.ServletContextHandler@d3f3c6{/,null,AVAILABLE}
   [junit4]   2> 1623878 INFO  (TEST-HttpPartitionTest.test-seed#[262B93D78B5E421F]) [    ] o.e.j.s.AbstractConnector Started ServerConnector@1055342{HTTP/1.1,[http/1.1]}{127.0.0.1:42273}
   [junit4]   2> 1623878 INFO  (TEST-HttpPartitionTest.test-seed#[262B93D78B5E421F]) [    ] o.e.j.s.Server Started @1624849ms
   [junit4]   2> 1623878 INFO  (TEST-HttpPartitionTest.test-seed#[262B93D78B5E421F]) [    ] o.a.s.c.s.e.JettySolrRunner Jetty properties: {hostContext=/, solrconfig=solrconfig.xml, solr.data.dir=/home/jenkins/workspace/Lucene-Solr-master-Linux/solr/build/solr-core/test/J2/temp/solr.cloud.HttpPartitionTest_262B93D78B5E421F-001/tempDir-001/jetty3, hostPort=38323, coreRootDirectory=/home/jenkins/workspace/Lucene-Solr-master-Linux/solr/build/solr-core/test/J2/temp/solr.cloud.HttpPartitionTest_262B93D78B5E421F-001/shard-3-001/cores, replicaType=TLOG}
   [junit4]   2> 1623878 ERROR (TEST-HttpPartitionTest.test-seed#[262B93D78B5E421F]) [    ] o.a.s.s.StartupLoggingUtils Missing Java Option solr.log.dir. Logging may be missing or incomplete.
   [junit4]   2> 1623878 INFO  (TEST-HttpPartitionTest.test-seed#[262B93D78B5E421F]) [    ] o.a.s.s.SolrDispatchFilter  ___      _       Welcome to Apache Solr? version 8.0.0
   [junit4]   2> 1623878 INFO  (TEST-HttpPartitionTest.test-seed#[262B93D78B5E421F]) [    ] o.a.s.s.SolrDispatchFilter / __| ___| |_ _   Starting in cloud mode on port null
   [junit4]   2> 1623878 INFO  (TEST-HttpPartitionTest.test-seed#[262B93D78B5E421F]) [    ] o.a.s.s.SolrDispatchFilter \__ \/ _ \ | '_|  Install dir: null, Default config dir: null
   [junit4]   2> 1623878 INFO  (TEST-HttpPartitionTest.test-seed#[262B93D78B5E421F]) [    ] o.a.s.s.SolrDispatchFilter |___/\___/_|_|    Start time: 2017-08-16T11:16:48.916772Z
   [junit4]   2> 1623880 INFO  (TEST-HttpPartitionTest.test-seed#[262B93D78B5E421F]) [    ] o.a.s.s.SolrDispatchFilter Loading solr.xml from SolrHome (not found in ZooKeeper)
   [junit4]   2> 1623880 INFO  (TEST-HttpPartitionTest.test-seed#[262B93D78B5E421F]) [    ] o.a.s.c.SolrXmlConfig Loading container configuration from /home/jenkins/workspace/Lucene-Solr-master-Linux/solr/build/solr-core/test/J2/temp/solr.cloud.HttpPartitionTest_262B93D78B5E421F-001/shard-3-001/solr.xml
   [junit4]   2> 1623882 INFO  (TEST-HttpPartitionTest.test-seed#[262B93D78B5E421F]) [    ] o.a.s.c.SolrXmlConfig MBean server found: com.sun.jmx.mbeanserver.JmxMBeanServer@133acf6, but no JMX reporters were configured - adding default JMX reporter.
   [junit4]   2> 1623884 INFO  (TEST-HttpPartitionTest.test-seed#[262B93D78B5E421F]) [    ] o.a.s.c.ZkContainer Zookeeper client=127.0.0.1:46215/solr
   [junit4]   2> 1623888 INFO  (TEST-HttpPartitionTest.test-seed#[262B93D78B5E421F]) [    ] o.a.s.c.c.ZkStateReader Updated live nodes from ZooKeeper... (0) -> (3)
   [junit4]   2> 1623889 INFO  (TEST-HttpPartitionTest.test-seed#[262B93D78B5E421F]) [    ] o.a.s.c.Overseer Overseer (id=null) closing
   [junit4]   2> 1623890 INFO  (TEST-HttpPartitionTest.test-seed#[262B93D78B5E421F]) [    ] o.a.s.c.ZkController Register node as live in ZooKeeper:/live_nodes/127.0.0.1:38323_
   [junit4]   2> 1623890 INFO  (zkCallback-4203-thread-1) [    ] o.a.s.c.c.ZkStateReader Updated live nodes from ZooKeeper... (3) -> (4)
   [junit4]   2> 1623890 INFO  (zkCallback-4196-thread-2) [    ] o.a.s.c.c.ZkStateReader Updated live nodes from ZooKeeper... (3) -> (4)
   [junit4]   2> 1623890 INFO  (zkCallback-4208-thread-1) [    ] o.a.s.c.c.ZkStateReader Updated live nodes from ZooKeeper... (3) -> (4)
   [junit4]   2> 1623890 INFO  (zkCallback-4220-thread-1) [    ] o.a.s.c.c.ZkStateReader Updated live nodes from ZooKeeper... (3) -> (4)
   [junit4]   2> 1623890 INFO  (zkCallback-4214-thread-1) [    ] o.a.s.c.c.ZkStateReader Updated live nodes from ZooKeeper... (3) -> (4)
   [junit4]   2> 1623934 INFO  (TEST-HttpPartitionTest.test-seed#[262B93D78B5E421F]) [    ] o.a.s.m.r.SolrJmxReporter JMX monitoring for 'solr.node' (registry 'solr.node') enabled at server: com.sun.jmx.mbeanserver.JmxMBeanServer@133acf6
   [junit4]   2> 1623942 INFO  (TEST-HttpPartitionTest.test-seed#[262B93D78B5E421F]) [    ] o.a.s.m.r.SolrJmxReporter JMX monitoring for 'solr.jvm' (registry 'solr.jvm') enabled at server: com.sun.jmx.mbeanserver.JmxMBeanServer@133acf6
   [junit4]   2> 1623942 INFO  (TEST-HttpPartitionTest.test-seed#[262B93D78B5E421F]) [    ] o.a.s.m.r.SolrJmxReporter JMX monitoring for 'solr.jetty' (registry 'solr.jetty') enabled at server: com.sun.jmx.mbeanserver.JmxMBeanServer@133acf6
   [junit4]   2> 1623943 INFO  (TEST-HttpPartitionTest.test-seed#[262B93D78B5E421F]) [    ] o.a.s.c.CorePropertiesLocator Found 0 core definitions underneath /home/jenkins/workspace/Lucene-Solr-master-Linux/solr/build/solr-core/test/J2/temp/solr.cloud.HttpPartitionTest_262B93D78B5E421F-001/shard-3-001/cores
   [junit4]   2> 1623973 INFO  (qtp31761672-20554) [    ] o.a.s.h.a.CollectionsHandler Invoked Collection Action :addreplica with params node=127.0.0.1:38323_&action=ADDREPLICA&collection=collection1&shard=shard2&type=TLOG&wt=javabin&version=2 and sendToOCPQueue=true
   [junit4]   2> 1623974 INFO  (OverseerThreadFactory-6623-thread-5) [    ] o.a.s.c.AddReplicaCmd Node Identified 127.0.0.1:38323_ for creating new replica
   [junit4]   2> 1623974 INFO  (OverseerCollectionConfigSetProcessor-98492888039751684-127.0.0.1:40273_-n_0000000000) [    ] o.a.s.c.OverseerTaskQueue Response ZK path: /overseer/collection-queue-work/qnr-0000000006 doesn't exist.  Requestor may have disconnected from ZooKeeper
   [junit4]   2> 1623975 INFO  (SocketProxy-Acceptor-38323) [    ] o.a.s.c.SocketProxy accepted Socket[addr=/127.0.0.1,port=44314,localport=38323], receiveBufferSize:531000
   [junit4]   2> 1623975 INFO  (SocketProxy-Acceptor-38323) [    ] o.a.s.c.SocketProxy proxy connection Socket[addr=/127.0.0.1,port=42273,localport=46852], receiveBufferSize=530904
   [junit4]   2> 1623975 INFO  (qtp10094728-20670) [    ] o.a.s.h.a.CoreAdminOperation core create command qt=/admin/cores&collection.configName=conf1&name=collection1_shard2_replica_t45&action=CREATE&collection=collection1&shard=shard2&wt=javabin&version=2&replicaType=TLOG
   [junit4]   2> 1623975 INFO  (qtp10094728-20670) [    ] o.a.s.c.TransientSolrCoreCacheDefault Allocating transient cache for 4 transient cores
   [junit4]   2> 1624984 INFO  (qtp10094728-20670) [    ] o.a.s.c.SolrConfig Using Lucene MatchVersion: 8.0.0
   [junit4]   2> 1624994 INFO  (qtp10094728-20670) [    ] o.a.s.s.IndexSchema [collection1_shard2_replica_t45] Schema name=test
   [junit4]   2> 1625076 INFO  (qtp10094728-20670) [    ] o.a.s.s.IndexSchema Loaded schema test/1.0 with uniqueid field id
   [junit4]   2> 1625083 INFO  (qtp10094728-20670) [    ] o.a.s.c.CoreContainer Creating SolrCore 'collection1_shard2_replica_t45' using configuration from collection collection1, trusted=true
   [junit4]   2> 1625084 INFO  (qtp10094728-20670) [    ] o.a.s.m.r.SolrJmxReporter JMX monitoring for 'solr.core.collection1.shard2.replica_t45' (registry 'solr.core.collection1.shard2.replica_t45') enabled at server: com.sun.jmx.mbeanserver.JmxMBeanServer@133acf6
   [junit4]   2> 1625084 INFO  (qtp10094728-20670) [    ] o.a.s.c.SolrCore solr.RecoveryStrategy.Builder
   [junit4]   2> 1625084 INFO  (qtp10094728-20670) [    ] o.a.s.c.SolrCore [[collection1_shard2_replica_t45] ] Opening new SolrCore at [/home/jenkins/workspace/Lucene-Solr-master-Linux/solr/build/solr-core/test/J2/temp/solr.cloud.HttpPartitionTest_262B93D78B5E421F-001/shard-3-001/cores/collection1_shard2_replica_t45], dataDir=[/home/jenkins/workspace/Lucene-Solr-master-Linux/solr/build/solr-core/test/J2/temp/solr.cloud.HttpPartitionTest_262B93D78B5E421F-001/shard-3-001/cores/collection1_shard2_replica_t45/data/]
   [junit4]   2> 1625086 INFO  (qtp10094728-20670) [    ] o.a.s.u.RandomMergePolicy RandomMergePolicy wrapping class org.apache.lucene.index.TieredMergePolicy: [TieredMergePolicy: maxMergeAtOnce=34, maxMergeAtOnceExplicit=30, maxMergedSegmentMB=83.3388671875, floorSegmentMB=1.2861328125, forceMergeDeletesPctAllowed=22.642799959419058, segmentsPerTier=17.0, maxCFSSegmentSizeMB=8.796093022207999E12, noCFSRatio=0.6168663172757627
   [junit4]   2> 1625088 WARN  (qtp10094728-20670) [    ] o.a.s.c.RequestHandlers INVALID paramSet a in requestHandler {type = requestHandler,name = /dump,class = DumpRequestHandler,attributes = {initParams=a, name=/dump, class=DumpRequestHandler},args = {defaults={a=A,b=B}}}
   [junit4]   2> 1625125 INFO  (qtp10094728-20670) [    ] o.a.s.u.UpdateHandler Using UpdateLog implementation: org.apache.solr.update.UpdateLog
   [junit4]   2> 1625125 INFO  (qtp10094728-20670) [    ] o.a.s.u.UpdateLog Initializing UpdateLog: dataDir= defaultSyncLevel=FLUSH numRecordsToKeep=100 maxNumLogsToKeep=10 numVersionBuckets=65536
   [junit4]   2> 1625126 INFO  (qtp10094728-20670) [    ] o.a.s.u.CommitTracker Hard AutoCommit: disabled
   [junit4]   2> 1625126 INFO  (qtp10094728-20670) [    ] o.a.s.u.CommitTracker Soft AutoCommit: disabled
   [junit4]   2> 1625127 INFO  (qtp10094728-20670) [    ] o.a.s.u.RandomMergePolicy RandomMergePolicy wrapping class org.apache.lucene.index.LogDocMergePolicy: [LogDocMergePolicy: minMergeSize=1000, mergeFactor=48, maxMergeSize=9223372036854775807, maxMergeSizeForForcedMerge=9223372036854775807, calibrateSizeByDeletes=true, maxMergeDocs=2147483647, maxCFSSegmentSizeMB=8.796093022207999E12, noCFSRatio=0.32365302918939876]
   [junit4]   2> 1625127 INFO  (qtp10094728-20670) [    ] o.a.s.s.SolrIndexSearcher Opening [Searcher@5baac0[collection1_shard2_replica_t45] main]
   [junit4]   2> 1625128 INFO  (qtp10094728-20670) [    ] o.a.s.r.ManagedResourceStorage Configured ZooKeeperStorageIO with znodeBase: /configs/conf1
   [junit4]   2> 1625128 INFO  (qtp10094728-20670) [    ] o.a.s.r.ManagedResourceStorage Loaded null at path _rest_managed.json using ZooKeeperStorageIO:path=/configs/conf1
   [junit4]   2> 1625129 INFO  (qtp10094728-20670) [    ] o.a.s.h.ReplicationHandler Commits will be reserved for  10000
   [junit4]   2> 1625130 INFO  (searcherExecutor-6659-thread-1) [    ] o.a.s.c.SolrCore [collection1_shard2_replica_t45] Registered new searcher Searcher@5baac0[collection1_shard2_replica_t45] main{ExitableDirectoryReader(UninvertingDirectoryReader())}
   [junit4]   2> 1625130 INFO  (qtp10094728-20670) [    ] o.a.s.u.UpdateLog Could not find max version in index or recent updates, using new clock 1575886216409120768
   [junit4]   2> 1625132 INFO  (qtp10094728-20670) [    ] o.a.s.c.ZkController Core needs to recover:collection1_shard2_replica_t45
   [junit4]   2> 1625133 INFO  (updateExecutor-4217-thread-1) [    ] o.a.s.u.DefaultSolrCoreState Running recovery
   [junit4]   2> 1625133 INFO  (qtp10094728-20670) [    ] o.a.s.s.HttpSolrCall [admin] webapp=null path=/admin/cores params={qt=/admin/cores&collection.configName=conf1&name=collection1_shard2_replica_t45&action=CREATE&collection=collection1&shard=shard2&wt=javabin&version=2&replicaType=TLOG} status=0 QTime=1157
   [junit4]   2> 1625133 INFO  (recoveryExecutor-4218-thread-1) [    ] o.a.s.c.RecoveryStrategy Starting recovery process. recoveringAfterStartup=true
   [junit4]   2> 1625133 INFO  (recoveryExecutor-4218-thread-1) [    ] o.a.s.c.RecoveryStrategy ###### startupVersions=[[]]
   [junit4]   2> 1625133 INFO  (recoveryExecutor-4218-thread-1) [    ] o.a.s.c.ZkController collection1_shard2_replica_t45 stopping background replication from leader
   [junit4]   2> 1625133 INFO  (recoveryExecutor-4218-thread-1) [    ] o.a.s.c.RecoveryStrategy Begin buffering updates. core=[collection1_shard2_replica_t45]
   [junit4]   2> 1625133 INFO  (recoveryExecutor-4218-thread-1) [    ] o.a.s.u.UpdateLog Starting to buffer updates. FSUpdateLog{state=ACTIVE, tlog=null}
   [junit4]   2> 1625133 INFO  (recoveryExecutor-4218-thread-1) [    ] o.a.s.c.RecoveryStrategy Publishing state of core [collection1_shard2_replica_t45] as recovering, leader is [http://127.0.0.1:44871/collection1_shard2_replica_t41/] and I am [http://127.0.0.1:38323/collection1_shard2_replica_t45/]
   [junit4]   2> 1625134 INFO  (qtp31761672-20554) [    ] o.a.s.s.HttpSolrCall [admin] webapp=null path=/admin/collections params={node=127.0.0.1:38323_&action=ADDREPLICA&collection=collection1&shard=shard2&type=TLOG&wt=javabin&version=2} status=0 QTime=1160
   [junit4]   2> 1625135 INFO  (recoveryExecutor-4218-thread-1) [    ] o.a.s.c.RecoveryStrategy Sending prep recovery command to [http://127.0.0.1:44871]; [WaitForState: action=PREPRECOVERY&core=collection1_shard2_replica_t41&nodeName=127.0.0.1:38323_&coreNodeName=core_node46&state=recovering&checkLive=true&onlyIfLeader=true&onlyIfLeaderActive=true]
   [junit4]   2> 1625135 INFO  (SocketProxy-Acceptor-44871) [    ] o.a.s.c.SocketProxy accepted Socket[addr=/127.0.0.1,port=37212,localport=44871], receiveBufferSize:531000
   [junit4]   2> 1625135 INFO  (SocketProxy-Acceptor-44871) [    ] o.a.s.c.SocketProxy proxy connection Socket[addr=/127.0.0.1,port=42879,localport=51724], receiveBufferSize=530904
   [junit4]   2> 1625135 INFO  (qtp21766048-20608) [    ] o.a.s.h.a.PrepRecoveryOp Going to wait for coreNodeName: core_node46, state: recovering, checkLive: true, onlyIfLeader: true, onlyIfLeaderActive: true, maxTime: 183 s
   [junit4]   2> 1625136 INFO  (qtp21766048-20608) [    ] o.a.s.h.a.PrepRecoveryOp In WaitForState(recovering): collection=collection1, shard=shard2, thisCore=collection1_shard2_replica_t41, leaderDoesNotNeedRecovery=false, isLeader? true, live=true, checkLive=true, currentState=down, localState=active, nodeName=127.0.0.1:38323_, coreNodeName=core_node46, onlyIfActiveCheckResult=false, nodeProps: core_node46:{"core":"collection1_shard2_replica_t45","base_url":"http://127.0.0.1:38323","node_name":"127.0.0.1:38323_","state":"down","type":"TLOG"}
   [junit4]   2> 1625136 INFO  (TEST-HttpPartitionTest.test-seed#[262B93D78B5E421F]) [    ] o.a.s.SolrTestCaseJ4 ###Starting test
   [junit4]   2> 1625136 INFO  (TEST-HttpPartitionTest.test-seed#[262B93D78B5E421F]) [    ] o.a.s.c.AbstractFullDistribZkTestBase Wait for recoveries to finish - wait 30000 for each attempt
   [junit4]   2> 1625136 INFO  (TEST-HttpPartitionTest.test-seed#[262B93D78B5E421F]) [    ] o.a.s.c.AbstractDistribZkTestBase Wait for recoveries to finish - collection: collection1 failOnTimeout:true timeout (sec):30000
   [junit4]   2> 1625976 INFO  (OverseerCollectionConfigSetProcessor-98492888039751684-127.0.0.1:40273_-n_0000000000) [    ] o.a.s.c.OverseerTaskQueue Response ZK path: /overseer/collection-queue-work/qnr-0000000008 doesn't exist.  Requestor may have disconnected from ZooKeeper
   [junit4]   2> 1626136 INFO  (qtp21766048-20608) [    ] o.a.s.h.a.PrepRecoveryOp In WaitForState(recovering): collection=collection1, shard=shard2, thisCore=collection1_shard2_replica_t41, leaderDoesNotNeedRecovery=false, isLeader? true, live=true, checkLive=true, currentState=recovering, localState=active, nodeName=127.0.0.1:38323_, coreNodeName=core_node46, onlyIfActiveCheckResult=false, nodeProps: core_node46:{"core":"collection1_shard2_replica_t45","base_url":"http://127.0.0.1:38323","node_name":"127.0.0.1:38323_","state":"recovering","type":"TLOG"}
   [junit4]   2> 1626136 INFO  (qtp21766048-20608) [    ] o.a.s.h.a.PrepRecoveryOp Waited coreNodeName: core_node46, state: recovering, checkLive: true, onlyIfLeader: true for: 1 seconds.
   [junit4]   2> 1626136 INFO  (qtp21766048-20608) [    ] o.a.s.s.HttpSolrCall [admin] webapp=null path=/admin/cores params={nodeName=127.0.0.1:38323_&onlyIfLeaderActive=true&core=collection1_shard2_replica_t41&coreNodeName=core_node46&action=PREPRECOVERY&checkLive=true&state=recovering&onlyIfLeader=true&wt=javabin&version=2} status=0 QTime=1000
   [junit4]   2> 1626637 INFO  (recoveryExecutor-4218-thread-1) [    ] o.a.s.c.RecoveryStrategy Starting Replication Recovery.
   [junit4]   2> 1626637 INFO  (recoveryExecutor-4218-thread-1) [    ] o.a.s.c.RecoveryStrategy Attempting to replicate from [http://127.0.0.1:44871/collection1_shard2_replica_t41/].
   [junit4]   2> 1626638 INFO  (SocketProxy-Acceptor-44871) [    ] o.a.s.c.SocketProxy accepted Socket[addr=/127.0.0.1,port=37224,localport=44871], receiveBufferSize:531000
   [junit4]   2> 1626638 INFO  (SocketProxy-Acceptor-44871) [    ] o.a.s.c.SocketProxy proxy connection Socket[addr=/127.0.0.1,port=42879,localport=51736], receiveBufferSize=530904
   [junit4]   2> 1626639 INFO  (qtp21766048-20602) [    ] o.a.s.u.DirectUpdateHandler2 start commit{_version_=1575886217991421952,optimize=false,openSearcher=false,waitSearcher=true,expungeDeletes=false,softCommit=false,prepareCommit=false}
   [junit4]   2> 1626639 INFO  (qtp21766048-20602) [    ] o.a.s.u.DirectUpdateHandler2 No uncommitted changes. Skipping IW.commit.
   [junit4]   2> 1626639 INFO  (qtp21766048-20602) [    ] o.a.s.u.DirectUpdateHandler2 end_commit_flush
   [junit4]   2> 1626639 INFO  (qtp21766048-20602) [    ] o.a.s.u.p.LogUpdateProcessorFactory [collection1_shard2_replica_t41]  webapp= path=/update params={waitSearcher=true&openSearcher=false&commit=true&softCommit=false&commit_end_point=true&wt=javabin&version=2}{commit=} 0 0
   [junit4]   2> 1626640 INFO  (SocketProxy-Acceptor-44871) [    ] o.a.s.c.SocketProxy accepted Socket[addr=/127.0.0.1,port=37228,localport=44871], receiveBufferSize:531000
   [junit4]   2> 1626640 INFO  (SocketProxy-Acceptor-44871) [    ] o.a.s.c.SocketProxy proxy connection Socket[addr=/127.0.0.1,port=42879,localport=51740], receiveBufferSize=530904
   [junit4]   2> 1626640 INFO  (qtp21766048-20602) [    ] o.a.s.c.S.Request [collection1_shard2_replica_t41]  webapp= path=/replication params={qt=/replication&wt=javabin&version=2&command=indexversion} status=0 QTime=0
   [junit4]   2> 1626641 INFO  (recoveryExecutor-4218-thread-1) [    ] o.a.s.h.IndexFetcher Master's generation: 1
   [junit4]   2> 1626641 INFO  (recoveryExecutor-4218-thread-1) [    ] o.a.s.h.IndexFetcher Master's version: 0
   [junit4]   2> 1626641 INFO  (recoveryExecutor-4218-thread-1) [    ] o.a.s.h.IndexFetcher Slave's generation: 1
   [junit4]   2> 1626641 INFO  (recoveryExecutor-4218-thread-1) [    ] o.a.s.h.IndexFetcher Slave's version: 0
   [junit4]   2> 1626641 INFO  (recoveryExecutor-4218-thread-1) [    ] o.a.s.c.RecoveryStrategy Replication Recovery was successful.
   [junit4]   2> 1626641 INFO  (recoveryExecutor-4218-thread-1) [    ] o.a.s.c.RecoveryStrategy Registering as Active after recovery.
   [junit4]   2> 1626641 INFO  (recoveryExecutor-4218-thread-1) [    ] o.a.s.c.ZkController collection1_shard2_replica_t45 starting background replication from leader
   [junit4]   2> 1626641 INFO  (recoveryExecutor-4218-thread-1) [    ] o.a.s.c.ReplicateFromLeader Will start replication from leader with poll interval: 00:00:03
   [junit4]   2> 1626642 INFO  (recoveryExecutor-4218-thread-1) [    ] o.a.s.h.ReplicationHandler Poll scheduled at an interval of 3000ms
   [junit4]   2> 1626642 INFO  (indexFetcher-6665-thread-1) [    ] o.a.s.h.IndexFetcher Updated masterUrl to http://127.0.0.1:44871/collection1_shard2_replica_t41/
   [junit4]   2> 1626642 INFO  (qtp21766048-20608) [    ] o.a.s.c.S.Request [collection1_shard2_replica_t41]  webapp= path=/replication params={qt=/replication&wt=javabin&version=2&command=indexversion} status=0 QTime=0
   [junit4]   2> 1626642 INFO  (indexFetcher-6665-thread-1) [    ] o.a.s.h.IndexFetcher Master's generation: 1
   [junit4]   2> 1626642 INFO  (indexFetcher-6665-thread-1) [    ] o.a.s.h.IndexFetcher Master's version: 0
   [junit4]   2> 1626643 INFO  (indexFetcher-6665-thread-1) [    ] o.a.s.h.IndexFetcher Slave's generation: 1
   [junit4]   2> 1626643 INFO  (indexFetcher-6665-thread-1) [    ] o.a.s.h.IndexFetcher Slave's version: 0
   [junit4]   2> 1626643 INFO  (recoveryExecutor-4218-thread-1) [    ] o.a.s.c.RecoveryStrategy Updating version bucket highest from index after successful recovery.
   [junit4]   2> 1626643 INFO  (recoveryExecutor-4218-thread-1) [    ] o.a.s.u.UpdateLog Could not find max version in index or recent updates, using new clock 1575886217995616256
   [junit4]   2> 1626645 INFO  (recoveryExecutor-4218-thread-1) [    ] o.a.s.c.RecoveryStrategy Finished recovery process, successful=[true]
   [junit4]   2> 1627136 INFO  (TEST-HttpPartitionTest.test-seed#[262B93D78B5E421F]) [    ] o.a.s.c.AbstractDistribZkTestBase Recoveries finished - collection: collection1
   [junit4]   2> 1627137 INFO  (qtp31761672-20558) [    ] o.a.s.u.DirectUpdateHandler2 start commit{_version_=1575886218513612800,optimize=false,openSearcher=true,waitSearcher=true,expungeDeletes=false,softCommit=false,prepareCommit=false}
   [junit4]   2> 1627137 INFO  (qtp31761672-20558) [    ] o.a.s.u.DirectUpdateHandler2 No uncommitted changes. Skipping IW.commit.
   [junit4]   2> 1627137 INFO  (qtp31761672-20558) [    ] o.a.s.u.DirectUpdateHandler2 end_commit_flush
   [junit4]   2> 1627138 INFO  (qtp31761672-20558) [    ] o.a.s.u.p.LogUpdateProcessorFactory [control_collection_shard1_replica_n1]  webapp= path=/update params={waitSearcher=true&commit=true&softCommit=false&wt=javabin&version=2}{commit=} 0 0
   [junit4]   2> 1627139 INFO  (SocketProxy-Acceptor-44871) [    ] o.a.s.c.SocketProxy accepted Socket[addr=/127.0.0.1,port=37244,localport=44871], receiveBufferSize:531000
   [junit4]   2> 1627140 INFO  (SocketProxy-Acceptor-44871) [    ] o.a.s.c.SocketProxy proxy connection Socket[addr=/127.0.0.1,port=42879,localport=51756], receiveBufferSize=530904
   [junit4]   2> 1627142 INFO  (SocketProxy-Acceptor-46243) [    ] o.a.s.c.SocketProxy accepted Socket[addr=/127.0.0.1,port=39432,localport=46243], receiveBufferSize:531000
   [junit4]   2> 1627142 INFO  (SocketProxy-Acceptor-38323) [    ] o.a.s.c.SocketProxy accepted Socket[addr=/127.0.0.1,port=44376,localport=38323], receiveBufferSize:531000
   [junit4]   2> 1627142 INFO  (SocketProxy-Acceptor-46243) [    ] o.a.s.c.SocketProxy proxy connection Socket[addr=/127.0.0.1,port=43409,localport=34634], receiveBufferSize=530904
   [junit4]   2> 1627143 INFO  (SocketProxy-Acceptor-44871) [    ] o.a.s.c.SocketProxy accepted Socket[addr=/127.0.0.1,port=37250,localport=44871], receiveBufferSize:531000
   [junit4]   2> 1627143 INFO  (SocketProxy-Acceptor-38323) [    ] o.a.s.c.SocketProxy proxy connection Socket[addr=/127.0.0.1,port=42273,localport=46916], receiveBufferSize=530904
   [junit4]   2> 1627143 INFO  (SocketProxy-Acceptor-44871) [    ] o.a.s.c.SocketProxy proxy connection Socket[addr=/127.0.0.1,port=42879,localport=51768], receiveBufferSize=530904
   [junit4]   2> 1627143 INFO  (qtp10094728-20666) [    ] o.a.s.u.TestInjection Start waiting for replica in sync with leader
   [junit4]   2> 1627143 INFO  (qtp29941995-20640) [    ] o.a.s.u.DirectUpdateHandler2 start commit{_version_=1575886218519904256,optimize=false,openSearcher=true,waitSearcher=true,expungeDeletes=false,softCommit=false,prepareCommit=false}
   [junit4]   2> 1627143 INFO  (qtp21766048-20608) [    ] o.a.s.u.DirectUpdateHandler2 start commit{_version_=1575886218519904256,optimize=false,openSearcher=true,waitSearcher=true,expungeDeletes=false,softCommit=false,prepareCommit=false}
   [junit4]   2> 1627143 INFO  (qtp29941995-20640) [    ] o.a.s.u.DirectUpdateHandler2 No uncommitted changes. Skipping IW.commit.
   [junit4]   2> 1627143 INFO  (qtp21766048-20608) [    ] o.a.s.u.DirectUpdateHandler2 No uncommitted changes. Skipping IW.commit.
   [junit4]   2> 1627144 INFO  (qtp29941995-20640) [    ] o.a.s.u.DirectUpdateHandler2 end_commit_flush
   [junit4]   2> 1627144 INFO  (qtp21766048-20608) [    ] o.a.s.u.DirectUpdateHandler2 end_commit_flush
   [junit4]   2> 1627144 INFO  (qtp29941995-20640) [    ] o.a.s.u.p.LogUpdateProcessorFactory [collection1_shard1_replica_t43]  webapp= path=/update params={update.distrib=FROMLEADER&waitSearcher=true&openSearcher=true&commit=true&softCommit=false&distrib.from=http://127.0.0.1:44871/collection1_shard2_replica_t41/&commit_end_point=true&wt=javabin&version=2&expungeDeletes=false}{commit=} 0 0
   [junit4]   2> 1627144 INFO  (qtp21766048-20608) [    ] o.a.s.u.p.LogUpdateProcessorFactory [collection1_shard2_replica_t41]  webapp= path=/update params={update.distrib=FROMLEADER&waitSearcher=true&openSearcher=true&commit=true&softCommit=false&distrib.from=http://127.0.0.1:44871/collection1_shard2_replica_t41/&commit_end_point=true&wt=javabin&version=2&expungeDeletes=false}{commit=} 0 0
   [junit4]   2> 1627145 INFO  (SocketProxy-Acceptor-44871) [    ] o.a.s.c.SocketProxy accepted Socket[addr=/127.0.0.1,port=37260,localport=44871], receiveBufferSize:531000
   [junit4]   2> 1627145 INFO  (SocketProxy-Acceptor-44871) [    ] o.a.s.c.SocketProxy proxy connection Socket[addr=/127.0.0.1,port=42879,localport=51772], receiveBufferSize=530904
   [junit4]   2> 1627145 INFO  (qtp21766048-20602) [    ] o.a.s.c.S.Request [collection1_shard2_replica_t41]  webapp= path=/replication params={qt=/replication&wt=javabin&version=2&command=details} status=0 QTime=0
   [junit4]   2> 1627146 INFO  (qtp10094728-20666) [    ] o.a.s.u.p.LogUpdateProcessorFactory [collection1_shard2_replica_t45]  webapp= path=/update params={update.distrib=FROMLEADER&waitSearcher=true&openSearcher=true&commit=true&softCommit=false&distrib.from=http://127.0.0.1:44871/collection1_shard2_replica_t41/&commit_end_point=true&wt=javabin&version=2&expungeDeletes=false}{commit=} 0 2
   [junit4]   2> 1627146 INFO  (qtp21766048-20604) [    ] o.a.s.u.p.LogUpdateProcessorFactory [collection1_shard2_replica_t41]  webapp= path=/update params={waitSearcher=true&commit=true&softCommit=false&wt=javabin&version=2}{commit=} 0 6
   [junit4]   2> 1627147 INFO  (SocketProxy-Acceptor-44871) [    ] o.a.s.c.SocketProxy accepted Socket[addr=/127.0.0.1,port=37264,localport=44871], receiveBufferSize:531000
   [junit4]   2> 1627148 INFO  (SocketProxy-Acceptor-44871) [    ] o.a.s.c.SocketProxy proxy connection Socket[addr=/127.0.0.1,port=42879,localport=51776], receiveBufferSize=530904
   [junit4]   2> 1627148 INFO  (qtp21766048-20608) [    ] o.a.s.c.S.Request [collection1_shard2_replica_t41]  webapp= path=/select params={q=*:*&distrib=false&tests=checkShardConsistency&rows=0&wt=javabin&version=2} hits=0 status=0 QTime=0
   [junit4]   2> 1627149 INFO  (SocketProxy-Acceptor-38323) [    ] o.a.s.c.SocketProxy accepted Socket[addr=/127.0.0.1,port=44392,localport=38323], receiveBufferSize:531000
   [junit4]   2> 1627149 INFO  (SocketProxy-Acceptor-38323) [    ] o.a.s.c.SocketProxy proxy connection Socket[addr=/127.0.0.1,port=42273,localport=46930], receiveBufferSize=530904
   [junit4]   2> 1627149 INFO  (qtp10094728-20670) [    ] o.a.s.c.S.Request [collection1_shard2_replica_t45]  webapp= path=/select params={q=*:*&distrib=false&tests=checkShardConsistency&rows=0&wt=javabin&version=2} hits=0 status=0 QTime=0
   [junit4]   2> 1627150 INFO  (SocketProxy-Acceptor-46243) [    ] o.a.s.c.SocketProxy accepted Socket[addr=/127.0.0.1,port=39456,localport=46243], receiveBufferSize:531000
   [junit4]   2> 1627151 INFO  (SocketProxy-Acceptor-46243) [    ] o.a.s.c.SocketProxy proxy connection Socket[addr=/127.0.0.1,port=43409,localport=34654], receiveBufferSize=530904
   [junit4]   2> 1627151 INFO  (qtp29941995-20638) [    ] o.a.s.c.S.Request [collection1_shard1_replica_t43]  webapp= path=/select params={q=*:*&distrib=false&tests=checkShardConsistency&rows=0&wt=javabin&version=2} hits=0 status=0 QTime=0
   [junit4]   2> 1629151 INFO  (TEST-HttpPartitionTest.test-seed#[262B93D78B5E421F]) [    ] o.a.s.c.AbstractFullDistribZkTestBase Creating collection with stateFormat=1: c8n_crud_1x2
   [junit4]   2> 1629154 INFO  (SocketProxy-Acceptor-44871) [    ] o.a.s.c.SocketProxy accepted Socket[addr=/127.0.0.1,port=37296,localport=44871], receiveBufferSize:531000
   [junit4]   2> 1629154 INFO  (SocketProxy-Acceptor-44871) [    ] o.a.s.c.SocketProxy proxy connection Socket[addr=/127.0.0.1,port=42879,localport=51808], receiveBufferSize=530904
   [junit4]   2> 1629155 INFO  (qtp21766048-20604) [    ] o.a.s.h.a.CollectionsHandler Invoked Collection Action :create with params pullReplicas=0&maxShardsPerNode=1&collection.configName=conf1&nrtReplicas=0&name=c8n_crud_1x2&action=CREATE&numShards=1&tlogReplicas=2&stateFormat=1&wt=javabin&version=2 and sendToOCPQueue=true
   [junit4]   2> 1629157 INFO  (OverseerThreadFactory-6623-thread-5) [    ] o.a.s.c.CreateCollectionCmd Create collection c8n_crud_1x2
   [junit4]   2> 1629264 INFO  (qtp31761672-20552) [    ] o.a.s.h.a.CoreAdminOperation core create command qt=/admin/cores&collection.configName=conf1&newCollection=true&name=c8n_crud_1x2_shard1_replica_t1&action=CREATE&numShards=1&collection=c8n_crud_1x2&shard=shard1&wt=javabin&version=2&replicaType=TLOG
   [junit4]   2> 1629265 INFO  (qtp10094728-20671) [    ] o.a.s.h.a.CoreAdminOperation core create command qt=/admin/cores&collection.configName=conf1&newCollection=true&name=c8n_crud_1x2_shard1_replica_t2&action=CREATE&numShards=1&collection=c8n_crud_1x2&shard=shard1&wt=javabin&version=2&replicaType=TLOG
   [junit4]   2> 1629643 INFO  (qtp21766048-20602) [    ] o.a.s.c.S.Request [collection1_shard2_replica_t41]  webapp= path=/replication params={qt=/replication&wt=javabin&version=2&command=indexversion} status=0 QTime=0
   [junit4]   2> 1629644 INFO  (indexFetcher-6665-thread-1) [    ] o.a.s.h.IndexFetcher Master's generation: 1
   [junit4]   2> 1629644 INFO  (indexFetcher-6665-thread-1) [    ] o.a.s.h.IndexFetcher Master's version: 0
   [junit4]   2> 1629644 INFO  (indexFetcher-6665-thread-1) [    ] o.a.s.h.IndexFetcher Slave's generation: 1
   [junit4]   2> 1629644 INFO  (indexFetcher-6665-thread-1) [    ] o.a.s.h.IndexFetcher Slave's version: 0
   [junit4]   2> 1630279 INFO  (qtp10094728-20671) [    ] o.a.s.c.SolrConfig Using Lucene MatchVersion: 8.0.0
   [junit4]   2> 1630279 INFO  (qtp31761672-20552) [    ] o.a.s.c.SolrConfig Using Lucene MatchVersion: 8.0.0
   [junit4]   2> 1630286 INFO  (qtp31761672-20552) [    ] o.a.s.s.IndexSchema [c8n_crud_1x2_shard1_replica_t1] Schema name=test
   [junit4]   2> 1630286 INFO  (qtp10094728-20671) [    ] o.a.s.s.IndexSchema [c8n_crud_1x2_shard1_replica_t2] Schema name=test
   [junit4]   2> 1630365 INFO  (qtp31761672-20552) [    ] o.a.s.s.IndexSchema Loaded schema test/1.0 with uniqueid field id
   [junit4]   2> 1630365 INFO  (qtp10094728-20671) [    ] o.a.s.s.IndexSchema Loaded schema test/1.0 with uniqueid field id
   [junit4]   2> 1630370 INFO  (qtp31761672-20552) [    ] o.a.s.c.CoreContainer Creating SolrCore 'c8n_crud_1x2_shard1_replica_t1' using configuration from collection c8n_crud_1x2, trusted=true
   [junit4]   2> 1630370 INFO  (qtp10094728-20671) [    ] o.a.s.c.CoreContainer Creating SolrCore 'c8n_crud_1x2_shard1_replica_t2' using configuration from collection c8n_crud_1x2, trusted=true
   [junit4]   2> 1630370 INFO  (qtp31761672-20552) [    ] o.a.s.m.r.SolrJmxReporter JMX monitoring for 'solr.core.c8n_crud_1x2.shard1.replica_t1' (registry 'solr.core.c8n_crud_1x2.shard1.replica_t1') enabled at server: com.sun.jmx.mbeanserver.JmxMBeanServer@133acf6
   [junit4]   2> 1630370 INFO  (qtp10094728-20671) [    ] o.a.s.m.r.SolrJmxReporter JMX monitoring for 'solr.core.c8n_crud_1x2.shard1.replica_t2' (registry 'solr.core.c8n_crud_1x2.shard1.replica_t2') enabled at server: com.sun.jmx.mbeanserver.JmxMBeanServer@133acf6
   [junit4]   2> 1630371 INFO  (qtp31761672-20552) [    ] o.a.s.c.SolrCore solr.RecoveryStrategy.Builder
   [junit4]   2> 1630371 INFO  (qtp10094728-20671) [    ] o.a.s.c.SolrCore solr.RecoveryStrategy.Builder
   [junit4]   2> 1630371 INFO  (qtp31761672-20552) [    ] o.a.s.c.SolrCore [[c8n_crud_1x2_shard1_replica_t1] ] Opening new SolrCore at [/home/jenkins/workspace/Lucene-Solr-master-Linux/solr/build/solr-core/test/J2/temp/solr.cloud.HttpPartitionTest_262B93D78B5E421F-001/control-001/cores/c8n_crud_1x2_shard1_replica_t1], dataDir=[/home/jenkins/workspace/Lucene-Solr-master-Linux/solr/build/solr-core/test/J2/temp/solr.cloud.HttpPartitionTest_262B93D78B5E421F-001/control-001/cores/c8n_crud_1x2_shard1_replica_t1/data/]
   [junit4]   2> 1630371 INFO  (qtp10094728-20671) [    ] o.a.s.c.SolrCore [[c8n_crud_1x2_shard1_replica_t2] ] Opening new SolrCore at [/home/jenkins/workspace/Lucene-Solr-master-Linux/solr/build/solr-core/test/J2/temp/solr.cloud.HttpPartitionTest_262B93D78B5E421F-001/shard-3-001/cores/c8n_crud_1x2_shard1_replica_t2], dataDir=[/home/jenkins/workspace/Lucene-Solr-master-Linux/solr/build/solr-core/test/J2/temp/solr.cloud.HttpPartitionTest_262B93D78B5E421F-001/shard-3-001/cores/c8n_crud_1x2_shard1_replica_t2/data/]
   [junit4]   2> 1630373 INFO  (qtp31761672-20552) [    ] o.a.s.u.RandomMergePolicy RandomMergePolicy wrapping class org.apache.lucene.index.TieredMergePolicy: [TieredMergePolicy: maxMergeAtOnce=34, maxMergeAtOnceExplicit=30, maxMergedSegmentMB=83.3388671875, floorSegmentMB=1.2861328125, forceMergeDeletesPctAllowed=22.642799959419058, segmentsPerTier=17.0, maxCFSSegmentSizeMB=8.796093022207999E12, noCFSRatio=0.6168663172757627
   [junit4]   2> 1630373 INFO  (qtp10094728-20671) [    ] o.a.s.u.RandomMergePolicy RandomMergePolicy wrapping class org.apache.lucene.index.TieredMergePolicy: [TieredMergePolicy: maxMergeAtOnce=34, maxMergeAtOnceExplicit=30, maxMergedSegmentMB=83.3388671875, floorSegmentMB=1.2861328125, forceMergeDeletesPctAllowed=22.642799959419058, segmentsPerTier=17.0, maxCFSSegmentSizeMB=8.796093022207999E12, noCFSRatio=0.6168663172757627
   [junit4]   2> 1630374 WARN  (qtp31761672-20552) [    ] o.a.s.c.RequestHandlers INVALID paramSet a in requestHandler {type = requestHandler,name = /dump,class = DumpRequestHandler,attributes = {initParams=a, name=/dump, class=DumpRequestHandler},args = {defaults={a=A,b=B}}}
   [junit4]   2> 1630374 WARN  (qtp10094728-20671) [    ] o.a.s.c.RequestHandlers INVALID paramSet a in requestHandler {type = requestHandler,name = /dump,class = DumpRequestHandler,attributes = {initParams=a, name=/dump, class=DumpRequestHandler},args = {defaults={a=A,b=B}}}
   [junit4]   2> 1630418 INFO  (qtp10094728-20671) [    ] o.a.s.u.UpdateHandler Using UpdateLog implementation: org.apache.solr.update.UpdateLog
   [junit4]   2> 1630418 INFO  (qtp10094728-20671) [    ] o.a.s.u.UpdateLog Initializing UpdateLog: dataDir= defaultSyncLevel=FLUSH numRecordsToKeep=100 maxNumLogsToKeep=10 numVersionBuckets=65536
   [junit4]   2> 1630418 INFO  (qtp31761672-20552) [    ] o.a.s.u.UpdateHandler Using UpdateLog implementation: org.apache.solr.update.UpdateLog
   [junit4]   2> 1630418 INFO  (qtp31761672-20552) [    ] o.a.s.u.UpdateLog Initializing UpdateLog: dataDir= defaultSyncLevel=FLUSH numRecordsToKeep=100 maxNumLogsToKeep=10 numVersionBuckets=65536
   [junit4]   2> 1630419 INFO  (qtp31761672-20552) [    ] o.a.s.u.CommitTracker Hard AutoCommit: disabled
   [junit4]   2> 1630419 INFO  (qtp31761672-20552) [    ] o.a.s.u.CommitTracker Soft AutoCommit: disabled
   [junit4]   2> 1630419 INFO  (qtp10094728-20671) [    ] o.a.s.u.CommitTracker Hard AutoCommit: disabled
   [junit4]   2> 1630419 INFO  (qtp10094728-20671) [    ] o.a.s.u.CommitTracker Soft AutoCommit: disabled
   [junit4]   2> 1630419 INFO  (qtp31761672-20552) [    ] o.a.s.u.RandomMergePolicy RandomMergePolicy wrapping class org.apache.lucene.index.LogDocMergePolicy: [LogDocMergePolicy: minMergeSize=1000, mergeFactor=48, maxMergeSize=9223372036854775807, maxMergeSizeForForcedMerge=9223372036854775807, calibrateSizeByDeletes=true, maxMergeDocs=2147483647, maxCFSSegmentSizeMB=8.796093022207999E12, noCFSRatio=0.32365302918939876]
   [junit4]   2> 1630419 INFO  (qtp31761672-20552) [    ] o.a.s.s.SolrIndexSearcher Opening [Searcher@58344[c8n_crud_1x2_shard1_replica_t1] main]
   [junit4]   2> 1630420 INFO  (qtp10094728-20671) [    ] o.a.s.u.RandomMergePolicy RandomMergePolicy wrapping class org.apache.lucene.index.LogDocMergePolicy: [LogDocMergePolicy: minMergeSize=1000, mergeFactor=48, maxMergeSize=9223372036854775807, maxMergeSizeForForcedMerge=9223372036854775807, calibrateSizeByDeletes=true, maxMergeDocs=2147483647, maxCFSSegmentSizeMB=8.796093022207999E12, noCFSRatio=0.32365302918939876]
   [junit4]   2> 1630420 INFO  (qtp10094728-20671) [    ] o.a.s.s.SolrIndexSearcher Opening [Searcher@162a1c3[c8n_crud_1x2_shard1_replica_t2] main]
   [junit4]   2> 1630420 INFO  (qtp31761672-20552) [    ] o.a.s.r.ManagedResourceStorage Configured ZooKeeperStorageIO with znodeBase: /configs/conf1
   [junit4]   2> 1630420 INFO  (qtp31761672-20552) [    ] o.a.s.r.ManagedResourceStorage Loaded null at path _rest_managed.json using ZooKeeperStorageIO:path=/configs/conf1
   [junit4]   2> 1630420 INFO  (qtp10094728-20671) [    ] o.a.s.r.ManagedResourceStorage Configured ZooKeeperStorageIO with znodeBase: /configs/conf1
   [junit4]   2> 1630421 INFO  (qtp10094728-20671) [    ] o

[...truncated too long message...]

.ContextHandler Stopped o.e.j.s.ServletContextHandler@d3f3c6{/,null,UNAVAILABLE}
   [junit4]   2> 1647073 ERROR (TEST-HttpPartitionTest.test-seed#[262B93D78B5E421F]) [    ] o.a.z.s.ZooKeeperServer ZKShutdownHandler is not registered, so ZooKeeper server won't take any action on ERROR or SHUTDOWN server state changes
   [junit4]   2> 1647073 INFO  (TEST-HttpPartitionTest.test-seed#[262B93D78B5E421F]) [    ] o.a.s.c.ZkTestServer connecting to 127.0.0.1:46215 46215
   [junit4]   2> 1652867 INFO  (Thread-2933) [    ] o.a.s.c.ZkTestServer connecting to 127.0.0.1:46215 46215
   [junit4]   2> 1652868 WARN  (Thread-2933) [    ] o.a.s.c.ZkTestServer Watch limit violations: 
   [junit4]   2> Maximum concurrent create/delete watches above limit:
   [junit4]   2> 
   [junit4]   2> 	6	/solr/aliases.json
   [junit4]   2> 	4	/solr/security.json
   [junit4]   2> 	4	/solr/configs/conf1
   [junit4]   2> 	3	/solr/collections/collection1/state.json
   [junit4]   2> 	3	/solr/collections/collMinRf_1x3/state.json
   [junit4]   2> 	2	/solr/collections/c8n_crud_1x2/state.json
   [junit4]   2> 
   [junit4]   2> Maximum concurrent data watches above limit:
   [junit4]   2> 
   [junit4]   2> 	6	/solr/clusterstate.json
   [junit4]   2> 	6	/solr/clusterprops.json
   [junit4]   2> 
   [junit4]   2> Maximum concurrent children watches above limit:
   [junit4]   2> 
   [junit4]   2> 	6	/solr/live_nodes
   [junit4]   2> 	6	/solr/collections
   [junit4]   2> 	4	/solr/overseer/queue
   [junit4]   2> 	4	/solr/overseer/collection-queue-work
   [junit4]   2> 	2	/solr/overseer/queue-work
   [junit4]   2> 
   [junit4]   2> 1652868 WARN  (TEST-HttpPartitionTest.test-seed#[262B93D78B5E421F]) [    ] o.a.s.c.SocketProxy Closing 6 connections to: http://127.0.0.1:38323/, target: http://127.0.0.1:42273/
   [junit4]   2> 1652868 WARN  (TEST-HttpPartitionTest.test-seed#[262B93D78B5E421F]) [    ] o.a.s.c.SocketProxy Closing 3 connections to: http://127.0.0.1:44871/, target: http://127.0.0.1:42879/
   [junit4]   2> 1652868 WARN  (TEST-HttpPartitionTest.test-seed#[262B93D78B5E421F]) [    ] o.a.s.c.SocketProxy Closing 3 connections to: http://127.0.0.1:46243/, target: http://127.0.0.1:43409/
   [junit4]   2> 1652868 WARN  (TEST-HttpPartitionTest.test-seed#[262B93D78B5E421F]) [    ] o.a.s.c.SocketProxy Closing 9 connections to: http://127.0.0.1:40273/, target: http://127.0.0.1:36765/
   [junit4]   2> NOTE: reproduce with: ant test  -Dtestcase=HttpPartitionTest -Dtests.method=test -Dtests.seed=262B93D78B5E421F -Dtests.multiplier=3 -Dtests.slow=true -Dtests.locale=gd -Dtests.timezone=America/Cordoba -Dtests.asserts=true -Dtests.file.encoding=US-ASCII
   [junit4] FAILURE 35.2s J2 | HttpPartitionTest.test <<<
   [junit4]    > Throwable #1: java.lang.AssertionError: Doc with id=1 not found in http://127.0.0.1:38323/collMinRf_1x3 due to: Path not found: /id; rsp={doc=null}
   [junit4]    > 	at __randomizedtesting.SeedInfo.seed([262B93D78B5E421F:AE7FAC0D25A22FE7]:0)
   [junit4]    > 	at org.apache.solr.cloud.HttpPartitionTest.assertDocExists(HttpPartitionTest.java:603)
   [junit4]    > 	at org.apache.solr.cloud.HttpPartitionTest.assertDocsExistInAllReplicas(HttpPartitionTest.java:558)
   [junit4]    > 	at org.apache.solr.cloud.HttpPartitionTest.testMinRf(HttpPartitionTest.java:249)
   [junit4]    > 	at org.apache.solr.cloud.HttpPartitionTest.test(HttpPartitionTest.java:127)
   [junit4]    > 	at java.base/jdk.internal.reflect.NativeMethodAccessorImpl.invoke0(Native Method)
   [junit4]    > 	at java.base/jdk.internal.reflect.NativeMethodAccessorImpl.invoke(NativeMethodAccessorImpl.java:62)
   [junit4]    > 	at java.base/jdk.internal.reflect.DelegatingMethodAccessorImpl.invoke(DelegatingMethodAccessorImpl.java:43)
   [junit4]    > 	at java.base/java.lang.reflect.Method.invoke(Method.java:564)
   [junit4]    > 	at org.apache.solr.BaseDistributedSearchTestCase$ShardsRepeatRule$ShardsFixedStatement.callStatement(BaseDistributedSearchTestCase.java:993)
   [junit4]    > 	at org.apache.solr.BaseDistributedSearchTestCase$ShardsRepeatRule$ShardsStatement.evaluate(BaseDistributedSearchTestCase.java:968)
   [junit4]    > 	at java.base/java.lang.Thread.run(Thread.java:844)
   [junit4]   2> NOTE: leaving temporary files on disk at: /home/jenkins/workspace/Lucene-Solr-master-Linux/solr/build/solr-core/test/J2/temp/solr.cloud.HttpPartitionTest_262B93D78B5E421F-001
   [junit4]   2> NOTE: test params are: codec=Asserting(Lucene70): {multiDefault=PostingsFormat(name=MockRandom), a_t=PostingsFormat(name=MockRandom), id=Lucene50(blocksize=128), text=PostingsFormat(name=Direct)}, docValues:{range_facet_l_dv=DocValuesFormat(name=Lucene70), _version_=DocValuesFormat(name=Asserting), range_facet_i_dv=DocValuesFormat(name=Direct), intDvoDefault=DocValuesFormat(name=Lucene70), timestamp=DocValuesFormat(name=Direct)}, maxPointsInLeafNode=304, maxMBSortInHeap=5.718164103983911, sim=RandomSimilarity(queryNorm=false): {}, locale=gd, timezone=America/Cordoba
   [junit4]   2> NOTE: Linux 4.10.0-27-generic i386/Oracle Corporation 9 (32-bit)/cpus=8,threads=1,free=144722568,total=515112960
   [junit4]   2> NOTE: All tests run in this JVM: [HardAutoCommitTest, TestJsonFacetRefinement, BadIndexSchemaTest, CurrencyFieldTypeTest, CloudMLTQParserTest, TestReloadAndDeleteDocs, SSLMigrationTest, TestFieldCacheReopen, V2StandaloneTest, HLLSerializationTest, JSONWriterTest, ReturnFieldsTest, TestZkChroot, TestTrackingShardHandlerFactory, SortByFunctionTest, SuggesterFSTTest, DirectUpdateHandlerTest, TestReplicationHandlerBackup, TestTrieFacet, DateMathParserTest, TestSchemalessBufferedUpdates, HdfsUnloadDistributedZkTest, DistributedFacetPivotWhiteBoxTest, TestLegacyFieldReuse, TestRawResponseWriter, NotRequiredUniqueKeyTest, TestDynamicFieldCollectionResource, TestMultiValuedNumericRangeQuery, AtomicUpdatesTest, TestRecovery, TestUnifiedSolrHighlighter, SuggesterTest, ConfigSetsAPITest, RecoveryAfterSoftCommitTest, CdcrVersionReplicationTest, TestStressLiveNodes, DocValuesNotIndexedTest, TestJettySolrRunner, PingRequestHandlerTest, CopyFieldTest, TestDistributedMissingSort, TestFieldResource, StatsComponentTest, AliasIntegrationTest, ConfigureRecoveryStrategyTest, AnalyticsMergeStrategyTest, OverseerCollectionConfigSetProcessorTest, TestSSLRandomization, TestCustomDocTransformer, VMParamsZkACLAndCredentialsProvidersTest, ClassificationUpdateProcessorTest, ResponseLogComponentTest, TestCustomStream, TestCodecSupport, TestFreeTextSuggestions, SolrTestCaseJ4Test, TestSolrCoreSnapshots, DirectUpdateHandlerOptimizeTest, TestSha256AuthenticationProvider, BasicDistributedZk2Test, TermsComponentTest, TestExpandComponent, TestSolrCoreProperties, CdcrReplicationDistributedZkTest, XsltUpdateRequestHandlerTest, TestQuerySenderListener, SolrCoreCheckLockOnStartupTest, TestManagedStopFilterFactory, ReplicationFactorTest, ExitableDirectoryReaderTest, ShowFileRequestHandlerTest, HdfsLockFactoryTest, TestSurroundQueryParser, TestReversedWildcardFilterFactory, SolrMetricReporterTest, LargeFieldTest, VersionInfoTest, CircularListTest, TestCloudManagedSchema, EnumFieldTest, AddBlockUpdateTest, OverseerStatusTest, SimplePostToolTest, TestSolrCLIRunExample, LeaderElectionTest, PreAnalyzedFieldTest, TestComplexPhraseLeadingWildcard, TestAnalyzedSuggestions, TestConfigsApi, TestSolrCloudWithHadoopAuthPlugin, TestBackupRepositoryFactory, TestChildDocTransformer, PathHierarchyTokenizerFactoryTest, TestPayloadScoreQParserPlugin, CustomCollectionTest, TestScoreJoinQPNoScore, TestOrdValues, OverseerTest, DeleteNodeTest, MultiTermTest, BlockJoinFacetDistribTest, ClusterStateTest, MoveReplicaHDFSUlogDirTest, TestUtils, TestStressReorder, TestCollectionAPI, MigrateRouteKeyTest, TestAuthorizationFramework, TestSolrCloudWithSecureImpersonation, PolyFieldTest, TestRestManager, TestSolrDeletionPolicy2, TermVectorComponentDistributedTest, TestInfoStreamLogging, TestHashQParserPlugin, UnloadDistributedZkTest, CollectionsAPIDistributedZkTest, SyncSliceTest, RecoveryZkTest, FullSolrCloudDistribCmdsTest, ZkSolrClientTest, ShardRoutingCustomTest, TestDistributedSearch, TestDistributedGrouping, DistributedSpellCheckComponentTest, TestReload, TestStressVersions, TestRangeQuery, TestCoreDiscovery, SignatureUpdateProcessorFactoryTest, TestExtendedDismaxParser, SpellCheckCollatorTest, SolrRequestParserTest, TestFoldingMultitermQuery, DocValuesTest, TestTrie, SuggesterWFSTTest, SchemaVersionSpecificBehaviorTest, TestPseudoReturnFields, TestUpdate, QueryEqualityTest, DocValuesMultiTest, DistanceFunctionTest, TestSolrDeletionPolicy1, SolrInfoBeanTest, DisMaxRequestHandlerTest, TestQueryUtils, PrimitiveFieldTypeTest, FileBasedSpellCheckerTest, DocumentBuilderTest, MoreLikeThisHandlerTest, FieldAnalysisRequestHandlerTest, RegexBoostProcessorTest, UpdateRequestProcessorFactoryTest, MBeansHandlerTest, UniqFieldsUpdateProcessorFactoryTest, TestPartialUpdateDeduplication, SearchHandlerTest, AlternateDirectoryTest, TestSolrIndexConfig, TestQuerySenderNoQuery, BadComponentTest, SampleTest, TestDocSet, TestSearchPerf, NumericFieldsTest, MinimalSchemaTest, TestElisionMultitermQuery, TestConfig, TestFuzzyAnalyzedSuggestions, TestPostingsSolrHighlighter, DirectSolrConnectionTest, TestPhraseSuggestions, SpellPossibilityIteratorTest, TestCharFilters, TestXIncludeConfig, EchoParamsTest, TestDFRSimilarityFactory, TestLMJelinekMercerSimilarityFactory, TestIBSimilarityFactory, TestFastWriter, TimeZoneUtilsTest, ResourceLoaderTest, OpenExchangeRatesOrgProviderTest, URLClassifyProcessorTest, TestFastLRUCache, ChaosMonkeyNothingIsSafeTest, CdcrReplicationHandlerTest, CdcrRequestHandlerTest, ChaosMonkeySafeLeaderWithPullReplicasTest, CloudExitableDirectoryReaderTest, CollectionsAPIAsyncDistributedZkTest, ConnectionManagerTest, DeleteLastCustomShardedReplicaTest, DeleteShardTest, DeleteStatusTest, DistribJoinFromCollectionTest, HealthCheckHandlerTest, HttpPartitionTest]
   [junit4] Completed [492/730 (1!)] on J2 in 35.17s, 1 test, 1 failure <<< FAILURES!

[...truncated 37298 lines...]

Mime
View raw message